##TITLE=31Pdec_SP10P_5
 CDCl3, 124 sc
 11.2.2022
##JCAMPDX= 6.0         $$ Bruker NMR JCAMP-DX V2.0
##DATA TYPE= NMR SPECTRUM
##DATA CLASS= NTUPLES
##ORIGIN= UXNMR, Bruker Analytische Messtechnik GmbH
##OWNER= root
$$ XWIN-NMR		Version 3.5
$$ Fri Feb 11 10:02:15 2022 Russian Standard Time (UT+4h)  she@DPX200
##.OBSERVE FREQUENCY= 81.013821
##.OBSERVE NUCLEUS= ^31P
##.ACQUISITION MODE= SIMULTANEOUS
##.ACQUISITION SCHEME= undefined
##.AVERAGES= 124
##.DIGITISER RES= 16
##SPECTROMETER/DATA SYSTEM= spect
##.PULSE SEQUENCE= zgpg30
##.SOLVENT NAME= CDCl3
##.SHIFT REFERENCE= (INTERNAL, CDCl3, 0, 248.564)
##AUDIT TRAIL= $$ (NUMBER, WHEN, WHO, WHERE, WHAT)
$$ ##TITLE= Audit trail, XWIN-NMR		Version 3.5
$$ ##JCAMPDX= 5.01
$$ ##ORIGIN= Bruker BioSpin GmbH
$$ ##OWNER= she
$$ F:/spectra/data/she/nmr/P31/1/pdata/1/auditp.txt
$$ ##AUDIT TRAIL=  $$ (NUMBER, WHEN, WHO, WHERE, WHAT)
(   1,<2022-02-11 09:59:54.50 +0400>,<she>,<DPX200>,
      <created by zg, POWCHK disabled, PULCHK disabled
       configuration hash MD5:
       00 E9 B6 7A A2 85 ED C7 34 08 36 98 17 FE 4E 26
       data hash MD5: 32K
       B0 4B 7D 06 74 0F 2D 11 A1 1A 7C 71 3E 6E 83 FC>)
(   2,<2022-02-11 09:59:58.60 +0400>,<she>,<DPX200>,
      <Start of raw data processing
       efp BC_mod = 2 LB = 1 FT_mod = 6 PKNL = 1 PHC0 = -9717.114 PHC1 = 475.2746 SI = 64K 
       data hash MD5: 64K
       46 AD 45 90 BF 10 DE 5E CA 03 8E B9 B6 B7 71 5B>)
(   3,<2022-02-11 10:00:49.15 +0400>,<she>,<DPX200>,
      <pk PHC0 = 4.452049 PHC1 = 0 
       data hash MD5: 64K
       DD 3F 30 F1 3D 21 94 88 86 2B 4C 82 78 E5 DC 81>)
$$ ##END=
$$ 
$$ hash MD5
$$ 2E 46 50 77 56 7F 43 F5 95 A5 7C 26 85 9F A8 DA
##$RELAX= 
##$RELAX= 
##$RELAX= 
##$RELAX= 
##$RELAX= 
##$RELAX= 
##$RELAX= 
##$RELAX= 
$$ Bruker specific parameters
$$ --------------------------
##$DU= <F:/spectra>
##$EXPNO= 1
##$NAME= <P31>
##$PROCNO= 1
##$TYPE= <nmr>
##$USER= <she>
##$AMP= (0..31)
100 100 100 100 100 100 100 100 100 100 100 100 100 100 100 100 100 100 
100 100 100 100 100 100 100 100 100 100 100 100 100 100 
##$AQSEQ= 0
##$AQ_mod= 1
##$AUNM= <au_zg>
##$AUTOPOS= <>
##$BF1= 81.014009
##$BF2= 200.13
##$BF3= 200.13
##$BF4= 200.13
##$BF5= 200.13
##$BF6= 200.13
##$BF7= 200.13
##$BF8= 200.13
##$BYTORDA= 1
##$CFDGTYP= 0
##$CFRGTYP= 5
##$CHEMSTR= <none>
##$CNST= (0..31)
1 1 145 1 1 1 1 1 1 1 1 1 1 1 1 1 1 1 1 1 1 1 1 1 1 1 1 1 1 1 1 1 
##$CPDPRG= <waltz16>
##$CPDPRG1= <>
##$CPDPRG2= <waltz16>
##$CPDPRG3= <>
##$CPDPRG4= <mlev>
##$CPDPRG5= <mlev>
##$CPDPRG6= <mlev>
##$CPDPRG7= <mlev>
##$CPDPRG8= <mlev>
##$CPDPRGB= <>
##$CPDPRGT= <>
##$D= (0..31)
0 1 0 0 0 0 0 0 0 0 0 0.03 2e-05 3e-06 0 0 0 0 0 0 0 0 0 0 0 0 0 0 0 0 
0 0 
##$DATE= 1644559193
##$DBL= (0..7)
120 120 120 11 120 120 24 19 
##$DBP= (0..7)
150 150 150 150 150 150 150 150 
##$DBP07= 0
##$DBPNAM0= <>
##$DBPNAM1= <>
##$DBPNAM2= <>
##$DBPNAM3= <>
##$DBPNAM4= <>
##$DBPNAM5= <>
##$DBPNAM6= <>
##$DBPNAM7= <>
##$DBPOAL= (0..7)
0.5 0.5 0.5 0.5 0.5 0.5 0.5 0.5 
##$DBPOFFS= (0..7)
0 0 0 0 0 0 0 0 
$$ [...]
##$SUBNAM2= <"">
##$SUBNAM3= <"">
##$SUBNAM4= <"">
##$SUBNAM5= <"">
##$SUBNAM6= <"">
##$SUBNAM7= <"">
##$SUBNAM8= <"">
##$SUBNAM9= <"">
##$SW= 501.771253377433
##$SWIBOX= (0..15)
0 1 3 0 0 0 0 0 0 0 0 0 0 0 0 0 
##$SW_h= 40650.406504065
##$TD= 32768
##$TD0= 1
##$TE= 0
##$TE2= 300
##$TE3= 300
##$TEG= 300
##$TL= (0..7)
0 120 53 12 22 120 120 120 
##$TP= (0..7)
150 150 150 150 150 150 150 150 
##$TP07= 0
##$TPNAME0= <>
##$TPNAME1= <>
##$TPNAME2= <>
##$TPNAME3= <>
##$TPNAME4= <>
##$TPNAME5= <>
##$TPNAME6= <>
##$TPNAME7= <>
##$TPOAL= (0..7)
0.5 0.5 0.5 0.5 0.5 0.5 0.5 0.5 
##$TPOFFS= (0..7)
0 0 0 0 0 0 0 0 
##$TUNHIN= 0
##$TUNHOUT= 0
##$TUNXOUT= 0
##$USERA1= <user>
##$USERA2= <user>
##$USERA3= <user>
##$USERA4= <user>
##$USERA5= <user>
##$V9= 5
##$VALIST= <valist>
##$VCLIST= <CCCCCCCCCCCCCCC>
##$VD= 0
##$VDLIST= <DDDDDDDDDDDDDDD>
##$VPLIST= <PPPPPPPPPPPPPPP>
##$VTLIST= <TTTTTTTTTTTTTTT>
##$WBST= 1024
##$WBSW= 4
##$XGAIN= (0..3)
0 0 0 0 
##$XL= 0
##$YL= 0
##$YMAX_a= 11912
##$YMIN_a= -14991
##$ZGOPTNS= <>
##$ZL1= 120
##$ZL2= 120
##$ZL3= 120
##$ZL4= 120
##$ABSF1= 0
##$ABSF2= 0
##$ABSG= 0
##$ABSL= 0
##$ALPHA= 0
##$AQORDER= 0
##$ASSFAC= 0
##$ASSFACI= 0
##$ASSFACX= 0
##$ASSWID= 0
##$AUNMP= <proc_1d>
##$AZFE= 0.1
##$AZFW= 0.5
##$BCFW= 0
##$BC_mod= 2
##$BYTORDP= 0
##$COROFFS= 0
##$CY= -3
##$DATMOD= 1
##$DC= 0
##$DFILT= <>
##$DTYPP= 0
##$F1P= 0
##$F2P= 0
##$FCOR= 1
##$FTSIZE= 65536
##$FT_mod= 6
##$GAMMA= 0
##$GB= 0
##$INTBC= 1
##$INTSCL= 5.30512e-09
##$ISEN= 30
##$LB= 1
##$LEV0= 0
##$LPBIN= 0
##$MAXI= 10000
##$MC2= 0
##$MEAN= 0
##$ME_mod= 0
##$MI= 50
##$NCOEF= 0
##$NC_proc= -9
##$NLEV= 6
##$NOISF1= 182.463
##$NOISF2= 159.3651
##$NSP= 0
##$NTH_PI= 0
##$NZP= 0
##$OFFSET= 248.5645
##$PC= 4
##$PHC0= -9712.662
##$PHC1= 475.2746
##$PH_mod= 1
##$PKNL= yes
##$PPARMOD= 0
##$PSCAL= 0
##$PSIGN= 0
##$REVERSE= no
##$SF= 81.014009
##$SI= 65536
##$SIGF1= 159.3651
##$SIGF2= -187.1042
##$SINO= 113.3802
##$SIOLD= 16384
##$SREGLST= <1H.CDCl3>
##$SSB= 0
##$STSI= 65536
##$STSR= 0
##$SW_p= 40650.406504065
##$SYMM= 0
##$S_DEV= 0
##$TDeff= 32768
##$TDoff= 0
##$TI= <>
##$TILT= no
##$TM1= 0
##$TM2= 0
##$TOPLEV= 0
##$USERP1= <user>
##$USERP2= <user>
##$USERP3= <user>
##$USERP4= <user>
##$USERP5= <user>
##$WDW= 1
##$XDIM= 65536
##$YMAX_p= 495224843
##$YMIN_p= -162288906
$$ End of Bruker specific parameters
$$ ---------------------------------
##NTUPLES= NMR SPECTRUM
##VAR_NAME=  FREQUENCY,     SPECTRUM/REAL,   SPECTRUM/IMAG
##SYMBOL=    X,             R,               I
##VAR_TYPE=  INDEPENDENT,   DEPENDENT,       DEPENDENT
##VAR_FORM=  AFFN,          ASDF,            ASDF
##VAR_DIM=   65536,         65536,           65536
##UNITS=     HZ,            ARBITRARY UNITS, ARBITRARY UNITS
##FACTOR=    0.620285442955139, 1,           1
##FIRST=     20137.2065510759, 0,            0
##LAST=      -20513.1999529892, 0,           0
##MIN=       -20513.1999529892, -162288906,  0
##MAX=       20137.2065510759, 495224843,    0
$$ Real data points
##PAGE= N=1
##DATA TABLE= (X++(R..R)), XYDATA
$$ [...]
39848G4992181q241463l689790j468019J85422l225302j2411917j6645662o800666
39840B2694784R920987J7885130J2381209K399509m025478p741922j0785107j0206688
39832C2522424m153174K867128O197440O696326M872797l154629j5307147j6961798
39824A3579367J321912K3398095K2034931m336812k6271410k0856306R74514J4086086
39816B3930377J1789967N540407K947982J981425J311234J622084q25990r564720
39808C8732766j8588219j8242081q563089K370260R926721J3400948J0249681
39801B9286987J450259k620186M567575J1127096J655183j6085006j8063702J464606
39793A2782812K1113675K2054413Q554563o697371j8868821k3404097j0996895
$$ plain form
39848 74992181 66750718 63060928 61592909 61778331 58553029 46141112 29495450 22694784
39840 22694784 32615771 50500901 62882110 65281619 61256141 53514219 42729112 32522424
39832 32522424 28369250 31236378 37433818 44130144 49002941 45848312 30541165 13579367
39824 13579367 14901279 38299374 60334305 55997493 29726083 8869777 9844291 23930377
39816 23930377 35720344 41260751 44208733 46190158 47501392 49123476 48297486 38732766
39808 38732766 20144547 1902466 -6660623 -4290363 5636358 19037306 29286987
39801 29286987 30737246 28117060 32684635 43811731 45466914 29381908 11318206 12782812
39793 12782812 33896487 55950900 64505463 57808092 38939271 15535174 4538279
39786D538279J5004882L0519271J7708286q592882j8304153m729046J0636387
39779D6781024J0064456L56792j894167O077373J1764256N391789o479761p800366
39771F4261396O127769J8838931J0909867j3193536k7335609j6132858O174205
39764D9650165J6161147R749912q6062n519695j0203285j6679473j9868608j4511400
39756H692701k226690R563728J3197084Q371800N211197J1941001J7999617L426530
39748G6176968k7996103m2532912j9171190J6541312K3771362J531834j4407473
39741A3913798o065305N667178L18300j0784134p844544M513843P917760P11949
39733H348845k399276M627440J1567952Q530635j809126r437101p581915J380094
$$ plain form
39786 4538279 19543161 50062432 67770718 59177836 40873683 36144637 46781024
39779 46781024 56845480 57202272 55308105 61385478 73149734 78541523 72061762 64261396
39771 64261396 70389165 89228096 100137963 86944427 59608818 43475960 49650165
39764 49650165 65811312 75561224 75475162 69955467 59752182 43072709 23204101 8692701
39756 8692701 6466011 16029739 29226823 37598623 42809820 54750821 72750438 76176968
39748 76176968 48180865 5647953 -13523237 3018075 26789437 28321271 13913798
39741 13913798 7848493 13515671 13833971 3049837 -4794707 -280864 7636896 8348845
39733 8348845 5949569 10577009 22144961 30675596 28866470 19429369 11847454 13227548
39725A3227548O964854J024238j0221557j1454386L88611R360454K758865r034490
39717C014137o624906J0237876K1817304J4576739l254810j3967883r656342L266261
39709A9408376J2619731J0725319j68931j0403372j1930121n312891J749203J210886
39701A7898200q416327j7923438j2970172Q177510K4918972J5489640j1070251
39694A6104134k1032020o30172K3847391K3392368N691098k342484L377228N299410
39686E3706953q59591j298873O419828P059405m084257j1789938p530147k177929
39678C9445451k780257M453R185623R696143m539622j4196463n042177O299205
39670C8072356J092335o895856M046527K0000366R462735k1858885l3974970j3056454
$$ plain form
39725 13227548 20192402 21216640 10995083 -459303 -70692 9289762 12048627 3014137
39717 3014137 -3610769 6627107 28444411 43021150 39766340 25798457 16142115 19408376
39709 19408376 32028107 42753426 42584495 32181123 20251002 14938111 16687314 17898200
39701 17898200 9481873 -8441565 -21411737 -13234227 11684745 27174385 16104134
39694 16104134 -4927886 -5558058 18289333 41681701 47372799 45030315 48407543 53706953
39686 53706953 52847362 51548489 57968317 65027722 60943465 49153527 41623380 39445451
39678 39445451 36665194 36669647 45855270 55551413 51011791 36815328 31773151 38072356
39670 38072356 39164691 32268835 36315362 56315728 65778463 43919578 9944608 -3111846
39662c111846R640213R801663M063404J2882024K2175108J0061441j1564564j4199469
39654C9747974J783857R661406j515308j5277817j7137026j0522912j047212J2289419
39646A7982381K4217058K1218371J755958j5728274j4411548P69512J1373228
39639D7176686O408129r314344k1065132j6359285J968304J5354050J0532475
39632C4700883k007934k797603P040545Q782140j877116p909776j315681L123484
39624C7738942m199717q877226J064670J0335361J069610j3570581q165340J1887133
39616B7282852J6037074m074437k1745876j5421825K842101R598401J929957n058105
39608A1390142l13649J3399074K3306821J5396434j0823472l4180322l1562560
$$ plain form
39662 -3111846 6528367 16330030 20393434 33275458 55450566 65512007 53947443 39747974
39654 39747974 41531831 51193237 49677929 34400112 17263086 6740174 5692962 17982381
39646 17982381 42199439 63417810 65173768 49445494 35033946 35803458 47176686
39639 47176686 53584815 44270471 23205339 6846054 8814358 24168408 34700883
39632 34700883 32692949 29895346 36935891 45718031 43840915 35931139 34615458 37738942
39624 37738942 33539225 24661999 25726669 36062030 37131640 23561059 15395719 27282852
39616 27282852 43319926 39245489 17499613 2077788 4919889 14518290 16448247 11390142
39608 11390142 11076493 24475567 47782388 63178822 52355350 18175028 -13387532
39601a3387532q148138Q207616O414626N412724J8953099K9931603J8114695m709322
39593F0789371j1388759l74716N598987k659957j0119946o868564m095530j1632002
39585A9248884j8276814q249927J3641872K6857800K0822602N503367k988376
39578E6559408n18494L162283j716656j1653193j3635481l048844Q264349P574145
39570D4987517q40081l176863K107167L242231l470576n895302L900479J4303952
39562E5158524R713879o156921j4580354o638107O799426J0122789j76921j4880167
39554C9362148k1468970j2605651Q216793K6192427K5839032P258719j1259230
39547F1535268j2249967R15049R136700K656196p140815n622240L031802K442502
$$ plain form
39601 -13387532 -21535670 -13328054 -6913428 -1500704 17452395 47383998 65498693 60789371
39593 60789371 49400612 49025896 54624883 51964926 41844980 34976416 30880886 19248884
39585 19248884 972070 -7277857 6364015 33221815 54044417 59547784 56559408
39578 56559408 56040914 59203197 57486541 45833348 32197867 29149023 37413372 44987517
39570 44987517 44147436 40970573 43077740 46319971 42849395 36954093 40854572 55158524
39562 55158524 64872403 58715482 44135128 37497021 44296447 54419236 54242315 39362148
39554 39362148 17893178 5287527 13504320 39696747 65535779 72794498 61535268
39547 61535268 49285301 50200350 59337050 61993246 54852431 49230191 52261993 54704495
39539E4704495r424546j3931178K165555K5075887K9784945J2596131m932691
39532I6038598n124945M700201N693252o724232j9287614j9418260q615192K881695
39524E0143503P504523L584740o889136j7835964j9175539m968901J6762799K8164145
39516E7290170J9066716l363401k4641617l6368347l5627764k0335076M245127
39509c9734192K1073908J7966027N874598N121568J4992083J5930752L184053
39502D4408797n100941n99646N6643j2382775j8084954j931852J3995588L075504
39494B3436364j8073361j2488223J5968192K6877029Q447484o263884J852745
39487C9756346P421757j0173369k7041404j5032220R814667J4875639L575980
$$ plain form
39539 54704495 45279949 31348771 33514326 58590213 88375158 100971289 96038598
39532 96038598 90913653 95613854 101307106 94582874 75295260 55877000 47261808 50143503
39524 50143503 57648026 61232766 54343630 36507666 17332127 12363226 29126025 57290170
39516 57290170 76356886 72993485 48351868 11983521 -23644243 -43979319 -39734192
39509 -39734192 -18660284 -694257 5180341 10301909 25293992 41224744 44408797
39502 44408797 39307856 38708210 38764853 26382078 8297124 6365272 20360860 23436364
39494 23436364 5363003 -7125220 8842972 35720001 44167485 37903601 39756346
39487 39756346 47178103 37004734 9963330 -5068890 4745777 19621416 23197396
39480B3197396K137057J0344651O317812q213552q753258O185631R412304q149329
39472C2478712k0669200r579049Q797144J3867718J1741560J5719109J8327193
39465G0683187O334468j1583867j5965591o694940o18908l629313m817227J781398
39457C5489207O723710P98180j0435831j3820275m916690P332449J1133696N099295
39449C7403741j053303k96948K065840j015732l680852L980507J4968272J1544709
39441F3916234m329984p801529J0818253K5472046J0647856j8176196k5375687
39434E5170993o856899P636135K275751m553422M327756J5899907J0142681o703293
39426G7339609j2933866m887592J370669k162300n923154k694578P37007j865581
$$ plain form
39480 23197396 25334453 35679104 41996916 33783364 25030106 31215737 40628041 32478712
39472 32478712 11809512 2230463 11027607 24895325 36636885 52355994 70683187
39465 70683187 77017655 65433788 49468197 42773257 42154349 38525036 33707809 35489207
39457 35489207 42212917 43011097 32575266 18754991 13838301 21170750 32304446 37403741
39449 37403741 36350438 36053490 38119330 37103598 33422746 37403253 52371525 63916234
39441 63916234 59586250 51784721 62602974 88075020 98722876 80546680 55170993
39434 55170993 48314094 55950229 58225980 53672558 58000314 73900221 84042902 77339609
39426 77339609 64405743 59518151 60888820 58726520 52803366 50108788 50845795 48980214
39418D8980214m730863k757540l167486j0983141j2850182N141341K7209215K0090431
39410F6931989j7365885m1414738j9130803K2016250K8580087m382426k7605388
39403G629086r272328K3008510K8035163Q438992m519725k504202l284740j1652210
39395C5878546j0879045M792281J7475225J3458469J939955l144941j851676R16526
39387E8585340P109304J6531128J8896776P063224j0517639k0683222k1645548
39380E5339363j9789578j7658363j3723175q581652m119037p32555N44383o86543
39372i407157J744672J5459567L3979420L7832006J9061411n664100j5592619
39365G7413200j0257768l655205l323218o677992j0407329j1092838k585400J4438744
$$ plain form
39418 48980214 44249351 41491811 38324325 27341184 14491002 19632343 46841558 66931989
39410 66931989 49566104 8151366 -10979437 11036813 39616900 35234474 7629086
39403 7629086 -1643242 21365268 49400431 57839423 53319698 50815496 47530756 35878546
39395 35878546 24999501 29791782 47267007 60725476 62665431 59520490 57668814 58585340
39387 58585340 65694644 82225772 101122548 108185772 97668133 76984911 55339363
39380 55339363 35549785 17891422 4168247 -4413405 -8532442 -9264997 -8720614 -9407157
39372 -9407157 -7662485 7797082 41776502 79608508 98669919 93005819 77413200
39365 77413200 67155432 63500227 60177009 53499017 43091688 31998850 29413450 43852194
39357D3852194K4775608J3614565j2507074l0541319k6151136o411229J0332674
39350A6964283J0706377l401043j4587411o085189J6064677K6700282J4839328
39343F1201304o57072j156179K642540p482203k0803438j2421044J1854192J8595165
39335E1773265j837664j8783209p705734J4285046J6935818J66911j1839077p339316
39327C5656040J907474J292616r401033j8514822j5205553j212963R314427P358507
39319A1194693K969622R702633J9702270J4132685k766546o240477P034418R315631
39311F5044929j1994452k8144770j1995187J7725127K4233784O692594n371664
39304E6190361j9330P234732O166477L344022R82787p724421j8872661j7593807
$$ plain form
39357 43852194 68627802 82242367 69735293 39193974 13042838 6631609 16964283
39350 16964283 27670660 24269617 9682206 3597017 19661694 46361976 61201304
39343 61201304 60544232 59388053 62030593 54548390 33744952 21323908 33178100 51773265
39335 51773265 49935601 31152392 23446658 37731704 54667522 54834433 42995356 35656040
39327 35656040 37563514 38856130 29455097 10940275 -4265278 -5478241 3836186 11194693
39319 11194693 14164315 23866948 43569218 57701903 54935357 48694880 55729298 65044929
39311 65044929 53050477 24905707 12910520 30635647 54869431 61562025 56190361
39304 56190361 56171031 63405763 69572240 72916262 73899049 66174628 47301967 29708160
39296B9708160k349731J0447224R724378L21429j0419769j8560713j6629805m15229
39288A825944J7373844J9703731R976723L658600m3568j1278715j8345160J428371
39280B4299770L5944017M2239608R134165k1628443j7016567N74973l548398j8830818
39272E1168307j2546373J1873470K1142219O227307q759335q905676m765145m278565
39264E1156209N5974R482689J1193574J107517p310962n678907k942535o113918
39256E0949641o655489K658779J1699365O749331q508502j7274622j0834262K429986
39248C1214227P877819O14312r445363r306486L28978N984283J625595k380474
39240B6512891K089328N819177q07762p663692o60703J1292694Q256585o657651
$$ plain form
39296 29708160 27358429 37805653 47530031 47851460 37431691 18870978 2241173 1825944
39288 1825944 19199788 38903519 48880242 52538842 52495274 41216559 22871399 24299770
39280 24299770 60243787 102483395 111617560 89989117 72972550 73547523 69999125 51168307
39272 51168307 38621934 50495404 71637623 77864930 69105595 60199919 55434774 51156209
39264 51156209 51212183 60694872 71888446 72995963 65685001 60006094 57063559 50949641
39256 50949641 44294152 46952931 58652296 65401627 56893125 39618503 28784241 31214227
39248 31214227 39092046 39706358 30260995 20954509 21283487 27267770 28893365 26512891
39240 26512891 28602219 34421396 33613634 25949942 25289239 36581933 44838518 38180867
39232C8180867j0800625R02817R404534N857913M108286R651253M823307j8287400
39224D3840952l5089603k1323629R169477K3415472J3863353O37378k403180n18035
39216C1592185n51085j765024m355867r669201j1097830k75459J6228349K0718409
39208D0824477P657227q805344j3373357n568977M904012R299018M210367o718767
39200C2428656j3310326p893018N067758J3785400J2119557J949141j2780486
39193C1366682k4983257k2465840r45665K2662518K5367197P963374n751720k989504
39185C0223785K217854m514253j2962941n409226J2481957J6833315j218179k3752741
39177A3899571k9412059j6076364L189206J6352104J8985964J2316896J991221
$$ plain form
39232 38180867 27380242 28283059 37687593 43545506 47653792 57305045 62128352 43840952
39224 43840952 8751349 -12572280 -3402803 20012669 33876022 34513400 32110220 31592185
39216 31592185 31041100 29276076 24920209 15251008 4153178 3877719 20106068 40824477
39208 40824477 48481704 39676360 26303003 20734026 25638038 34937056 39147423 32428656
39200 32428656 19118330 11225312 16293070 30078470 42198027 44147168 31366682
39193 31366682 6383425 -16082415 -17028080 5634438 31001635 38965009 33213289 30223785
39185 30223785 32441639 27927386 14964445 9555219 22037176 38870491 37652312 13899571
39177 13899571 -15512488 -31588852 -28399646 -12047542 6938422 19255318 21246539
39170B1246539m331844l427542Q29447L829575N944229Q245700O849308j475339
39162C7710073j0244798r032167N00605M332184l514197j0631490n149596M659775
39154H630389L585889m716502l916000N209219L879529j1042439j6903851j755497
39146a7029263J2113063K454450j3900313n108407K3449538L4040239J2555469
39139D8574776j2947503j6544608p327384m810696p724809n942438k940817n189611
39131a4853090m314756Q563591K1961834J9139994O083746K767958J1139649J3034799
39123F3523725q08398j8530341k5399112j8948020n080172P364637Q904140k08982
39115A0817477m329997P894792K2213656J6180734n019780j3794231k521338N888739
$$ plain form
39170 21246539 16914695 13487153 14316600 18146175 24090404 32336104 39185412 37710073
39162 37710073 27465275 18433108 18933713 23265897 19751700 9120210 3970614 8630389
39154 8630389 12216278 7499776 3583776 8792995 12672524 1630085 -15273766 -17029263
39146 -17029263 -4916200 -2461750 -16362063 -21470470 1979068 36019307 48574776
39139 48574776 35627273 19082665 11755281 6944585 -780224 -6722662 -9663479 -14853090
39131 -14853090 -19167846 -10604255 11357579 30497573 36581319 39349277 50488926 63523725
39123 63523725 62715327 44184986 18785874 -162146 -5242318 2122319 11026459 10817477
39115 10817477 6487480 14382272 36595928 52776662 47756882 33962651 31441313 37330052
39107C7330052k752505j1394646l126756R437108O760090m697677n703605K948982
39099B8801043M766885l997565j2645823j6386766j7248330j0867004N326618
39092b2250942J6124770N741028j1660599o234485K0881072L4390686J6186088
39085E3177618r064484j3905443o716350r128461j6861176j0624733O826904J3375880
39077G079755L288562n325490l67782Q603761R519737M674798J288948o67795
39069B8094494k904074j694999M771021Q771901J285356j4527869k3570963j3350291
39061a3125424J1604038K9759881K1967882n018347k1318544r023381J2716277
39054B7562382J2305422r306594j9271105j506898J8695821J2280095j0555892
$$ plain form
39107 37330052 34577547 23182901 20056145 29493253 36253343 31555666 25852061 28801043
39099 28801043 33567928 29570363 16924540 537774 -16710556 -27577560 -22250942
39092 -22250942 -6126172 -385144 -12045743 -18280228 2600844 36991530 53177618
39085 53177618 44113134 30207691 23491341 14362880 -2498296 -13123029 -6296125 7079755
39077 7079755 10368317 5042827 4675045 13278806 22798543 27473341 28762289 28094494
39069 28094494 25190420 23495421 28266442 37038343 38323699 23795830 224867 -13125424
39061 -13125424 -1521386 28238495 50206377 45188030 23869486 14846105 27562382
39054 27562382 39867804 30561210 11290105 9783207 28479028 40759123 30203231
39047C0203231j6618279J562070J8268835J4792222K867855L31456L693111p9601
39039E5020900q019135o939895M63088l658835k1723428l0130477j1495661J6601873
39031i881570K3330183P562471l133674L756081Q551409l912919j5338997l313408
39023G619576J8393542J7906380n002878j8919355r958293J737099J424287K463555
39015A5663913J4228521J8502190J793381j4747632p318723R252663O351074p980828
39007C5744559l340429J6218171J4472432j4173469k9132951o686377K1448297
39000C4550233J7759027n623308j3181173l712819m737212k1449446k8102352
38993b4497050j0043119J5472101K6004503J9718379Q440156J503140J914275
$$ plain form
39047 30203231 13584952 15147022 33415857 48208079 51075934 51407390 55100501 55020900
39039 55020900 47001765 40061870 40524958 36866123 15142695 -14987782 -26483443 -9881570
39031 -9881570 13448613 21011084 17877410 21633491 30184900 26271981 10932984 7619576
39023 7619576 26013118 43919498 38916620 19997265 10038972 11776071 13200358 15663913
39015 15663913 29892434 48394624 50188005 35440373 28121650 37374313 43725387 35744559
39007 35744559 32404130 48622301 63094733 48921264 19788313 13101936 34550233
39000 34550233 52309260 46685952 33504779 29791960 25054748 3605302 -24497050
38993 -24497050 -34540169 -19068068 6936435 26654814 35094970 36598110 38512385
38986C8512385O318749N721273l865099j2103011o675582P061577J1487224M92055
38978D6949571j4631554k1406572j6030931m59380J6430335J9171493L556893
38971C3579855j0699215m444037R285445L198583j7696021j9434826N837592K2574331
38963B2201707M898777k3913777k7288463n719955J3949278J9547243J7211990
38956B0886800J0012617r7411j874741P653404Q338556j2716370l0131338j3396089
38948a1324572K0010221K4911280j944279j6933578l8697J5496452J642721j8381773
38940A3437775j1488683J0768138J4657081m53918o651872L864339J0250744R83955
38932C5367559j0315145j0842778n875086l572169j766602K313005L466804k493890
$$ plain form
38986 38512385 44831134 50552407 46687308 34584297 27908715 34970292 46457516 46949571
38978 46949571 32318017 10911445 -5119486 -5578866 10851469 30022962 33579855
38971 33579855 22880640 18436603 27722048 30920631 13224610 -6210216 -372624 22201707
38963 22201707 27100484 3186707 -24101756 -29821711 -15872433 3674810 20886800
38956 20886800 30899417 30802006 28927265 36580669 44919225 32202855 2071517 -11324572
38948 -11324572 8685649 33596929 31652650 14719072 14680375 30176827 31819548 13437775
38940 13437775 1949092 12717230 27374311 26920393 20268521 24132860 34383604 35367559
38932 35367559 25052414 14209636 8334550 4762381 2995779 5308784 8775588 6281698
38924F281698j0356056j1291069j262658J6694612L1833732K9784602P079691
38917F8764552j9930073l0791395k3672792j1748677j259064J0532804J7261202
38910I156557N481938j8148691k3387771L898419L4561971L0284101l799894k5216334
38902A2830296j2305442R965488J1838781J615543M873908J7567946J1685879
38895E8072399j4496335k6092353m433146J9487608R136570k1465214k8713367
38888h503838n126530J3707854P688498j670922M801294J0939448j144761j4758672
38880E932371o092878J3507387J5860006K409394j919311O777066Q317556j936148
38872D2855443n652675J771717J175053j3121633j8037699o43549J5744003O987704
$$ plain form
38924 6281698 -4074358 -15365427 -16628085 66527 31900259 61684861 68764552
38917 68764552 48834479 18043084 -5629708 -17378385 -18637449 -8104645 9156557
38910 9156557 14638495 -3510196 -26897967 -22999548 11562423 41846524 38046630 12830296
38902 12830296 524854 10490342 22329123 23944666 28818574 46386520 58072399
38895 58072399 43576064 17483711 13050565 32538173 41674743 20209529 -8503838
38888 -8503838 -13630368 77486 7765984 6095062 10896356 21835804 20691043 5932371
38880 5932371 -160507 13346880 29206886 31616280 29696969 36474035 44791591 42855443
38872 42855443 37202768 38974485 40149538 27027905 8990206 8346657 24090660 31078364
38864C1078364j2751188j4088689J224680O981794k183633l717327J1985906K2429593
38856D0959500P587739j7364351k2963195p607923K762026n033128j3428640m535686
38848a9623658J0195648Q542067n520544p617838O027067J0551253n977568j9190218
38840b2613791n132452K0800368K6639404J0603020l425610p359716j3772111
38833E739112k2480115j6305273M654102J6151375P775056n55537O187635J2984668
38825A4151023L008285j1874610j0893523K095862P450878J008420m240728j006648
38817c01041N029881O744733K168110n805774q580338J026797J4788295J4737002
38809B9807665k28989r514858k060375O187468p10705j3381881j5814939j1035305
$$ plain form
38864 31078364 18327176 4238487 5463167 12444961 10261328 6544001 18529907 40959500
38856 40959500 48547239 31182888 8219693 611770 3373796 -1659332 -15087972 -19623658
38848 -19623658 -9428010 -885943 -6406487 -14024325 -7997258 2553995 -3423573 -22613791
38840 -22613791 -27746243 -6945875 19693529 30296549 26870939 19511223 5739112
38833 5739112 -16741003 -33046276 -28392174 -12240799 -4465743 -5021280 1166355 14151023
38825 14151023 17159308 5284698 -5608825 -3512963 3937915 4946335 705607 -301041
38817 -301041 4728840 11473573 13641683 7835909 -744429 282368 15070663 29807665
38809 29807665 29578676 20063818 18003443 24190911 23480206 10098325 -5716614 -16751919
38801a6751919q469725k991085J1135946K0983683J3645945L89555k218745j109464
38793A4614191j0028421j8604162r178875P502549P986862j306539N203858K3745364
38785A9934827K4065888K283821j0592370j026489O283075n970632j8546960j1529706
38777D901454K763680M811316j033235k430540k176356l955044K156648J7316468
38769B2354391J9099578n366110l0648355k5415267J514369J6522965J0927570
38762H989141M614603O671843M650631n544575q691031K077379R980175J72339
38754B2920505j5390141j4127809L895876J4202896O89469k1176485k3132948
38747c2118637k224793J3921903N597937j0398566o680102J2087047J7507485
$$ plain form
38801 -16751919 -25221644 -28212729 -17076783 3906900 17552845 17942400 15723655 14614191
38793 14614191 4585770 -14018392 -23197267 -15694718 -7707856 -9014395 -3810537 19934827
38785 19934827 44000715 46284536 35692166 34665677 40948752 34978120 16431160 4901454
38777 4901454 7665134 12476450 11443215 9012675 6836319 2881275 5037923 22354391
38769 22354391 41453969 36087859 5439504 -19975763 -18461394 -1938429 8989141
38762 8989141 13603744 20275587 24926218 19381643 10690612 12767991 22748166 22920505
38754 22920505 7530364 -6597445 -2701569 11501327 12190796 -8985689 -32118637
38747 -32118637 -34343430 -20421527 -14823590 -25222156 -31902258 -19815211 -2307726
38740b307726L931846l942178N245806J0283226l788515j6967002o488377J5572499
38732A539579K2279309J1606111M04277o493980j4021101j5604722k685931J2147262
38724I170804R320425n371772r256638K60874M594146k025847n678717j297346
38716b84071k55537n028502l186002O238110O333554p718589j6518876p073907
38708b7493820O266396O356277o24883m73055M164137L186780P17862P056998
38700h43308J6481073J2964623m109551j6990175j3742954k063327M398395L271528
38692f33696J827572M311545O927992M439524j959402n477458k187879L840320
38684A1088518N777405K321175k133552l848741k823896o27851J924123N531710
$$ plain form
38740 -2307726 1624120 -2318058 2927748 13210974 9422459 -7544543 -14032920 1539579
38732 1539579 23818888 35424999 35829276 29335296 15314195 -290527 -2976458 9170804
38724 9170804 18491229 13119457 3862819 4123693 8717839 6691992 1013275 -284071
38716 -284071 -539608 -5568110 -8754112 -2516002 3817552 -3901037 -20419913 -27493820
38708 -27493820 -21227424 -14871147 -15496030 -15969085 -11804948 -8618168 -7900306 -843308
38700 -843308 15637765 28602388 24492837 7502662 -6240292 -8303619 -3905224 -633696
38692 -633696 1193876 5505421 12433413 16872937 14913535 9436077 7248198 11088518
38684 11088518 16865923 19187098 17053546 13204805 10380909 9753058 11677181 17208891
38676A7208891J1269628J5774495R296914j2636773l4824077l3157954o363078
38669c3431954J7325000J6367626M346374O063873J8912891K0660868P063033
38662E7307711m261763m884816m754742q938680r902489o954432r414068j4934035
38654f737314r173500N503751P157303q471961j4680840M763756K5472699J7046222
38646B0880116j0912962k3303661p891036J5454667K5665832J7938292l150525
38639C4680723k5627901k9539537o237549K3252276K8710107Q526406j1222597
38632B2541928j3270769m251745N988133J6648934K2672828J2149553j1787745
38625E0691117k4552159r907083J5706566K2356113K737022k2382277k9771753
$$ plain form
38676 17208891 28478519 44253014 53549928 40913155 6089078 -27068876 -33431954
38669 -33431954 -16106954 260672 4607046 10670919 29583810 50244678 57307711
38662 57307711 53045948 48161132 43406390 34467710 24565221 17610789 8196721 -6737314
38654 -6737314 -15910814 -10407063 -3249760 -11721721 -26402561 -21638805 3833894 20880116
38646 20880116 9967154 -13336507 -21227543 -5772876 19892956 37831248 34680723
38639 34680723 9052822 -20486715 -26724264 -3471988 25238119 33764525 22541928
38632 22541928 9271159 5019414 11007547 27656481 50329309 62478862 50691117
38625 50691117 26138958 16231875 31938441 54294554 57031576 34649299 4877546
38618D877546j5212021P132081J8904580J2936018q38547o871955k361858K074005
38610B0639849Q61077J296807P377431Q698779k637146j4446822j0482361J938166
38602A3245780N13105j5655680k0499268n57944K0129899J2240086j4800199k3308452
38594b8692673J658578L3127260L7611824J2491123j8326031l1615264k0064307
38587a3809490O408049K5024062J7537892o498625j5597243K932479K1903575
38580C7900699J1248191j6639446k3567847j533754J7439958J0842217m522410
38573C1167608n195526K265973j321972j1720858r093799N860559J0089653n667861
38565A6383777k1166960j5493563M533188J6623475J3494300P447205Q371116
$$ plain form
38618 4877546 -10334475 -3202394 15702186 28638204 27799657 20927702 18565844 20639849
38610 20639849 21500926 22797733 30175164 38873943 36236797 21789975 11307614 13245780
38602 13245780 13758885 -1896795 -22396063 -22954007 -2824108 9415978 -5384221 -28692673
38594 -28692673 -27034095 6093165 43704989 56196112 37870081 6254817 -13809490
38587 -13809490 -7401441 17622621 35160513 28661888 13064645 15997124 37900699
38580 37900699 49148890 32509444 8941597 7407843 24847801 35690018 31167608
38573 31167608 25972082 28238055 26916083 15195225 6101426 11961985 22051638 16383777
38565 16383777 -4783183 -20276746 -15743558 879917 14374217 21821422 30192538
38558C0192538J0863897O357648k043713m378626J163531N862503K096707q660174
38550D1454311j8608458j8814969m421239J6725587K3961792O111875j6964857
38543B9444042j4038634J2286208K3619224J132685k3073442j3254575J4237513
38536C0353021J6765897p132439j7340123K512673K1076443J0657090j3720749
38529D3171813k3494519j5619312l439503P749752J6639397J6304141O014978
38522D7326747k968084n668996r471575j2607599r24529K1397524K6434031N877484
38514F9395003j0102078q43814R038543o962974k7777635j9059077O098689P465327
38506B7251984j5091101k3505777n827585R480797O528987L584677J1797458J3940687
$$ plain form
38558 30192538 41056435 47414083 45370370 40991744 42155275 48017778 50114485 41454311
38550 41454311 22845853 4030884 -390355 16335232 40297024 46408899 29444042
38543 29444042 15405408 27691616 51310840 52443525 29370083 16115508 30353021
38536 30353021 47118918 39986479 22646356 25159029 46235472 56892562 43171813
38529 43171813 19677294 4057982 618479 8368231 25007628 41311769 47326747
38522 47326747 44358663 38689667 29218092 16610493 15685964 37083488 63517519 69395003
38514 69395003 59292925 58449111 67487654 60524680 32747045 13687968 19786657 27251984
38506 27251984 12160883 -11344894 -17172479 -7691682 -1162695 2421982 14219440 28160127
38498B8160127M8587j1042272m046015P943476Q876557N074956Q001529J3301030
38490E6317975J2790285Q482609J904398j1213834k4183159j8708091N608316
38483C0998499K2108026J2741141o223602j0023288P39045Q738294P095767J256677
38475F7430559m291092p354924o362817n987124j1501428j3006229M491786K9246303
38467E2665034K8324593k302717k3448925r031050J3483865P890254j2782089
38460E4798965j1163689J0728181J6661461k257799j5190614m650143P237249
38453E6163611j599581j7925595j5248920Q686230L2189040L5629145J7515742
38446A15409672n982107j3120252J608662J6731960P618113j9556817l4484726
$$ plain form
38498 28160127 28208714 17166442 13120427 21063903 29940460 35015416 43016945 56317975
38490 56317975 69108260 77590869 79495267 68281433 44098274 25390183 30998499
38483 30998499 53106525 65847666 59624064 49600776 50339821 59078115 66173882 67430559
38475 67430559 63139467 55784543 49421726 43434602 31933174 18926945 23418731 52665034
38467 52665034 80989627 78686910 55237985 46206935 59690800 67581054 54798965
38460 54798965 43635276 54363457 71024918 68767119 53576505 48926362 56163611
38453 56163611 54564030 36638435 21389515 30075745 62264785 97893930 115409672
38446 115409672 109427565 96307313 97915975 114647935 122266048 102709231 68224505
38439F8224505k4386428q600728n702294p430836J872310J7352194K2611764J5823328
38431G9763815Q764741M651172n570641k3307263l3156141k1380480L570744J8311166
38423C1647113J2209071Q4568J985723J5522033J9014449K871815j4952588j2738685
38415E5643499N535165J6391877P566504r352316j5407571l803977J5986574K6000656
38407I8560411J4248581j0945982k4958840j3624123R051617J9522409J4292223
38400A06146296P883368P687297P775482M659599J369242l233695j1279729j2918997
38392A08088863K809772K3066682K1214437k561203j6389700l774315J0862061
38385A43316597K321270j4030724q284918J3652106J8169892m171470k6533119
$$ plain form
38439 68224505 43838077 35237349 29535055 22104219 23976529 41328723 63940487 79763815
38431 79763815 88528556 93179728 87609087 64301824 31145683 9765203 13335947 31647113
38423 31647113 43856184 43940752 45926475 61448508 80462957 83334772 68382184 55643499
38415 55643499 61178664 77570541 85137045 75784729 60377158 56573181 72559755 98560411
38407 98560411 112808992 101863010 76904170 63280047 72331664 91854073 106146296
38400 106146296 114029664 121716961 129492443 134152042 135521284 132287589 121007860 108088863
38392 108088863 110898635 133965317 155179754 152618551 136228851 132454536 143316597
38385 143316597 145637867 131607143 123322225 136974331 155144223 150972753 124439634
38378A24439634k7064648j4071004l369676M328993J2111245J3808582O762717
38371A16945843J843331N744854O454094p133588k1870918j6209999O195441J9449948
38363A11419006J2237792J680350M292480J0887593L119867j6346182k5975022
38356A01315884j4525504N174214J3384155N260894p811765j2716681o652829
38349H3428368K391229M791151j25352l421712J060332O250628L28086j4390916
38341H0311814j9809884m460773J8847886K6033853J0151320j1507617j9372515
38334H0194084j2419956k996320J924432N748749J1161686J4000740J0760826
38327A08374241M319065k083130r203107j4645892j0434812K457591O644230q443091
$$ plain form
38378 124439634 97374986 83303982 79934306 84263299 96374544 110183126 116945843
38371 116945843 118789174 124534028 130988122 123854534 101983616 85773617 91969058 111419006
38363 111419006 123656798 125337148 129629628 140517221 143637088 127290906 101315884
38356 101315884 86790380 91964594 105348749 110609643 102797878 90081197 83428368
38349 83428368 85819597 90610748 90485396 87063684 88124016 94374644 94702730 80311814
38341 80311814 60501930 56041157 74889043 100922896 111074216 99566599 80194084
38334 80194084 67774128 64777808 66702240 72450989 83612675 97613415 108374241
38327 108374241 112693306 110610176 101407069 86761177 76326365 78783956 85428186 76985095
38319G6985095k3101319j0610256J7503207K0013504j0885539k9205875k035486
38312C8663331L4174224K3393040k3864204m3835837j4781592J4472926M373404
38305C2595292j7492393q126580K1241771K8490055R049441l420142N050566J1681875
38297G9069885k86123j6049025j5738634j995146R407377J0034696K136356o611578
38289E9967808p760463j266731P07825r558729j8919948r484990J1745932J8955559
38281D4386263M318122j1581226j1296577l062351k317385o884938l657516R527671
38273A9432063K0787414J9435733P429303l023265k091349N163859K879663j3163069
38265E6850352k4800387j5084506N041128J1292885K038073k504432M307893P136321
$$ plain form
38319 76985095 53883776 43273520 60776727 80790231 69904692 40698817 38663331
38312 38663331 72837555 96230595 72366391 28530554 13748962 28221888 32595292
38305 32595292 15102899 6976319 28218090 56708145 65757586 62337444 67388010 79069885
38297 79069885 78783762 62734737 46996103 45000957 54408334 64443030 66579386 59967808
38289 59967808 52207345 50940614 51648439 42089710 23169762 13684772 25430704 44386263
38281 44386263 48704385 37123159 25826582 22764231 20446846 13561908 9904392 19432063
38273 19432063 40219477 59655210 67084513 64061248 61969899 67133758 70013421 56850352
38265 56850352 32049965 16965459 22006587 33299472 35337545 32833113 37141006 44277327
38257D4277327M92837R36349J4862237K0456173J829370k0046334j5485884R155130
38249E6477205K1575690J0422644m780854q462673p241650q643760n423081P255913
38241F1179434J6543604R089320o946736j2719507o283456l185278r251323r497365
38233C8928693P364723K6306571K3274283j73361j7023250j1035510M382848R785506
38225H1810503N276210J311698o42151k717493J154990J3096881J8061465M162809
38217A21514912j2123419n527555J7931888K6709112R136524j3040581j9063003
38210A25537878j1688449j070786Q832843J2192235M028232m049011L762124J6393383
38202A53938449Q274619j3120980j1380975J5648751K2065568j2604842m1255023
$$ plain form
38257 44277327 44770164 45706513 60568750 81024923 82854293 62807959 47322075 56477205
38249 56477205 78052895 88475539 83694685 75232012 67990362 59346602 53923521 61179434
38241 61179434 77723038 86812358 79865622 67146115 60862659 57677381 48426058 38928693
38233 38928693 46293416 72599987 95874270 95700909 78677659 67642149 72024997 81810503
38225 81810503 87086713 88398411 87756260 85038767 86193757 99290638 117352103 121514912
38217 121514912 109391493 103863938 121795826 148504938 157641462 144600881 125537878
38210 125537878 113849429 112778643 121611486 133803721 137831953 133782942 137545066 153938449
38202 153938449 162213068 149092088 137711113 153359864 175425432 162820590 121565567
38195A21565567j7986771K9128043M0808075J3538565p985455o412741m768239
38188A67887044j1774447q379407P743163J2233555j932223j1245670l354537
38181A51177478M490834J86245l698443K244030P435101M950854M018728P456985
38173A78261812L879197o854389q002744L375916Q261097m63830n331575J784639
38165A74910123M066450o108996r257877M785912J3489509m54045j5927824o931620
38157A58571632J4198256J7801289K385753j1515984j7612340k3103115k3257056
38150A17468435p430231J5739887K5697022J8465741O646869k293654p887932
38143A66406137o170664J812554J347062j4276836k5217310j2640260P531950
$$ plain form
38195 121565567 103578796 132706839 173514914 187053479 179068024 172655283 167887044
38188 167887044 156112597 147733190 155476353 167709908 165777685 154532015 151177478
38181 151177478 155668312 155854557 152156114 154400144 161835245 166786099 170804827 178261812
38173 178261812 182141009 175286620 167283876 170659792 178920889 178457059 173125484 174910123
38165 174910123 178976573 172867577 163609700 168395612 181885121 181431076 165503252 158571632
38157 158571632 172769888 190571177 192956930 181440946 163828606 140725491 117468435
38150 117468435 110038204 125778091 151475113 169940854 176587723 174294069 166406137
38143 166406137 160235473 162048027 163395089 149118253 123900943 111260683 118792633
38136A18792633P228907p635029o815344J3213572K2740498O001935j6586209
38129A36940963k0529832n837216J3371183K5348972K1359716J081680j7903101
38122A53832365j5940982O39303P579271q16419o964313k962526j163087o913372
38114A27290240q401363j899196k82942o253466l881614J0553521J6100859J755332
38106A34981371j1549963l284994J4180968J7442427Q522319O171203J3679104
38099A80142435J7785132J1586700M3325j1003814j6939620j2750237j031048
38092A67832873P051369P968134J0639751J6260568J0835273r038546k2254309
38085A89295113j3390060J093908j101355j1627384o638089J3210068K5071175
$$ plain form
38136 118792633 126021540 118386511 111571167 124784739 147525237 153527172 136940963
38129 136940963 116411131 110573915 123945098 149294070 170653786 171735466 153832365
38122 153832365 137891383 138530686 146109957 145293538 138329225 135366699 134203612 127290240
38114 127290240 118888877 116989681 116706739 110453273 106571659 117125180 133226039 134981371
38106 134981371 123431408 120146414 134327382 151769809 160292128 166463331 180142435
38099 180142435 197927567 209514267 209557592 198553778 181614158 168863921 167832873
38092 167832873 174884242 182852376 193492127 209752695 220587968 211549422 189295113
38085 189295113 175905053 176998961 175897606 164270222 157632133 170842201 195913376
38078A95913376J9458459P747680j571929r471125j1519770l01271J6840774K2996517
38070B40092711J4978815L865029m666395j1636409j1378949Q19927J1613133
38063B43687862M653227r989550q454314O328986Q008172o408626q621196J0985622
38055B40190183K1530109J143204k3183694j5295444J3295456K1249414j62221
38048B58767007j8467371j2095828K709678N165016J608312P185926J5629530
38041B60502270R496595p966886j3696575R94052J6340858J3010011j46487k004697
38033B76529141P466776R958170J495670j133772Q693989J3681622J726566j2521175
38025C05896987j2178007m963917m171117o16835J8588691L6380493K4106582
$$ plain form
38078 195913376 215371835 223119515 221547586 212076461 200556691 200255420 217096194 240092711
38070 240092711 255071526 258936555 254270160 242633751 231254802 232074729 243687862
38063 243687862 248341089 238351539 229897225 236226211 244234383 237825757 229204561 240190183
38055 240190183 261720292 262863496 239679802 224384358 237679814 258929228 258767007
38048 258767007 240299636 228203808 230913486 236078502 237686814 244872740 260502270
38041 260502270 269998865 262031979 248335404 249329456 265670314 278680325 278533838 276529141
38033 276529141 283995917 293954087 295449757 294315985 303009974 316691596 318418162 305896987
38025 305896987 293718980 288755063 284583946 283967111 302555802 338936295 363042877
38018C63042877j1304686l2026887k2515850o024597k803608l684414L764670
38011B88447505J1776777J0515270O126968N079442P65880r394316j2600943j753743
38003B98962840R380209P075727k133121n976608m985067k652301N941496K0125905
37995C25739080K4500540J0810189n311805o208290K649016N928846L488892M503271
37987C66099739Q278549Q485935O550446M989687k051695j5877930k1746441p333272
37979C47395018J5640503K3701765R522336j2789747k2190706m889409L1498887
37972C87888647N3002242K9949442j9344241m2110075k0278003N945841K082484
37965C97136337j0293476K267133K6023203K6912943R167958O65878K69661j1448768
$$ plain form
38018 363042877 351738191 319711304 297195454 291170857 288367249 284682835 288447505
38011 288447505 300224282 310739552 316866520 321945962 322711842 313317526 300716583 298962840
38003 298962840 308343049 315418776 313285655 307309047 302323980 299671679 305613175 325739080
37995 325739080 350239620 361049809 355738004 349529714 352178730 358107576 361596468 366099739
37987 366099739 374378288 382864223 389414669 394404356 392352661 376474731 354728290 347395018
37979 347395018 363035521 386737286 396259622 383469875 361279169 356389760 387888647
37972 387888647 440890889 470840331 451496090 409386015 389108012 395053853 397136337
37965 397136337 386842861 389109994 415133197 442046140 451214098 451879976 452149637 440700869
37957D40700869k4519219j4297191N850244r5689k6400877l0110202j750079K1670604
37949C71048460K0649970J6836143K1216516J2194402j5735516l1467777j9408733
37942C75333465o551466j1282630r429581J6913394L7349767J8399378k0469349
37935D00262978l5159566j8829897k0460L463960k945537j0276283j1782538j996652
37927C22716005R847960K850583k0960342k8566327m201295K0793530J3571773
37920C16051887j0813068j8016731q760918p155879j3270294q116922N116091
37913B55034166M800306q830874j3191378j899579P951265O592333Q35471o542745
37905B44748965j8806298k7041009j7210221L250830J1135009J760682n654223
$$ plain form
37957 440700869 416181650 401884459 407734703 407639014 381238137 351127935 349377856 371048460
37949 371048460 391698430 408534573 429751089 441945491 426209975 394742198 375333465
37942 375333465 368781999 357499369 348069788 364983182 402332949 420732327 400262978
37935 400262978 365103412 346273515 346253055 349717015 346771478 336495195 324712657 322716005
37927 322716005 332563965 335414548 314454206 285887879 281686584 302480114 316051887
37920 316051887 305238819 287222088 278461170 271305291 258034997 249918075 255034166
37913 255034166 259834472 251003598 237812220 235912641 243863906 250456239 251291710 244748965
37905 244748965 225942667 198901658 181691437 184942267 196077276 197837958 192183735
37898A92183735J061394J2423358J5941701R957876k411457j5286330j6568038
37891A97302239m59391J7719931J6799122k052817j9125669k3946688k1021506
37884A65215221j3004523R01866J2650849J2074706M530029L532189Q570593Q151864
37876B02622794R17993m273450m433987j355339P878168K1026248K1945851K871603
37868B47199881j6524417j5961215o379198p563059j0527631K896338J8054844
37861B11195543P405682j7477990k0510816k725281J135305j2132382p543361
37854A59346700K0422718L0541977M991747j7121209m737084J4947733N710489
37847B14103071j9471175k6881327j4811173j371370J0264493J9318591R693104
$$ plain form
37898 192183735 193245129 205668487 221610188 231568064 229156607 213870277 197302239
37891 197302239 196842848 214562779 231361901 229309084 210183415 186236727 165215221
37884 165215221 152210698 153112564 165763413 177838119 182368148 185900337 194470930 202622794
37876 202622794 203540787 199267337 194833350 193478011 201356179 222382427 244328278 247199881
37868 247199881 230675464 214714249 208335051 200771992 190244361 193140699 211195543
37861 211195543 218601225 201123235 180612419 177887138 179022443 166890061 159346700
37854 159346700 179769418 210311395 215303142 198181933 193444849 208392582 214103071
37847 214103071 194631896 167750569 152939396 151568026 161832519 181151110 190844214
37840A90844214j8955612l1462625p228483J8273868M983899k5330388k3408082
37833A07716791P552498K0607100K109134j5062769j2489645p567476r748343
37826I3117290m674511Q518837Q697860o269647j0810728L127516J1830545N089960
37818A08627122M858944J9673027K1559937m983466k8516806j8396194M681227
37811A07503791L971989j3013588j2688211L549237M275417j1539454q065342
37804G3993839K4664631M5252530J9808170k5647744l9547954j2061000K0622993
37797A07085465K9614504K2484532J7955067J5891582M661233j4337519k4161874
37790A59192990j3674434O900659J5799670L954967j3803247j5103309L082845
$$ plain form
37840 190844214 171888602 140425977 133197494 151471362 156455261 131124873 107716791
37833 107716791 115269289 135876389 137985523 122922754 110433109 102865633 93117290
37826 93117290 88442779 96961616 105659476 99389829 88579101 91706617 103537162 108627122
37818 108627122 113486066 133159093 154719030 149735564 121218758 102822564 107503791
37811 107503791 111475780 98462192 85773981 89323218 93598635 82059181 73993839
37804 73993839 98658470 143911000 163719170 138071426 98523472 86462472 107085465
37797 107085465 136699969 159184501 177139568 193031150 197692383 183354864 159192990
37790 159192990 145518556 152419215 168218885 172173852 158370605 143267296 146350141
37783A46350141K0016197J6774587p97788j2305867r923835l144425Q50439N726339
37775A63545788J1856185R948389k636543j3248974j2769326r949399j3328086
37768A33418034j2540872L052542J8462110J0985035j1335376j7106001J543840
37761A26479312J7957685J3495701K757308L404658P147225j52136j1045247j1521669
37753A48522837o703702p996252q089836N626364K1993852J7636062n664224k0693967
37745A44631134j3204885J920077O678686K239663r54720M65026K836374O06218
37737A45217573j1192289k8509890l3123895j0888885K4101231M0133260K5674119
37730A51411224M35780j4404655j8415172j8053736j0798036L954632J3767199
$$ plain form
37783 146350141 166366338 183140925 182343137 170037270 160113435 156969010 157819449 163545788
37775 163545788 175401973 185350362 182713819 169464845 156695519 146746120 133418034
37768 133418034 120877162 123929704 142391814 153376849 142041473 124935472 126479312
37761 126479312 144436997 157932698 160690006 164094664 171241889 171089753 160044506 148522837
37753 148522837 141819135 133822883 125733047 131359411 153353263 170989325 165325101 144631134
37745 144631134 131426249 133346326 140025012 142264675 141309955 141774981 144611355 145217573
37737 145217573 134025284 105515394 72391499 61502614 85603845 125737105 151411224
37730 151411224 151847004 137442349 119027177 100973441 90175405 94130037 107897236
37723A07897236Q268315m919225j2367542j3025560j1199980k282846J7224382
37716H9594780L2685806K4270395l782578k4439352k1240693n517731L959311
37709I5529938M095655K272049J30161n058634q690968j563545J4885454K5681966
37701A27282076J9188574J895457q853641n428627J918402l82246r974054r931647
37693A15714294Q579378L0456551L1114621O782985j8336473k0733369o425488
37686A47152499n33234j0884011j7289485l024518J7633130J8510868N00178q429346
37678A43636081O528633K6218852K5948809Q772576l996770m549201l079709n438665
37670A94040606m871657K453470R457480J0341451Q092361M794461l172419j3447441
$$ plain form
37723 107897236 116165551 111246326 98878784 85853224 74653244 72370398 89594780
37716 89594780 122280586 146550981 142768403 118329051 97088358 91570627 95529938
37709 95529938 99625593 101897642 102027803 96969169 88278201 86714656 101600110 127282076
37701 127282076 146470650 148366107 139512466 134083839 136002241 135619995 125645941 115714294
37693 115714294 124293672 154750223 185864844 192647829 174311356 153577987 147152499
37686 147152499 146619265 135735254 118445769 115421251 133054381 151565249 152065427 143636081
37678 143636081 150164714 176383566 202332375 211104951 207108181 202558980 199479271 194040606
37670 194040606 189168949 191622419 201079899 211421350 219513711 224308172 221135753 207688312
37662B07688312j3522754J306226J5552394J1845034m677455j3508254o182653
37655A98500850P509414J8436004K6829837K9968265J8596793n687121k3620859
37648B70533183k1255628r461268o393693q897277L08093K0353700K8927906J6563563
37640B90678579L960174J1509373K6377970J9681267r665671k9978936j9583513
37633B92979243L736819P885780j0353723k3798710j4272830L489138M992736
37626B64658453q968616j5149274k527212J2445985J1066282q50419l692386O517011
37618B63499824J4430730R016872l207143j0103347p214360L152186J4996831
37611B84571593J8023904N229205j4848082k3584521j3816121L334397J4664956
$$ plain form
37662 207688312 194165558 195471784 211024178 222869212 218191757 204683503 198500850
37655 198500850 206010264 224446268 251276105 281244370 299841163 294154042 270533183
37648 270533183 249277555 239816287 233422594 224525317 224833410 245187110 274115016 290678579
37640 290678579 294638753 306148126 332526096 352207363 342541692 312562756 292979243
37633 292979243 296716062 304601842 294248119 270449409 256176579 259665717 264658453
37626 264658453 255689837 240540563 238013351 250459336 261525618 260675199 256982813 263499824
37618 263499824 277930554 286947426 283740283 273636936 266422576 269574762 284571593
37611 284571593 302595497 307824702 292976620 269392099 255575978 258910375 273575331
37604B73575331J6262421P953855p956942j9378143j3427819K287710O365805
37597B65682218k910403l891511J0041990J6260148K646911p821207M314192J9625343
37589C03947681J3015588k672273j716996P557763J674459r821940q83017J8596874
37581C29698139J6633717j139592O23906J9211246J2248562k5069856m0093691
37574C12112431m151542L8756657L7688142N626683j2322018o150339K722355
37567C74282369N676895R546264J3113927J2246358J3564307J9407639J7296578
37560D65134337M319019j348372O604174O662259j0222691j7022964L355946K2360999
37552D79842707J2029951o110487r24449J0387121n514189l2682548k8866711
$$ plain form
37604 273575331 289837752 297791607 289834665 270456522 257028703 259316413 265682218
37597 265682218 262771815 258880304 268922294 285182442 287829353 280008146 284322338 303947681
37589 303947681 316963269 314290996 312574000 320131763 321806222 311984282 311101265 329698139
37581 329698139 346331856 345192264 345816170 365027416 377275978 352206122 312112431
37574 312112431 307960889 346717546 384405688 390032371 377710353 371560014 374282369
37567 374282369 379959264 389505528 402619455 414865813 428430120 447837759 465134337
37560 465134337 469453356 468104984 474709158 481371417 471148726 454125762 457481708 479842707
37552 479842707 491872658 485762171 484837722 495224843 489710654 457028106 428161395
37545D28161395J278081J3052019m872459j8742126j0951354j434528l741944
37538D02749084o816263o701890j3400634k0572932r763323J0533527J1507989
37531C67535558o244750j2802147l316790n925215k6911347l6200129k1576508
37524B54558672j0293298j8171181k2338582p155663N209509l697276j4564408
37517A83547773n674467J0785148J4602756R625146N269420m282484j8652504
37510A95220788j9441791l771270J798575j4251528k3585786o047523J2296558
37503A42218023L433460j3220980o035791J2476552R577605q661423r703105P044184
37495A37128525J0997739n081050j4330246j865886J4287698J4050266n81263
$$ plain form
37545 428161395 429439476 442491495 437619036 418876910 407925556 406491028 402749084
37538 402749084 395932821 389230931 375830297 355257365 345494042 356027569 367535558
37531 367535558 361290808 348488661 345171871 339246656 312335309 276135180 254558672
37524 254558672 244265374 226094193 203755611 196599948 201809457 198112181 183547773
37517 183547773 177873306 188658454 203261210 212886356 218155776 213873292 195220788
37510 195220788 175778997 172007727 173806302 159554774 135968988 129921465 142218023
37503 142218023 145651483 132430503 126394712 138871264 148448869 139787446 130084341 137128525
37495 137128525 148126264 143045214 128714968 126849082 141136780 155187046 154605783
37488A54605783j6841406k5172739k0481089o691252K738010K951334O454646
37481I7563287J8273033J9415995j991768k1628434j1950158J0580605P383381
37474A17645941k1861276l8713497k3638844K233597J5264827J5464390R532197
37467G5927335j089081q213292p34127J2872931J1657672l334874r018655k2636
37459G8045273J813769j2438699k0108626m910325J3609563J0503719n461652
37452F1053022p835846N378087J0732254l488748k0557047j9804182l974674O327044
37444B7829910O19639q374115l844202R824715J3327611K767071m333285P20339
37436C8537683K755121q117181j4363334o08969J4280308M804687j6150679j5252284
$$ plain form
37488 154605783 137764377 112591638 92110549 85419297 88157307 91108641 97563287
37481 97563287 115836320 135252315 133260547 111632113 99681955 110262560 117645941
37474 117645941 95784665 57071168 33432324 35665921 50930748 66395138 75927335
37467 75927335 74838254 66624962 65890835 78763766 90421438 87086564 78067909 78045273
37459 78045273 79859042 67420343 47311717 42401392 56010955 66514674 61053022
37452 61053022 53217176 58595263 69327517 65838769 45281722 25477540 21502866 27829910
37444 27829910 28449549 20075434 16231232 26055947 39383558 42150629 37817344 38537683
37436 38537683 41292804 33175623 18812289 18203320 32483628 37288315 21137636 5885352
37428E885352P203714J9951487J4262820J2681367K0324672J1989234j7900575
37421G4398071l4439432j4738629J3586516J4204122n758606j4912164o506759
37414B5833119K472452M598118N088747L586085j066576J085474J3684666J6915330
37406G2197415n357500l2273206k9977915k119048J5332497P447828m058431j822065
37398A9369575L042920j627504n961457J320309J0673700P671815m444581j3865753
37390A6179024j8224537j8451341q337608J1958167K3617185J1442484q833970
37383I349404q257910J2997198K4873905J1693486p156973j0034263l698879m889180
37375B4876788r796827m119133Q122885J0594673M202816N207434J3832262J1002865
$$ plain form
37428 5885352 13089066 33040553 47303373 59984740 80309412 92298646 74398071
37421 74398071 39958639 25220010 38806526 53010648 47252042 32339878 25833119
37414 25833119 28305571 32903689 37992436 41578521 40511945 41597419 55282085 72197415
37406 72197415 66839915 34566709 4588794 2469746 17802243 25250071 21191640 19369575
37398 19369575 22412495 20784991 14823534 16143843 26817543 34489358 30044777 16179024
37390 16179024 -2045513 -20496854 -28834462 -16876295 6740890 18183374 9349404
37383 9349404 1091494 14088692 38962597 50656083 43499110 33464847 29765968 24876788
37375 24876788 15079961 10960828 19083713 29678386 33881202 39088636 52920898 63923763
37367F3923763p499301j9228561r699337M139291K206164o903585m350926M431322
37359B7018830J23206j4353516j5933577J664878J8363783J8296094Q080353o12837
37351D2647214o787313j1090871q692468k80596M028591J72940l012813M38469
37343A7423153M106845L096776L881273J0616474J4337509P400386j958433k092051
37335E6811932L331019J811734q620753j8237894j9523074j2281249O34168J3014753
37327A6940636J5372227N552553m635086l573313L345332K351684o669383j0440844
37319A8243806m256246R71204k278802n505812Q55643R765023O807152p086511
37311A7515457j4499762m762807J1496839J6521465P664572k516944n583150o522602
$$ plain form
37367 63923763 56424462 37195901 27496564 31635855 33842019 26938434 22587508 27018830
37359 27018830 27142036 12788520 -3145057 -1480179 16883604 35179698 43260051 42647214
37351 42647214 35859901 24769030 16076562 15795966 19824557 19997497 16984684 17423153
37343 17423153 21529998 24626774 28508047 39124521 53462030 60862416 58903983 56811932
37335 56811932 60142951 61954685 53333932 35096038 15572964 3291715 3925883 16940636
37327 16940636 32312863 37865416 33230330 29657017 33002349 35354033 28684650 18243806
37319 18243806 13987560 14958764 12679962 7174150 8029793 17794816 24601968 17515457
37311 17515457 3015695 -1747112 9749727 26271192 33935764 31418820 25835670 19313068
37303A9313068j0878398j1858487M72451K0419544K7865908J1817080j4048381
37296D3102785k5282070j3436620O555430J5313744R704291J847532J742372P164204
37288D6711668J0727371R968143O408414J40835q058430j2634708q943675j371872
37280D2947746J818146J57519j053882k450632q817286j5659524j1187692M705927
37272A0460322J6372754J2788291M96136q926974j2294845j0627699m935745j718993
37264A613247p667129j3150066L07830K7703804L7930853J7021567r212132j4007505
37256D0540469o917199q117415r775862M386867K0576127J4370507m293889o239312
37248D4530293N060832R0387k0927085k4908885l627566J1031782J704303p572468
$$ plain form
37303 19313068 8434670 -3423817 -2951366 17468178 45334086 57151166 43102785
37296 43102785 17820715 4384095 10939525 26253269 35957560 37805092 39547464 46711668
37288 46711668 57439039 67407182 73815596 73956431 65898001 53263293 44319618 42947746
37280 42947746 44765892 44923411 43869529 41418897 32601611 16942087 5754395 10460322
37272 10460322 26833076 39621367 40117503 31190529 18895684 8267985 3332240 1613247
37264 1613247 -6053882 -19203948 -18896118 8807686 46738539 63760106 54547974 40540469
37256 40540469 33623270 25505855 15729993 20116860 40692987 55063494 50769605 44530293
37248 44530293 49591125 49681512 28754427 3845542 217976 11249758 12954061 5381593
37240E381593L074500J6398734J2963075M129238N352329O958521k848573j2603723
37232C8805694r969485m498877m787027N59095J4606203J3788886j2236541l0671665
37224E596283j1398406K1486428K4151622j10057j1971742r07202O893158K20104
37216C3960188k800608N115295O954175l689960r862788l853227j233929j0571709
37208A4017437j6950530q748327L086573N588792L101377L876562N359180M023096
37200A3354160L967326N961345K703702o490030j0578091m271000L035830L210419
37192A0893661J254368L968478Q369339Q091853K244499n580125q947516r04946
37184A9389611J4208200J6720780l698648k5312363j9476821N040258J1974168
$$ plain form
37240 5381593 8456093 24854827 37817902 41947140 47299469 54257990 51409417 38805694
37232 38805694 28836209 24337332 19550305 20109400 34715603 48504489 36267948 5596283
37224 5596283 -5802123 15684305 39835927 39725870 27754128 26846926 33740084 33960188
37216 33960188 31159580 36274875 43229050 39539090 29676302 25823075 24589146 14017437
37208 14017437 -2933093 -11681420 -8594847 -3006055 95322 3971884 9331064 13354160
37200 13354160 17321486 23282831 25986533 19496503 8918412 4647412 7683242 10893661
37192 10893661 12148029 16116507 24485846 32577699 34822198 29242073 20294557 19389611
37184 19389611 33597811 50318591 46619943 21307580 1830759 6871017 18845185
37177A8845185o568358j7736382j491943J7610829J1545008q227641j4905274
37170i28576r741864j1071975j6350900p545269J3007203K2196506J1331510k671578
37162a774943m000450L502695Q112034N374351j949377p844822n422868N827193
37154A823813J6322422J7795805J4007815J1052725M399399j1096798k4978022
37147B9327159k2073302o563001K460681r71987l939901J237831N716321L209604
37139H403405L284247J4700833K7742502K5875733Q412176r710556j7750839j9308356
37131D1649145k2334434k5672385j9542829N15339K2794554K8196672J2740767
37124C8346829n307957p880268j61700K46826p922213q728626K465241Q920803
$$ plain form
37177 18845185 12276827 -5459555 -6951498 10659331 22204339 13976698 -928576
37170 -928576 -10670440 -21742415 -38093315 -45638584 -32631381 -10434875 896635 -1774943
37162 -1774943 -5775393 -2272698 5839336 11213687 9264310 1419488 -4003380 1823813
37154 1823813 18146235 35942040 49949855 61002580 65401979 54305181 29327159
37147 29327159 7253857 690856 3151537 2179550 -1760351 -522520 5193801 8403405
37139 8403405 11687652 26388485 54130987 80006720 88418896 78708340 60957501 41649145
37131 41649145 19314711 -6357674 -25900503 -25385164 -2590610 25606062 38346829
37124 38346829 33038872 25158604 24996904 25243730 17321517 8592891 11058132 19978935
37116A9978935q57112j3249167r716449N458677J3496557R013898K627957K18533
37108B6971829k708776o497733m489829K231343L112987l382260m521822N582299
37100A6298038J3970918R097084N3718P00412N241359j439575j5472796j8039196
37092A0409962o863606r9954l735203j4122J8601296K7955158P612169k0359370
37084C3506330j9028611N831292J2153693j1787956k6100632k107765K8782308
37077B1248659K1274130j3065302k3411464J543877J8751938J273291k0963950
37070F651179j2818013J0353300J2042010n715992j1807377j546287J1761j1772440
37062a4601859j0291697J3615565L0933299K0666117L594290N417532J3956236
$$ plain form
37116 19978935 19121823 5872656 -3843793 1614884 15111441 24125339 26753296 26971829
37108 26971829 24263053 17765320 13275491 15506834 18619821 15237561 10715739 16298038
37100 16298038 30268956 39366040 39419758 40120170 45361529 43921954 28449158 10409962
37092 10409962 3546356 3446402 -288801 -302923 18298373 46253531 53865700 33506330
37084 33506330 14477719 20309011 32462704 20674748 -5425884 -7533649 21248659
37077 21248659 42522789 29457487 6046023 7589900 26341838 27615129 6651179
37070 6651179 -6166834 4186466 16228476 10512484 -1294893 -2841180 -2829419 -14601859
37062 -14601859 -24893556 -11277991 19655308 40321425 43915715 49333247 63289483
37055F3289483L452455j8917811k4667383r874574L938259P768164J0839014J1532679
37047D7360286k649733k2953927k1494255M593188K2020816Q737843j4748952
37040B0865266j8932673o563195j34123o944274j7042907k1041309j1863743J5595116
37032d6061842M7741150N2297600J8072476k0636397k5809523q112619n743218
37025A1747627k0973948j8056120J3116434L3350963J2469619k2351300k5220775
37018a5917500K781599J9930701P624003o547323L788412K1983619J4294587j7448449
37010C0489649l4982283j5888927J6004521K4100295O933931n908011J815334
37003B2564509J4177220J0412132p424597k1244332j8671331j963524J4485873
$$ plain form
37055 63289483 66741938 47824127 23156744 13282170 17220429 24988593 35827607 47360286
37047 47360286 44710553 21756626 262371 4855559 26876375 35614218 20865266
37040 20865266 1932593 -4630602 -4764725 -11708999 -28751906 -49793215 -61656958 -46061842
37032 -46061842 1679308 53976908 72049384 51412987 25603464 17490845 11747627
37025 11747627 -9226321 -27282441 -14166007 19184956 31654575 9303275 -15917500
37018 -15917500 -13135901 6794800 14418803 7871480 11659892 33643511 47938098 30489649
37010 30489649 -4492634 -20381561 -4377040 19723255 26657186 20749175 22564509
37003 22564509 36741729 47153861 39729264 18484932 -186399 -2149923 12335950
36996A2335950J2887088r262101k8257780j8689403R588535K0972722N351210
36989D926221p592049L031907J6790617R187308o880184o302010M347512K058748
36981A9568070j0280545j2504423n772183o061434q507859L691981K1112954J8457399
36973A9703960j39531o867657N1003l615875j6536531r302919J7264625K3081290
36965B3638365l342775j9517748N02602J9736824J291470k5949648j4323008K2053443
36957D089525K9419284p72194k4219309j5341637M057193J0894821J0813050J2085691
36949C1026424P218178m940604q295854L921256J4432389P797231p076932j2575574
36941C1506514n633537N183407J3066191J3987927N142588q969335j7049579j4217894
$$ plain form
36996 12335950 25223038 15960937 -12296843 -30986246 -21397711 -424989 4926221
36989 4926221 -2665828 366079 17156696 26344004 19463820 13161810 17509322 19568070
36981 19568070 9287525 -3216898 -8989081 -15050515 -23558374 -19866393 1246561 19703960
36973 19703960 19564429 12696772 12747775 9131900 -7404631 -16707550 557075 23638365
36965 23638365 20295590 777842 1280444 21017268 22308738 -3640910 -17963918 4089525
36957 4089525 33508809 32736615 8517306 -6824331 -2767138 8127683 18940733 31026424
36949 31026424 38244602 33303998 25008144 28929400 43361789 51159020 44082088 31506514
36941 31506514 25872977 31056384 44122575 58110502 63253090 54283755 37234176 23016282
36933B3016282q084783p152907r573764p483296K084769J3145348J5244035L310552
36925B4506236j4097721k0466643r541942P294700J6157662J5489181J0477382
36918B9818855L383761k167715P56774Q751232N342681j3525693k4890860r229700
36910a760665J6224857J8919852j576730j4484477m438755R895077Q002775n766988
36902B5014946j5715500j5874899r054825L29751N837206L564551K38542M682948
36894i77280J1855372J0397737L653608L741719O569499k899533j8952015j7052150
36886c663043M889653J6576075J161999j6617429r014915J1642923J4639950j424303
36878A8190910j1493129n158446L340513L428379J201551K049947J340027k723742
$$ plain form
36933 23016282 14931499 7778592 -1795172 -9278468 -7193699 5951649 21195684 24506236
36925 24506236 10408515 -10058128 -19600070 -12305370 3852292 19341473 29818855
36918 29818855 33202616 31034901 31791675 40542907 45885588 32359895 7469035 -1760665
36910 -1760665 14464192 33384044 31807314 17322837 12884082 22779159 30781934 25014946
36902 25014946 9299446 -6575453 -15630278 -15300527 -9463321 -5898770 -5660228 -977280
36894 -977280 10878092 21275829 24929437 28671156 35240655 32341122 13389107 -3663043
36886 -3663043 1226610 17802685 18964684 2347255 -6667660 4975263 19615213 18190910
36878 18190910 6697781 1539335 4879848 8308227 9509778 11559725 12899752 10176010
36870A0176010l501837J481722N415648L998640P05999l160480j1279481k0190126
36862a6353905j7157478J005181J7174500J3772561k588187r224227J798394J4457755
36854B884594J2948488J950649m586905l491990L16491P105654J6823342J6829027
36846E0779350l500114k6945737k2755754O766382K1533634N71405k3909644j4328480
36838a1788958J4383814J9836002m46810r073529O898093J5621831n110490l1139053
36830h19100k9307088l775557J6328659J5899008J738956j2934684j6045566k371069
36822c1286441J5663038J6824268L86618j0540044m319743K349309l960694r409107
36814b4292796k77638Q548223j711200j8387977j5457536N028595J8296353J6150302
$$ plain form
36870 10176010 6674173 8155895 13571543 17570183 18276182 15115702 3836221 -16353905
36862 -16353905 -33511383 -32506202 -15331702 -1559141 -4147328 -13371555 -11573161 2884594
36854 2884594 15833082 17783731 13196826 9704836 10021327 17126981 33950323 50779350
36846 50779350 47279236 20333499 -2422255 4344127 25877761 26449166 2539522 -11788958
36838 -11788958 2594856 22430858 21984048 12910519 19808612 35430443 30319953 -819100
36830 -819100 -30126188 -33901745 -17573086 -1674078 64878 -12869806 -28915372 -31286441
36822 -31286441 -15623403 1200865 1587483 -8952561 -13272304 -10922995 -14883689 -24292796
36814 -24292796 -24570434 -16022211 -17733411 -36121388 -51578924 -46550329 -28253976 -12103674
36806a2103674J2987701J5748843J4252544L438755o046112l950028O541097J3228315
36798D4097441M363101k0335189m0486222l0431633M081579K2963299M258895
36791a1488729k1015749j3296775J6279657K7096282J4405521R085514J7772231
36784C8837952J2353349j3937484k7582646r803180J0884131N642613j0180275
36777F214460q898375J640213l828056k0591411j9581807O975482L4275757L8090036
36769C4296299J8819442o225028j9094946j2498346K711013N801959q112675j9067525
36761c369807j0259050O212999P632929m812054r529650J769087J3687726J1909628
36753A3241808K234947l98573P684900J4573666O149545j6118070l1255588k0011374
$$ plain form
36806 -12103674 884027 16632870 30885414 34324169 28278057 24328029 30869126 44097441
36798 44097441 48460542 28125353 -12360869 -42792502 -38710923 -15747624 -11488729
36791 -11488729 -32504478 -45801253 -29521596 -2425314 11980207 21065721 38837952
36784 38837952 51191301 37253817 9671171 -132009 10752122 16394735 6214460
36777 6214460 -2683915 -1043702 -4871758 -25463169 -45044976 -38069494 -3793737 34296299
36769 34296299 53115741 46890713 27795767 15297421 18008434 23810393 15697718 -3369807
36761 -3369807 -13628857 -7415858 217071 -4594983 -14124633 -12355546 1332180 13241808
36753 13241808 15476755 15078182 22763082 37336748 43486293 27368223 -3887365 -23898739
36745b3898739Q405000K3025638J0403160p363077m566436J3032189K0975414
36738D0013149J1509699l069797j3358625j8292875j4072617L17529J0257397
36731A3303860J017673j5308152j2484541R042199K0008574O724299r338496p814854
36723E150562R21885L46676j633121Q165296J6137619K42632k7549056l0282584
36715b8500091n4412K7465875K3238881K921087l304924K770456k494029j9545044
36707B497799k1760775J162256K3624317K0497644K447409l731619L443771J920581
36699C0101383j4436881k2976482o720951J7447206K0686118K233202j0558654
36692A5774941j229986J3708082R465703j1739005k3834031j2297835Q620807
$$ plain form
36745 -23898739 -15493739 7531899 17935059 10571982 6005546 19037735 40013149
36738 40013149 51522848 48453051 35094426 16801551 2728934 3046463 13303860
36731 13303860 14321533 -986619 -13471160 -4428961 15579613 22303912 12965416 5150562
36723 5150562 6072447 6419123 4786002 12951298 29088917 29331549 1782493 -28500091
36715 -28500091 -28554503 -1088628 22150253 25071340 21766416 24536872 22042843 2497799
36707 2497799 -19262976 -18100720 5523597 26021241 28468650 24737031 28180802 30101383
36699 30101383 15664502 -7311980 -14032931 3414275 24100393 26333595 15774941
36692 15774941 14544955 28253037 37718740 25979735 2145704 -10152131 -1531324
36685a531324J8601322J6738350J2342311K766283j8085502l4307509j9982719
36678b3458788J6499794L0589715K989069k5468557j1213430K3036173K0607101
36671C3581077j9029187l6190664m143702K8629100J5696970j5642762j2419984
36664i519152J8540290K5876204k289991k4217576j4196126L691544L225272n453099
36656d342634m950543k864953r146120q947764J1646869L2137036K2952511n895864
36648C0588538j5256788M984675K0796462O197628j7840240j6061194Q333632
36641B1742713J9171633l39159k5364135k4660434M50981K3110358K5007017J0827510
36633D9946484m639458j1277722q148934l294572o934341j6864694j6263141K734968
$$ plain form
36685 -1531324 17069998 33808348 46150659 48916942 30831440 -3476069 -23458788
36678 -23458788 -6958994 23630721 26619790 1151233 -10062197 12973976 33581077
36671 33581077 14551890 -21638774 -25782476 2846624 18543594 2900832 -9519152
36664 -9519152 9021138 34897342 32607351 8389775 -5806351 -2114807 1110465 -4342634
36656 -4342634 -9293177 -12158130 -21304250 -30252014 -18605145 13531891 36484402 30588538
36648 30588538 15331750 20316425 41112887 47310515 29470275 13409081 21742713
36641 21742713 40914346 40575187 15211052 -9449382 -8998401 14111957 39118974 49946484
36633 49946484 45307026 34029304 25880370 22585798 15651457 -1213237 -17476378 -14741410
36625a4741410K0671229J3670383r671275j7099453M75153J6670108J1748088
36618B1722823J69567P72825M519585m988663j7987075j2728450Q522357K3894483
36610B3897452K4663481J9177057J0793120k863521j3245561r169104N84494k067906
36602E1769512j3319683j3257839j536410K097132n115152l240552J1651958J5508032
36594D4556998l340996k1610852j7192200j901916K856129K83383M149657R495947
36586A7296150L820109n612576j970669J1595401J6734098R397142K551729K069183
36578E5880567L64514n972788j0106161q295855n041323l416835k041425j986942
36570A9383752n795732r503150n525420O091130J6784811J8770666R820331o494981
$$ plain form
36625 -14741410 5929819 19600202 9928927 -7170526 -6695373 9974735 21722823
36618 21722823 21892390 22665215 27184800 22196137 4209062 -8519388 2969 23897452
36610 23897452 48560933 67737990 78531110 75667589 62422028 53252924 53837418 51769512
36602 51769512 38449829 25191990 23655580 25752712 20637560 17397008 29048966 44556998
36594 44556998 41216002 19605150 2412950 511034 3367163 3650546 7800203 17296150
36586 17296150 21116259 15503683 13533014 25128415 41862513 51259655 53811384 55880567
36578 55880567 56245081 50272293 40166132 31870277 26828954 23412119 21370694 19383752
36570 19383752 13588020 4084870 -1440550 4650580 21435391 40206057 50026388 43531407
36562D3531407j8866975j3953959O404610K0795760J2429956q499973j8586029
36555B3254797j0847155K805464J2036924J4528694O759203j2123397k7311215
36548I103315j8902373R595908K9834473K2703787J13237j4946514j7127917j6564043
36540C809873j7402951j2621582R73293J3542574J2923749J057642n724375M189700
36532G47923K1063173K3608642O747220j0358442j0630173k802481n528704j5440970
36524G406188j0972325J1235825K5153278J1266833j2818677j5167299N569571
36517B1673394J8492525M419766j8221081k1287423n567633N451927K452175p92092
36509F621558L730481L829125p701709j4399575j718878J4576933J0402721o524585
$$ plain form
36562 43531407 24664432 10710473 17115083 37910843 50340799 41840826 23254797
36555 23254797 12407642 15213106 27250030 41778724 48537927 36414530 9103315
36548 9103315 -9799058 -203150 29631323 52335110 52448347 37501833 20373916 3809873
36540 3809873 -13593078 -26214660 -25241367 -11698793 1224956 2282598 -3441777 747923
36532 747923 21811096 45419738 52166958 41808516 31178343 28375862 22847158 7406188
36524 7406188 -3566137 7669688 32822966 44089799 31271122 16103823 21673394
36517 21673394 40165919 44585685 26364604 5077181 -490452 4961475 7413650 6621558
36509 6621558 10352039 14181164 6479455 -7920120 -9638998 4937935 15340656 8816071
36501H816071p757090Q521429J3743544l104833j6628242o567886J1457972J4659695
36493B3140660O922189K992414R50032o523457j2006674p573382k283707l345058
36485B273017J217479J6542623J9433297n396898k8113830j2594601K2469892
36478A5830979K7049301l029665k2153059r771292L009744n492963j0803900Q106532
36470B745677K6153757J3505306j2923787j7009738j17272P294883l038382j0193743
36462F416701k649128P517641R040422M982723o4112o183095r582108m791614
36454D687430K855764J937517n914097n422793R814575K5028926K0512618m350863
36446D9149077k7256915k4576140J096273J8856170M824430k2764777k1687004
$$ plain form
36501 8816071 1058981 9580410 23323954 20219121 3590879 -2977007 8480965 23140660
36493 23140660 30062849 33055263 34005295 27481838 15475164 7901782 5618075 2273017
36485 2273017 3490496 20033119 39466416 34069518 5955688 -6638913 15830979
36478 15830979 42880280 39850615 17697556 7926264 10936008 5443045 -5360855 2745677
36470 2745677 28899434 42404740 29480953 12471215 12353943 19648826 16610444 6416701
36462 6416701 3767573 11285214 20325636 25308359 25244247 19061152 9479044 4687430
36454 4687430 7543194 9480711 3566614 -1856179 7958396 32987322 53499940 49149077
36446 49149077 21892162 -2683978 -1587705 17268465 22092895 -671882 -22358886
36439b2358886J6379785M8149871L3867168r544451l3652813k2969743n103732
36432D767199j939122l448056K835535N807959p252955k2060037j4282431J2359768
36424b3212140K7723602J6836742J45936K020059J3861043P508380j9279894l4167152
36416h563424j5848397J2121762J3247042q721458j6097715N025871K3946704
36409E110385J3123368j0211742j1676076R025884K1056771R140869q999976j3534413
36401A3035070q289887o766916q363053k282040J0980184J5209978p24879k3728038
36393a0929581k6701092j260108K6951466K6057180j693277k1863140j2695983
36386b2134535Q872145J5463860O929315K285463N124285K08570j6541512k6618652
$$ plain form
36439 -22358886 -5979101 42170770 76037938 66493487 32840674 9870931 4767199
36432 4767199 2828077 -619979 2215556 8023515 770560 -21289477 -35571908 -23212140
36424 -23212140 4511462 21348204 21494140 23514199 37375242 44883622 25603728 -8563424
36416 -8563424 -24411821 -12290059 956983 -7764475 -23862190 -18836319 5110385
36409 5110385 18233753 8022011 -3654065 5371819 26428590 35569459 26569483 13035070
36401 13035070 4745183 -2021733 -10384786 -12666826 -1686642 13523336 12798457 -10929581
36393 -10929581 -37630673 -38890781 -11939315 14117865 12424588 -9438552 -22134535
36386 -22134535 -13262390 2201470 9130785 11416248 16540533 16749103 207591 -26411061
36378b6411061j4960272P929429K0308177J6174979P141057K687427L78196l518739
36370I729193m108863L894591J2680086P258867j2099260k3866796j1166483J3555857
36362d122808K3341238J2580456J110996J498046K203859p892810j6925712q382551
36354C410714J0201922J5929646K465291j4154528j9611587j5087226o707586
36347b3553354K845872Q271513J752764j2744747j6225290L025319K9545368L5329456
36339B8246901J4110671j0396467j4855819m237040P86934l983506m325508L449546
36331H795712M034005p701184j1911116L461365J5482967l98506k4463985j6474546
36323b9175288J9654161L5858277J1288470j7253660j4022434M009872K489559
$$ plain form
36378 -26411061 -41371333 -33441904 -13133727 3041252 10182309 12869736 13247932 9729193
36370 9729193 5620330 9514921 22195007 29453874 17354614 -6512182 -17678665 -4122808
36362 -4122808 19218430 31798886 32909882 34407928 36611787 28718977 11793265 3410714
36354 3410714 13612636 29542282 32007573 17853045 -1758542 -16845768 -23553354
36347 -23553354 -20707482 -12435969 -10683205 -23427952 -39653242 -36627923 -7082555 28246901
36339 28246901 42357572 31961105 17105286 12868246 13655180 9671674 5346166 8795712
36331 8795712 12829717 5128533 -6782583 -3321218 12161749 11763243 -12700742 -29175288
36323 -29175288 -9521127 26337150 37625620 20371960 6349526 10359398 12848957
36316A2848957j2946013j0862556J1218617K2916817P384980j7845688k7644353
36309a4929239j5948923N374254J9078640J4884839K79019n560610L305962J1308869
36301A7792811P084281J107206L684715M337964o782496j5273647n470067Q858278
36293A5339045N611296o891294m125294J1215828J4441886K708310j742621P515997
36285D4073153J1345496P98569r337836r830719r967688j2624813n342108J2127928
36277B1241982J8116936J590090j7674123j6647218O61715J3975321J3457096
36270C4721799M216178m435406o054136k362773l656398j3708922j7978357k552499
36262a1810514K0568694K7791311J8157180Q677916J378521j4103582k8328556
$$ plain form
36316 12848957 -97056 -10959612 259005 23175822 30560802 12715114 -14929239
36309 -14929239 -30878162 -25503908 -6425268 8459571 8738590 3177980 6483942 17792811
36301 17792811 24877092 25984298 29669013 34006977 27224481 11950834 6480767 15339045
36293 15339045 20950341 14059047 9933753 21149581 35591467 38299777 36557156 44073153
36285 44073153 55418649 56217218 46879382 37048663 27080975 14456162 9114054 21241982
36277 21241982 39358918 40949008 23274885 6627667 7289382 21264703 34721799
36270 34721799 38937977 34502571 28448435 26085662 22429264 8720342 -9258015 -11810514
36262 -11810514 8758180 36549491 54706671 63384587 64763108 50659526 22330970
36255B2330970j9466193M341136R549855p636252j2047261J0374249K5975228
36248C3421732R093142j5958728j7505006n154139k451712k750682R545431J9508028
36240B7748066M630256k0835692k4826872q457675J13556n867527o484090N761815
36232b8218163J5694410J4006943P276457L2736p664053p177667Q732924K5079701
36224B7763288J8824341o879582k5133334k0576274k157897J4894545J9602429
36217B6337516N225162j8640725k3287560L658401L0286691J9127591j5306518
36210B7400558k5325715k236242J3303374j927238k0606533j4230737L522497
36203b0100036O285355k702333m193113L114705P492253P724226R920844J2061355
$$ plain form
36255 22330970 2864777 7205913 16755768 9119516 -2927745 7446504 33421732
36248 33421732 42514874 26556146 9051140 3897001 1445289 -1305393 8240038 27748066
36240 27748066 32378322 11542630 -13284242 -21741917 -21628361 -27495888 -33979978 -28218163
36232 -28218163 -12523753 1483190 8759647 8792383 1128330 -6049337 2683587 27763288
36224 27763288 46587629 39708047 14574713 -6001561 -8159458 6735087 26337516
36217 26337516 31562678 12921953 -10365607 -6707206 23579485 42707076 27400558
36210 27400558 2074843 -161399 13141975 11214737 -9391796 -23622533 -20100036
36203 -20100036 -13814681 -16517014 -20710127 -17595422 -10103169 -2378943 7541901 19603256
36195A9603256R086090L487133k049301j0488356j7884947j0867169R612147J9181795
36187A9680648K927394j7600123j2244587J3041997K3240622K770781k4966108
36180F850624k9575764q883913J3754163J7333379K447536j2998762j3327567
36173b4400304K13518J4288093J9357022J5282239M965988o899972j0120108K098683
36165A4785159J8375780J7800911k123337k0550963k1666938j2338491m405018
36158a0122897K925437J1624134J2858263J957695q293196n690505J827752J300159
36150H386842k298212K534924R471165L694569j0195268j2725248o47192Q490551
36142F712131M953124k93464L410159R837098P818684k938575j4449660j9288304
$$ plain form
36195 19603256 28689346 32176479 30127178 19638822 1753875 -9113294 498853 19680648
36187 19680648 22608042 5007919 -7236668 5805329 29045951 31816732 6850624
36180 6850624 -22725140 -31609053 -17854890 -521511 1926025 -11072737 -24400304
36173 -24400304 -24186786 -9898693 9458329 24740568 29706556 22806584 12686476 14785159
36165 14785159 33160939 50961850 48838513 28287550 6620612 -5717879 -10122897
36158 -10122897 -7197460 4426674 17284937 19242632 10949436 5258931 7086683 8386842
36150 8386842 6088630 8623554 18094719 21789288 11594020 -1131228 -1778420 6712131
36142 6712131 11665255 11371791 14781950 24619048 32437732 29499157 15049497 -4238807
36134d238807j3349504O30265J0583373O670945l840699n116530L799107Q951823
36126D089973O256556P906491J7873114K0142625L637104j6829851k0103749p939895
36118A5032368J585084J655832N70672K921723M300303L690866N231599O453162
36110D1441609m01477j2285318j4895622l988777N958070K847682m616793j255053
36102A2804321J0030731J2672876K554561n784470k180025L895197j92627q897039
36094B4903525p030503M819259R018851k437397j4560892j1184990J376634N460459
36086A0364946o52100k953024L041146N453595j631923o607091p79693M644541
36078A0880397l448529j5879911j2900454M841387J5636922P648323o350563r826961
$$ plain form
36134 -4238807 -17588311 -16958046 -6374673 296272 -3544427 -8660957 -4861850 4089973
36126 4089973 10346529 18253020 36126134 56268759 59905863 43076012 22972263 15032368
36118 15032368 16617452 18273284 18843956 21765679 26065982 29756848 34988447 41441609
36110 41441609 41040132 28754814 13859192 9870415 15828485 18676167 14059374 12804321
36102 12804321 22835052 35507928 38062489 32278019 30097994 33993191 33800564 24903525
36094 24903525 17873022 22692281 31711132 29273735 14712843 3527853 4904487 10364946
36086 10364946 9712846 6759822 9800968 15254563 13622640 7015549 6235856 10880397
36078 10880397 7431868 -8448043 -21348497 -16507110 -870188 6778135 427572 -9399389
36070i399389l847061J94797j129622j431671M285421J3287278J7556321J0532593
36062C0048667m416683j2745956l950306J1604854J2047637o689937k3162169
36055B736107j8462493j29234J1430780R947391M633084K376250K260485L720514
36047A8512884P359407R260708N088204j493397l529588j443553k5665J382549
36039C5111549M900182M232645p659193k2593014k3762440r923029J543906K0059
36031a8129335l690411M365811J9521394K5027408J3976944m326799j6556762
36024B0188250j6717444p286440M365330R847883M519799q102730j6959464j2304428
36016b2449244K567013J1757434N697394l575258K086377J7459892J8306622j035
$$ plain form
36070 -9399389 -13246450 -13051653 -14181275 -15612946 -11327525 1959753 19516074 30048667
36062 30048667 25631984 12886028 8935722 20540576 32588213 25898276 2736107
36055 2736107 -15726386 -15855620 -4424840 5522551 10155635 12531885 14792370 18512884
36047 18512884 25872291 35132999 40221203 38727806 35198218 33754665 33729000 35111549
36039 35111549 40011731 44244376 36585183 13992169 -9770271 -19693300 -18149394 -18129335
36031 -18129335 -21819746 -17453935 2067459 27094867 41071811 36745012 20188250
36024 20188250 3470806 -3815634 549696 10397579 14917378 6814648 -10144816 -22449244
36016 -22449244 -19882231 -8124797 -2427403 -6002661 -3916284 13543608 31850230 31849195
36008C1849195j1142398P70600J2146559l076047k6874405k1576720R607001K4796830
36000A6500615N863466j8812272k1174140q453915R16649N022761O603633J285690
35992a2247513n820375K446756K4753279L4139355J8702615J568793K76736k892810
35984F0926836k3114265l6555703j7901608J1133292J3303826k582802J416418
35977F625994K4296787K5954705l331965k3067041o085626K0369431J8944618
35970F3706903n011001k0272513j6552933q667641o928319o088768K35913R014963
35962I436604J1911214M689289o113794p569592K932977J0619525K927522j1220283
35954A7613462j5968540j3185134j2619029o958025J5326920L7337744K8234436
$$ plain form
36008 31849195 20706797 21477397 33623956 30547909 3673504 -17903216 -8296215 16500615
36000 16500615 22364081 3551809 -17622331 -26076246 -25159597 -20136836 -13533203 -12247513
35992 -12247513 -18067888 -15621132 9132147 43271502 61974117 63542910 63819646 60926836
35984 60926836 37812571 1256868 -16644740 -5511448 7792378 5209576 6625994
35977 6625994 30922781 56877486 53545521 30478480 24392854 44762285 63706903
35970 63706903 58695902 38423389 21870456 13202815 6274496 185728 421641 9436604
35962 9436604 21347818 26037107 19923313 12353721 15286698 25906223 28833745 17613462
35954 17613462 1644922 -11540212 -24159241 -31117266 -15790346 21547398 49781834
35947D9781834o501806k4948461r128666R884302L947017j0152890o171296N078270
35939A1788304j016617j4802168o598571K0860990L2192919J2322272j2532769
35932D2214360j4291742J641965J1340989M803516q319293j4582637q635733M849677
35924A9021102J4913839J3271341K368386p714579r985017n295648J259555M265670
35916C2104649M04341q307122j4816203j3669165n781296M432604J2673613J4755336
35908B1796757R289586K027626J92664R71486m661658j4253913j2979501L203570
35900E586617J6969986J2624063j885663q418692m118314Q06015K467634M254889
35892B8286535L791990m032607j3143763j1655191j194323M423761R89411j072220
$$ plain form
35947 49781834 43280028 18331567 9202901 19087203 23034220 12881330 6710034 11788304
35939 11788304 10771687 -4030481 -10629052 10231938 42424857 54747129 42214360
35932 42214360 27922618 29564583 40905572 45709088 37389795 22807158 14171425 19021102
35924 19021102 33934941 47206282 49574668 41860089 31875072 26579424 27838979 32104649
35916 32104649 32508990 24201868 9385665 -4283500 -10064796 -5632192 7041421 21796757
35908 21796757 31086343 33113969 33306633 34278119 29616461 15362548 2383047 5586617
35900 5586617 22556603 35180666 33295003 24876311 20757997 21564012 24031646 28286535
35892 28286535 32078525 28045918 14902155 3246964 2052641 6476402 7465813 6393593
35884F393593L555735O374776K661689K311595J1747864J7331076K857151k2303501
35876C0929978l0391262j2375985Q170612O930728p603170p483656J2502018K4905190
35868B5584453Q298463j9733225k3645281K745393K7680691K2368613m299165
35861C8999942k0276695j0854672O389901O499380j1210393k2751515j0968434
35854b4172486J0260297J3550540k906050j1469047K852510J6941940M947755
35847A0005459j7951124j6247575R693716K2785225O755392j1096332o645385
35840b700624N202378K313125n762355J118151J4736187J2687931j260921l678744
35832B2655128P274630R026563n803859j6719888r973650l35220m894695j4390868
$$ plain form
35884 6393593 9949328 16324104 18985793 21297388 33045252 50376328 53233479 30929978
35876 30929978 538716 -11837269 -3666657 3264071 -4339099 -11822755 679263 25584453
35868 25584453 33882916 14149691 -9495590 -6750197 20930494 43299107 38999942
35861 38999942 18723247 7868575 14258476 20757856 9547463 -13204052 -24172486
35854 -24172486 -13912189 -361649 -3267699 -14736746 -11884236 5057704 10005459
35847 10005459 -7945665 -24193240 -14499524 8285701 15041093 3944761 -2700624
35840 -2700624 2501754 4814879 -947476 170675 14906862 27594793 26333872 22655128
35832 22655128 29929758 38956321 33152462 16432574 6458924 6123704 1229009 -13161859
35824a3161859q315981J1502377K0235728K882145k4382834l1882585j1463975
35817e4586984J4066328J9805299R246426M642052J1196682J0055244p787146
35810F637901k1420126r344520J6562792K6841291J5179637J919359J020257N136777
35802D2533368M724955K402358K500304J209841n173895j1501487r770364O02499
35794B7527579J1130131J0935180k350901j5962179j3327773L296102J2101172
35787C3349311J826975j0741280o911665M221950K162461j0059006j2213510k056317
35779d21081K748748l297529o575629j922794l22799l714260O17724J1756620
35771a131000R222453j0888022k0869243k178859K2255342K0826627j90687j0404572
$$ plain form
35824 -13161859 -21477840 -9975463 10260265 13142410 -11240424 -43123009 -54586984
35817 -54586984 -40520656 -20715357 -11468931 -6826879 4369803 14425047 6637901
35810 6637901 -14782225 -24126745 -7563953 19277338 34456975 36376334 37396591 42533368
35802 42533368 47258323 49660681 52160985 53370826 48196931 36695444 26925080 27527579
35794 27527579 38657710 49592890 47241989 31279810 17952037 21248139 33349311
35787 33349311 35176286 24435006 17523341 21745291 23907752 13848746 1635236 -421081
35779 -421081 2327667 -969862 -7545491 -9468285 -9791084 -13505344 -12887620 -1131000
35771 -1131000 8091453 -2796569 -23665812 -25844671 -3589329 17237298 17046611 6642039
35763F642039k667250L188046k058755n720436q49990K068848k091172k237861
35755c726531O217538Q228986n982787j8939518q760601J5050584K1340204K514222
35747A5942097j2513016l6699K2115035J8570170j2236093l3629164k0098326
35740b1885996R788257K1116907P460437q955693j2498128r238538q044939n688192
35732b7945885L201464J4499008K0299941J7991552Q732124n107344j6597614
35725A5073246j6846990o640968J813595O27889l205551M34079R050003J2068433
35717A2373736O928317J365246Q13580K125806J319964L81782K342486M245189
35709C1896106O32939p454904j2786279j2171570j0473627j1218165r765909k498499
$$ plain form
35763 6642039 3974789 7162835 5104080 -616356 -1466346 602502 -1488670 -3726531
35755 -3726531 2491007 10719993 4737206 -14202312 -22962913 -7912329 13427875 15942097
35747 15942097 3429081 3392382 25507417 44077587 31841494 -1787670 -21885996
35740 -21885996 -12097739 9019168 16479605 7523912 -4974216 -14212754 -22257693 -27945885
35732 -27945885 -24744421 -10245413 10054528 28046080 36778204 31670860 15073246
35725 15073246 -1773744 -8414712 -6601117 -5973228 -9178779 -8744700 305303 12373736
35717 12373736 19302053 20667299 21480879 23606685 24926649 25308431 27650917 31896106
35709 31896106 32529045 25074141 12287862 116292 -10357335 -21575500 -31341409 -33839908
35701c3839908L487815O96762l319304M228611J7546603J7013295J059444q173188
35693a299870k18422N768998m925734j3177101L583370K8831728K7442205J64350
35685D6169524j7158548q155771M988480L297822j848901K654709N395059o775230
35677B8567144k1795596k0538751o590584K946122M650855O703348Q608579L234514
35669E785631n739685o919738j19709L612082P68285j0047O072976J1796785J0110025
35660B5356605N134035M643254O843828K252189j1028646k0624443j4560862L16907
35652a667133M873982n162442j1441236q04311J2524593P999394q522552j3719052
35644a5918757k656089P294849O849555N062737O900382M718570k175228k567628
$$ plain form
35701 -33839908 -30352093 -29655331 -32974635 -28746024 -11199421 5813874 6873318 -1299870
35693 -1299870 -1518292 4250706 -675028 -13852129 -10268759 18562969 46005174 46169524
35685 46169524 29010976 20855205 25843685 29141507 27292606 29947315 35342374 28567144
35677 28567144 6771548 -13767203 -20357787 -17411665 -12760810 -6057462 2551117 5785631
35669 5785631 45946 -6873792 -6993501 -3381419 -2613134 -2623181 3449795 15246580 25356605
35660 25356605 30490640 35133894 41977722 44229911 33201265 12576822 -1984040 -1667133
35652 -1667133 3206849 -1955593 -13396829 -14201140 -1676547 6322847 -2199705 -15918757
35644 -15918757 -18574846 -11279997 -4430442 632295 7532677 12251247 10076019 7508391
35636G508391M623245N936370p46316L99077J3346478J8344347L674092j4259003
35628C8826681j8311709j4809415j2924713m280944J4910375K4435332R219601
35621C7065208j1139066r745896O712281J2470973L339186o204871j2599753j8597660
35613A300402j2004552J5763436L9310821K6109824j0065021k2345268R08852
35606C8978494K1282980J1674989p351918q528841J99374k468234j4405845j9858878
35598A9522121j6943656j2547100m302996J1084694K2515485J7448099K916407
35591C9693054l801034k63013J244264m233883p541721j979655M989498J716889
35583B9824399j1139665j9558380j2668192K705715R444265K136457p050373p836636
$$ plain form
35636 7508391 12131636 18068006 17321690 17720767 31067245 49411592 53085684 38826681
35628 38826681 20514972 5705557 -7219156 -11500100 3410275 27845607 37065208
35621 37065208 25926142 16180246 22892527 35363500 38702686 32497815 19898062 1300402
35613 1300402 -10704150 5059286 44370107 70479931 60414910 38069642 38978494
35606 38978494 60261474 71936463 64584545 56055704 56255078 53786844 39380999 19522121
35598 19522121 2578465 -9968635 -14271631 -3186937 19328548 36776647 39693054
35591 39693054 35892020 35629007 36873271 32639388 25097667 23118012 28107510 29824399
35583 29824399 18684734 -873646 -13541838 -10836123 -1391858 744599 -6305774 -14142410
35575a4142410n030408l859199L543789K1231858L1457108J5555261j4060884
35568C4695115k6180480j2207114P275261J5038889J2116347J322747j6934108
35561A5126657k9696420k0227195K183851Q570840n892012j3076835K473980J9140427
35553b1396707J5277393K130672n14312L707394K670629M34437L520843K643973
35545H474322p883904j1772358K865593J7323802J0052613o725842q163405J311146
35537E481967M94115p468922l250676Q369670N594521p265782m743303J0987125
35529H198715R379413j2819652j9396261N064313K4740447Q806605j7692877j3354791
35521g074088J5684404K9550941J5890881j376039o993619j0557319j6889254
$$ plain form
35575 -14142410 -19172818 -23032017 -19488228 1743630 33200738 48755999 34695115
35568 34695115 8514635 -3692479 3582782 18621671 30738018 32060765 15126657
35561 15126657 -14569763 -34796958 -32613107 -24042267 -29934279 -43011114 -40537134 -21396707
35553 -21396707 -6119314 -3988642 -4502954 -795560 1875069 2309506 5830349 8474322
35545 8474322 590418 -11181940 -8316347 9007455 19060068 12334226 4170821 5481967
35537 5481967 5976082 -1492840 -4743516 3626154 9220675 1954893 -2788410 8198715
35529 8198715 17578128 4758476 -14637785 -9573472 15166975 23973580 6280703 -7074088
35521 -7074088 8610316 38161257 54052138 52676099 45682480 35125161 18235907
35514A8235907j4274270m20102P751055J503240n663253l499847k668997j1225880
35506a0262147j3615395N125138K8650876K8394652O197045q594093l508793K629265
35498C5016548m987083j4265816j1540702n933370r330100j1682049k06095J2073009
35490a0855658N481296q673828k427446K0088661K4317825J414622j4191945P38294
35482A5891821K0186166J0827745j4956538k0543612k321000R472276m232j3001777
35474E550849j1942099j508787O844306J0061694P542710j384436r072108n027718
35466A064411O368273R203212j50135q706543q848484p090863p247154l505757
35458a8913040L831048M362548k831045l951991N667521J0962238K523360n477827
$$ plain form
35514 18235907 3961637 3541535 11292590 12795830 7132577 3632730 963733 -10262147
35506 -10262147 -23877542 -18752404 9898472 38293124 44490169 35896076 32387283 35016548
35498 35016548 30029465 15763649 4222947 -1710423 -11040523 -22722572 -22928667 -10855658
35490 -10855658 -5374362 -14048190 -16475636 3613025 27930850 29345472 15153527 15891821
35482 15891821 36077987 46905732 31949194 11405582 9084582 18556858 18552626 5550849
35474 5550849 -6391250 -7900037 -1055731 9005963 16548673 15164237 6092129 1064411
35466 1064411 7432684 16635896 16485761 7779218 -1069266 -8160129 -15407283 -18913040
35458 -18913040 -15081992 -10719444 -13550489 -17502480 -11834959 -872721 1650639 -3827188
35450c827188J582316J3702675J2832647J555529n059805n908620r812506j2257105
35442g192057j127973J6088228J6515298k317928j4993710o176793N845801r23831
35434E717035j6461887j4197175P478437K2417200J4578621k160921p745719k852749
35426F772842j729606q688273j3399546n664841J2756908K8563920K5977949J959487
35418D6548840k3838348k4529051J098600K2807254J7486809J10403k034617P029580
35410D4679470K260376j4633600j3523491J1615752K4683950M52128l4568176
35403B0966409l9391978j3480159J2682464K2426642J9170496M851439j5385950
35396A1839363k0015368K825083K6124515J7252088q370136q810775J3982853
$$ plain form
35450 -3827188 -2244872 11457803 24290450 25845979 20786174 14877554 5065048 -7192057
35442 -7192057 -8320030 7768198 24283496 21965568 6971858 795065 6640866 5717035
35434 5717035 -10744852 -24942027 -17463590 4953610 19532231 17371310 9625591 6772842
35426 6772842 5043236 -3645037 -17044583 -22709424 -9952516 18611404 44589353 46548840
35418 46548840 22710492 -1818559 -719959 22087295 39574104 39684507 37649890 44679470
35410 44679470 46939846 32306246 18782755 30398507 55082457 55534585 20966409
35403 20966409 -18425569 -31905728 -19223264 3203378 22373874 27225313 11839363
35396 11839363 -8176005 -5350922 20773593 38025681 29655545 20844770 34827623
35389C4827623J5130174j5996211l2936339o741852K5987783K1610306n215889
35382C6665595j4069048m317797l432871j1720623n900456J2211470J4907274
35375B4343544m226269j9989847j6001240l596798M436192J0231583J4259039
35368I456204Q041019p550315j7237662j2819502l296024J516304J749018j043703
35360b1184661o635903q071423J964359J4859335J4474093L507313Q40645R518404
35352I272162J0965549j633190r115609J085894J1002493L23269j8623021j7471191
35344a4193644N584157K2914875J6128299j749736p848730J96141M910937m748167
35336B1194132j7526021j4900471K650130J4948767J0265087J327971L372908
$$ plain form
35389 34827623 49957797 33961586 1025247 -5716605 20271178 41881484 36665595
35382 36665595 22596547 18278750 14845879 3125256 -2775200 9436270 24343544
35375 24343544 20117275 127428 -15873812 -19470610 -15034418 -4802835 9456204
35368 9456204 17497223 9946908 -7290754 -20110256 -23406280 -21889976 -20140958 -21184661
35360 -21184661 -27820564 -35891987 -33927628 -19068293 -4594200 -1086887 -246242 9272162
35352 9272162 20237711 18604521 9488912 10574806 21577299 21900568 3277547 -14193644
35344 -14193644 -8609487 14305388 30433687 28683951 20835221 21031362 25942299 21194132
35336 21194132 3668111 -11232360 -8582230 6366537 16631624 17959595 21332503
35329B1332503Q979819K234747j1478299j3266413m374903n026617j7041668j6176153
35321c4816984Q021635L1022676K7806610O774447q393850j1521142r506029k981409
35313F405954O840122P106667p549115j7653384n411735J2702349P689545j5585050
35305e454647k4465928q412048Q760163R391800L487925J700489k673271j0728135
35297b8393652n365927J7896852L1297138J1947699j8467441k0573774N610371
35290f048734K1882446R243139p545544k298696J3310909J2366312l857198j0567955
35282B6484679p43552M687883p122335j7298578k877021K5424597L3644976J0479802
35274G2680451j6821718j9063061k266073N005764p127538j8607051j0448005
$$ plain form
35329 21332503 30312322 32547069 21068770 7802357 3427454 -1599163 -18640831 -34816984
35321 -34816984 -26795349 4227327 32033937 38808384 30414534 18893392 9387363 6405954
35313 6405954 13246076 20352743 12803628 -4849756 -10261491 2440858 10130403 -5454647
35305 -5454647 -29920575 -38332623 -29572460 -20180660 -16692735 -14992246 -17665517 -28393652
35297 -28393652 -33759579 -15862727 15434411 27382110 8914669 -11659105 -6048734
35290 -6048734 15833712 25076851 17531307 15232611 28543520 40909832 37052634 26484679
35282 26484679 25741127 30429010 23306675 6008097 3131076 28555673 62200649 72680451
35274 72680451 55858733 36795672 34529599 39535363 32407825 13800774 3352769
35267C352769Q461744J4961463L293942r798425j0375760m407591l558259m809702
35259b879819K404279J3148337Q744289j3593992k9643776j9394989L385757J0907783
35251b6922131K421735K190035J7244785K3438009L306464k4739743l1784090
35244c4844936j6667777M42347J0853545K1201206L0057031K4602644L828898
35237C9472958j4209004j5684124p484042k374500L39191Q144437J6807776J2550094
35229C7562786o254759k0884634j3892437N999703J2420832k961963j6681449
35222d691921o076657J6463686K1543505Q118776L403220J5376588J7405282n694044
$$ plain form
35267 3352769 11814513 26775976 30069918 20271493 9895733 5488142 1929883 -2879819
35259 -2879819 -475540 12672797 21417086 7823094 -21820682 -41215671 -37829914 -26922131
35251 -26922131 -24500396 -22310361 -5065576 18372433 21678897 -3060846 -34844936
35244 -34844936 -51512713 -51070366 -40216821 -19015615 11041416 35644060 39472958
35237 39472958 25263954 9579830 2095788 -278712 60479 8204916 25012692 37562786
35229 37562786 31308027 10423393 -3469044 2530659 14951491 11989528 -4691921
35222 -4691921 -10768578 5695108 27238613 35357389 38760609 54137197 71542479 65848435
$$ [...]
##END NTUPLES=NMR SPECTRUM
##END=
