##TITLE=31Pdec_SP10P_4
 CDCl3, 124 sc
 10.2.2022
##JCAMPDX= 6.0         $$ Bruker NMR JCAMP-DX V2.0
##DATA TYPE= NMR SPECTRUM
##DATA CLASS= NTUPLES
##ORIGIN= UXNMR, Bruker Analytische Messtechnik GmbH
##OWNER= root
$$ XWIN-NMR		Version 3.5
$$ Thu Feb 10 13:43:13 2022 Russian Standard Time (UT+4h)  she@DPX200
##.OBSERVE FREQUENCY= 81.013821
##.OBSERVE NUCLEUS= ^31P
##.ACQUISITION MODE= SIMULTANEOUS
##.ACQUISITION SCHEME= undefined
##.AVERAGES= 124
##.DIGITISER RES= 16
##SPECTROMETER/DATA SYSTEM= spect
##.PULSE SEQUENCE= zgpg30
##.SOLVENT NAME= Acetone
##.SHIFT REFERENCE= (INTERNAL, Acetone, 0, 248.564)
##AUDIT TRAIL= $$ (NUMBER, WHEN, WHO, WHERE, WHAT)
$$ ##TITLE= Audit trail, XWIN-NMR		Version 3.5
$$ ##JCAMPDX= 5.01
$$ ##ORIGIN= Bruker BioSpin GmbH
$$ ##OWNER= she
$$ F:/spectra/data/she/nmr/P31/1/pdata/1/auditp.txt
$$ ##AUDIT TRAIL=  $$ (NUMBER, WHEN, WHO, WHERE, WHAT)
(   1,<2022-02-10 13:40:52.73 +0400>,<she>,<DPX200>,
      <continue with go, POWCHK disabled, PULCHK disabled
       configuration hash MD5:
       00 E9 B6 7A A2 85 ED C7 34 08 36 98 17 FE 4E 26
       data hash MD5: 32K
       1B 8B A1 05 12 67 99 C1 20 17 E1 3C 10 9E E9 DB>)
(   2,<2022-02-10 13:40:59.71 +0400>,<she>,<DPX200>,
      <Start of raw data processing
       efp BC_mod = 2 LB = 1 FT_mod = 6 PKNL = 1 PHC0 = -9713.604 PHC1 = 475.2746 SI = 64K 
       data hash MD5: 64K
       A9 50 05 B7 BA 92 2F FB 6F 1E D1 CD AA 0D 72 7A>)
(   3,<2022-02-10 13:42:00.93 +0400>,<she>,<DPX200>,
      <pk PHC0 = -3.5108 PHC1 = 0 
       data hash MD5: 64K
       31 1D 8D E3 65 D1 B4 77 C0 8D EC 30 72 E1 57 94>)
$$ ##END=
$$ 
$$ hash MD5
$$ A5 72 ED A3 37 95 DE 7B 7C BB 15 88 E3 6D 0C 7D
##$RELAX= 
##$RELAX= 
##$RELAX= 
##$RELAX= 
##$RELAX= 
##$RELAX= 
##$RELAX= 
##$RELAX= 
$$ Bruker specific parameters
$$ --------------------------
##$DU= <F:/spectra>
##$EXPNO= 1
##$NAME= <P31>
##$PROCNO= 1
##$TYPE= <nmr>
##$USER= <she>
##$AMP= (0..31)
100 100 100 100 100 100 100 100 100 100 100 100 100 100 100 100 100 100 
100 100 100 100 100 100 100 100 100 100 100 100 100 100 
##$AQSEQ= 0
##$AQ_mod= 1
##$AUNM= <au_zg>
##$AUTOPOS= <>
##$BF1= 81.014009
##$BF2= 200.13
##$BF3= 200.13
##$BF4= 200.13
##$BF5= 200.13
##$BF6= 200.13
##$BF7= 200.13
##$BF8= 200.13
##$BYTORDA= 1
##$CFDGTYP= 0
##$CFRGTYP= 5
##$CHEMSTR= <none>
##$CNST= (0..31)
1 1 145 1 1 1 1 1 1 1 1 1 1 1 1 1 1 1 1 1 1 1 1 1 1 1 1 1 1 1 1 1 
##$CPDPRG= <waltz16>
##$CPDPRG1= <>
##$CPDPRG2= <waltz16>
##$CPDPRG3= <>
##$CPDPRG4= <mlev>
##$CPDPRG5= <mlev>
##$CPDPRG6= <mlev>
##$CPDPRG7= <mlev>
##$CPDPRG8= <mlev>
##$CPDPRGB= <>
##$CPDPRGT= <>
##$D= (0..31)
0 1 0 0 0 0 0 0 0 0 0 0.03 2e-05 3e-06 0 0 0 0 0 0 0 0 0 0 0 0 0 0 0 0 
0 0 
##$DATE= 1644485880
##$DBL= (0..7)
120 120 120 11 120 120 24 19 
##$DBP= (0..7)
150 150 150 150 150 150 150 150 
##$DBP07= 0
##$DBPNAM0= <>
##$DBPNAM1= <>
##$DBPNAM2= <>
##$DBPNAM3= <>
##$DBPNAM4= <>
##$DBPNAM5= <>
##$DBPNAM6= <>
##$DBPNAM7= <>
##$DBPOAL= (0..7)
0.5 0.5 0.5 0.5 0.5 0.5 0.5 0.5 
##$DBPOFFS= (0..7)
$$ [...]
##$SUBNAM2= <"">
##$SUBNAM3= <"">
##$SUBNAM4= <"">
##$SUBNAM5= <"">
##$SUBNAM6= <"">
##$SUBNAM7= <"">
##$SUBNAM8= <"">
##$SUBNAM9= <"">
##$SW= 501.771253377433
##$SWIBOX= (0..15)
0 1 3 0 0 0 0 0 0 0 0 0 0 0 0 0 
##$SW_h= 40650.406504065
##$TD= 32768
##$TD0= 1
##$TE= 0
##$TE2= 300
##$TE3= 300
##$TEG= 300
##$TL= (0..7)
0 120 53 12 22 120 120 120 
##$TP= (0..7)
150 150 150 150 150 150 150 150 
##$TP07= 0
##$TPNAME0= <>
##$TPNAME1= <>
##$TPNAME2= <>
##$TPNAME3= <>
##$TPNAME4= <>
##$TPNAME5= <>
##$TPNAME6= <>
##$TPNAME7= <>
##$TPOAL= (0..7)
0.5 0.5 0.5 0.5 0.5 0.5 0.5 0.5 
##$TPOFFS= (0..7)
0 0 0 0 0 0 0 0 
##$TUNHIN= 0
##$TUNHOUT= 0
##$TUNXOUT= 0
##$USERA1= <user>
##$USERA2= <user>
##$USERA3= <user>
##$USERA4= <user>
##$USERA5= <user>
##$V9= 5
##$VALIST= <valist>
##$VCLIST= <CCCCCCCCCCCCCCC>
##$VD= 0
##$VDLIST= <DDDDDDDDDDDDDDD>
##$VPLIST= <PPPPPPPPPPPPPPP>
##$VTLIST= <TTTTTTTTTTTTTTT>
##$WBST= 1024
##$WBSW= 4
##$XGAIN= (0..3)
0 0 0 0 
##$XL= 0
##$YL= 0
##$YMAX_a= 12895
##$YMIN_a= -15248
##$ZGOPTNS= <>
##$ZL1= 120
##$ZL2= 120
##$ZL3= 120
##$ZL4= 120
##$ABSF1= 0
##$ABSF2= 0
##$ABSG= 0
##$ABSL= 0
##$ALPHA= 0
##$AQORDER= 0
##$ASSFAC= 0
##$ASSFACI= 0
##$ASSFACX= 0
##$ASSWID= 0
##$AUNMP= <proc_1d>
##$AZFE= 0.1
##$AZFW= 0.5
##$BCFW= 0
##$BC_mod= 2
##$BYTORDP= 0
##$COROFFS= 0
##$CY= -3
##$DATMOD= 1
##$DC= 0
##$DFILT= <>
##$DTYPP= 0
##$F1P= 0
##$F2P= 0
##$FCOR= 1
##$FTSIZE= 65536
##$FT_mod= 6
##$GAMMA= 0
##$GB= 0
##$INTBC= 1
##$INTSCL= 5.30512e-09
##$ISEN= 30
##$LB= 1
##$LEV0= 0
##$LPBIN= 0
##$MAXI= 10000
##$MC2= 0
##$MEAN= 0
##$ME_mod= 0
##$MI= 50
##$NCOEF= 0
##$NC_proc= -8
##$NLEV= 6
##$NOISF1= 182.463
##$NOISF2= 159.3651
##$NSP= 0
##$NTH_PI= 0
##$NZP= 0
##$OFFSET= 248.5645
##$PC= 4
##$PHC0= -9717.114
##$PHC1= 475.2746
##$PH_mod= 1
##$PKNL= yes
##$PPARMOD= 0
##$PSCAL= 0
##$PSIGN= 0
##$REVERSE= no
##$SF= 81.014009
##$SI= 65536
##$SIGF1= 159.3651
##$SIGF2= -187.1042
##$SINO= 113.3802
##$SIOLD= 16384
##$SREGLST= <1H.CDCl3>
##$SSB= 0
##$STSI= 65536
##$STSR= 0
##$SW_p= 40650.406504065
##$SYMM= 0
##$S_DEV= 0
##$TDeff= 32768
##$TDoff= 0
##$TI= <>
##$TILT= no
##$TM1= 0
##$TM2= 0
##$TOPLEV= 0
##$USERP1= <user>
##$USERP2= <user>
##$USERP3= <user>
##$USERP4= <user>
##$USERP5= <user>
##$WDW= 1
##$XDIM= 65536
##$YMAX_p= 271949595
##$YMIN_p= -313168054
$$ End of Bruker specific parameters
$$ ---------------------------------
##NTUPLES= NMR SPECTRUM
##VAR_NAME=  FREQUENCY,     SPECTRUM/REAL,   SPECTRUM/IMAG
##SYMBOL=    X,             R,               I
##VAR_TYPE=  INDEPENDENT,   DEPENDENT,       DEPENDENT
##VAR_FORM=  AFFN,          ASDF,            ASDF
##VAR_DIM=   65536,         65536,           65536
##UNITS=     HZ,            ARBITRARY UNITS, ARBITRARY UNITS
##FACTOR=    0.620285442955139, 1,           1
##FIRST=     20137.2065510759, 0,            0
##LAST=      -20513.1999529892, 0,           0
##MIN=       -20513.1999529892, -313168054,  0
##MAX=       20137.2065510759, 271949595,    0
$$ Real data points
##PAGE= N=1
##DATA TABLE= (X++(R..R)), XYDATA
$$ [...]
41973 -1232648 8016151 8798234 4565799 5158003 10721421 10267408 -1323344 -13338036
41965 -13338036 -12043588 1051744 10287620 4574586 -10374068 -20392714 -19241142 -12454047
41957 -12454047 -7210399 -4649009 -3092944 -2342606 -930857 5528967 17554763 26960664
41949 26960664 25180915 14432180 4571118 497760 -771942 -1442727 977907 7121872
41941 7121872 11406394 7870644 -2301726 -11425356 -12817906 -7621740 -4100058 -7644570
41933 -7644570 -11403018 -2868981 17165944 30052648 21274806 880123 -8493707 -633658
41925 -633658 8968705 6565163 -3088838 -7083849 -2285688 2787753 -532173 -11345671
41917 -11345671 -18883612 -12117732 7113449 22746024 21357357 7799422 -2312777
41910 -2312777 -2345857 1689839 4350815 6669537 9175236 9947495 10925424 16091559 22044261
41901 22044261 20737067 13261038 9871132 13800822 16693248 13864125 11965045 15792656
41893 15792656 19189472 16648241 13638678 16641340 21488170 20659386 15165325 10538776
41885 10538776 7176010 2982812 50186 568892 1060961 -1671088 -3775956 -1194415
41877 -1194415 1623868 -1849415 -8952304 -11299205 -6828095 -855954 2839705 5324484
41869 5324484 8592249 13850467 21606763 28680308 28072386 16957372 2212232 -6518245
41861 -6518245 -6578124 -1848861 3057657 4371608 319652 -4497068 -1374673 10473997
41853 10473997 19716973 16510395 4746661 -5148110 -9280099 -9270402 -5026925 2596779
41845 2596779 7350282 5076142 1368235 3049236 6644310 4762723 -479417 -928001
41837 -928001 3893127 7121910 6546642 6174661 7313765 7534346 7146701 7923991 7391024
41828 7391024 3173538 101297 3311562 7840930 6386670 3909237 10814593 23326616
41820 23326616 25930210 14661813 3173593 2167672 6359923 6435023 1464675 -5619504
41812 -5619504 -13084338 -15651308 -6567981 9354450 16242585 7780043 -3653819 -6099823
41804 -6099823 -4815708 -9931329 -17526422 -15614719 -2639498 11825002 20703481 23577696
41796 23577696 21078789 15054189 11350293 13142313 14153101 7415394 -2197369 -4085880
41788 -4085880 1583767 4427297 704206 -1494140 3766606 11206943 13749394 12780661
41780 12780661 13108326 13542040 9069194 -697365 -10909883 -17708971 -20395173 -18473069
41772 -18473069 -11306829 -1222722 6830056 9921996 8621312 3150512 -7667163 -20817132
41764 -20817132 -26890308 -19526126 -5112115 4075894 6107300 10149546 19166967 22571844
41756 22571844 12719132 -1098508 -5660758 -3288306 -5090488 -9914253 -6211712 5943521
41748 5943521 11846250 4836061 -3837016 -4193920 -1725258 -3517258 -4103042 2677386
41740 2677386 8960374 4152498 -7067186 -12321622 -10959392 -11164565 -12373936 -6900383
41732 -6900383 2421336 2851775 -7763532 -16005647 -12880857 -5836860 -4855723 -7848352
41724 -7848352 -7233995 -1977194 4593792 11507986 17008239 15230273 4456862 -6204252
41716 -6204252 -7049146 -1287225 450445 -3020861 -1791306 9102769 21252542 24703261
41708 24703261 21421359 20686923 24782371 26595250 21260784 13148859 8119967 4422978
41700 4422978 -2696852 -10455312 -10662710 -2818445 3162265 780584 -3849264 -2201562
41692 -2201562 3811745 6869658 6812033 8446324 10140461 5977016 -1405880 -2238903 4052753
41683 4052753 6045609 -1401043 -7652812 -2758349 6679239 8365319 3532233 3315604
41675 3315604 10143932 14971428 12055239 5645014 1355917 294421 2614378 7688860
41667 7688860 9465854 1441194 -11228775 -14884379 -6981067 -1858380 -9639254 -19482398
41659 -19482398 -15049654 385825 8151403 1118916 -7725871 -5893765 1977858 4045418
41651 4045418 -1632430 -7754326 -9444581 -7114554 -1173311 8130078 16513986 17911063
41643 17911063 11518650 2322240 -4991334 -8385931 -5956873 2829184 12655894 15309898
41635 15309898 9913075 5418055 9288637 17327063 19005086 10768742 -127336 -4291057
41627 -4291057 521807 8406215 11053444 4906028 -5142210 -9504884 -3366774 7914865
41619 7914865 14528033 12563483 6739257 3792256 5855806 10126047 12339028 10064455
41611 10064455 4548138 -322656 -2294720 -3466071 -6813527 -11068036 -12207920 -9616734
41603 -9616734 -6993551 -6834410 -7937807 -8950201 -9606003 -6981431 3593052 19937212
41595 19937212 30437954 25950322 11302424 -788472 -4709053 -4519894 -3936525 -2244577
41587 -2244577 -502738 -3064494 -9726534 -13226012 -8484581 1075896 9698810 15799251
41579 15799251 18587360 15149158 6753490 1766060 4909479 8974490 5535065 -1216609
41571 -1216609 -1666505 2272505 341636 -7094428 -7789397 1686845 8128292 1574947
41563 1574947 -8840213 -8583485 1527805 9035668 8402240 4946350 3565874 3884854
41555 3884854 5635239 10036491 15320027 17325401 14714390 8985367 1081209 -7040386
41547 -7040386 -10453339 -7248837 -3709910 -6518515 -12514561 -13873544 -10489292 -7947293
41539 -7947293 -5581529 2270985 13394374 17746060 12190702 4314023 -782031 -6187498
41531 -6187498 -12423546 -13249800 -7866277 -5386110 -9544804 -10456897 -1444976 6740568
41523 6740568 1448936 -10473301 -12054055 -2193218 4122353 1032548 865755 13442377
41515 13442377 29720528 34249213 25437631 14860474 11011405 11515015 10005829 4597745
41507 4597745 -1670330 -5673626 -7375531 -8084345 -6756755 -553009 9813437 18189582
41499 18189582 19407242 15511551 12183011 10962828 9257622 6418393 4546854 3597349
41491 3597349 954409 -3382846 -5972954 -5580503 -5281951 -7040818 -8011209 -4871112 823946
41482 823946 4471731 4548503 4845899 10308176 20818598 29413164 28310500 17733228
41474 17733228 6591819 2453876 3368351 2702391 -687666 -2099296 459378 2936903
41466 2936903 1257130 -3518408 -7094430 -6008449 240404 7830679 9789455 2686555
41458 2686555 -7508152 -10260631 -1924238 10879702 19313476 20230456 16585936 14251196
41450 14251196 17851065 24850774 24683540 10383379 -8895505 -15206452 -4050349 8931765
41442 8931765 7993639 -3511177 -10353361 -5713834 3804711 9728831 9778933 5434740
41434 5434740 -1056153 -6257174 -7423700 -5984076 -5613867 -6761886 -6546730 -3776466
41426 -3776466 -335103 2322681 4350874 5128918 3509156 1102744 1938937 7771579
41418 7771579 16149801 23531380 27740427 27290456 21635873 13155025 6084681 2160962
41410 2160962 -539288 -3533894 -5082528 -2603128 4029760 12610844 20144806 23684429
41402 23684429 22340307 19764824 21707534 28724662 33675278 29463705 17624862 5908915
41394 5908915 -1419336 -6604399 -11601624 -13165117 -7754623 1423465 6298158 2876215
41386 2876215 -4133409 -6294988 -54780 9558998 13214346 6307995 -5000430 -8478275
41378 -8478275 714817 12625313 12902941 480556 -10782434 -10052787 -2495456 1011470
41370 1011470 1062181 6961711 18906223 24654325 17332546 6371835 3842978 7886295
41362 7886295 9123732 7879727 12799413 23575966 27870214 18968954 5858673 -294841
41354 -294841 -919024 -3433144 -6961887 -4768526 2743662 7791589 7102354 4965680 4334396
41345 4334396 3498416 2240975 2479021 1590338 -5190583 -13378163 -11221362 2063569
41337 2063569 11274935 6112962 -3413334 -2591730 6515864 11985834 12490430 15152310
41329 15152310 17817812 11174594 -2026056 -7273809 -362555 7095657 8171495 10016225
41321 10016225 16386897 17734624 8943763 1644956 5693426 11548615 6725607 -999517
41313 -999517 4708418 20336156 25474355 13106890 -921824 -1638955 6484048 9867726
41305 9867726 4093786 -3643814 -3909752 6060870 18359607 20145653 8866110 -1654835
41297 -1654835 1629070 12210272 13948259 6284137 4409443 13971174 21993309 17951278
41289 17951278 9212402 7458822 11559612 13458724 12381208 13489073 17847093 21530930
41281 21530930 21027485 14687320 3433800 -6528766 -7918565 -2700923 -801123 -4704601
41273 -4704601 -4393675 6347518 17607340 15882571 2402159 -9609191 -11156748 -3604426
41265 -3604426 6634192 12343460 8841212 -128783 -3835903 2480203 11077739 13264040
41257 13264040 10450389 7100001 1030545 -9665899 -17475408 -15022593 -8427885 -8699169
41249 -8699169 -13769346 -12445504 -4100735 -247209 -5565747 -10424609 -5609290 5884794
41241 5884794 15105647 16549705 9078477 -3901090 -13067774 -10725630 -1886206 922871
41233 922871 -4399633 -7082983 -1712048 3179725 771936 -1533822 5111505 14915395
41225 14915395 15918916 8663210 3793175 3736973 -242255 -11341197 -19006158 -12521578
41217 -12521578 4542764 18970816 22522009 17439826 11113058 10020543 16276422 24933120
41209 24933120 25972290 14307993 -2053799 -8895818 -1993743 8436206 11384149 7530793
41201 7530793 4139252 3117621 1303239 -585941 1966551 8166725 10794584 6123652
41193 6123652 -1384020 -6158253 -7257333 -5394900 -948733 2873267 2138779 312449
41185 312449 6185107 19534700 27576711 21931515 10837419 6621985 8742336 8908463
41177 8908463 6469879 7293440 11637478 14869920 17720324 24177573 30356312 27152997
41169 27152997 14691618 3531911 -12426 15909 -294952 2337705 11464143 24121043
41161 24121043 33926082 35811432 27744638 14314881 7295257 13677572 23724539 21319373
41153 21319373 6559762 -3810912 -503091 6826878 6804098 1928764 -863155 -3818374
41145 -3818374 -12290452 -22943440 -27732115 -23891122 -12455686 5803345 24339746 28909872
41137 28909872 13579018 -6791410 -12600327 -4631475 -309079 -6859465 -12672636 -7424378
41129 -7424378 2928749 7287588 5088657 3168345 4125551 5601978 6483874 6717454
41121 6717454 4405260 -162641 -720726 6784540 13917925 7289619 -11780848 -24491103
41113 -24491103 -16957114 1855091 12216619 8198726 332558 -2981528 -3982693 -4073806
41105 -4073806 2687043 17416793 28124922 24009874 11832021 7428691 14560042 22441000
41097 22441000 22152126 15241573 6600594 -1151598 -4978587 -2009908 4859318 8712714
41089 8712714 7392958 4717744 3232283 2546223 3898407 8159089 10165837 4643788
41081 4643788 -2559626 -140220 11011316 17922428 15329445 11946062 12833827 9998973
41073 9998973 -1786238 -13242157 -14948547 -11980615 -12609746 -12600800 -4277366 6763156
41065 6763156 9029276 4584634 6406591 18129200 29734511 33249549 30710735 25629404
41057 25629404 17663121 8187137 2045526 930693 1870538 3638976 7873085 12966372
41049 12966372 14134679 11198939 9618937 11753757 13004010 8842512 784452 -6307566
41041 -6307566 -8455185 -3290631 8249594 19355680 21405558 13273101 3378266 335111
41033 335111 3829198 6258274 1764881 -7447559 -13331903 -10802083 -3995970 -1205401
41025 -1205401 -3310070 -1887572 8861887 23279142 31142072 28887641 19810566 8212739
41017 8212739 -1182787 -3178339 1439258 3446371 -3403723 -12220316 -12102153 -3725270
41009 -3725270 3216863 4978576 5736561 6436449 3262244 -2172517 -2329229 4124267 9696795
41000 9696795 10557696 11846654 16456272 18112616 11822528 3608137 2751044 9476035
40992 9476035 16672206 19892678 19809335 17775086 14567670 11992958 11337275 11071445 9144915
40983 9144915 6541576 5895865 7142597 6672194 1306648 -7230145 -12445125 -9502799
40975 -9502799 -1996866 1064207 -2872334 -5446295 977680 11783823 16707952 14260204
40967 14260204 11396279 11288981 10940584 10149194 12531141 16489351 15436347 9629400
40959 9629400 7649532 12068228 13736297 6450026 -1789957 -273545 8539027 13596969
40951 13596969 11374309 8676453 11384226 17971021 23917081 26780118 26258448 22853091
40943 22853091 17113018 9106705 -105371 -6387942 -5688513 -453948 1876274 -950093
40935 -950093 -2575689 1877208 7937582 9136287 7373534 9228555 14790528 17329732
40927 17329732 13634109 8546425 7842426 10581533 10474871 3324937 -7845992 -15066656
40919 -15066656 -13382625 -6032926 93348 3008930 5917866 9737883 11192126 9716543
40911 9716543 10026452 14414719 17773837 14538837 6360773 -1291327 -6100316 -8037066
40903 -8037066 -5694957 801601 5926801 3641167 -4780818 -12148825 -13770503 -11157065
40895 -11157065 -8545385 -8602884 -10245106 -8714566 -225478 11540353 17135602 12310322
40887 12310322 3437923 -1205857 -1126862 -373571 609771 3922963 8409787 11121162 12101776
40878 12101776 11992838 7763494 -2447809 -12537108 -14055212 -7690093 -1797421 64368
40870 64368 2249373 7037521 9958025 8000796 5151498 5332607 5710861 2338921 -2128066
40861 -2128066 -2835807 -2317478 -8155786 -19927781 -24979532 -12185268 12584765 30397557
40853 30397557 29633503 17821157 10332231 11706478 14015671 11220146 6698900 4982878
40845 4982878 4040010 482954 -3416069 -3678314 -1558793 -820644 -1099000 466672 3496850
40836 3496850 5820637 8484524 13603405 18997989 20917507 20783283 22978776 26591110
40828 26591110 25946740 20034218 15410698 17998594 26378859 34459250 37066393 32408356
40820 32408356 22982454 14693594 11625387 11567763 9725628 5337549 283205 -6503207
40812 -6503207 -16314381 -23423969 -19230066 -5425741 5089133 4026205 -2484308 -3985227
40804 -3985227 1143430 7880771 13519987 17096867 14472328 2934052 -10560907 -14076776
40796 -14076776 -4972297 6870955 11994815 11678474 12030085 13076180 9838169 2329087
40788 2329087 -2305459 513480 5993122 6690842 2676195 -284286 -898700 -3687027
40780 -3687027 -9069038 -9704247 -1351310 8664066 10602653 5845919 3392834 5310072
40772 5310072 4853783 -898713 -6102671 -6647721 -7068785 -11889273 -16580225 -13432554 -2608629
40763 -2608629 8106348 12079080 8401134 765033 -4254463 -1138256 7798228 12501980
40755 12501980 6735405 -3289489 -6645071 -879704 8169762 16171884 22006494 21830526
40747 21830526 11328951 -4711428 -14030758 -11587416 -5309883 -3269727 -2370458 4454197
40739 4454197 15790055 23737767 24712122 21358262 16275488 10757240 8214011 11780647
40731 11780647 18536176 22012017 20439614 17108343 13419489 8376874 4718864 7392455
40723 7392455 14266719 16461802 10857342 4393841 2346422 1061413 -2204935 -1546188
40715 -1546188 6883322 14330878 10677449 699139 -3151720 -778082 -3797297 -15564487
40707 -15564487 -25576072 -25995110 -20886943 -15047682 -6288882 4696718 8411317 -223256
40699 -223256 -11303855 -12516660 -6088628 -3478694 -7835109 -11768929 -10278381 -6845993
40691 -6845993 -6972070 -12033180 -18881034 -21094600 -13432113 210259 7650049 3281957
40683 3281957 -3264535 -1425350 3312444 -1365602 -12255574 -12826413 1059686 13059733
40675 13059733 10000135 329155 -569472 6718698 9509416 3749284 -2154672 -2762775
40667 -2762775 -2933953 -7558476 -13507330 -16044208 -16007563 -15370734 -11562854 -3157171 2720161
40658 2720161 -2544105 -15059876 -20398569 -12102265 -48909 4478982 4061120 7357980
40650 7357980 12735047 11582795 5162269 4484276 11815000 15412584 7339342 -5451024
40642 -5451024 -14145803 -20237256 -25760453 -23106361 -7608785 8379242 9364025 -133709
40634 -133709 -1832679 9140329 19274436 19502599 17005842 19823408 23814067 22221902
40626 22221902 17267887 14016970 10920048 4700622 -1209196 -887086 4872206 9433858
40618 9433858 8068604 1346580 -6062383 -7558001 139876 11424731 16254255 12606414
40610 12606414 8928737 11154657 13622909 7731181 -5630900 -17709547 -21999706 -17902360
40602 -17902360 -8190842 1821974 5563299 1161264 -5172505 -5672433 275273 6756757
40594 6756757 8793310 6381637 2648016 299194 -891266 -3293987 -6313563 -3930559
40586 -3930559 7404343 19531662 19414164 7058448 -2064370 3042994 14510489 17443116
40578 17443116 9313643 -301670 -4207177 -2964782 1391402 8263122 15325301 19129493
40570 19129493 19332430 17771576 14185123 7637341 1207195 -127655 3453003 6121102
40562 6121102 3755131 -1360806 -3695133 -198055 6836932 10957960 6810038 -3745360
40554 -3745360 -11987738 -10719354 -1106460 9962173 16997770 18681273 16141354 11148341
40546 11148341 5060934 -1298668 -5535308 -3073141 6857358 15641132 12864627 1085772
40538 1085772 -4541100 4838016 20059838 26073281 19944406 11185542 8881723 14070524
40530 14070524 21276133 23011194 16178965 7184229 6138318 13687777 20277893 21059658
40522 21059658 22102633 26916870 27877914 19611041 10639418 10627540 14766628 13337409
40514 13337409 9133699 11261538 17687387 19305196 17248531 20311198 27551726 29508930
40506 29508930 25847174 25793612 30630160 31557800 26208551 21471972 18290652 10458578
40498 10458578 1259993 3124953 15629340 22266685 16195768 10263718 12038594 9201208
40490 9201208 -5749025 -15308499 -1565465 23032038 32031826 23324168 18102099 25734605
40482 25734605 32771984 28152387 18511617 12764967 8144776 -596182 -10169866 -14504165
40474 -14504165 -12985589 -7291310 2714983 15096175 23907131 25095834 19973579 11727166
40466 11727166 4026837 2699616 10751706 21079039 23073599 17983349 17829881 26307670
40458 26307670 31807976 25058313 13377486 9196055 12561284 14455007 11569327 7919203
40450 7919203 5363541 1843942 -2634248 -5991084 -8659543 -11573573 -11629871 -6090937
40442 -6090937 588999 1912657 -326569 1147233 7252777 12293734 14824054 18819737
40434 18819737 23373444 22239413 16424688 15888450 23621726 29079976 24613225 17685676
40426 17685676 17158322 17644173 10525666 2449727 6569413 19283052 23127574 13152997
40418 13152997 3520221 4418180 8688768 7838999 6094134 9026770 11369840 7657026
40410 7657026 4045183 7053753 10278212 6261784 2725200 10332478 21070402 18511407
40402 18511407 6737033 7043197 22985707 30851501 14346634 -10281042 -17908496 -8783585
40394 -8783585 -2178951 -5753818 -10327489 -11001986 -13958110 -19880813 -17588638 -1778163
40386 -1778163 14910898 17365393 8175203 2158064 4608544 5912652 -1399555 -10139250
40378 -10139250 -8616320 2605667 11845580 12310532 8834759 7182024 4827154 -1981239
40370 -1981239 -8003012 -4599407 6341961 12883790 8740079 1172551 424622 7326664
40362 7326664 15137678 18917825 18678248 16290582 13342150 10666721 7795627 4480827
40354 4480827 3520076 8748879 18701085 25823580 24172347 15191814 4818782 -1611632
40346 -1611632 -1093299 5136735 9948239 6634395 -715535 50764 12287240 23670313
40338 23670313 21811280 9940500 -127454 -4300619 -6251873 -6026015 73536 9446236
40330 9446236 13665610 10398513 6444045 7026204 9295392 8653708 5349988 2554031
40322 2554031 2842805 7821320 16319486 22569838 21795872 17784293 18398942 23321632 24153797
40313 24153797 18024371 12041810 11002015 10225961 6243149 5332434 12903139 21715384
40305 21715384 21158459 13494002 9544019 10865568 8720059 1193708 -1816759 4520449
40297 4520449 9710755 3277927 -7691643 -7407281 5865856 17290436 16235898 9437598
40289 9437598 9410483 17258754 23025140 18906204 6306791 -7907579 -16847703 -16548366
40281 -16548366 -8665832 -466335 1693657 -906431 -2015127 1236395 6507296 11571324
40273 11571324 16200291 18906655 17650978 14587837 14027528 14432864 9588772 228721
40265 228721 -3952073 809255 3763153 -5366169 -18885680 -19493764 -3592674 14487038
40257 14487038 21528815 18758486 14501611 12852960 13400698 14845283 14360471 8704018
40249 8704018 -140080 -5004337 -2533827 2352644 4097474 3678404 4292499 4732563 2334628
40240 2334628 -779726 105056 5514387 11623322 15575823 17039361 15616746 10785967
40232 10785967 4428623 376538 763308 3974515 5972604 3575626 -1869909 -4272447
40224 -4272447 439371 7152192 6288249 -2619854 -8393221 -3139902 6951019 12042698
40216 12042698 13164410 16472984 18090980 8685813 -6815854 -9683676 5856933 19575280
40208 19575280 10575109 -13169775 -25142711 -16318615 -4955846 -8394605 -20281039
40201 -20281039 -23960203 -17055759 -10418566 -8527604 -4636456 4578680 11560781 9290095
40193 9290095 1747573 -2530187 -1710501 -83716 -408724 -2254856 -5089041 -7963945
40185 -7963945 -8203463 -4760783 -714165 1576423 4517005 9294481 9856408 944410
40177 944410 -10165402 -10058631 1907021 11396778 9200032 3409907 5132182 11107997
40169 11107997 10557003 3695964 1530656 8168762 14486223 12206651 5449796 3204940
40161 3204940 6484924 9269651 8899440 8898361 11758032 14534537 13788586 11464896 12643613
40152 12643613 18525360 24423155 25014969 19737980 12526998 7965491 8412300 13002389
40144 13002389 18079071 20074480 19147184 18188392 17387636 13352908 6105545 2382658
40136 2382658 6653022 12503370 10508814 2766277 542870 7223313 13547011 12419909
40128 12419909 8135029 5708736 1438289 -7417856 -12484533 -5400366 6605854 9074254
40120 9074254 1525138 -2873729 1214254 3681054 -3594660 -13779136 -16134813 -10986077
40112 -10986077 -6089982 -4507373 -3560823 -1412178 1984113 6960306 11483575 10530393
40104 10530393 4385233 2971502 13277274 25527125 22809148 5177781 -6907897
40097 -6907897 2017304 22566324 33512557 28266058 18710429 15689426 17071871 17375865
40089 17375865 18881719 25991501 34617252 36044510 29446393 22534123 19769350 17742712
40081 17742712 13886190 11628903 12650764 11403473 4153485 -2076492 1736620 12004153
40073 12004153 16275403 11211015 7030296 11497678 18442439 17744207 10308959 5954116
40065 5954116 9364407 14687076 13711021 4926140 -5839111 -10982712 -7528895 -223793
40057 -223793 2330111 -3244141 -10713498 -11388414 -4950745 166286 -1985355 -6353796
40049 -6353796 -2583470 11495917 25558130 28075282 19761532 11804569 11121395 12911867
40041 12911867 10390050 6114542 7475750 14360602 19181724 18607179 17504542 19785103
40033 19785103 22441038 21723015 19535379 20086729 24267673 29960431 34119913 33176713
40025 33176713 26353575 19694494 20278746 24820185 22369091 11563666 5213053 11499019
40017 11499019 20784529 20567852 14428372 13658488 17183408 15012765 8003046 7642523
40009 7642523 15797954 20675650 16441352 12107551 15181781 20113998 20794950 22012922
40001 22012922 28255722 31753402 24284378 13426140 13216963 22408703 25656509 16055537
39993 16055537 4263895 2710063 10562429 18454010 20897794 19404475 17956957 19484273
39985 19484273 24293984 29540218 31920695 31542369 30961292 30851439 29913541 28465124 27692812
39976 27692812 25441163 18231754 8717256 5247932 10957686 18451697 19658191 16592966
39968 16592966 16680301 20481041 21294911 16671785 13163385 17004122 25299826 30301649
39960 30301649 28993195 24430269 20165326 17981877 19568037 24956965 29084053 25237025
39952 25237025 13691882 2464201 -2540973 -3360062 -3189237 374303 9514821 18074315
39944 18074315 17343494 8599236 1950019 2288042 4017887 1490544 -2867641 -4261377
39936 -4261377 -2598106 812888 7707036 17905487 24274879 19896369 8669827 2363898
39928 2363898 6806286 15546909 17858365 9884328 -2395790 -8846472 -3944510 8027406
39920 8027406 16686475 15710648 8636060 4050665 6934778 15366009 22911825 23142012
39912 23142012 15072339 5532112 2599065 5869664 8258625 8165929 11957391 21281268
39904 21281268 27540003 25618690 23532276 28347918 31234336 20644772 4737965 3437181
39896 3437181 18542217 28992518 20213598 2974618 -4395002 143246 5989992 8005377
39888 8005377 10047916 15371643 22434695 27861733 28057657 21093145 11053645 6083607
39880 6083607 8430649 11964719 13166968 17125603 27135664 36222968 36733096 31758707
39872 31758707 28656860 27252221 23746358 20855661 23459920 28143541 28069205 25442723
39864 25442723 27805942 33766131 34426537 28858926 26088542 30140175 34646053 35108693
39856 35108693 35444141 38312994 39492394 37262135 37783005 44449715 49992297 46560721
39848 46560721 37306209 30779304 29203216 29347073 30374553 33530847 37207071 38570086
39840 38570086 37453983 33994566 26727874 18329968 17558630 27616356 37273077 33346806
39832 33346806 19445661 11745599 16529938 22859661 19972291 11840041 9119108 14021561
39824 14021561 19626322 19996571 15636874 11548062 13553331 23660532 35856751 39890916
39816 39890916 32800732 23162859 19919312 21169827 19858552 16655444 18319092 24062115
39808 24062115 23823366 13923920 5706055 11102758 24952034 30876051 23091926 12889783
39800 12889783 11602927 15956374 15748725 9582061 4881092 5157642 6166699 5634578
39792 5634578 8671533 19028592 30252515 31670299 21508269 9054947 3956308 7398583
39784 7398583 14261579 19861089 22508898 22441809 21612789 23754421 31602295 43121241
39776 43121241 52114113 53826021 49375427 43863500 40753274 39232168 36749059 32617140
39768 32617140 28697817 27668670 30954500 36956448 40842836 38263830 31014014 27094668
39760 27094668 32194386 41799535 44999368 36714019 23533535 16317225 19141178 27167781
39752 27167781 33852830 37645625 40815323 43248405 40607949 31154725 22351772 24653926
39744 24653926 36744844 43492849 34411173 18808836 13552628 18948056 18988580 6685112
39736 6685112 -4423616 -708688 11270317 15894734 12057147 12300222 21542460 29886920
39728 29886920 27777406 17594106 7431865 2115990 3607024 12402661 24091802 30414576
39720 30414576 27974871 21715898 17406178 15830933 16628021 21446408 29406485 35108288
39712 35108288 35515895 33732673 31859868 26144653 14906289 5521264 5844729 12326139
39704 12326139 14449458 8796424 1262634 -3209472 -5385247 -6278332 -4143951 1408956
39696 1408956 7192343 9476584 6233824 -2081933 -9712856 -6596378 10585689 29879498
39688 29879498 34820138 23615698 9317929 1131270 -3703223 -7290763 -3177847 11375489
39680 11375489 25362221 26766371 19023839 14136193 13817604 9425151 -488715 -4717232
39672 -4717232 5080122 22050229 32195534 29471836 18819136 8232475 2238693 1410430
39664 1410430 4562182 10447507 17465321 22103062 20339050 13198342 8550890 12884341
39656 12884341 22261765 26283400 20643759 10499861 1626221 -4768996 -6744374 666295
39648 666295 16857520 30699740 31715440 23384228 18197706 21019565 24896720 23520007
39640 23520007 19705190 18342610 17730038 13389986 6233227 864894 -1848978 -4288996
39632 -4288996 -5155994 202745 11375338 21036347 24336174 24757371 26764698 27751049
39624 27751049 23042940 15172589 11086148 11866036 12383468 10504961 9090389 8482250
39616 8482250 5385092 1363355 3755759 13777572 21792917 20562487 16008672 17094998
39608 17094998 21198958 19273888 11702862 8300626 13256601 19643040 19975382 14461575
39600 14461575 7482621 2616310 2242441 6035949 9411778 9259504 10085152 16850365
39592 16850365 23235228 17801060 2940331 -4330366 5032321 19761946 25013034 21249796
39584 21249796 17905364 17088053 14611219 11570712 13325486 19229450 23300066 24204554
39576 24204554 26040457 29697147 31576984 31275514 32934266 37382503 39276827 34495037
39568 34495037 26006233 20260261 20461543 24468142 27469978 26620415 23934102 23104369
39560 23104369 23089220 19043206 11404419 8038505 12996421 19298593 19347371 16730182 19158753
39551 19158753 24399919 23742176 17105382 13707374 17735471 23397407 25066290 23048545
39543 23048545 18480032 12187033 9814538 17492218 29823205 33074458 24366735 16648132
39535 16648132 18717560 21434478 12874668 -1644404 -5939367 5277499 21016735 28142230
39527 28142230 23145488 11968673 4890191 9468675 22433557 30940398 27491482 20051316
39519 20051316 20549845 27286449 27981062 18407946 7743551 4552974 7289749 11965695
39511 11965695 20354559 34244005 47066633 48735288 37736955 23266091 14828732
39504 14828732 13154637 12841185 11652091 13704891 22193566 31894559 33571542 26145541
39496 26145541 19434623 21993755 30407531 34756049 31318248 24656254 19412185 16134041
39488 16134041 14754532 16461041 21067963 26584112 31830827 35823892 35199270 27505521
39480 27505521 17464786 14064831 19377841 25592259 25980422 23506778 24129316 26142084
39472 26142084 22796135 13762277 7021584 8138915 13446422 17168952 20788381 29349584
39464 29349584 39688627 39795090 24094051 4777728 845416 16207873 35385832
39457 35385832 42816467 39662565 37041456 39036304 40663910 39614340 40172649 44128652
39449 44128652 45947511 40757107 31737103 26018751 27459280 36156010 49961377 62535641
39441 62535641 65107245 56280632 47009022 49519481 62814057 74706069 76586000 69815621
39433 69815621 58749707 45799796 35079104 32476940 37068038 38580738 29759767 17196507
39425 17196507 13003209 18186561 21871648 16817963 8235295 5015662 8337780 12642804
39417 12642804 13576642 10846422 6081099 1971139 1891929 6705196 12636262 15042117
39409 15042117 13577642 11453130 10741321 10937506 11326746 12335481 14847711 19536809
39401 19536809 25738398 30139083 29410297 25964689 27134249 35097512 41980924 40531105
39393 40531105 35471471 36035341 39814446 34848092 18841082 5003462 3751829 8327353
39385 8327353 6574293 -113654 417998 12677932 27591467 34868687 33506757 28561054
39377 28561054 23728250 19930823 17406869 16245098 15938653 15350588 12923547 8279682
39369 8279682 4606057 6641463 13636984 17406223 11837427 2180408 -730703 5200975
39361 5200975 10811409 8495747 1887661 -202163 4433580 9463900 8288507 1390367
39353 1390367 -4388269 -2683727 6152321 15499042 19496589 18809880 18346462 20819077
39345 20819077 25041463 29385089 33285183 35284980 33321368 28036521 22631245 18148810
39337 18148810 12248768 4758102 1077340 6276916 17480651 26286934 28708132 28840170
39329 28840170 31540402 35260786 35230430 31265402 27894420 27134640 26115003 23496058
39321 23496058 23198609 27564471 30650466 24801352 12837068 6767825 12696383 22822169
39313 22822169 25790772 20702429 16595847 20339551 29111436 34589377 32181064 25550091
39305 25550091 22161064 24393863 27176611 26427436 26383081 33178839 43686279 48664350
39297 48664350 46467842 44245432 44060767 38626649 25513608 15065024 16466689 24451767
39289 24451767 28528529 28093678 29088935 32423699 36011321 42277619 52576090 59804690
39281 59804690 58793132 58456619 68993215 81266125 76477104 55672643 41033992 44614160
39273 44614160 53845008 54320676 49362530 47022648 43576009 33811383 25956382 30793798
39265 30793798 42957628 47540914 41112233 33231214 30070197 29049716 28364822 29834631
39257 29834631 31699828 29062446 22944434 19682156 19733285 16386512 8440959 4913243
39249 4913243 11763434 21365637 22434745 15774960 12134327 16294475 21767129 22815536
39241 22815536 23700159 30228662 37438311 34758359 22860069 15656812 21537338 30900395
39233 30900395 29580150 18486750 10394602 10811254 12958768 11299792 9268037 11253473
39225 11253473 15925492 20691037 25302158 28319335 27104849 23546193 22464624 22748736
39217 22748736 18558038 10965083 8258548 11912473 13509639 9682733 7765120 10817182
39209 10817182 10633079 4308575 3856665 16904894 30063925 27021265 14108282 10987645
39201 10987645 21647593 31352097 29334723 18977747 7085723 -2506388 -5458568 -399935
39193 -399935 4699895 1532698 -5213004 -5643702 -1857699 -2633183 -4994518 756481 9514096
39184 9514096 5671021 -9188222 -14337937 -1247845 13767048 16459479 14129993 16979017
39176 16979017 19059102 12883089 7254036 13281965 24211979 26135929 19902712 16176478
39168 16176478 16109187 13091906 8139615 7785829 10503144 9830137 7851010 11479260 17934430
39159 17934430 17928471 11696220 8301423 9818299 9164474 3325514 -3474587 -8960653 -12716468
39150 -12716468 -8512679 8645285 27863571 30839057 17606419 7805945 11691108 16452639
39142 16452639 9435098 -886894 432347 10996887 16218503 11197802 3935399 490347
39134 490347 -938959 -2360328 -2462293 -1144196 -278720 401717 2885260 6902619 10709866
39125 10709866 14397560 18475829 21395497 22280615 23004065 23650134 20540321 14136690
39117 14136690 13309419 23483473 34905220 33094481 19031825 7936046 7955909 11669431
39109 11669431 11065472 9020531 10374668 12408631 12453236 16109403 27355491 36677000
39101 36677000 31358997 15123550 5139088 8657034 14259059 10107771 543743 -2283448
39093 -2283448 4151184 11865112 14528398 12531802 8272099 4018471 3792625 10251281
39085 10251281 18807501 20766469 13810510 4574060 -237293 -205488 2464780 6941365
39077 6941365 11345177 12114151 10021499 11941563 21275337 30384418 28901916 17619738
39069 17619738 7689533 6322773 9340110 9274777 5731005 4414854 8241554 12678431
39061 12678431 10628842 1246190 -7543848 -7128439 1740979 10096219 12151486 11188460
39053 11188460 12724112 17254247 22829962 29018207 33686203 31926107 24605011 21998705
39045 21998705 30403853 40337054 38395781 26619988 17759091 14283040 7142094 -4369924
39037 -4369924 -8043941 1372890 12902185 16909480 18008762 21968703 23563579 18586928
39029 18586928 15319755 20516826 24904304 18111833 8872052 12627863 25441613 29530872
39021 29530872 21638248 15852003 17872892 16644792 5977737 -3993289 -4371881 -852892
39013 -852892 -1073961 -2399343 -1283835 -1908757 -5322257 -1854983 13887672 30399806
39005 30399806 33952690 27486486 22329280 19125418 11574756 3070949 3049040 9033558
38997 9033558 8737026 1000216 -968132 8724733 17869152 14280723 3695876 400315
38989 400315 7143441 13847125 13003473 8215330 7493411 12998470 18374879 15019261 2155169
38980 2155169 -9348257 -7291032 6050620 13718590 4195385 -12620238 -16679665 -3430313
38972 -3430313 10376887 9047494 -1911919 -5132085 3899205 12005392 9179849 3558891
38964 3558891 8607501 22600862 31170622 27785784 21198362 21465549 27787407 33176689
38956 33176689 33435019 28021385 19184149 13866395 18918884 29910348 32606951 21362410
38948 21362410 7934443 4707792 7609860 5784213 756563 2578518 10830507 14007586
38940 14007586 8025642 2156436 3804647 8724228 10577148 10599787 12458101 15006582
38932 15006582 15724746 15903364 17523961 19093605 18665262 17871574 19706306 24399658 29314465
38923 29314465 31246015 28553510 22760063 16785021 9779128 -2327277 -17255985 -23421740
38915 -23421740 -14616271 -2571150 -3601128 -15386650 -20030301 -10145848 2052873 4720855
38907 4720855 1968959 3617022 10674005 18016050 22536996 22429675 16653363 10354583
38899 10354583 11825477 18981062 19217086 8824996 826692 5075035 12841550 12877734
38891 12877734 11264455 19606029 31763873 30872123 16565660 6883292 11245815 17893252
38883 17893252 13695187 2927815 -2125544 376475 3004007 3561061 7637105 16366992
38875 16366992 20789348 13870922 3098577 2417630 11736664 14807963 2980873 -9330693
38867 -9330693 -4403712 11692512 18549796 13794195 14597059 24945917 25727797 7804104
38859 7804104 -7910746 -1136052 15134073 14740381 -1489761 -9896190 -1337763 9863488
38851 9863488 12395609 10664781 9029863 3502740 -5786625 -10045491 -5310567 1986603
38843 1986603 6514861 9802562 12658774 13181003 13128159 14839528 12718496 1041187
38835 1041187 -11372676 -10313454 625519 4417687 -587599 2745628 19554279 30481636
38827 30481636 20654495 2357313 -4746654 -592697 2743448 2804644 5326023 9774080
38819 9774080 10910275 9292979 8685048 7945231 4739065 1775341 1491977 1000567 -866939
38810 -866939 346535 4814873 4819068 -843162 -543129 11455153 21875899 17558717 7117627
38801 7117627 7782713 19094379 26767941 26577452 26406609 27887310 23895211 13907250
38793 13907250 5693689 968665 -5679570 -12417210 -10024651 548948 4756531 -5684930
38785 -5684930 -20896063 -26979639 -22955223 -17384248 -15107179 -13551674 -8502611 378028
38777 378028 8128300 8662391 3080399 1122814 9261951 20651201 23838177 18133548
38769 18133548 11767439 7871515 3013177 -1598163 653531 9630676 15943816 13677685
38761 13677685 7286719 3293332 2655181 3416231 3969898 2362556 -1162470 -1229876 5738548
38752 5738548 13406198 13774739 11395577 16906043 27169186 27183620 14592564 6247433
38744 6247433 13718083 26955158 31338151 27713708 24545481 21974854 16764174 13667972
38736 13667972 17475299 20350733 11850235 -2550484 -7565932 -885796 4598345 2075309
38728 2075309 376236 7983806 18677546 19747000 7770806 -9329437 -21506300 -23694751
38720 -23694751 -17173305 -7412122 1001786 8331368 16672861 24140614 26624762 24958832
38712 24958832 24246733 24672620 19543209 6186261 -6753907 -8473633 779617 11177325
38704 11177325 15773516 15377818 11982632 4953659 -3557556 -5921918 2313922 14113486
38696 14113486 17554074 10154111 967100 -2046653 -711039 -505161 -1655381 -856407
38688 -856407 2205389 5141193 6934020 7047144 3443732 -2988482 -5069335 2219911
38680 2219911 11480593 9820525 -2998813 -11845493 -4819976 12578497 25985790 28620618
38672 28620618 24151190 18303369 13860954 11463483 10112069 7761802 4269343 2016080
38664 2016080 1818312 1615088 1616424 6312673 17262640 27684688 29332349 22433083 14298837
38655 14298837 10194793 9937996 11417261 12701449 11929240 9332870 8371435 11436000
38647 11436000 15943438 17804539 16613534 14463168 12853756 13936953 19772771 25505213
38639 25505213 19882903 950552 -14837699 -11190184 3892684 7241717 -6121702
38632 -6121702 -15179803 -3783981 16377122 24176992 18087951 12897787 14991025 16105551
38624 16105551 9642283 112559 -4829153 -2282421 6911361 19091143 27155152 26358492
38616 26358492 20993392 18610313 18761717 15604968 10286471 10252293 15626111 17531983
38608 17531983 12667634 8421173 9314342 9580815 5263007 2768939 7301248 12606802
38600 12606802 11793462 9546497 12614353 15864029 10644267 1566409 1123499 10139282
38592 10139282 16623528 13376126 5099561 -1622245 -4437687 -1793540 5684369 10868225
38584 10868225 8056737 3844790 7851819 14701074 10894036 -522887 -818511 14872297
38576 14872297 28075152 25188038 16746348 16659120 19096096 12052270 1060815 1355568
38568 1355568 14137846 26986168 32417176 31460018 24040824 10624808 -386859 -907659
38560 -907659 4324285 6217866 7724191 17405764 30900229 35263230 29809883 25859033
38552 25859033 26271247 22822365 15548564 16565849 29651404 42468045 45891973 46289908
38544 46289908 50723009 53692867 48258589 38966380 33609860 31338525 28498446 27871845
38536 27871845 32083554 34768197 28659716 17833599 12712573 16134071 21936449 24454887
38528 24454887 23092039 20530290 21729442 30800360 43618670 48186862 38410668 23078200
38520 23078200 14620633 13457218 11388458 6895099 7133329 14752655 22002378 21500056
38512 21500056 16701282 16548721 22493675 26432469 22497374 16055461 16029612 20511494
38504 20511494 18360258 7548279 2290061 13715127 30990710 34069683 21614639
38497 21614639 12150512 17218439 27652606 30312088 25476750 21231924 21102127 24517358
38489 24517358 31347046 39146369 42311545 39094437 33541145 27927984 21392976 17721411
38481 17721411 22990309 32128325 31501213 20702258 16590815 26562929 33823983 22992862
38473 22992862 5910629 4119820 16628093 25333578 25353931 28193100 37286597 42044241
38465 42044241 38453687 36359454 41033900 44028706 39412055 35115382 39455512 47121805
38457 47121805 47750812 41115292 35606131 36455400 41972042 47860264 49937793 45168302
38449 45168302 34597505 24544204 22367045 30500903 43734159 51653590 46775597 33081159
38441 33081159 23329111 24378073 29215158 28236279 23363267 23662002 30796076 37357102
38433 37357102 37591441 32017480 23528901 16663498 18002037 28398329 37171234 33758881
38425 33758881 23418443 21069903 30837635 42773347 49187216 51905098 52381318 47650026
38417 47650026 39660463 36953154 42296199 48530452 50767272 52738324 56885290 58737463
38409 58737463 56474687 55734834 58695951 58598353 52491856 49315807 55949086 64175380
38401 64175380 62882663 56579843 58918217 70854337 78055309 71106521 57992597 52712864
38393 52712864 58271135 65846535 67759962 66243053 67793868 71331982 67367142 52105080
38385 52105080 37278000 37835300 51614608 61393092 58609370 53902945 58931948 68547154
38377 68547154 70476893 64974986 62810246 66894705 68004835 60211396 50890157 50632425
38369 50632425 58582936 63289287 57049663 45385947 40071486 44002116 47231995 40751890
38361 40751890 30099133 28626898 38742305 48340709 47510868 40323932 36161232 37250759
38353 37250759 40555247 45067944 49814100 49919341 42986403 35894926 36898340 43282795
38345 43282795 45539357 42598669 43252514 50984145 56892875 52470542 42072270 35758663
38337 35758663 34389228 30362216 22073934 18499603 25923564 37237970 40861490 35851024
38329 35851024 30402692 28320013 26986792 28035454 37236865 50168403 51755170 38459002
38321 38459002 27816889 33356535 42296178 35863830 22051420 24871745 44920830 56931490
38313 56931490 49593405 41138621 45823755 50531206 40827913 28059379 28935713 35249127
38305 35249127 29011890 16391894 19344923 38077081 48635632 39467992 26327415
38298 26327415 24998019 30172203 30601335 28082003 30006793 35366595 38981019 40640026
38290 40640026 40991278 36303916 25740386 16820018 15817808 19215681 21890721 26439794
38282 26439794 35625017 42519027 39233796 30933424 29167099 33286805 31149445 19443285
38274 19443285 10740146 15187831 25706858 29604986 27217406 28256519 33521069 32779453
38266 32779453 22474609 14148468 18811793 30705741 35217232 28673452 20997875 20050582
38258 20050582 22688413 23081111 21921498 23504077 28899966 35504690 39667376 37919966
38250 37919966 29906565 21399637 19157037 21567280 20885604 16140592 15113958 20221166
38242 20221166 22915035 19006181 19162277 33194707 51609342 56153690 44678406 32027645
38234 32027645 27834101 27165671 24447697 23396413 28380227 36036061 41058662 43123305
38226 43123305 43771455 42965764 42373757 45522823 51128688 52984982 50297606 50812294 58370003
38217 58370003 64402774 59310997 47550235 43226079 52758740 69051846 82023331 88206591
38209 88206591 89078646 85827940 79262649 72532961 70635567 76154753 85741906 91909102
38201 91909102 89803107 82091907 75742867 74546215 76934036 80096379 82341654 81492945
38193 81492945 76136733 70292327 71572579 80942771 88796144 86674639 79830687 81036153
38185 81036153 92257764 100189734 93481603 78594991 72204866 80117122 90875276 91565839
38177 91565839 83370420 76842289 76506358 77551724 76547307 77177413 82781600 89966902
38169 89966902 94218088 96804614 100625399 103071548 99491556 91526161 85375733 82745688
38161 82745688 80038348 76406257 75733053 79248002 82670425 83344981 84458774 88564574
38153 88564574 91919797 89859632 83909513 78328212 72522564 63228502 53163096 50437065
38145 50437065 57321424 65272708 65153880 58743634 55275954 58738831 64331069 67151997
38137 67151997 68029849 68767660 67821450 65054636 65720231 73542779 83053004 85622291 81405972
38128 81405972 78397392 80437621 83250943 82484946 78847202 74841125 72934034 76614839
38120 76614839 85687736 91278707 85079842 73395496 70405118 76459996 77112743 67224963
38112 67224963 60004175 64700978 71727194 71102516 69781122 75703534 79269103 69617232
38104 69617232 57567595 60498097 72664558 74290147 65369002 65024007 77726533 86133810
38096 86133810 81787316 77904620 83091767 85477843 75630732 65594136 69762728 81946506
38088 81946506 87135505 84362278 82617520 83240647 81389366 78775370 81311467 87836896
38080 87836896 92117507 92974346 93722364 94880384 94705756 93582702 92542824 91697648 93271495
38071 93271495 99145928 102938122 95278937 81242227 79167197 94701469 110169434 110002424
38063 110002424 102102892 100415311 100969056 93567589 85403615 90985652 105373390 110081312
38055 110081312 103046660 100742246 109619633 116391296 111268281 102886244 103513070 113490562
38047 113490562 126246060 136803437 140802748 136445540 131082350 134675290 144082347 145994005
38039 145994005 137800021 131496756 133194902 134321804 129703773 128680951 138103928 147690467
38031 147690467 144595757 132481634 123957592 122216266 122113878 122646370 126080674 129531842
38023 129531842 129105676 129121227 136387817 147516609 151924072 146371500 138078247 134549706
38015 134549706 137791369 146731274 157533331 163108763 160222212 155843780 158718921 166075061
38007 166075061 167235738 159612689 151637622 149082945 148341706 146197866 146844116 153578103
37999 153578103 160611890 160158827 153698421 149708034 152079464 156299846 156667707 152887943
37991 152887943 149009463 149043284 154552823 164172577 173989949 179634149 179630053 176612039 174141985
37982 174141985 172336899 168291390 161713261 157882281 161929994 171149584 177253239 177076423
37974 177076423 176602847 182028304 190986197 196339859 195287468 190152063 182928074 174657332
37966 174657332 168553960 167419359 168182191 165400600 160900030 162994177 173782066 184297590
37958 184297590 186767985 185333671 188052649 193394662 193676599 189681815 191444981 202477979
37950 202477979 212466806 210918286 201255024 194374105 192844856 190233715 184823263 184646302
37942 184646302 195573736 210885956 218040646 212817713 201951418 193130583 187220635
37935 187220635 181227683 175258504 173569092 179071448 188633954 195080538 193905506 186984185
37927 186984185 178987848 171699685 164277505 158398993 159095839 168248509 179653530 183701694
37919 183701694 176730600 163940631 153220960 147558573 143759217 137725538 130120980 125929659
37911 125929659 128221892 134331474 140211634 146453903 155828623 165792061 169110220 163129249
37903 163129249 152961394 143479075 134294700 126023805 124222043 130239760 133922315 124921473
37895 124921473 108800642 102022381 110610436 122876843 125608740 119530018 114916255 118179968
37887 118179968 127367745 136483386 139784597 134653206 123984911 114301003 109598708 108669408
37879 108669408 108837388 109334184 110601687 113758199 120673457 130157139 134767146 128054929
37871 128054929 115378809 109199817 111497850 110607075 100384349 92007472 97650779 111000870
37863 111000870 116168363 110780209 106691273 109443872 110841388 104090863 94204461 88739004
37855 88739004 87916563 89218350 93303314 99179021 100745570 95255151 89491532 89926725
37847 89926725 91212271 83086724 66597545 54772091 56471311 66454412 73330772 71962395
37839 71962395 65401727 58793540 55166803 55502638 59312308 64198410 66435695 63994842
37831 63994842 59611108 59020299 64012348 68812277 67052810 61280706 59882358 64076856
37823 64076856 65367461 59265452 53694529 57013588 64212970 64478853 58526104 57621977
37815 57621977 66465981 77617509 83647413 84521572 81000268 71473400 59583497 55094077
37807 55094077 61253282 69497571 72399780 73337782 76752208 78140709 72978419 67516576
37799 67516576 69793473 76374038 79583449 81773659 88814928 94520266 88170147 75716164
37791 75716164 75081899 87845706 94246142 83519123 71841932 78207968 96233282 104941179
37783 104941179 98575737 89882864 88327043 90300445 90585615 90620736 92808067 95563510
37775 95563510 96427331 93924178 86134097 74073820 66151121 71130832 85040457 92506985
37767 92506985 84221705 67407500 55940211 55220404 60588790 66658047 73229118 82731515
37759 82731515 94814843 104087085 103117327 88915706 67157670 49183861 43885811 51456464
37751 51456464 63441835 69030570 64160712 55862155 55247458 64934716 76266092 80225302
37743 80225302 77047092 72735261 70820423 71466705 74472458 78294916 79389061 77023593
37735 77023593 75254651 75771155 73569852 65573909 58358376 59393948 64884418 65631501
37727 65631501 61900861 61936762 67100402 69719043 66534393 63583145 65271994 68207504
37719 68207504 69019610 69554974 70812613 69887042 66675617 66013396 69405332 71851699 70264741
37710 70264741 67625397 65778309 62644490 60162168 65019382 75817661 79649982 69524285
37702 69524285 56262689 53582436 59260501 62259574 62047257 67293805 77972984 82323349
37694 82323349 73476997 59083518 51475318 55168011 65947399 76389772 80700596 78780186
37686 78780186 76188332 76508646 75607336 68814592 61131922 62081207 71082376 77306824
37678 77306824 75955638 75440809 83726345 95290854 98817935 93274357 88436464 90467680
37670 90467680 94033776 91085837 83140909 80522798 89648399 104381005 112339583 108595726
37662 108595726 100276643 97806090 105030008 118531347 131974520 138466447 133446602 120552667
37654 120552667 111968783 117072723 131287181 140949639 139019337 131599905 128886978 133954343
37646 133954343 141307512 143221287 136716044 126496456 120851482 122960935 128071517 131609557
37638 131609557 136360572 146421635 157421353 160860307 157477729 157372941 164778176 171131309
37630 171131309 167623253 157503565 149874277 146681527 143331731 139259486 139594589 145471400
37622 145471400 149082808 141895383 125325092 110544501 108058000 118617872 134273031
37615 134273031 146973561 154304330 156723296 153059441 143243432 133934525 134586237 145162914
37607 145162914 153052601 147042165 131253383 119915665 120177480 126249817 130575391 133804595
37599 133804595 140015556 147078417 148210184 142343063 137184403 139777959 147703043 152783442
37591 152783442 151077662 145100115 137453030 127943127 118540445 115449654 121321737 128710805
37583 128710805 127639305 119047951 114242999 119307262 126224905 123927806 114027073 109336439
37575 109336439 117539915 132044967 140882649 140691210 138545347 141712420 149485704 156108404
37567 156108404 159042844 161281000 165464281 168869289 167046183 161454004 159819446 167391729
37559 167391729 180399651 190756546 195685781 199305188 205018963 210528624 212533468 213301220
37551 213301220 218568755 229394195 239848948 244332023 244795381 248255514 257799510 268320163
37543 268320163 271949595 266650755 258333890 254566863 257184877 261779247 263591385 261983989
37535 261983989 258798228 254779532 249583671 243474040 236233410 225740503 211219025 197217042
37527 197217042 189869123 188468954 185090809 174206858 158881252 145868540 138676787
37520 138676787 137104246 138604797 137694637 129895625 119932360 119336467 130269647 138586689
37512 138586689 131051657 113372648 100825355 95916861 88565559 76500223 70229607
37505 70229607 74685296 79768484 75766731 67439211 65112821 70057754 76272563 79955485
37497 79955485 79898828 74549026 66062224 62080376 66269255 71696218 70453378 65049136
37489 65049136 62757592 63201228 60263446 53462862 48637663 48464039 50072005 51699455
37481 51699455 54691338 58512091 59760198 57152603 53293205 51117156 51594763 54208083
37473 54208083 57083154 58146840 57986305 58487238 57170665 48732701 35570644 29282552
37465 29282552 35284128 43097353 40705833 32189261 29829234 33299775 30609910 19297016
37457 19297016 12666090 20763504 35941773 43367967 38506000 28254842 19871681 14726506
37449 14726506 10876212 7259530 4727498 4095345 4266395 4187999 6343154 13903963 23190104
37440 23190104 25205187 18080528 10987928 10527887 11065957 5946327 2009 735858
37432 735858 4590452 4457701 4483324 12790412 23960397 24836889 15505254 8091012 5944538
37423 5944538 1873668 -2425017 5001694 23940248 37374848 36365796 31606741 31630371
37415 31630371 27960248 14248424 3211428 8218966 20637630 22813815 14743012 10634929
37407 10634929 14667897 16937742 11575226 4635975 3520439 8923468 17328549 23719937
37399 23719937 23304493 17147231 13044303 14668051 14983218 7878382 204283 2481555
37391 2481555 12400146 17990540 13973771 5300091 -2412140 -6377836 -3823451 4277961
37383 4277961 9214061 4151741 -4573512 -5409921 2027636 9030865 13331442 20196515
37375 20196515 29126661 32648625 29775607 28138671 29478949 24822633 9735111 -5175426
37367 -5175426 -6312978 5968770 18617710 20949979 14240791 8049519 9520933 16103663
37359 16103663 19434948 16684269 13920361 15543572 16435898 10759737 2822541 399008
37351 399008 1681767 -553100 -4566151 -1292350 10087882 19995975 23230926 24604895
37343 24604895 27054734 25077805 15106259 3893522 869175 7577388 18098721 24826668
37335 24826668 22185629 10932237 451380 268226 7873310 11688901 6722335 -791369
37327 -791369 -5032976 -7184438 -8287284 -5833206 -1181233 -318745 -2609556 1032477
37319 1032477 12871355 21505248 18099206 10159607 9521928 14170937 13015175 3876709
37311 3876709 -4441724 -6112948 -4717464 -5725892 -9558093 -12388031 -9460440 759042
37303 759042 11930920 13232888 2993684 -5326293 1519170 18181094 26565681 18954477
37295 18954477 5775840 -838781 -1383140 -2173375 -2560464 2407960 10126483 11052049
37287 11052049 3117860 -2369209 4880455 18684485 23824211 17555260 13110424 18506134
37279 18506134 23276953 15574978 3351269 4002678 16745791 21963341 10138082 -4486061
37271 -4486061 -6061547 452669 -321234 -10511612 -17774384 -13480149 -1770883 8193183
37263 8193183 11407134 8888560 5512898 5346360 6500105 3461944 -3215871 -4563860
37255 -4563860 5621305 22024654 34323806 37669766 33043144 23274276 13417268 8744926
37247 8744926 7149687 435056 -11192038 -14638410 -2362987 13298647 15680773 6942967
37239 6942967 2379584 6014648 6758662 -1702972 -11360053 -12944433 -7325557 -344606
37231 -344606 4851337 7051307 5730096 3203476 2744123 4184917 6552594 12770294
37223 12770294 24250306 33646618 32791068 25846633 23480003 25452952 21956397 12128188
37215 12128188 6515809 8759318 10192215 7355548 9009959 18088194 22291355 13725120
37207 13725120 4088625 6673486 14791781 13875312 6149623 5497591 12774401 14813537
37199 14813537 7707410 3744936 11057379 20185686 17610659 3716807 -8869971 -9816919
37191 -9816919 -636534 6730193 783976 -15831964 -25921299 -17547679 -610394 6166959
37183 6166959 1437179 443547 8300432 11390658 1457719 -8502574 -4511991 5078990
37175 5078990 2234906 -12498239 -21154031 -15086867 -4758150 -1733841 -4814349 -7728980
37167 -7728980 -8849250 -7997511 -3300622 2787244 2520769 -5546870 -10999282 -4700621
37159 -4700621 8264346 16227336 16486418 15002206 14649614 13214746 11013161 10934531 11555792
37150 11555792 9858541 10943784 23747576 43846498 52047529 37610415 14362950
37143 14362950 4578930 12678190 24525313 28440943 25606134 20702776 13843181 5071246
37135 5071246 -1584718 -3169758 -1682514 262321 2832200 5387304 4746457 566572
37127 566572 -2256189 -682198 917559 -3245044 -11852863 -18239472 -18253878 -12615353 -4165144
37118 -4165144 2981956 4085367 -1464252 -7402840 -6857301 7693 8224478 15103662
37110 15103662 19809040 18645765 8465243 -5383994 -12093207 -8173081 -977455 2365348
37102 2365348 3134996 5349476 8162614 8253383 5425053 2125710 1114823 5806428 17321063
37093 17321063 28187488 26209390 10108008 -5632795 -8665839 -4557902 -5346813 -9282071
37085 -9282071 -5477217 4997004 8824422 2203639 -3231491 -880578 152187 -6767078
37077 -6767078 -11488940 -3335769 9820815 13515228 9328471 9319423 13604385 11711320
37069 11711320 4326992 4343649 13481010 16500922 5681341 -5684400 -4450315 2167208
37061 2167208 509385 -7071866 -8991059 -5408155 -5653621 -9157003 -6223028 2809562
37053 2809562 6043368 604460 -790131 9936058 22668647 24334175 17187529 12163432
37045 12163432 12190592 12888139 14016874 18497913 22676834 18865883 7809560 -944045
37037 -944045 -2565303 -2436715 -5867076 -10241838 -11267798 -10305024 -10249221 -9020398 -3124183
37028 -3124183 5014815 8952529 6649073 2640276 1900170 4761690 7898057 7885011 4102125
37019 4102125 25130 405988 4746264 5597775 -2422474 -13138524 -14113801 -2481644
37011 -2481644 10310042 12669289 6734281 3189501 5972856 8946273 6895495 2819725
37003 2819725 2227566 5604859 9958696 13902976 17084927 17302147 13019964 7576862
36995 7576862 6016070 7684513 6832832 1796962 -1385363 2433248 9410898 11747484
36987 11747484 8175982 4084931 2421178 592693 -2842132 -4504842 -1934833 2063645
36979 2063645 4486451 7104937 11714978 14358633 10582560 4193745 3651862 9889219
36971 9889219 14496257 11474897 5004787 3265380 9117817 18830140 25743701 23805888
36963 23805888 12564703 629053 -1182868 7428586 15807879 16806708 14518217 13849582
36955 13849582 11041428 1974106 -7341193 -8476757 -4284441 -4618115 -11042109 -15994810
36947 -15994810 -15662771 -13277389 -9995279 -3305797 4316132 5944696 2205525 2613011
36939 2613011 10788478 17685123 14938310 6920037 3446218 7072244 13480456 18626766
36931 18626766 19778393 14848026 6472896 2085566 4797186 9037346 9945402 10990845
36923 10990845 16059132 20033479 15492482 4830019 -2548861 -2666939 946102 5605613
36915 5605613 12024167 18783685 21245689 17595189 11987205 10718672 16824616 26915353
36907 26915353 32059523 25445598 11356233 1896498 2217218 5134271 4006449 2772672
36899 2772672 6473374 9925914 5876691 -1206834 -605542 8506523 16761626 18402897
36891 18402897 15823342 12243930 9267290 9967417 15277476 19408336 17940856 17095841
36883 17095841 24318211 33589456 33351181 26177525 25204420 32020675 35080992 31191373
36875 31191373 29865640 31944807 23728339 1727473 -14922985 -10200062 5170218 10809027
36867 10809027 5754005 4020638 9596249 13400314 11244729 8644654 8204459 5638870
36859 5638870 -376236 -4835069 -4291163 -159377 6076631 13734750 19298102 18630424
36851 18630424 12618738 5454013 -796701 -4736227 -2536181 6461161 14196869 12213467
36843 12213467 3697638 -573481 3314401 9721209 13548659 14766416 13728660 10300325
36835 10300325 7903862 11048853 18170960 22867298 21870650 16414351 7965910 -546492
36827 -546492 -2196735 6357659 16751056 18230021 13763490 15545527 24351435 26493708
36819 26493708 15117608 2186884 2099327 12637051 20392816 18674200 12006192 7080022
36811 7080022 6589554 9941293 14329811 15828279 12740631 6984217 928600 -4600456
36803 -4600456 -8325719 -8308388 -5081260 -1168283 3339799 9807203 14709194 10972035
36795 10972035 -1125659 -10781376 -9523500 -2411712 -543303 -5808151 -9763413 -6646365
36787 -6646365 -1088041 -860575 -5953436 -8731516 -4584193 1429709 1809879 -1816851
36779 -1816851 -834241 5893901 8378525 1417162 -4951121 -733708 5781302 -720127
36771 -720127 -16810317 -22522071 -10412652 4247090 7156066 2947220 1464274 823005
36763 823005 -4298470 -9110355 -6661331 -1115127 -349367 -1897869 1104867 5563258
36755 5563258 3321653 -3385079 -4779872 141555 3109214 1858335 3318733 10298410
36747 10298410 16416771 16881011 14647505 13159708 11444259 8925371 7356305 5805297
36739 5805297 1178992 -4428810 -4594809 1172895 5749620 5329737 4215455 5797123
36731 5797123 6870466 5267334 5828689 13109044 23237052 28141596 24313015 14018589
36723 14018589 1832134 -7146446 -9799114 -8175573 -5985491 -1138728 11168824 25914540
36715 25914540 28363874 12962483 -6078941 -11757055 -5519331 -1162747 -2034617 2365142
36707 2365142 16362021 27779941 24067507 10063265 1044676 2561796 6433873 6003927
36699 6003927 5846316 12231271 21022391 22701965 16513203 11028493 10283930 8374694
36691 8374694 1730510 -1808374 5901742 18749164 22780754 14931877 5529405 2264807
36683 2264807 1646817 -1276038 -3892503 -1445632 5103886 11245574 14023936 11703729
36675 11703729 3807200 -5099627 -7439651 -2395959 2036715 764976 -1266150 996781
36667 996781 2772752 -2629277 -11533018 -14988183 -12566408 -11044624 -11258019 -7213255
36659 -7213255 1026868 4613043 -93094 -4283680 233611 7935760 7616630 -737067
36651 -737067 -5968829 -1614746 6762275 11788239 13935296 16253420 15850916 8657920
36643 8657920 -136838 97059 9950727 17177623 13366536 5328967 3388975 5497702
36635 5497702 2444790 -5791871 -10117267 -7286622 -3800542 -4104660 -5069742 -3989485
36627 -3989485 -2350372 544832 7642390 15034789 13772668 5086391 2248404 10940991
36619 10940991 19488593 17402980 12307701 16363796 24838337 22738342 8175848 -4820953
36611 -4820953 -5574312 2485981 9884405 10594098 4160265 -3645278 -3734971 5564136 13739752
36602 13739752 11777894 6150630 9299965 20269096 26582040 23137024 17119684 14879594
36594 14879594 15493171 17215460 19250920 17371924 8970791 1964070 6664895 19060478
36586 19060478 25123660 21940755 20210437 24337733 25874614 20669793 16518423 17346712
36578 17346712 15168454 6372125 1721718 9353028 19893602 20336601 12922447 8391142
36570 8391142 8850521 9531370 10829925 16083097 21560769 20054220 12297742 5900146
36562 5900146 4811124 6853580 9168289 9977864 7643945 2840399 -1433853 -4824865
36554 -4824865 -9282157 -11862213 -6483830 3878055 7497062 1607367 -2182940 2801246
36546 2801246 7198832 3848031 2573630 12311186 21657694 15630466 1709055 -1621269
36538 -1621269 4451467 2320006 -10849035 -18227539 -11557497 -2723379 -1623416 -1781912
36530 -1781912 3657163 8111756 4389084 -1114441 1751110 10919822 15493479 10145882
36522 10145882 -296105 -6748948 -2894501 9005226 17461512 12465492 -2346722 -14305978
36514 -14305978 -17349095 -14516051 -6723315 8214450 24041487 27747344 18161325 10343505
36506 10343505 14350163 20984680 17397024 6795996 1777600 5030816 8144342 6143977
36498 6143977 2871084 2428342 3359689 2899111 2104563 4380477 10134009 14440936 11985820
36489 11985820 4944984 1925555 5937987 8983199 4869501 1033517 7130568 16955791
36481 16955791 15986322 5105818 693305 9234269 18107468 16588777 10596218 9260038
36473 9260038 10844111 10651616 10252463 9739838 3079027 -8855237 -12721943 -1809643
36465 -1809643 10301809 8034525 -3680747 -8563861 -2319115 7154197 15566226 23169038
36457 23169038 25063675 15815304 1192647 -7959224 -11138909 -15148049 -19036928 -16072818
36449 -16072818 -8904746 -8037099 -14292061 -16239267 -7721111 3539027 8033266 5553471
36441 5553471 1135430 -1861834 -1773956 1661406 5532094 6430306 4579485 926719 -6446146
36432 -6446146 -16473243 -20453027 -12712378 -1978691 -1047688 -8147383 -10921753 -6808307
36424 -6808307 -5396710 -10469291 -14287466 -12156319 -8808076 -6591306 -707537 8934977
36416 8934977 14161336 12934546 14804901 24477355 31696617 26597650 14869337 7657772
36408 7657772 5399883 2655140 1253604 6004753 12167721 10115997 942082 -3977686
36400 -3977686 647409 7902048 10433065 9510366 9028001 7655544 2351725 -4154092
36392 -4154092 -5226950 399982 5349721 1906146 -8230481 -15731984 -14879351 -8580709
36384 -8580709 -736306 10087642 23790761 31227125 23459260 6765075 -2462698 835025
36376 835025 4770641 -46047 -6461315 -3443075 6256326 11256833 9125996 8122315
36368 8122315 12961106 18285362 17502684 11180795 4543710 1396207 2566558 6921905
36360 6921905 11720398 13686291 11395694 6568628 3126652 4736168 11432952 17753137
36352 17753137 16414446 6105638 -5374189 -7876532 940041 12838498 16460650 8039835
36344 8039835 -4679057 -10108280 -5201882 1883412 3172505 1262109 3700230 9860379
36336 9860379 10709780 1957799 -9372364 -13549648 -7945878 3562749 15401008 21852108
36328 21852108 19086730 9429081 202800 -4283241 -6235285 -8155309 -7760971 -2177881
36320 -2177881 6476815 12762078 12628413 5153658 -6650753 -15458315 -14749925 -6497971
36312 -6497971 421533 973680 -1699608 -3594789 -4673670 -4030040 2000093 12373142
36304 12373142 19003812 17422379 13413675 13046822 12624414 6167988 -2671478 -5188256
36296 -5188256 -571264 4500831 6759650 8137424 8275226 4387196 -1158454 -1615323
36288 -1615323 3882940 7615637 3181716 -7079096 -16435384 -20868985 -19905924 -14377049
36280 -14377049 -5809998 3807003 12342779 16492874 12663549 2529257 -4554952 -565185
36272 -565185 10163799 15194678 10376691 5469693 10003838 19050876 19160455 6485477
36264 6485477 -7310417 -8918593 1186812 11092275 13209536 11856235 13352131 14786621
36256 14786621 9221732 -1111849 -5806477 -1147024 4908256 5905914 6459088 12605809
36248 12605809 19808018 18930267 9923358 1160562 -2516446 -3271748 -3110594 -820762
36240 -820762 3624190 7578815 9263505 8692291 6009241 2944577 3647959 8924855 12273355
36231 12273355 8023196 1158723 1754006 11130420 21197748 26491264 28641514 29334339
36223 29334339 27665547 25070127 24070493 21191542 10551566 -3834337 -9676297 -3588943
36215 -3588943 3799867 4495893 4002554 8856153 14164447 13299031 10943532 14498208 18861100
36206 18861100 12928449 -2116260 -13995548 -17490462 -18425614 -18795556 -11406961 5916814
36198 5916814 21914769 24799447 16204824 5975226 -478559 -3058868 -1228013 4246905
36190 4246905 7077393 1408805 -8571887 -11843084 -3971057 8057488 15125300 15061994
36182 15061994 11026339 5574116 -466533 -5551118 -6984841 -3283316 3447259 7758153
36174 7758153 5302077 -1299051 -3077024 5490271 18518742 24558103 19983118 12167636
36166 12167636 8993547 10036397 9773441 5185765 -2127484 -7815358 -6738061 3097702
36158 3097702 16245475 23389081 21798068 18039216 17414930 16030988 8351885 -2093227
36150 -2093227 -6524137 -3022065 1950317 3116285 1231382 -1409119 -4389009 -7089107
36142 -7089107 -7608329 -4915345 469925 7297006 12508246 11509349 3431493 -5896420
36134 -5896420 -10307570 -10057762 -7845116 -2173181 8334501 17229307 15676082 4767675
36126 4767675 -5528999 -9105754 -7718157 -3652170 2329934 6097026 3337115 -1281695
36118 -1281695 1918309 12708994 19907913 17473688 11453165 7957850 4913739 199885
36110 199885 -2113182 849196 5603055 9002525 11784915 12349295 7056153 14220
36102 14220 857920 8624148 11170189 6107430 6778580 18649905 26093447 15740535
36094 15740535 -1546115 -7791912 -4622632 -5228885 -9749600 -8069941 -435138 4042906
36086 4042906 5199247 9688164 14199995 9316612 -1388000 -4341681 1888288 5048848
36078 5048848 947838 -622101 5349032 10645970 8734869 4265639 3176739 5051531
36070 5051531 8308763 11977083 11241748 2962124 -4864422 -2614037 3538073 136806
36062 136806 -8834083 -6134841 7949445 12071964 -1962370 -14259105 -7648790 7136273
36054 7136273 11476164 5890620 821669 -3508694 -9935873 -10605321 259853 10654061
36046 10654061 7528235 209810 6385414 21581783 25001566 12699298 2275834 3624154
36038 3624154 6986355 4981954 5814166 15040109 21517940 14763099 4065272 5396787
36030 5396787 16316902 19244520 8188717 -1992852 2838007 15883415 19150009 8156664
36022 8156664 -3310113 -3465609 2520595 3601712 1066790 5184806 16384326 21637816
36014 21637816 12314309 -3565303 -11434492 -5955331 7119207 18554430 21127059 13433877
36006 13433877 2436923 -2562886 -941627 197461 -813562 2605055 11544881 16357979
35998 16357979 12142863 8643154 14688179 22099441 17699759 4766053 -1431121 3831542
35990 3831542 10390140 10825194 9520319 11841583 15017781 14045914 9290871 4185840
35982 4185840 360324 -1827479 -1335673 2524168 8379716 12517716 10216549 -125788
35974 -125788 -13250188 -21261589 -22767108 -22370575 -19997858 -9780343 6264912 14403490
35966 14403490 7811259 -694668 3625904 15023010 17017908 8879560 5231791 10567181
35958 10567181 11898688 618064 -13569757 -17482166 -11649848 -4994422 -1128568 2008047
35950 2008047 4726518 5271617 4182167 4169768 7084465 12490378 16772076 14374120 4931913
35941 4931913 -1705465 4936665 20347316 27356453 17519900 2739840 320889 11976832
35933 11976832 23722257 23504692 13257036 3950245 2475847 4979011 3187677 -3782009
35925 -3782009 -7741511 -3513455 2765769 3312148 1692803 6638620 15368566 14972146
35917 14972146 1884126 -11540298 -14130044 -9334058 -5867900 -4645840 -3053285 -4159932
35909 -4159932 -11425560 -18980638 -17515769 -7892088 263419 2791468 5040005 10834030
35901 10834030 15662609 13875492 6448806 -1982256 -8922088 -12970181 -11286698 -3445688
35893 -3445688 4237805 3698268 -5287408 -14429635 -16444945 -11784646 -5204672 148294
35885 148294 2873446 1263329 -4881162 -12054191 -16034067 -15914765 -12635465 -5896645
35877 -5896645 3595790 11091737 12222495 9448622 8901574 11376247 11725386 6886458
35869 6886458 -649463 -6676973 -7258045 1099311 15713690 23829254 14144695 -7423639
35861 -7423639 -23253056 -25748352 -22511754 -19192161 -11635225 448826 7087658 3664364
35853 3664364 -203510 2927338 5323329 -1502820 -10938502 -12396493 -8007131 -4957936
35845 -4957936 -974947 7914344 13949897 8111735 -2713135 -5073501 173492 2051064
35837 2051064 -1060884 -2536157 -2943952 -7093322 -9810210 -2237825 11188278 19373153
35829 19373153 23474318 30115972 31414343 15432779 -6279465 -8213965 10463050 23701289
35821 23701289 19463774 14866239 21991110 27309331 19814234 13502586 21940229 31421779
35813 31421779 21914467 -402190 -13528745 -11618054 -5831932 -1189065 7493820 20455432
35805 20455432 30690512 35395134 37268934 36364345 30513337 21276882 12050741 4307182
35797 4307182 849424 5362125 13224805 12745128 2759641 -1923435 8576523 23826825
35789 23826825 28121914 19881583 6458073 -7796122 -16910471 -10409814 10339890 24854502
35781 24854502 18338106 3018203 -1242228 3781282 3267977 -3231068 -4448957 -550574
35773 -550574 -1622234 -6754328 -5611786 1072642 2619383 -984755 687499 7535912
35765 7535912 7864873 213952 -2674864 4565255 11792824 11592773 9790003 12128887
35757 12128887 14446149 12135388 7788634 4369804 695257 -3037429 -4511976 -5319456
35749 -5319456 -8071842 -8404069 -1651658 4045347 -3925552 -20837712 -27025158 -14909415
35741 -14909415 1407020 7247300 3423706 -3147026 -10178241 -15257992 -13405316 -5983095
35733 -5983095 -1320377 -1923034 -2211086 -2076086 -9032846 -21911144 -26440778 -14489388
35725 -14489388 3866230 14189330 13205017 5608555 -3083308 -5770669 1662763 10049580
35717 10049580 4430655 -13108100 -22961687 -16640611 -9284549 -14359621 -22744206 -20148455
35709 -20148455 -11002587 -9725086 -18726961 -29364623 -36063653 -36731598 -27855620 -11765173
35701 -11765173 -422023 -60914 -1068489 4950169 8968928 307340 -11614626 -9288571
35693 -9288571 5866434 16701134 16291032 12961894 11841281 8937659 3764723 2143705
35685 2143705 4807815 6272573 5819356 7449146 9144847 4962837 -2019282 -1825983
35677 -1825983 6392962 12887653 12907887 11406857 11006115 8243757 4079390 5160419 11044440
35668 11044440 12290373 5342105 -2294271 -5941377 -10863649 -20065717 -26627673 -25169723
35660 -25169723 -20597606 -17947671 -13333873 -3599877 3972403 1849589 -4543322 -4486151
35652 -4486151 1673209 4484388 1347335 2773 5529792 12592665 13506724 8367219
35644 8367219 3798111 4431192 8216156 9442117 5148202 -1979350 -7169079 -8430711
35636 -8430711 -5834041 2024854 15744679 29102701 31610760 20622759 6572149 1767244
35628 1767244 6564784 10711055 6501221 -3641381 -12061537 -14486272 -12748294 -10814386
35620 -10814386 -9453151 -5599004 2158104 8795330 7084702 -2674308 -11026370 -10047997
35612 -10047997 -2808931 1056191 -2932493 -10700598 -16722542 -19741236 -20369829 -17253130
35604 -17253130 -9176188 466109 5101195 2107928 -3525638 -4591663 57891 4604611
35596 4604611 3649153 -1603556 -5574034 -5069046 -1959248 361763 1307480 3103419 7121644
35587 7121644 11207494 11315639 5657976 -3631897 -12980323 -20090823 -23891805 -24065314
35579 -24065314 -21803890 -18460649 -12131727 139538 13695183 15703068 510652 -18530286
35571 -18530286 -22346419 -9870239 1985494 2303812 -1877351 -750234 3588344 4624643
35563 4624643 3166897 2711659 1133695 -3796504 -7143400 -4020991 1763692 4721781
35555 4721781 6751673 9871743 7290568 -6147875 -20369085 -20619761 -8147063 3330763
35547 3330763 9086127 16199999 25518142 27044397 16800991 4196712 -2531871 -6219947
35539 -6219947 -10731470 -12202171 -7000862 510549 4665529 5931764 6703047 6431707
35531 6431707 5130640 5036663 5351745 2251774 -3204804 -5006167 -2475046 -1725916 -4083968
35522 -4083968 -3155657 2702445 5924964 3265962 2942731 11062306 20610024 21855253
35514 21855253 15394769 7745471 2458812 2138528 9403527 18529551 17178519 5094924
35506 5094924 -1217230 6678685 13302923 3436255 -10667922 -6649918 11917551 20348211
35498 20348211 11000162 2755406 9260964 19654833 19122874 10864121 6680835 8691155
35490 8691155 11625519 14227265 17926426 19990961 16592547 9263703 2817227 206091
35482 206091 2566885 9377530 15535608 14092781 5781110 642727 6147670 17782811
35474 17782811 24656896 21000160 10261718 1365497 1298875 7130175 6689440 -6409387
35466 -6409387 -20638816 -19292054 -4567825 3771911 -3813449 -14137478 -12571074 -3077360
35458 -3077360 2804531 4975115 9669987 13911890 9805016 50981 -4588076 -1574817
35450 -1574817 1831627 2275763 3544390 5828203 3962881 -966882 386373 11020594
35442 11020594 20285426 17812671 7976375 3160187 6769935 10325458 6296135 -2220123
35434 -2220123 -5902225 10493 11108251 19038344 20145760 18276716 19207869 23932013
35426 23932013 28603049 29384846 25173017 17003878 7915486 2863765 5375817 13492731
35418 13492731 21108683 23643638 20798307 14566650 7503259 2859754 2984851 6424750
35410 6424750 9244267 10418886 13183729 19091625 23410209 20209393 11458514 6713027
35402 6713027 11357856 18085032 14668210 -40790 -13267319 -14017018 -6413370 -1833045
35394 -1833045 -1838470 1997749 11569946 16095878 7496015 -6015934 -9499433 -364218
35386 -364218 9634511 9741417 968096 -8191185 -11375172 -8872498 -5975177 -7305556
35378 -7305556 -11133352 -10794913 -3467904 5485608 9566054 8584973 5249049 -1002257
35370 -1002257 -10771818 -19231811 -21255445 -19443119 -19313241 -18663841 -10768465 2414484
35362 2414484 9903993 6208002 -2345178 -7951704 -9820011 -9638644 -6909457 -2867434
35354 -2867434 -1677255 -3217760 -1393581 5772707 11084177 8438222 1764153 -2088449
35346 -2088449 -3208211 -4729459 -4851673 -570948 5089526 7744734 10013716 16748117
35338 16748117 24634042 25750872 20311098 16522421 17350872 16565509 10168538 3392651
35330 3392651 2212540 4365898 3920150 683981 201071 6199735 16142597 23042683
35322 23042683 20391465 7775058 -6690549 -12149396 -5630400 4767225 9102305 6150745
35314 6150745 2642534 3705291 7308811 8455479 6202093 4342186 5642968 8018560
35306 8018560 8191356 7274281 9070722 13149788 14472478 11685036 10521509 14681407
35298 14681407 17798598 11158465 -2661494 -11255277 -7892301 1139885 6572307 7463828
35290 7463828 8981184 13510692 18680832 22098283 23887441 24765473 24214103 21173023
35282 21173023 15873492 10848946 9450173 12244682 15704817 16183655 14117147 11938183
35274 11938183 9416486 5015527 1033692 2274428 8781668 14777285 16570042 17047861
35266 17047861 20092364 24872845 28502793 30218908 29486141 23968621 13969211 5854639
35258 5854639 5717528 11040056 13587104 9965666 4536424 1646462 -101600 -3773603
35250 -3773603 -7961548 -8361397 -4631722 -2195537 -5056156 -8166267 -1044656 18577487
35242 18577487 37984695 41606633 29074532 15143086 11002498 12928834 12428947 9488053
35234 9488053 8906057 9764744 7855175 5197685 7162429 11182671 8474632 -2004032
35226 -2004032 -11153316 -13754351 -14940303 -18238887 -17252661 -6917094 5204060 8721505
35218 8721505 5713964 5308155 6975931 2090043 -8431213 -11747058 -2245750 9010282
35210 9010282 10808868 7355767 7812669 8928103 1468806 -10148297 -10222699 3850317
35202 3850317 13580916 3653368 -15577023 -20647571 -5215018 13596419 18571964 11590688
35194 11590688 6038605 8525846 14877625 19610701 21311727 19122441 11240250 -101885
35186 -101885 -7128734 -4803318 1540104 1864186 -5410229 -10843059 -6291561 4652503
35178 4652503 12013805 11813525 8159722 4828336 814687 -5089784 -10727476 -13799502
35170 -13799502 -14598096 -13307761 -8518186 -1210269 3442865 1809346 -3280539 -6356316
35162 -6356316 -5267766 -525439 7429203 15984522 18976748 13183823 4010748 -626134
35154 -626134 35083 1437811 2379871 4859450 7432222 6975430 6042234 9506065 14245907
35145 14245907 12623815 7390691 10899279 25033228 34348790 27304754 13424728 8524985
35137 8524985 11935086 11972642 7808200 9531046 17457811 17775851 3517581 -12968010
35129 -12968010 -15992645 -6115268 4287314 8894052 12055969 18028723 23748295 23888370
35121 23888370 18545252 13215015 12293557 14494569 15616554 14851603 15456143 18315633
35113 18315633 18920964 14096933 7930327 5750084 5341352 1098301 -5108597 -5744292
35105 -5744292 -125503 4141013 3919428 4935986 9512667 9915733 994483 -8883402
35097 -8883402 -8734606 -913868 3790457 2865465 2789638 4737028 1533947 -8825049 -16915713
35088 -16915713 -14269374 -4877224 1372963 1833170 1806440 5039324 9287066 10932218
35080 10932218 9826750 8654500 9684705 13047032 17272812 20733237 22266921 20765129
35072 20765129 15611939 8331157 2098228 -1802491 -5023719 -7964483 -7913811 -4851105
35064 -4851105 -4797053 -10579732 -12472086 1567740 25603476 37295948 25235658 4723624
35056 4723624 -2243709 5346355 11112121 7042161 1407250 1094660 362702 -7128703
35048 -7128703 -15612139 -14990920 -5583109 2811266 3860383 325851 -1994738 -755413
35040 -755413 2498090 5078814 6172884 8098893 12718004 16042441 11018785 -1283520
35032 -1283520 -8275359 396097 18460053 28983272 23875326 11334525 3852661 5115985
35024 5115985 10421812 14358044 14634660 11773510 8393777 7389754 9153783 11782848
35016 11782848 14105033 16101356 16552033 14145195 11804077 15408389 25459526 33455908
35008 33455908 30309897 16865443 3153952 -1863322 2435405 10303510 16245319 19152271
35000 19152271 20921340 21942508 19476649 11933299 3323230 312156 4878792 12818152
34992 12818152 19408781 23013117 23049356 19221381 14345681 13270804 16332024 17889444
34984 17889444 14282253 9315139 8348673 10566697 11218797 8602097 4684809 1477348
34976 1477348 960967 5736701 14706697 20467546 16825546 7784628 3346056 6688425
34968 6688425 11126988 10344113 6242070 4807413 8189413 12991089 14092404 9345990
34960 9345990 2578398 1514424 9612861 20375947 23671295 17966047 12215930 14650779
34952 14650779 23444595 29865170 27441555 16852643 5015389 489184 6165225 14826708
34944 14826708 15560755 6668314 -1669187 -656574 5219355 4817258 -3527565 -9563257
34936 -9563257 -5733716 2900024 7962201 11348529 20930812 34138856 36642328 22249316
34928 22249316 5215665 3405679 14373525 19563463 10480793 -1871963 -5206521 -701701
34920 -701701 5370767 12482137 20134677 21752283 14593996 7741182 9476987 13681246
34912 13681246 10099989 1559222 -1797319 290454 972459 1677662 8884625 18278877
34904 18278877 19231235 14409354 16952632 26727456 28405798 17349405 8053707 9736255
34896 9736255 12658761 8716344 6858220 14393500 19975137 12139658 823979 1535803
34888 1535803 9117288 7699961 -1062394 -1434036 8524256 14134925 9547223 5968050
34880 5968050 10725201 15778953 13446544 8889611 8921225 9603915 3619760 -7299293
34872 -7299293 -14618999 -13518689 -6717999 -754942 -159551 -2543117 -495664 7752135
34864 7752135 12859238 5988156 -7745792 -15821990 -14918052 -11129160 -7060800 -1029373
34856 -1029373 2767058 -2624149 -12956958 -15940894 -10311668 -7548441 -11497126 -11526258
34848 -11526258 -1618034 8666595 10278286 8010843 8305297 6606215 -1652721 -8513388
34840 -8513388 -4961079 3311457 4327063 -2416983 -8461875 -10544375 -10009192 -3670492
34832 -3670492 10934953 24166315 22084524 5933443 -7727420 -7761789 148672 4369986
34824 4369986 1296190 -3894644 -4725413 64398 4564084 1689582 -6285650 -8001257
34816 -8001257 1535460 12271718 13295094 8855827 9846994 15109488 14394458 6873448
34808 6873448 2418211 4607358 6456853 5074332 7006528 14562451 18771721 12224868
34800 12224868 -107480 -8494982 -9387646 -4519261 3124719 8245200 5823657 -1069279
34792 -1069279 -3489420 28300 1028781 -4209676 -7831002 -3973051 1351453 1906485
34784 1906485 2710424 9504586 15253689 9768299 -2480045 -6957776 908567 11650678
34776 11650678 16371461 14908660 10006989 3588791 -448005 1270614 5193716 4614944
34768 4614944 -87348 -2893637 -3019573 -4656129 -5921249 248944 11608823 15149265
34760 15149265 5897090 -3523883 882 12015032 18276837 13688928 4405913 -2951690
34752 -2951690 -4425708 3488870 17524805 22649364 6928138 -18402146 -27068747 -9717208
34744 -9717208 13783025 19608951 7240717 -6298326 -10487563 -8652591 -6151457 -3103769
34736 -3103769 969752 4414876 7451622 12633429 19515682 23909703 23711271 20692237
34728 20692237 15643510 7342101 -1855508 -5360821 -852236 5364983 6588075 4140037
34720 4140037 2875975 2213403 -1837259 -7666046 -8549557 -3097003 1341484 -1147385
34712 -1147385 -6295086 -5568749 2024546 9256523 11083054 10244737 10553996 9398167 1951688
34703 1951688 -8978544 -13473183 -6515467 5341956 12386691 12754394 10918928 9199375
34695 9199375 7213147 7424592 13062543 20146265 19851323 11365196 4671919 6515600
34687 6515600 11064881 10369212 7088748 8453648 12585777 11158415 4051925 1022426
34679 1022426 7126899 15160388 16313170 11940165 10064743 14229808 20530682 23945705
34671 23945705 23705375 22116442 20206054 16204205 9051246 2165444 637139 4173841
34663 4173841 6766168 5053234 2214526 598845 -3404140 -11499603 -16505863 -11672981
34655 -11672981 -2465270 1272062 1880191 10021719 24356427 29280536 17719122 3572006
34647 3572006 3019733 12699240 16514491 8287248 -2864142 -7476439 -6615664 -6488578
34639 -6488578 -8271781 -6332440 4633704 21469193 32728408 29666615 16646534 6609964
34631 6609964 6225258 10532260 12375120 10311014 5605244 -900729 -5401724 -1936105
34623 -1936105 8581129 16472925 15620223 11831985 13562824 20040373 24652847 24899385
34615 24899385 22400667 17384834 9907568 3522852 2099695 5491709 11962383 20568268
34607 20568268 27569043 26388527 15994556 3804939 -3786329 -6997293 -5564149 3353162
34599 3353162 14065126 11759676 -6359322 -20871013 -14584089 2836253 10063728 4622233
34591 4622233 -138226 -1087291 -6489856 -14149018 -11328556 1514405 8125536 2223653
34583 2223653 -3602666 -844434 1927571 -2604150 -6455809 -1073811 8342438 13657580
34575 13657580 16091568 17802131 13869146 3394776 -3163065 977835 7166815 5637032
34567 5637032 1043767 1915923 4757176 1861591 -3519462 -3355152 733788 2208449
34559 2208449 2563935 6859892 12118232 12777495 12066039 15099532 16370035 8051337 -4178502
34550 -4178502 -8417724 -5707980 -6419660 -10417845 -7668001 2035114 7307228 5217089
34542 5217089 6274963 14681676 19200984 11294125 -337969 -2116721 6932114 18108406
34534 18108406 25626609 28348676 25059308 16019577 6095850 653489 320571 2703812
34526 2703812 5971575 8165032 6639223 1081679 -5307180 -8981050 -8257802 -3217878
34518 -3217878 2873859 3630790 -3551443 -11825508 -12235681 -5594396 -262191 317945 -682839
34509 -682839 -3128639 -10500627 -19559517 -20758527 -12729270 -5834394 -6322341 -7407548
34501 -7407548 -2948702 213484 -6428313 -16873049 -17516238 -6785592 3164247 3781254
34493 3781254 -636586 -2678733 -2389470 -3638589 -5189179 -1475770 8433357 17496014
34485 17496014 18562790 12689581 5705578 -1617418 -13009745 -25084269 -25532426 -9827418
34477 -9827418 7657387 9549692 -1999569 -10187498 -7821012 -3001716 -1239443 2202955
34469 2202955 8296723 8268259 -280585 -4617380 4954802 18447993 19634036 8726931
34461 8726931 -401584 -602179 2698098 3277321 1215108 -1000255 -1552556 502005 2294787
34452 2294787 -2545792 -14532659 -23501023 -20335979 -9136517 9231 5059727 9277796
34444 9277796 9936178 2360833 -7683579 -9240080 -3238855 -803726 -3672349 -792121
34436 -792121 11936503 22864970 22281548 16334846 14729801 15506871 12290468 7310343
34428 7310343 5163047 754246 -12882741 -28714656 -31791300 -20621018 -9329388 -6996154
34420 -6996154 -7605140 -4398241 -1649264 -4587384 -7781142 -3809521 3017529 2479110
34412 2479110 -5461609 -10741689 -7881850 -753898 6932568 15626326 22828508 22127043
34404 22127043 13186093 4106800 -348299 -4279048 -9644035 -9749352 -1645681 4400280
34396 4400280 -956226 -9583259 -6685551 6165976 13334109 9101957 4196032 6212594
34388 6212594 8269673 3143013 -3538284 -2638689 4328815 8470735 5395932 -2145739
34380 -2145739 -8375057 -6805846 5293515 20085903 23570336 12166013 -1723960 -6153858
34372 -6153858 -4126620 -4806908 -8133833 -7864424 -4364962 -3542531 -5562689 -4474471 1454347
34363 1454347 6977903 7578945 3996201 -474774 -2487866 -41510 4343724 4550137
34355 4550137 -741720 -4588838 -1724941 3255683 4271185 4476379 9508067 14907874
34347 14907874 11665856 1929224 -2927376 -211412 -241458 -9845769 -21212812 -21799725
34339 -21799725 -9043330 8201573 18315664 15648984 5212571 -1343760 764888
34332 764888 2009787 -8402118 -24809204 -30970969 -23086657 -14323458 -13588458 -13165050
34324 -13165050 -4746451 3974307 401089 -12029170 -16804636 -7029005 5478786 6266958
34316 6266958 -3610856 -9756109 -1863490 14526396 23966671 17344461 638031 -12729124
34308 -12729124 -15621142 -10788193 -3499074 3900822 9968839 12252632 9899634 4971853
34300 4971853 -562701 -6322099 -10892810 -11256122 -6967265 -2257970 -1663653 -5135464
34292 -5135464 -9143750 -11282476 -12063419 -12467321 -11116345 -5566041 2545271 5961270
34284 5961270 -203223 -9774278 -11567284 -5520853 -4272469 -14184719 -24236731 -22184203
34276 -22184203 -13187296 -10437666 -13788883 -12669119 -7048012 -8573475 -19437454 -26467096
34268 -26467096 -21331084 -12270656 -8825951 -8015340 -4571970 -3132804 -8691815 -13444773
34260 -13444773 -5946397 10740248 21157540 16360378 2558300 -8161829 -9496491
34253 -9496491 -4378547 -1429980 -6390953 -14248024 -13790902 -3116814 5481437 1593570
34245 1593570 -8376237 -10078800 -725127 8914410 9908202 4358586 -518998 -801722
34237 -801722 2188760 3581353 -1205333 -10536159 -15884596 -11136276 -691469 6067056
34229 6067056 6172422 4102955 3931273 6425619 12137923 20375199 25237670 19656378
34221 19656378 5242840 -7232661 -9662348 -5090058 -2143476 -4123679 -6486367 -3794335
34213 -3794335 3464630 9853298 12045044 12954015 16881636 21914189 21262573 12771711
34205 12771711 2644665 -2113988 -416053 6254736 18346856 34191698 45548227
34198 45548227 44190237 32159979 20049940 14990517 14551417 12673658 7611692 2658871
34190 2658871 1262971 2835197 3435537 1021156 -934562 2334528 9642853 15202936
34182 15202936 17493633 20709291 25246122 23907338 12726917 -387275 -4708517 -460792
34174 -460792 3185211 545841 -7187673 -17938009 -29689288 -36563541 -32505193 -20042751
34166 -20042751 -8606669 -2820406 1487128 8410702 15448338 18222166 16350979 11725960
34158 11725960 5260198 -1657097 -5959340 -6251811 -5068469 -5388003 -6681914 -6269782
34150 -6269782 -3160450 769931 2341848 -452319 -5832348 -8239876 -3645701 4746890
34142 4746890 9247157 7443459 6061394 12360697 23735276 29548796 23431899 10766277
34134 10766277 2356081 2452620 5613649 5190143 1806857 1272126 5762324 10310926 8611416
34125 8611416 359040 -8169079 -10257147 -5388463 97367 -54007 -4411508 -5809107
34117 -5809107 -1741036 1484735 -1914911 -8342069 -10814930 -10061681 -12300394 -18168624
34109 -18168624 -22127694 -22222224 -21907616 -21710484 -17801832 -10470966 -5472200 -4518449 -2617948
34100 -2617948 2421714 6073261 5787829 5516008 8324467 12486883 17410034 24143422
34092 24143422 27563743 19683805 5022220 -219160 9135273 18654908 16985516 13143339
34084 13143339 19342147 29681905 31026776 24678028 20854876 19800685 15218207 9834692
34076 9834692 10233676 11586532 5248113 -3078189 -1555202 5132450 1978551 -9069536
34068 -9069536 -10382610 1001720 7317871 223619 -5189911 3629777 16582546 19497684
34060 19497684 15871837 15326568 14252736 4396538 -8992497 -13960303 -10945505 -10476552
34052 -10476552 -15280379 -17623515 -12941680 -5299228 293680 2577245 1792028 -217785
34044 -217785 1076760 7311090 11982340 7338296 -4094675 -10729876 -5012617 8847470
34036 8847470 20310988 22535667 16969825 10076466 5985136 3064345 -850889 -2529479
34028 -2529479 2106269 9043374 9542839 3279065 -333808 3273420 6611854 2475793
34020 2475793 -4465042 -5459268 -1146869 708901 -2365426 -4795460 -1601690 5629817
34012 5629817 11496959 12460843 9768517 7448729 6556440 3249129 -3834257 -7329856
34004 -7329856 211327 12873854 16406158 7637989 -1719675 -3143779 -1338188 -1403078
33996 -1403078 1243814 9375886 13601834 5407797 -7059595 -8726812 1390595 10422761
33988 10422761 10197416 4990356 1868784 2477483 4670007 5630638 3391476 -556195
33980 -556195 -2261892 -1978204 -4543416 -8883484 -5148866 9843770 22289762 17706107
33972 17706107 1823117 -7340278 -4295793 809943 2126939 5945565 15917499 23664561
33964 23664561 20127210 7649513 -4231263 -8683874 -4263661 5720506 13566839 12756221
33956 12756221 5513949 -375397 -2836020 -6636415 -12442076 -13446773 -6270925 2604132
33948 2604132 5968492 5119031 5133935 6474409 6714966 6437707 7782597 9462217 7853636
33939 7853636 2034649 -5113354 -9809465 -9835556 -5635901 36893 4972729 9564505
33931 9564505 13783196 14079911 8191026 1713049 2926631 10311660 12622508 4035105
33923 4035105 -7663703 -11771316 -7322927 -657442 3743608 4634420 1472890 -3330832
33915 -3330832 -3848877 1433683 5029964 556244 -6327042 -5119949 4187179 12213314
33907 12213314 15060809 17330213 19428694 13919869 -221787 -10161217 -4670338 9853858
33899 9853858 18194037 16504356 13767839 15639682 17521482 14362041 7891817 1681976
33891 1681976 -3034733 -3745748 3471143 16359415 25266992 23937729 15978926 7077525
33883 7077525 -2135479 -10515229 -11730864 -3236966 6138504 6652623 1268333 -259645
33875 -259645 3175676 4572991 1565284 -2358736 -7181231 -15079288 -20929082 -17037754
33867 -17037754 -8120704 -8107040 -19285989 -28054592 -25741845 -19971811 -18831604 -17338120
33859 -17338120 -9070466 547264 3788664 3802095 6475117 7551782 953148 -6467334
33851 -6467334 -2636928 10528574 18741511 14800499 4877988 -3518929 -8261156 -7191080
33843 -7191080 2284676 15421106 21305655 15712035 6718524 5091712 13691610 26877670
33835 26877670 35419911 32228375 18610377 4750762 -621724 270362 -248593 -3351441
33827 -3351441 -3955857 -344390 4163900 7301161 7885576 2219178 -10270351 -19726200
33819 -19726200 -15260872 -1649619 4900073 -780840 -6655496 -3421670 1824269 -875013
33811 -875013 -7392977 -6125525 4275053 13230163 11894163 1536223 -10192439 -15974102
33803 -15974102 -12813301 -3415238 6645390 14525427 20908198 24864590 22689980 14322062
33795 14322062 6224498 4038931 5770203 5768746 2228900 -2711735 -6896910 -8254360
33787 -8254360 -4365570 3324401 7679100 3843345 -2634932 -1785416 6970434 13582589
33779 13582589 11685024 7454689 9319180 13941674 10631748 -1266104 -8667714 -2400999
33771 -2400999 8954996 10431766 1370356 -4764681 -63189 8590168 12040414 10876600
33763 10876600 9920442 8671286 4044468 -2608156 -7468449 -9407158 -8498287 -3905214
33755 -3905214 2511710 6022445 6765014 10671153 17700711 18342879 9469333 3371741
33747 3371741 9565319 17039147 9580537 -8325073 -18197961 -15750821 -13359408 -15590966
33739 -15590966 -12507837 -451653 9819890 12024081 13868690 19826780 21233773 13843466
33731 13843466 9591393 17670003 26932146 22310092 8903486 3558507 8983095 12624508
33723 12624508 8312025 3436187 4167210 7005192 7880398 8801786 11114655 10322404 3065967
33714 3065967 -5505226 -6539367 1690384 11041164 12146663 4459018 -4024504 -7025709
33706 -7025709 -6346922 -5326431 -1058082 9517165 19174767 16841406 4555826 -3507105
33698 -3507105 -1290449 2129290 291143 660230 9636616 18468041 16074863 6805565
33690 6805565 2440875 3422182 1623604 -3197063 -3840639 216756 2751209 3433148 7325871
33681 7325871 12355269 11050967 5837287 8323015 19655469 25263820 15744747 1268991
33673 1268991 -3438728 714828 1995407 -3346827 -7766763 -5883329 -2152674 -3713611
33665 -3713611 -10780325 -16000326 -11722547 1816373 14855929 16825090 8006678 -269755
33657 -269755 1142820 8924794 12563401 6538139 -5983002 -18409934 -25273955 -23683127
33649 -23683127 -15471830 -7654923 -6360304 -9878998 -11337466 -8234818 -4740190 -3590255
33641 -3590255 -1274502 5200846 11315211 10254684 2670348 -4564969 -7972057 -9324752
33633 -9324752 -8268248 -1343336 8855098 11773850 2366630 -9493360 -10790455 -2696657
33625 -2696657 2334017 -1286215 -6255655 -4951336 729564 4924210 6376251 7718498
33617 7718498 10826818 15903271 21686669 24865087 22888421 18118837 14850277 12171948
33609 12171948 5844412 -2151733 -3808025 2376026 7079275 3384296 -2762435 -1911500
33601 -1911500 4792137 8806971 7829456 7633334 11222464 14050408 11673320 6360006
33593 6360006 3120971 2468015 368986 -5385830 -11312814 -12130738 -7655794 -3171809
33585 -3171809 -2131165 -2074274 -587664 -1025567 -6496105 -11293469 -6473345 6633431
33577 6633431 16948527 18809582 18281081 21842976 26749471 26552819 19776811 9457347
33569 9457347 -297089 -4769364 -1955964 2635422 1922418 -549808 5696399 19247711
33561 19247711 24149026 12984959 302285 2192854 12643167 13817088 2937701
33554 2937701 -6409205 -7097200 -7294578 -14179599 -20937803 -15878586 1516403 18342559
33546 18342559 20502551 6580997 -9546603 -12094759 -592879 10424475 10513652 5086380
33538 5086380 3947892 6438605 6108895 3848790 6222944 13644003 19204290 18213184
33530 18213184 12346641 5966319 3436026 6955323 12182835 10580349 1320265 -5221542
33522 -5221542 -2216718 2626058 -829286 -9413409 -13400853 -12433761 -12819801 -14188277
33514 -14188277 -11565629 -6864400 -5460667 -4497815 2279562 10707458 10947709 4169523
33506 4169523 350595 720138 -2429369 -8368146 -6587239 4433676 12402601 9648227
33498 9648227 2714787 -1195570 -4079742 -7748251 -7154218 -81842 6936015 8717419
33490 8717419 8105333 7625250 4609260 -338324 -673799 4688357 8015128 6574950 8352241
33481 8352241 17106899 23785533 21563437 17591388 19006859 18488988 7198318 -6936531
33473 -6936531 -9368569 -1793917 987212 -5316204 -9583530 -4890596 1416327 1496794
33465 1496794 -1000355 729132 4973841 5848924 3970556 4913800 9122497 10498580
33457 10498580 5727710 -662095 -3211690 -3331098 -5713700 -9150038 -6960280 2511230
33449 2511230 11489249 11928769 4833927 -3017490 -7683537 -9480197 -9798397 -11102753
33441 -11102753 -16303329 -23265650 -24178053 -15988269 -6785519 -5008123 -7155110 -4554121
33433 -4554121 2043557 4418397 313687 -5252476 -9896918 -14947057 -18431313 -17143550
33425 -17143550 -14010919 -13535741 -12716539 -7488268 -4289756 -11376432 -21467109 -19048949
33417 -19048949 -4300905 6756637 6504453 3043979 2039213 -224541 -2643470 2215498
33409 2215498 10163896 5918222 -10960853 -20591891 -12669108 -2046531 -3165726 -8887668
33401 -8887668 -8735097 -8549155 -14575604 -15633082 -1318199 16246062 19517410 12468928
33393 12468928 9851484 10529154 3659668 -6994213 -7778098 1003370 7117884 8101397
33385 8101397 10667281 12702592 7113965 674874 6761626 19896917 20001668 4117250
33377 4117250 -7933229 -4263659 3233556 1217876 -4996984 -3590473 5175390 12424295
33369 12424295 13454552 9681370 4608882 2080389 2819804 2188020 -2214883 -3883384
33361 -3883384 2280621 8210115 4763839 398050 9803145 26600192 28549080 11498184
33353 11498184 -3649152 -2755715 4303727 5775084 5876989 9306409 7785691 -3539547
33345 -3539547 -12917916 -10323644 -4347766 -5499953 -6902324 1075737 9813499 5912783
33337 5912783 -4107283 -3766218 5039786 5363260 -5676989 -12356777 -6232246 2793185
33329 2793185 5334841 5290083 7682614 8673661 5298138 2600094 2702758 -2188780 -16049752
33320 -16049752 -27328034 -22640278 -6813526 2616067 -1023441 -6707500 -3536746 5017657
33312 5017657 9378200 8223913 6699780 4680649 -3264192 -15497636 -20273326 -10527676
33304 -10527676 4382276 9214990 2117006 -4594787 -2009267 5619720 10404689 11677262
33296 11677262 12548672 12124366 7905657 2549807 1579648 5322896 8440839 7452240 4340928
33287 4340928 2241279 1728351 3088042 8714870 19563335 30285060 32337153 24253604
33279 24253604 15829651 17508772 26485399 29381481 20414245 10092930 10735111 18972532
33271 18972532 20570368 9876204 -3981178 -9813449 -5471586 4405735 14252951 19242702
33263 19242702 17488932 13197849 12951274 17304325 20286417 17413468 9293617 -1833446
33255 -1833446 -12606035 -16627613 -10553390 -2178684 -2803163 -10315211 -10657517 1223760
33247 1223760 13869303 17454499 16549304 16938823 12635271 -1846349 -16302751 -16479097
33239 -16479097 -4844160 4289924 5971272 6541133 7540516 3830320 -1889086 1121183
33231 1121183 13291163 20739353 16068816 10129331 14091848 20924832 16552095 2063987
33223 2063987 -8255414 -7821309 -4250524 -5073819 -8217148 -9318512 -8957749 -8114030 -4270356
33214 -4270356 2114194 3650683 -4114739 -13358907 -12911769 -4062625 1681237 -29658
33206 -29658 -1548517 2065707 4371020 -347227 -5632827 -2696774 4864353 6805401
33198 6805401 2728511 1656209 6801856 11961493 13237146 13340125 12679183 7337583
33190 7337583 -684058 -2048211 5793769 12699139 10378899 4021149 2060091 2571358
33182 2571358 -1075880 -7413367 -9675175 -7344122 -5583276 -5916626 -6012243 -6334969 -8484877
33173 -8484877 -8794452 -2448013 6795085 9807451 5471563 2539570 6697950 13626071
33165 13626071 17518464 19281596 22056089 24122019 21624241 15656119 11856303 13327898
33157 13327898 17078101 18362101 17047291 17716929 22598019 26345741 21321981 7786828
33149 7786828 -5653621 -12789531 -15711896 -17648478 -16285633 -9467390 -2294192 -1389258
33141 -1389258 -5108897 -6593835 -4690656 -4555585 -7882957 -9442357 -4442312 5621379
33133 5621379 15172834 18827597 14061766 3773059 -4645660 -6840356 -6685705 -9787152
33125 -9787152 -14350856 -14240438 -8923934 -3654140 -1156405 -166051 -1183583 -6004366
33117 -6004366 -11641519 -12350704 -8166726 -4206493 -1499727 3365379 9170285 9892854
33109 9892854 5233320 2027449 2797712 2520813 -79328 1476331 9167904 14618349
$$ [...]
##END NTUPLES=NMR SPECTRUM
##END=
