##TITLE=31Pdec_SP10P_3
 CDCl3, 124 sc
 10.2.2022
##JCAMPDX= 6.0         $$ Bruker NMR JCAMP-DX V2.0
##DATA TYPE= NMR SPECTRUM
##DATA CLASS= NTUPLES
##ORIGIN= UXNMR, Bruker Analytische Messtechnik GmbH
##OWNER= root
$$ XWIN-NMR		Version 3.5
$$ Thu Feb 10 12:37:07 2022 Russian Standard Time (UT+4h)  she@DPX200
##.OBSERVE FREQUENCY= 81.013821
##.OBSERVE NUCLEUS= ^31P
##.ACQUISITION MODE= SIMULTANEOUS
##.ACQUISITION SCHEME= undefined
##.AVERAGES= 124
##.DIGITISER RES= 16
##SPECTROMETER/DATA SYSTEM= spect
##.PULSE SEQUENCE= zgpg30
##.SOLVENT NAME= Acetone
##.SHIFT REFERENCE= (INTERNAL, Acetone, 0, 248.564)
##AUDIT TRAIL= $$ (NUMBER, WHEN, WHO, WHERE, WHAT)
$$ ##TITLE= Audit trail, XWIN-NMR		Version 3.5
$$ ##JCAMPDX= 5.01
$$ ##ORIGIN= Bruker BioSpin GmbH
$$ ##OWNER= she
$$ F:/spectra/data/she/nmr/P31/1/pdata/1/auditp.txt
$$ ##AUDIT TRAIL=  $$ (NUMBER, WHEN, WHO, WHERE, WHAT)
(   1,<2022-02-10 12:35:37.87 +0400>,<she>,<DPX200>,
      <continue with go, POWCHK disabled, PULCHK disabled
       configuration hash MD5:
       00 E9 B6 7A A2 85 ED C7 34 08 36 98 17 FE 4E 26
       data hash MD5: 32K
       C8 D6 88 B2 23 F3 32 99 68 22 C9 73 F8 B6 32 39>)
(   2,<2022-02-10 12:35:45.00 +0400>,<she>,<DPX200>,
      <Start of raw data processing
       efp BC_mod = 2 LB = 1 FT_mod = 6 PKNL = 1 PHC0 = -9726.11 PHC1 = 510.6746 SI = 64K 
       data hash MD5: 64K
       A2 BE F7 CA 05 1D EB 98 20 AB CD 43 08 9D 94 03>)
(   3,<2022-02-10 12:36:10.98 +0400>,<she>,<DPX200>,
      <pk PHC0 = 12.50671 PHC1 = -35.40001 
       data hash MD5: 64K
       6C 27 D0 1B E1 1D A1 B7 AC D7 6E 73 C9 10 53 B5>)
(   4,<2022-02-10 12:36:15.03 +0400>,<she>,<DPX200>,
      <abs ABSG = 5 
       data hash MD5: 64K
       F2 32 87 3E CD 2B DD 00 BA 94 E6 93 E6 35 5D 08>)
$$ ##END=
$$ 
$$ hash MD5
$$ 35 24 74 4D DB F9 DE DA B8 FE B4 EB 8A 8B 88 C5
##$RELAX= 
##$RELAX= 
##$RELAX= 
##$RELAX= 
##$RELAX= 
##$RELAX= 
##$RELAX= 
##$RELAX= 
$$ Bruker specific parameters
$$ --------------------------
##$DU= <F:/spectra>
##$EXPNO= 1
##$NAME= <P31>
##$PROCNO= 1
##$TYPE= <nmr>
##$USER= <she>
##$AMP= (0..31)
100 100 100 100 100 100 100 100 100 100 100 100 100 100 100 100 100 100 
100 100 100 100 100 100 100 100 100 100 100 100 100 100 
##$AQSEQ= 0
##$AQ_mod= 1
##$AUNM= <au_zg>
##$AUTOPOS= <>
##$BF1= 81.014009
##$BF2= 200.13
##$BF3= 200.13
##$BF4= 200.13
##$BF5= 200.13
##$BF6= 200.13
##$BF7= 200.13
##$BF8= 200.13
##$BYTORDA= 1
##$CFDGTYP= 0
##$CFRGTYP= 5
##$CHEMSTR= <none>
##$CNST= (0..31)
1 1 145 1 1 1 1 1 1 1 1 1 1 1 1 1 1 1 1 1 1 1 1 1 1 1 1 1 1 1 1 1 
##$CPDPRG= <waltz16>
##$CPDPRG1= <>
##$CPDPRG2= <waltz16>
##$CPDPRG3= <>
##$CPDPRG4= <mlev>
##$CPDPRG5= <mlev>
##$CPDPRG6= <mlev>
##$CPDPRG7= <mlev>
##$CPDPRG8= <mlev>
##$CPDPRGB= <>
##$CPDPRGT= <>
##$D= (0..31)
0 1 0 0 0 0 0 0 0 0 0 0.03 2e-05 3e-06 0 0 0 0 0 0 0 0 0 0 0 0 0 0 0 0 
0 0 
##$DATE= 1644481958
##$DBL= (0..7)
120 120 120 11 120 120 24 19 
##$DBP= (0..7)
150 150 150 150 150 150 150 150 
##$DBP07= 0
##$DBPNAM0= <>
##$DBPNAM1= <>
$$ [...]
##$SUBNAM3= <"">
##$SUBNAM4= <"">
##$SUBNAM5= <"">
##$SUBNAM6= <"">
##$SUBNAM7= <"">
##$SUBNAM8= <"">
##$SUBNAM9= <"">
##$SW= 501.771253377433
##$SWIBOX= (0..15)
0 1 3 0 0 0 0 0 0 0 0 0 0 0 0 0 
##$SW_h= 40650.406504065
##$TD= 32768
##$TD0= 1
##$TE= 0
##$TE2= 300
##$TE3= 300
##$TEG= 300
##$TL= (0..7)
0 120 53 12 22 120 120 120 
##$TP= (0..7)
150 150 150 150 150 150 150 150 
##$TP07= 0
##$TPNAME0= <>
##$TPNAME1= <>
##$TPNAME2= <>
##$TPNAME3= <>
##$TPNAME4= <>
##$TPNAME5= <>
##$TPNAME6= <>
##$TPNAME7= <>
##$TPOAL= (0..7)
0.5 0.5 0.5 0.5 0.5 0.5 0.5 0.5 
##$TPOFFS= (0..7)
0 0 0 0 0 0 0 0 
##$TUNHIN= 0
##$TUNHOUT= 0
##$TUNXOUT= 0
##$USERA1= <user>
##$USERA2= <user>
##$USERA3= <user>
##$USERA4= <user>
##$USERA5= <user>
##$V9= 5
##$VALIST= <valist>
##$VCLIST= <CCCCCCCCCCCCCCC>
##$VD= 0
##$VDLIST= <DDDDDDDDDDDDDDD>
##$VPLIST= <PPPPPPPPPPPPPPP>
##$VTLIST= <TTTTTTTTTTTTTTT>
##$WBST= 1024
##$WBSW= 4
##$XGAIN= (0..3)
0 0 0 0 
##$XL= 0
##$YL= 0
##$YMAX_a= 11885
##$YMIN_a= -16417
##$ZGOPTNS= <>
##$ZL1= 120
##$ZL2= 120
##$ZL3= 120
##$ZL4= 120
##$ABSF1= 248.5645
##$ABSF2= -253.2056
##$ABSG= 5
##$ABSL= 3
##$ALPHA= 0
##$AQORDER= 0
##$ASSFAC= 0
##$ASSFACI= 0
##$ASSFACX= 0
##$ASSWID= 0
##$AUNMP= <proc_1d>
##$AZFE= 0.1
##$AZFW= 0.5
##$BCFW= 0
##$BC_mod= 2
##$BYTORDP= 0
##$COROFFS= 0
##$CY= -3
##$DATMOD= 1
##$DC= 0
##$DFILT= <>
##$DTYPP= 0
##$F1P= 0
##$F2P= 0
##$FCOR= 1
##$FTSIZE= 65536
##$FT_mod= 6
##$GAMMA= 0
##$GB= 0
##$INTBC= 1
##$INTSCL= 5.30512e-09
##$ISEN= 30
##$LB= 1
##$LEV0= 0
##$LPBIN= 0
##$MAXI= 10000
##$MC2= 0
##$MEAN= 0
##$ME_mod= 0
##$MI= 50
##$NCOEF= 0
##$NC_proc= -8
##$NLEV= 6
##$NOISF1= 182.463
##$NOISF2= 159.3651
##$NSP= 0
##$NTH_PI= 0
##$NZP= 0
##$OFFSET= 248.5645
##$PC= 4
##$PHC0= -9713.604
##$PHC1= 475.2746
##$PH_mod= 1
##$PKNL= yes
##$PPARMOD= 0
##$PSCAL= 0
##$PSIGN= 0
##$REVERSE= no
##$SF= 81.014009
##$SI= 65536
##$SIGF1= 159.3651
##$SIGF2= -187.1042
##$SINO= 113.3802
##$SIOLD= 16384
##$SREGLST= <1H.CDCl3>
##$SSB= 0
##$STSI= 65536
##$STSR= 0
##$SW_p= 40650.406504065
##$SYMM= 0
##$S_DEV= 0
##$TDeff= 32768
##$TDoff= 0
##$TI= <>
##$TILT= no
##$TM1= 0
##$TM2= 0
##$TOPLEV= 0
##$USERP1= <user>
##$USERP2= <user>
##$USERP3= <user>
##$USERP4= <user>
##$USERP5= <user>
##$WDW= 1
##$XDIM= 65536
##$YMAX_p= 301205891
##$YMIN_p= -162741475
$$ End of Bruker specific parameters
$$ ---------------------------------
##NTUPLES= NMR SPECTRUM
##VAR_NAME=  FREQUENCY,     SPECTRUM/REAL,   SPECTRUM/IMAG
##SYMBOL=    X,             R,               I
##VAR_TYPE=  INDEPENDENT,   DEPENDENT,       DEPENDENT
##VAR_FORM=  AFFN,          ASDF,            ASDF
##VAR_DIM=   65536,         65536,           65536
##UNITS=     HZ,            ARBITRARY UNITS, ARBITRARY UNITS
##FACTOR=    0.620285442955139, 1,           1
##FIRST=     20137.2065510759, 0,            0
##LAST=      -20513.1999529892, 0,           0
##MIN=       -20513.1999529892, -162741475,  0
##MAX=       20137.2065510759, 301205891,    0
$$ Real data points
##PAGE= N=1
##DATA TABLE= (X++(R..R)), XYDATA
$$ [...]
41938 13442748 646686 -7179955 -6860015 -4262136 -5764673 -11953273 -18002831 -17343178
41930 -17343178 -7412861 5480071 10691578 6037842 1190905 3459847 6497887 1513226
41922 1513226 -6043720 -3490010 7649793 11881470 3795648 -2801577 3242761 12227954
41914 12227954 7990627 -8603163 -22737734 -26454538 -23918910 -19080051 -10886491 -991981
41906 -991981 5110023 6851773 9177925 12146879 9321942 114323 -5575360 -1077588
41898 -1077588 6234310 5428885 -2075179 -5506977 -430310 7522674 13767936 20324071
41890 20324071 27712653 29309896 19604778 3676498 -7808662 -11052761 -10630673 -9582052
41882 -9582052 -5402816 2041446 6079688 2526984 -1845339 1745460 9238416 7400518
41874 7400518 -6967866 -21267373 -24287226 -20227713 -19374962 -22582889 -23631740 -21268817
41866 -21268817 -18702253 -14503105 -4997927 5379088 7387775 1717820 -658162 4181308
41858 4181308 6626473 81351 -6404681 -948871 13253411 23178291 24490714 23957846
41850 23957846 25349250 24055090 17186966 9371363 4657618 310884 -6053925 -9041357
41842 -9041357 -2192220 10665374 18040486 15045873 8928103 8128335 11112407 10756427
41834 10756427 6424309 4674213 7654457 8032967 -296798 -11460548 -13788198 -4671043
41826 -4671043 6829785 11669103 9335387 4416502 702598 520929 4573155 9549739
41818 9549739 9947700 4908935 -241358 -1264553 271210 1735093 4117250 8570964
41810 8570964 12536649 13177246 10983177 6455589 -2300281 -14133630 -21551520 -18718178
41802 -18718178 -9298478 -673719 5620020 10795230 10679747 893923 -11358322 -12025197
41794 -12025197 925505 13080052 12217728 3204048 -1227753 2192374 6215404 5296912
41786 5296912 1667628 185811 2403812 6222644 8684679 8904840 9016317 11046327
41778 11046327 13139620 12105365 9618184 10551783 13759969 11433368 1702358 -5341799
41770 -5341799 -1572264 4919990 -286828 -16203712 -26017188 -20075330 -8841016 -7957659
41762 -7957659 -18382482 -28064170 -28208315 -20886299 -13135648 -9549474 -9652794 -8447451
41754 -8447451 -1061053 9861932 14507106 8149285 -604938 -455589 6605619 8613148
41746 8613148 1915551 -4114612 -2601685 1331099 1971655 4029742 13189348 22668755
41738 22668755 20450943 6853140 -6048735 -11778053 -15391254 -20511739 -21287570 -12615689
41730 -12615689 -485281 4630668 134059 -8393596 -15198091 -17201711 -12540430 -2879204
41722 -2879204 4517030 3404792 -2878722 -4968468 -7518 4891362 3432848 -1034996
41714 -1034996 -1553310 1197566 -418479 -9267047 -18007212 -18264726 -11549265 -6521667
41706 -6521667 -7237021 -9862624 -11295373 -13980512 -18328973 -16648032 -2111906 18923177
41698 18923177 31454108 28717754 17986823 9126639 4333534 1001606 -2156725 -5574352
41690 -5574352 -10234447 -14800790 -15428124 -11753915 -9109538 -11314724 -14850387 -13674208
41682 -13674208 -6916089 960655 4799217 1926900 -5294384 -8874499 -2891462 6378738
41674 6378738 5614806 -6547782 -14481551 -6272765 8993156 14395309 8839439 5158017
41666 5158017 8158795 8437947 -765062 -12590255 -16693623 -11926712 -4468894 720002
41658 720002 2783853 3356008 4367159 4776177 232103 -9765744 -16724914 -12386653 -1767389
41649 -1767389 1992025 -3799699 -7833964 -2205057 6758114 9740062 7175293 4167954
41641 4167954 758361 -4420220 -6746381 -1282255 7207136 8721003 1795025 -4362756
41633 -4362756 -1848028 7472354 16158003 19310344 17429841 14335208 13170979 12971676
41625 12971676 9828112 2847025 -3151080 -3511270 -315506 282550 -4136111 -10495817
41617 -10495817 -14893951 -15233284 -10378906 -1411614 6175386 6324655 -70118 -5544854
41609 -5544854 -5914530 -5584846 -9626041 -14383829 -11970669 -2916203 2739398 -830792
41601 -830792 -6746997 -5449592 1728197 5944393 4631066 3093376 3088385 -91525 -6836336
41592 -6836336 -9757916 -6069893 -3757149 -8054320 -10876311 -3601016 7440723 10294094
41584 10294094 6070319 4667890 6522720 4381281 686804 5158454 14218900 12248905
41576 12248905 -1691542 -8025768 3024268 13643835 4706313 -15584428 -26012376
41569 -26012376 -23137132 -19036973 -17107510 -10727010 -1886746 -578840 -5439555 -3791693
41561 -3791693 6188018 10549731 1842527 -9120245 -10639131 -5917403 -3482454 -3475564
41553 -3475564 -2773566 -4321377 -11114602 -17292827 -14732030 -4481083 5621603 10557902
41545 10557902 9138839 923780 -10045758 -13213385 -2584522 12442572 16151451 5649410
41537 5649410 -6928465 -10881034 -7259619 -1724976 4155299 10292294 13364557 10831389
41529 10831389 6384163 5515216 6665072 2277148 -10098808 -22347554 -24963474 -19100487
41521 -19100487 -14407626 -15040364 -14089792 -5371148 4961581 5865357 -2157787 -7101256
41513 -7101256 -2829726 2660032 405099 -6113805 -7499205 -2726374 1064388 -151663
41505 -151663 -4060264 -8255592 -11854023 -11483482 -3814895 6682815 10152663 4390576
41497 4390576 -932982 3070295 12773293 17425533 12621681 3922211 -635984 2294873
41489 2294873 10137995 16801417 16914278 10117926 1109485 -5198977 -7492660 -7388076
41481 -7388076 -7692373 -11151059 -16887728 -17843122 -7539913 8613833 15430805 5759508
41473 5759508 -9758995 -16485144 -13568865 -10176851 -8865786 -3474087 7488283 16201689
41465 16201689 16888825 13533308 12628728 14380921 14754083 11835880 7373990 5101757
41457 5101757 8171421 14465537 15516483 6056513 -6437831 -9707992 -3893066 -883230
41449 -883230 -5352880 -8210558 -3006953 3443679 3942824 2797585 5257074 5583231 -2298700
41440 -2298700 -10764608 -8864326 -741617 597789 -6006162 -9816175 -6604935 -2658360
41432 -2658360 -957231 2636283 8816493 13757710 19094734 29056142 36910916 30050380
41424 30050380 11315369 -1426087 -1674200 -2350137 -9872929 -9599310 9260293 30983450
41416 30983450 33708875 20690903 11996583 13291635 13240587 7579786 4892306 8048484
41408 8048484 8811140 4249341 2035534 4859547 4855131 -613096 -2317559 3785169 6647681
41399 6647681 -2039852 -11694087 -7757021 5344995 10798569 4726830 -144166 3779553
41391 3779553 7698251 1537695 -10444593 -16468345 -13229641 -7756585 -6439917 -8456604
41383 -8456604 -9033775 -4601980 4890591 15246468 20075184 16857110 10510309 7647961
41375 7647961 7941723 5495543 -947601 -4502291 393664 9007193 10934047 2118168
41367 2118168 -10770829 -17009842 -11037481 3278433 15650181 18457880 14366976 12407782
41359 12407782 15460539 16379222 9428615 -137380 -3495354 -638878 1519609 -90524
41351 -90524 -3381465 -7729352 -13560970 -17125892 -14230491 -7879489 -3614944 620363
41343 620363 9285953 15712985 7838965 -10662284 -19892124 -10313813 3382090 3112441
41335 3112441 -9430205 -20044624 -22491973 -20535929 -16897884 -11712049 -7649918 -6871030
41327 -6871030 -6015565 -1608023 3719623 6968781 11075227 18140627 22513916 19007981
41319 19007981 12391377 10211796 11738847 12395615 12799482 14283955 12493960 5945476
41311 5945476 3770730 12830064 23790466 23440705 14788627 10286847 10668809 6927909
41303 6927909 -1007971 -5563602 -8743323 -18742684 -29912514 -26543329 -9115222 3332460
41295 3332460 1709523 -1926153 1874889 4899737 -368752 -5803301 -3518314 -1099626
41287 -1099626 -7278057 -15117087 -13104976 -2642214 7777694 15827218 21029130 17485760
41279 17485760 3645613 -9661405 -13110288 -11974341 -13990600 -14934796 -9766707 -6854062
41271 -6854062 -14436736 -22545220 -17063659 -4126306 -308172 -4305273 -656217 10830161
41263 10830161 12919415 224463 -11704068 -11801952 -7481603 -6080926 -2181518 6318442
41255 6318442 7454874 -6044928 -21269208 -22519592 -13485123 -8513622 -10785363 -12874229
41247 -12874229 -11856469 -10002602 -5378843 5064708 16170534 20031515 18029355 16623182
41239 16623182 14496220 5868729 -5791152 -10280819 -6269283 -1651540 1861389 10561140
41231 10561140 22640750 24936142 12299036 -2160915 -4593820 2159332 7815616 11548538
41223 11548538 17780274 22333469 16864900 4542843 -1638274 3433681 11469054 13484927
41215 13484927 8149776 -2921751 -17014681 -25291132 -17892174 604608 11418208
41208 11418208 4492145 -7840352 -8410414 1913644 9293449 8203514 5026855 3610941
41200 3610941 359076 -5749088 -9719067 -9670458 -9935345 -12018242 -11024450 -4752722 1468926
41191 1468926 3305029 3709221 5971553 7024222 3263208 -2376514 -4882487 -4112554
41183 -4112554 -2011039 2001351 6644959 5218988 -5068364 -14190376 -10221055 2045608
41175 2045608 4865804 -7735627 -20165777 -16462116 -2272220 4046332 -2862930 -10049540
41167 -10049540 -6252257 3996822 10273784 11121047 11738055 12990981 11903164 10068562
41159 10068562 11524374 12464748 3730188 -13430686 -24343490 -19785873 -9090924 -5951968
41151 -5951968 -8529570 -4955020 5771188 11539130 5911193 -2798728 -4454528 261982
41143 261982 4247876 3586663 -1299419 -7887004 -11261981 -7154594 1521997 6420602
41135 6420602 4534716 1524773 2307176 5323081 8658756 13484074 17404360 13685312
41127 13685312 3425462 -716461 8109036 17845823 13189888 -1273939 -6817520 2482493
41119 2482493 11799462 6419009 -10704383 -26302596 -32614893 -30207853 -21554841 -8884534
41111 -8884534 3528188 9758867 5777121 -7340483 -21968412 -26670398 -15114872 5680686
41103 5680686 19292809 15027726 -1885085 -16474939 -19001250 -12489117 -6653633 -6487940
41095 -6487940 -7827923 -3802600 6012026 14798791 16524063 12254155 7692878 6764021
41087 6764021 8967792 11130666 10276378 6135944 1577418 -949538 -3135111 -8205515
41079 -8205515 -14873896 -17934556 -15419612 -10667029 -6342398 -1569395 3469602 5890675
41071 5890675 5448864 5429124 5292523 -563733 -12237534 -19682268 -15015357 -3581688
41063 -3581688 3989934 5189898 3768097 171650 -6950092 -13453947 -13248294 -7058384
41055 -7058384 105936 7194882 14585364 17057385 9626665 -1653348 -5336526 -355982
41047 -355982 3753759 1544650 -3899211 -10405420 -18569292 -23350478 -16714023 -1981381
41039 -1981381 6573734 3266371 -1123272 3221817 10765437 11200827 4958416 -644051
41031 -644051 -3360169 -5154414 -4914521 -558375 5330827 8788763 9697701 8289854 1637540
41022 1637540 -9974226 -18562174 -17880017 -12757342 -11123849 -11120316 -5475428 4132213 7405849
41013 7405849 308750 -9111347 -11543110 -6626742 -693152 824693 -2298235 -4663187
41005 -4663187 295352 11514007 18017985 11352452 -1229729 -3665088 8190635 20489910
40997 20489910 18949743 5897977 -4798899 -5213267 -219874 1174997 -3837979 -11097977
40989 -11097977 -15878383 -17452152 -17246863 -14818561 -8572216 -171246 5731629 7603842
40981 7603842 8538054 9006019 3621874 -9205493 -19311673 -15419302 -1939047 4711535
40973 4711535 -2426736 -12754225 -14581636 -10016182 -7377598 -7127527 -4121325 1569060
40965 1569060 5712400 8813115 14255148 18770234 14901427 4160328 -2042129 2134799
40957 2134799 9548421 12797250 15227685 21676103 26336962 20950833 10251655 6288058
40949 6288058 8622303 4291406 -9558061 -17194851 -6516361 11774000 18724072 12877806
40941 12877806 7956734 9433096 8806267 1581441 -3949967 -859253 5378728 6852419
40933 6852419 4871191 4209700 3668069 658875 -1391569 905402 2999748 -45782
40925 -45782 -3135445 888285 6815914 3549225 -6308916 -7575957 4375062 15328644
40917 15328644 12819826 2916475 -1785294 -791240 -1955398 -6326013 -8034843 -5355644
40909 -5355644 -1701094 1811007 5543410 5636494 -1104753 -8379573 -6892524 804659
40901 804659 2834852 -3805072 -8941627 -5772818 -186630 1262563 1559968 4335176
40893 4335176 4795315 -1168711 -6733910 -3480517 4667353 7510315 4553433 4019583
40885 4019583 8306736 11392099 10164322 8099985 7099807 5153696 3215008 5129583
40877 5129583 8968618 7683479 1165129 -1431450 4466229 10998364 9322624 2145235
40869 2145235 -1228858 2585333 9082178 12701100 10899908 4527011 -1909158 -3117412
40861 -3117412 779502 3788290 1888256 -2356907 -4908849 -5414237 -4885700 -2981696
40853 -2981696 -338129 893252 1220813 3728664 7836339 8822205 5768509 3605718
40845 3605718 4729680 5562146 4087077 2773263 987519 -5897035 -15580417 -18048941
40837 -18048941 -11893209 -9402138 -16732035 -21720539 -13581444 -2626150 -4518401 -14623454
40829 -14623454 -16430210 -8652530 -3960910 -4875783 -2426306 2126731 -2898085 -14684196
40821 -14684196 -13798684 4277896 16070661 1721874 -26267926 -40649580 -33851886
40814 -33851886 -19821910 -10434188 -5853380 -3911576 -4623138 -5653133 -3566643 3872
40806 3872 460293 -2184251 -3588316 -1742681 1457762 3814151 4328524 3294762 3551153
40797 3551153 8186969 14632522 15776890 9598214 1973146 -2850208 -7209347 -11545211
40789 -11545211 -9954633 -1079253 4971675 -237172 -10043785 -12455619 -7879446 -5959449
40781 -5959449 -8538650 -7947172 -1254810 5291948 7307634 8021779 10824604 14008629
40773 14008629 15123338 13947683 9712926 1902288 -4989106 -4410312 2607873 7332818
40765 7332818 5334556 2512755 5939253 13873083 18741251 16773265 11741028 11075895
40757 11075895 18951347 30489730 33726188 22331218 5895749 674309 9166141 17307387
40749 17307387 15331061 11874467 19308143 32365672 33480181 17737097 496556 -3022320
40741 -3022320 3913426 7816486 4692133 2667984 7227733 12722632 11059387 3155950
40733 3155950 -2395561 236028 8335149 14579326 14591817 10536190 8068897 9721087
40725 9721087 11865467 9587406 3622704 -586404 -592844 515050 450104 1720425 6239880
40716 6239880 10338927 9585427 5430379 2560324 2399701 3719058 6536798 10010580
40708 10010580 9420041 1598659 -8848627 -15136431 -17590298 -20205378 -21093958 -16020756
40700 -16020756 -9590895 -11174052 -18944089 -20445894 -12342263 -6771339 -11491022 -15674764
40692 -15674764 -5858663 12364298 20530338 11151886 -5239278 -15300995 -15880952 -11390041
40684 -11390041 -5784810 -91469 5356990 8519797 6362888 -244388 -3662547 3122938
40676 3122938 15491168 20038457 10811207 -3859127 -13559818 -17134147 -17471241 -13407828
40668 -13407828 -3978791 5820306 11124200 13680398 15356478 11620816 131901 -10227756
40660 -10227756 -9666432 -3071712 -4121520 -15381833 -24857284 -22601737 -11612387 -1253128
40652 -1253128 2358803 -1513704 -8717052 -11843400 -7120998 262663 2898188 1604777
40644 1604777 2615727 6149307 6101037 1108169 -2272619 1111674 9207773 17281913
40636 17281913 21792211 19145006 7964793 -5368566 -10196517 -3758458 5028263 6518237
40628 6518237 784030 -5151841 -6645869 -5233422 -5073530 -7341139 -8160225 -3455563
40620 -3455563 3906049 6186956 2330200 1284989 8449310 15314976 11307169 759134
40612 759134 -3295950 285967 -670392 -11329738 -20486464 -16316787 -2229784 8740211
40604 8740211 9199240 2548942 -2258487 2127889 15160098 26965315 27236799 16430142
40596 16430142 3794810 -4514045 -8238256 -5095535 9037336 28708370 37894853 27382877
40588 27382877 6847515 -6537154 -6444013 1181066 9702985 17274841 22947434 24285707
40580 24285707 20068729 12212201 4162772 -1658851 -5039874 -6760349 -6026037 -1056661
40572 -1056661 6098567 8700334 3486324 -3200438 -3160351 2054953 4163415 1346967
40564 1346967 499553 6095527 14401919 19827981 20272768 15560650 7532516 1987871
40556 1987871 2941536 4777561 -1296747 -12635271 -17072131 -11064271 -4860739 -6022556
40548 -6022556 -8941029 -6374995 -1209651 379108 -917983 -1163684 435661 4671473
40540 4671473 13625041 22688620 20940009 7683072 -1151434 6171035 18639798 17789495
40532 17789495 4869046 -2549020 1943713 5781396 -968679 -10588150 -10433256 -800484
40524 -800484 7157341 5886606 -2000924 -8617029 -8364737 -2508609 1741630 -1380812
40516 -1380812 -8838354 -11576434 -5811439 1599454 1473649 -5978612 -10895699 -5463605
40508 -5463605 6576711 14309946 12775247 8285341 9056844 14157734 15897997 10908928
40500 10908928 3443124 -1479462 -2476693 475702 6331095 10029126 5983928 -3115725
40492 -3115725 -7105230 -1023106 8335989 11544383 6987090 -911021 -8387201 -13098213
40484 -13098213 -12664029 -7021633 216616 5299829 6860813 4587318 -361661 -3724927
40476 -3724927 -2595427 -1099997 -4464291 -8389907 -4569601 2876820 -266583 -15671198
40468 -15671198 -26301133 -20644761 -10110026 -11729128 -24578466 -35370069 -37912197
40461 -37912197 -33698742 -21281350 -265446 18840530 23365247 14960650 5533910 -23023
40453 -23023 -4953198 -8389284 -6249922 -2857657 -7466703 -18583613 -24416887 -19968717
40445 -19968717 -11965941 -6179885 -1951459 -312645 -4804776 -11815611 -12301671 -6192616
40437 -6192616 -3395492 -7462105 -10689338 -9384146 -10467117 -16383507 -16759031 -4900897
40429 -4900897 8278473 8734718 285467 -1228926 9110133 19721324 19209443 9296629
40421 9296629 -369911 -3894727 -3248429 -3811098 -7369971 -9317078 -4005124 7153134
40413 7153134 16069367 17260034 13042522 8390965 5206459 3850367 5674230 10562212
40405 10562212 15240753 16997802 16410256 14589488 11334909 7876423 7065288 8326055
40397 8326055 7110832 2575116 690569 5031570 9162933 4774147 -5323497 -9656660
40389 -9656660 -3349192 5769561 8077598 3535589 -1336482 -3497902 -4744079 -4583098
40381 -4583098 1215203 12096916 18365256 11703989 -2103961 -8130759 -461142 11340692
40373 11340692 15528018 10822607 2922987 -3716271 -5554212 759832 11448483 14683261
40365 14683261 5228474 -5938527 -6294348 -95926 -3914 -5241809 -3251444 7927239
40357 7927239 14772220 8688361 -2696522 -9318409 -11245437 -11766010 -9388827 -3667276
40349 -3667276 523206 1054103 2252779 5131710 3774019 -2292382 -3007440 6403384
40341 6403384 14842248 11193031 1996629 1195077 8958584 13679380 10693865 6070610
40333 6070610 3895186 2066292 572708 2947749 8049783 9219453 3405298 -5296915
40325 -5296915 -11382843 -11396563 -3320960 10271792 20004000 18583690 10850684 6932780
40317 6932780 7136168 3748317 -2698204 -1418209 10864518 21537085 18298370 5627044
40309 5627044 -2354188 197844 7220162 11041239 9342524 3953202 -1352379 -2663046
40301 -2663046 101625 1847973 -1510601 -6703232 -6742706 -310126 6328137 7240015 3556944
40292 3556944 1066480 3118699 7492463 9437955 6328354 -826892 -9074669 -15196581
40284 -15196581 -16207792 -10909525 -2490190 2699268 1887715 195181 4720557 14585305
40276 14585305 20850762 17588159 9469954 5851068 9725721 15552622 16701663 11910656
40268 11910656 4657907 -745092 -1547227 2336518 7773780 10680512 10861270 12884771
40260 12884771 19134773 23693940 18612172 6793611 1619150 9582663 19936930 19176870
40252 19176870 10637980 8639323 15157327 16100166 3904194 -9944485 -12812266 -9379564
40244 -9379564 -10712792 -14441260 -10805353 -2768128 -2761327 -10021774 -8727185 6989579
40236 6989579 22060152 22446789 14534827 11886464 13840300 10995496 4568298 4611801
40228 4611801 11272022 12850303 4529881 -3729208 -2685073 2970616 3269333 -2587142
40220 -2587142 -7665993 -8681627 -8942496 -11591116 -15070772 -15235190 -9637801 -746685
40212 -746685 4356448 671379 -7058657 -8029670 620820 8844472 7126128 -580097
40204 -580097 -3915211 -1315883 813696 1264899 5339622 12355990 13055876 3860906 -5536764
40195 -5536764 -5154859 1789638 5312158 2759864 -1304954 -4780040 -8706095 -10679174
40187 -10679174 -6628738 994719 4838990 3348458 2688943 6741132 12314919 16395082
40179 16395082 20787645 25825229 26271242 19179055 10905429 9823759 15003508 18420435
40171 18420435 16542481 13079985 10676421 7035989 1435819 -1241862 2425724 7514990
40163 7514990 7038400 3467781 6971921 20444931 32750287 31950910 21099285 13735124
40155 13735124 15034765 15768974 7269377 -5323376 -10311808 -4793499 3851780 8764818
40147 8764818 9037783 5917355 745687 -2868233 -981217 5174150 10393305 12921469
40139 12921469 15442607 17818170 15272262 6761085 -600173 -99248 5445402 7943040
40131 7943040 4974832 1806290 3594053 9631932 15207133 16106173 11146681 2809541
40123 2809541 -3949667 -5248877 -1703618 2215340 2817073 952981 367276 1939666
40115 1939666 1163433 -5961499 -14948092 -15198245 -2684342 13529755 20973947 16847367
40107 16847367 7637441 -447573 -4964782 -4409828 633210 4795443 3601654 1027819
40099 1027819 3963982 10161692 10756788 4832505 907699 2003784 927466 -4910738
40091 -4910738 -5951419 4121244 15806305 17281823 12423814 12870622 17577117 14585424
40083 14585424 1990603 -6908495 -2727332 6787412 8266665 -283732 -10344210 -15803937
40075 -15803937 -18177712 -20247672 -20127005 -13732281 -1243041 11248216 17309449 16192121
40067 16192121 11844405 7461699 4269908 4586400 10583925 18933302 22495327 19893961
40059 19893961 17663659 19537832 20038152 13918895 5832727 3510378 6127724 7418494
40051 7418494 6777875 8779530 13927623 18307217 21006557 23751888 24464323 19817587
40043 19817587 13487144 12783334 17103671 19147631 17949035 20010615 25738209 26744495
40035 26744495 21194065 19827157 29054655 38734817 37034005 28782421 26590763 29855073
40027 29855073 27152812 17113798 11281215 14025817 14707002 6705419 1251163 10786663
40019 10786663 27051020 29857919 14852146 -1282189 -4578521 286817 2937283 4340064
40011 4340064 11091049 20426450 23200709 19049183 16937400 20396378 23014105 20805672
40003 20805672 18598954 19628169 18448950 11044479 3974465 5058108 11163327 14597027
39995 14597027 16623737 23542463 32010404 30830009 18521765 7356637 5742803 6878242
39987 6878242 1503693 -6558509 -6790692 1187653 7380249 6750802 5329952 9280708
39979 9280708 15883667 19412263 19883593 20475317 20298456 16028941 8676747 2622966 -827348
39970 -827348 -2596330 -70404 8956895 16434433 9941372 -7112090 -13755717 852406
39962 852406 19662836 21234543 11022445 10693371 22444002 26976184 17331806 10202075
39954 10202075 16202560 21996444 15091269 6324762 10305458 19740200 19323628 12714993
39946 12714993 13790974 19877300 17046254 7359743 6962168 17348296 21475584 11893029
39938 11893029 1585378 686556 1694740 -3661897 -9950243 -10694068 -10932561 -15799545
39930 -15799545 -18680811 -12672016 -4024559 -1993651 -2904630 3298119 15531817 22311358
39922 22311358 18029642 9152374 4612343 6743845 11610242 13818182 11274967 7189888
39914 7189888 5724814 5732220 3370002 681887 3928782 11708703 14028053 7606039 2728159
39905 2728159 7792383 15352790 13178835 3502240 44986 7516235 14606067 10051549
39897 10051549 -1424237 -4522175 6933938 20457879 18776007 2110297 -10491918
39890 -10491918 -6163031 3638966 189774 -13436905 -16031679 -276882 16390410 17790023
39882 17790023 9395286 4128609 2815205 756882 1096234 6979146 9733247 749198
39874 749198 -10709350 -7458679 10487626 25493511 26700246 21536955 21184453 26213146
39866 26213146 30672691 32322241 34259441 39981408 48458074 52876843 47171061 36140071
39858 36140071 33050287 41989007 49729763 43454127 30154352 27657338 40721693 57627829
39850 57627829 67857182 71244773 70496689 66334924 61192409 58042013 54588760 47001904
39842 47001904 38899096 37354706 40550543 39509370 32231279 25864515 24442860 25087817
39834 25087817 26912699 31990396 36030319 30951375 20087321 17641060 27525632 35703264
39826 35703264 31217116 22260067 20661144 21436776 12149165 -4127109 -11333515 -4771497
39818 -4771497 2139513 -883975 -5560259 1071994 15522293 21643428 13527736 3602541
39810 3602541 4254912 10468807 9253773 878611 -1377298 7680823 17414528 19052550
39802 19052550 18459457 22675841 24934402 15567513 91209 -7361196 -3717908 3184169
39794 3184169 9722237 16872611 19533625 12338175 4343209 9950964 25106493 31694666
39786 31694666 27345976 29191058 42455521 48690961 36547589 22192204 22869850 29415566
39778 29415566 25190477 16541161 20717876 34176629 38312887 31733494 31896805 44783010
39770 44783010 56153703 56743121 55312880 59860258 63824953 59973035 53291599 50191707
39762 50191707 46909113 39024908 32757807 35648657 42744394 42817596 34349469 25862959
39754 25862959 22706440 22187716 21453286 22618492 27930846 34446044 36504090 32228760
39746 32228760 25719777 22180286 21486104 18599668 11268970 4376142 3712806 8050028
39738 8050028 11537886 11714978 9956523 5975566 -1301164 -7762868 -6311674 3440991
39730 3440991 13647351 17752555 15827117 9805627 929137 -6003122 -4260660 4370542
39722 4370542 8301086 1506887 -6225834 -2226687 10449586 16393412 8264753 -4689307
39714 -4689307 -9527000 -4129695 3642413 6192449 2006590 -6005381 -14107511 -19371553
39706 -19371553 -19780245 -14876541 -7454862 -3293079 -6257967 -13159827 -16164494 -11239630
39698 -11239630 -1534853 8175997 16196471 21132799 19478472 10603654 917930 -2219458
39690 -2219458 918617 4639877 6983875 11122045 18003036 23280100 22889022 17419581
39682 17419581 9683338 1889878 -3331293 -3168443 1536234 5552171 5125246 2915576
39674 2915576 4756224 12283110 20460124 22546013 17401309 11766227 13494539 21181438
39666 21181438 23530946 12944067 -2848226 -8952776 -2218952 5666804 5174302 472042
39658 472042 100993 4510299 9562814 15319283 22344495 24424115 15689656 2624499
39650 2624499 -2056803 2796770 6303223 4381700 6924775 20709837 35614334 36702665
39642 36702665 23894393 11084086 9079727 16314807 23940678 24282128 16449706 8272704
39634 8272704 9748728 20304628 26979584 20752065 9472731 6842537 13031460 16189500
39626 16189500 11087836 5603195 7934754 16550320 24724779 27781383 24734117 19475988
39618 19475988 19973728 28412794 33578316 23846635 7328241 5044871 20899362 33797499
39610 33797499 27244186 12092510 8105500 15444740 19895853 17565181 16563355 18083776
39602 18083776 13828038 3297761 -1970041 4530391 15180394 20596285 20627700 18303567
39594 18303567 12250606 1246597 -10177375 -15759129 -12731251 -1203978 15339600
39587 15339600 27408251 25657595 13211639 4218873 6277219 11946547 11767538 7009131
39579 7009131 3730117 2904376 4053857 10568865 21880028 27155435 18209111 4376173
39571 4376173 2529054 14204322 24536286 23975812 19199848 19717912 24276034 25731290
39563 25731290 21581486 14087369 5721397 -258165 663788 8765594 17044007 18319001
39555 18319001 13742349 10794322 13964107 19876783 21023132 13522628 2451546 -1186812
39547 -1186812 8056914 22207500 28204788 24234463 21449420 27596197 36255268 37082926
39539 37082926 30316000 24004937 21028095 17054006 10033979 4130028 3345457 6742000
39531 6742000 10944354 13194321 11798057 7917629 6884372 12871696 21856315 25056385
39523 25056385 20538873 16179362 18953543 26191920 30628701 30060317 27955710 27016679
39515 27016679 26241306 23731316 19745801 16826947 17481472 20907189 22497256 18996767
39507 18996767 13869977 14100567 21278632 29520176 32591978 28966657 20091046 9834089
39499 9834089 6109217 14459880 27053073 27822096 14550318 5613883 15027073 30251547
39491 30251547 28892450 10996452 -2527468 -1349601 3645458 3854087 7261252 20215723
39483 20215723 31796633 29810950 20197877 16117551 17303851 15746358 14171941 20918856
39475 20918856 30295176 27155399 11931193 3172610 10853419 23387154 27873350 28069105
39467 28069105 32393518 36961791 33286790 24131413 18862746 18960514 20325627 25068399
39459 25068399 37562491 50953473 51359764 37097723 22495725 19949268 27567806 36829606
39451 36829606 42659138 42501471 35349956 27257831 29244327 43013416 55930805 57301721
39443 57301721 52810287 54202601 60588795 60969287 52502263 44805148 45626332 52170430
39435 52170430 58528262 62765909 63811520 59842086 53890465 53115483 57132353 54765598
39427 54765598 40155263 25896269 29616505 49521701 63819970 56300289 34109213
39420 34109213 16464497 12505099 16111916 18641684 19340092 21998527 26149435 25837583
39412 25837583 17286882 4932296 -2848050 -3252767 -822627 804659 3920929 10179470
39404 10179470 14012230 9474224 1155698 -314653 5914329 8713139 2063495 -4414894
39396 -4414894 954020 14279881 21585102 18860616 16070695 20191188 24334004 19083945
39388 19083945 7845245 3304454 11018901 23354150 30014974 28952311 24655922 20146504
39380 20146504 15129000 10503671 9813454 14586173 20993911 23387540 20014440 13827026
39372 13827026 8973397 7878355 9900326 10799862 5815496 -3519809 -8036689 -1376139
39364 -1376139 9794916 12662243 5417887 -414400 2807490 8119234 6371519 1578892
39356 1578892 4412903 14796471 21666076 19173289 13191564 10519103 10663368 10958234
39348 10958234 11470200 10864812 5016303 -4895705 -9317643 -1831347 11003305 18000554
39340 18000554 17796514 17779035 21349358 24400399 23794314 21200524 17235743 9497548 -269649
39331 -269649 -3709502 4020917 15830219 20426474 16560391 13662012 18372837 26239542
39323 26239542 29184730 26843233 26020713 30412091 35444656 34431855 26779230 18058510
39315 18058510 13753318 15092443 19841501 24651529 26917134 26580080 26150965 27078750
39307 27078750 26668135 21555217 14288748 12567038 20114402 31375304 37593532 35750855
39299 35750855 29438383 23878752 22900376 27448291 32803397 30313520 17853037 6824628
39291 6824628 11454283 30591885 47419387 49480149 42032464 37945378 41479958 48112196
39283 48112196 54459851 60049879 62478680 59556219 55279027 55680241 59007455 58133279
39275 58133279 53035179 51662790 56251854 58503360 52932746 45796927 44092927 43942699
39267 43942699 38402269 29856801 24695538 21231694 14140279 6757781 6456683 10277881
39259 10277881 8891331 4189756 7747679 19748885 25722124 19785605 14728243 19580472
39251 19580472 22926959 12584748 -1020507 1039156 16731632 26488063 22352443 15370047
39243 15370047 14431647 15607120 15255840 17263061 21687699 20229912 9945219 83886
39235 83886 -1395858 1892238 3796864 4548617 4304533 -1312461 -10898704 -12297995 2210324
39226 2210324 23116057 35042347 34139326 26097095 15027999 4270814 519789 5393140
39218 5393140 8695984 1600339 -9056732 -11660199 -8936190 -11786311 -18836972 -19020397
39210 -19020397 -12579157 -11196498 -15699936 -12426581 2628435 13839371 9637654 1082339
39202 1082339 4378649 16284805 20905310 13879373 6255108 7527147 15942444 24158844
39194 24158844 25934862 18758884 7081613 984733 5104802 11491096 10037726 2679162
39186 2679162 -656357 2449694 4480012 413406 -5919633 -8830540 -7143039 -2507276
39178 -2507276 2628134 4580325 1627506 -1839618 33419 5556440 7352701 3795958
39170 3795958 1623254 5194537 9991642 10378948 8308403 9849360 16443571 23180399
39162 23180399 23639254 14829423 319330 -10515358 -10410153 -2694526 2656962 2537780
39154 2537780 3993783 11436788 18246178 17121803 12483413 14056581 21613981 25288658
39146 25288658 20305713 12795979 9762589 10872300 12698853 14335845 14925813 11153358
39138 11153358 2345271 -5293019 -4622213 3645464 11757539 13342323 8253698 988650
39130 988650 -2267744 3002665 14681635 23416441 22037284 15331646 14578176 21457776
39122 21457776 24727086 16864267 6641349 6920016 14499363 13363481 -1716115 -16347536
39114 -16347536 -16164857 -5513630 1860912 3411920 7523318 16006816 20067340 15564172
39106 15564172 10376883 11083652 12056617 5860853 -2643805 -2395715 7458390 16876496
39098 16876496 19154396 16847286 13652804 9357416 4485459 1789287 464869 -3493876
39090 -3493876 -8071877 -4729982 7675610 16654898 11830616 700929 -1335208 6946112
39082 6946112 11788582 5452908 -3328163 -3516799 2804228 5484728 1197626 -3430585
39074 -3430585 -1497123 6193702 12465980 11015883 3209057 -2228402 947698 7483066
39066 7483066 6696234 -1963418 -7021290 -1827539 5334751 4774045 968549 4025263
39058 4025263 11163493 10462587 1721898 -1482615 5915847 10458445 413947 -15819271
39050 -15819271 -22733920 -20181406 -19100476 -20378708 -14312715 -1127880 4528139 -4226747
39042 -4226747 -13196455 -6268381 10904509 18463879 9365853 -3325134 -6036410 -614362
39034 -614362 2715486 -74939 -4717860 -6086675 -2488464 4571932 10691684 10848357
39026 10848357 5069496 -111218 763375 5188370 7071977 5481710 3928971 2629038
39018 2629038 -2025924 -9822618 -14926913 -13903798 -10047247 -6751904 -1889444 6660265
39010 6660265 14043282 12824359 2515161 -10147866 -18978093 -21756413 -17719443 -7971301
39002 -7971301 1418230 3214070 -1678966 -3874861 2117314 9376655 7195821 -4027415
38994 -4027415 -11961996 -7008396 6383085 15500437 14175233 8256158 6248918 8485338
38986 8485338 9039755 6349421 6187146 12424858 19873628 20307712 12379591 1202221
38978 1202221 -9076714 -16810390 -19002518 -12844486 -1613874 6826641 8708613 6841500
38970 6841500 4268204 1522409 980267 6357765 14779978 16645536 8366804 -860741
38962 -860741 -812833 6522178 11975654 12769851 13184583 14706543 14023264 10058917 5583840
38953 5583840 1901146 -1445435 -2112306 2465279 7586296 4602629 -6094301 -13438034
38945 -13438034 -10959545 -6172256 -8588777 -14358216 -11299671 3063620 16883578 18522347
38937 18522347 9333954 -889229 -6499787 -9380123 -11769642 -11412769 -6111825 362846
38929 362846 1384257 -3785598 -8496184 -7319928 -2427206 1107873 2769044 5428599
38921 5428599 9386846 12328232 13612506 13849309 11761771 7032092 4853778 10379502
38913 10379502 18535982 17862143 6986481 -1434684 1724830 8785242 7532966 346805
38905 346805 118703 9510654 16101792 10441598 -1062168 -6576569 -4817203 -3438890
38897 -3438890 -5741352 -7054560 -3823734 648553 1587377 -874036 -3574246 -5354731
38889 -5354731 -6824337 -6930892 -3353098 3955245 12196532 18441207 20592110 16604257
38881 16604257 6716481 -3048780 -4152140 5059911 16342760 20847956 18884581 17359842
38873 17359842 20039988 24409493 26759458 26213215 23971437 21730646 20530521 18917971
38865 18917971 13807246 5753604 610585 1903281 4638419 2388738 -2381485 -2787225
38857 -2787225 -452548 -3961287 -13282625 -16357907 -5801531 9960357 18445720 18521005
38849 18521005 16890787 15749231 12767491 9064466 7804441 6838378 1551151 -5407973
38841 -5407973 -5409645 4191822 16331158 23876775 26614493 26631414 23092233 15550413 8083584
38832 8083584 5441888 6828020 7028240 3155169 -2206968 -4680514 -3319563 -1453169
38824 -1453169 -2856444 -8107755 -15199327 -22310492 -27858881 -28786086 -22579557 -11791219
38816 -11791219 -2791449 1595068 4500003 8209330 9643667 6181518 1568977 963988
38808 963988 3392428 4744309 5629437 9701905 15388196 16160185 9687293 876104 -5444044
38799 -5444044 -9400496 -11508738 -8504545 1556500 12147228 11615778 -3566926 -20778682
38791 -20778682 -21390687 -1826259 19620054 23377494 13289835 10546175 22447913 30956986
38783 30956986 19539144 -1558135 -10048182 -2887665 3303463 -835955 -6821159 -5310620
38775 -5310620 1322293 6865985 9586897 9041705 4972459 1915264 4524441 6937714
38767 6937714 -1054480 -15848772 -22750941 -19708004 -20695044 -29095641 -27887071 -9137793
38759 -9137793 6034442 -3466065 -24278255 -26855395 -9401193 2110947 -4687702 -13039436
38751 -13039436 -7050803 6049834 12888779 14072084 15072263 11929231 414240 -10481839
38743 -10481839 -8615723 3103172 10695014 7985561 1135118 -3202483 -4273236 -2623701
38735 -2623701 1788725 5932938 5274246 389593 -3440195 -3904015 -3561745 -3584424 -1814490
38726 -1814490 969058 -860893 -9148269 -16114085 -13134429 -3311258 1084920 -5644337
38718 -5644337 -15139871 -16117218 -8569330 -2030361 -2052286 -4538296 -3877949 -471463 2969840
38709 2969840 7451999 14498537 19723661 16358650 5558576 -2830257 -2480253 846141
38701 846141 -2850247 -13573037 -19939539 -12960105 2356867 12062301 8728860 -1282808
38693 -1282808 -6507009 -3107475 3538333 7642408 9159080 11143416 14745179 18113496
38685 18113496 17953892 11831897 1562462 -6124692 -6299301 -2849822 -3150928 -5489811
38677 -5489811 -76797 14146302 23091297 15528043 4843 -6550798 -2030527 1388245
38669 1388245 -1287061 -1108722 7601704 16701050 17806888 16078341 20941309 29693299
38661 29693299 30901074 21537743 11015581 7613475 8837546 8034826 4844682 4637238
38653 4637238 10022721 17024096 19763038 16357732 9208512 1336149 -5388394 -9053212
38645 -9053212 -7754686 -2064684 4623463 9546617 12365365 12490713 8041866 84018
38637 84018 -5573028 -4852877 -975061 853415 1393805 4350569 7841794 6057951 -1246382
38628 -1246382 -7887049 -9814996 -7727149 -1559459 9246759 19241086 20225600 13712064
38620 13712064 10610050 14518920 15525325 6902085 -2433429 -1834966 3375079 821849
38612 821849 -7500643 -6921404 7487815 23248902 27762337 22539118 16352214 13369335
38604 13369335 13138765 14868104 15869559 11509640 2586842 -2161451 2579411 8907640
38596 8907640 5269994 -6075083 -10310812 -440544 12334444 14297476 8902395 11483078
38588 11483078 25847403 36682334 29648463 10908539 -1498297 -1093823 2401497 856836
38580 856836 -1230824 2682414 9413767 12257747 12196110 14199599 16745316 14676635 10514215
38571 10514215 12692472 21653832 27377870 24175613 19529582 22602787 30392055 32596508
38563 32596508 26689304 20576578 21035412 26040280 29572116 28776430 24301269 17742473
38555 17742473 11720878 9528922 11211107 11791707 7140342 702280 91374 6461417
38547 6461417 11798880 9246475 2471649 988334 8397387 19278155 26190401 25431939
38539 25431939 17198645 5686988 -796508 3907673 15156312 20465847 14385378 5665482
38531 5665482 5450967 12583132 16223829 10486706 359897 -6198044 -6380689 -1995946
38523 -1995946 4369733 10403760 13988021 14195674 11602622 7352360 3114923 1584248
38515 1584248 4777555 11148738 16113777 16775968 15416024 16693486 20743353 20683742 10136586
38506 10136586 -6229413 -14141223 -5581976 10353650 18532742 17096748 16962524 22348311
38498 22348311 23227753 12211267 -1107880 -1691773 11055225 24014585 27120364 20889471
38490 20889471 10484670 1510169 -28233 7097325 14463810 12972083 6731761 8687270
38482 8687270 21031152 29990682 24503386 11616161 6632356 13409101 21752066 22208195
38474 22208195 17046897 15574827 21977301 30144635 30995047 23773316 16857302 16031865
38466 16031865 16761471 12891144 8483102 12453530 23010891 27696025 21278868 14159761
38458 14159761 17480717 27002248 29053291 18652084 4702395 -1621917 1814808 8548332
38450 8548332 11379411 8835317 5706127 7906157 16406210 26293181 31385530 28979457
38442 28979457 21140418 13277363 10698673 14279803 19835579 23296902 25118632 27762478
38434 27762478 31263515 34133549 36048477 36488207 34135897 31414830 34803179 44872966
38426 44872966 51302172 45857528 35455385 32303099 35700483 36575713 36835385 47506712
38418 47506712 66330703 74879015 64415004 49191306 45019270 48170431 46644908 40674258
38410 40674258 38387580 39007794 34582594 24943873 19098894 22825474 33157864 43680703
38402 43680703 49295575 48640572 46595098 49810479 55776381 53951972 43235209 38148552
38394 38148552 48359826 61962154 61912326 51318274 47289823 54262966 59377015 53575631
38386 53575631 42960785 37510161 39799114 46302108 50440585 44455949 27868674 13397243
38378 13397243 14442544 27557330 37767747 39812156 41720402 47540125 50529893 46734675
38370 46734675 42981037 46425506 55494057 64689583 69594635 65031144 48495743 28440882
38362 28440882 18959450 22661930 28452276 29089484 29724260 34837829 38833168 36630119
38354 36630119 33246003 34759863 38325010 39240173 40230918 44979089 48579130 43471526
38346 43471526 31247889 21223943 19788378 26354689 36704834 45580202 48767311 46486949
38338 46486949 42617123 39244096 35758757 33491946 35157505 38947228 40178942 39628485
38330 39628485 42170779 46370977 45186126 38633360 34663294 34749419 31034315 22051889
38322 22051889 17746703 22498105 27204982 26737615 30574007 44237052 53997774 45554120
38314 45554120 27352208 18569099 21755078 24677361 23627256 26587739 35203619 40639262
38306 40639262 38343038 33071139 28341825 23153440 19270048 19472282 18434264 8100022
38298 8100022 -6692415 -10653499 1136189 16113171 21230244 17114705 11925397 10113796
38290 10113796 11059929 11916950 9300847 3663320 1591290 7089243 12892126 9744826
38282 9744826 1954703 1791628 9405354 12376572 6952561 4754513 13227236 23476035
38274 23476035 25497626 23410020 25670163 29945470 29080277 25299569 26436351 31285341
38266 31285341 30208848 20817075 13651761 18429552 30115702 34147758 24680844 12517675
38258 12517675 11362412 19560056 23055269 16467977 10540052 13664874 17813148 13456317
38250 13456317 8021980 13874429 25149415 25669620 16815943 16263178 27512960 32957777
38242 32957777 23854152 15475613 20522472 26634325 17164328 327947 -1539809 15630276
38234 15630276 33385651 35806054 24990200 13110901 10022454 17596293 27883099
38227 27883099 28807172 18358007 9415668 13961513 27537117 36553022 35416183 28536850
38219 28536850 21210786 17258855 20281442 28318307 32409447 28878461 26808369 34311023
38211 34311023 44948175 48837686 49406308 55531550 63868874 64741922 60689498 62150398
38203 62150398 67799828 67295441 62440913 66148426 78385547 82945980 73672801 65246178
38195 65246178 69444621 77437610 76302898 68657004 63891537 62226387 60318580 62347744
38187 62347744 71932211 81166209 81139162 76573817 76641254 77767977 70943798 61630920 64855417
38178 64855417 80437315 90116211 83468276 71849832 69750168 75028600 77184033 75469671
38170 75469671 76994973 82125852 83652037 79387022 75544621 76133790 77047089 73733211
38162 73733211 68574959 66431452 66901563 65723131 62132816 60792773 66246213 77432477
38154 77432477 87620003 89122243 79685378 65596030 56726158 56881766 60985722 63131795
38146 63131795 63641514 64792046 64004348 57963311 51190805 52237291 60861056 67023335
38138 67023335 64816018 59667196 58171145 58481171 56412721 54335978 56401964 59493842
38130 59493842 57373102 51897055 52298662 63044236 78126164 87976282 87947818 80174080
38122 80174080 70841254 65411186 63653022 60420338 53739213 49538154 54607656 67028304
38114 67028304 77554663 78985722 71490611 61564343 58384411 66580551 78704410 80556707
38106 80556707 69545010 61251351 69555263 86140859 90690067 77968285 62883108
38099 62883108 59643113 67402941 77086626 81452968 76809918 65125870 56822016 62073735
38091 62073735 77145870 88253594 89936959 89007049 89052393 84247904 73015008 64858451
38083 64858451 66604264 73053344 78496007 85836203 95402923 96800942 84442879 71613972
38075 71613972 74406742 87799409 92724046 83545249 73465928 73054109 77709387 79074629
38067 79074629 76714156 73847433 70893441 68563092 70691985 79136262 90143773 98747882
38059 98747882 102944178 102131749 96353386 89000362 85486103 86967967 89515488 91134900
38051 91134900 94625238 100843844 104289430 99979535 91484868 87001162 88632337 90460046
38043 90460046 88145705 86437155 93583627 109004048 120528699 117080109 102681022 93333788
38035 93333788 98689841 111025818 115613825 108731165 100649253 102181511 113215255 124992548
38027 124992548 129819100 127168392 122622145 121990438 125487751 128031085 126322758 123767161
38019 123767161 125680665 131375412 135110167 134391989 132954322 135006341 140690148 148022792
38011 148022792 154543511 155156096 143980047 123310045 107016131 108163155 123446225
38004 123446225 135709834 133095288 120519175 110337031 107812263 110740884 118189260
37997 118189260 130936498 144164231 148686758 142584280 135121226 134969314 139606177 140895760
37989 140895760 136716389 131833404 130737001 134808347 143264946 151477440 151924529 143227008
37981 143227008 134830276 135345552 139660890 136855179 128451892 127440736 138782270 152392364
37973 152392364 158289135 158139215 157596209 156899051 154488951 151874562 149807393 146951855
37965 146951855 146187402 153382345 165538869 170583588 165221245 161926112 169698834 179242872
37957 179242872 178844690 174626941 180078419 192660713 197224671 188853033 176313403 165156914
37949 165156914 154263115 148980067 159256050 180138459 190998241 182460901 170508323
37942 170508323 173967541 189152289 198281902 194888460 188309510 187079884 189545791 190376169
37934 190376169 187288052 180250108 170587092 162472918 160920495 166704918 175241721 180357460
37926 180357460 178160879 169702838 162147847 163939366 174613418 182283437 176969378 164780834
37918 164780834 161715258 172686052 184481202 183460376 173289632 167668262 169686881
37911 169686881 168679726 158099622 145935407 141990294 143389380 141562887 137751191 139887380
37903 139887380 146083578 144565676 133093567 125950777 133890748 146407935 144478826 126145690
37895 126145690 108799290 106918382 116396298 122592538 117736102 107504445 103101709 108691372
37887 108691372 116833955 117611493 111511060 108559114 113573192 118982551 116495728 109389392
37879 109389392 106359649 107924426 107181244 101876409 97911922 100914582 109904550 119238847
37871 119238847 123069686 119466119 113587350 113907378 121519684 127114711 123036709 113519540
37863 113519540 107314735 105407072 103241691 100517140 100643694 103773160 107528253 110925180
37855 110925180 111296638 103481935 89966028 83994086 91722691 99230618 91300576 76120308
37847 76120308 74035819 86197003 93891029 88025004 79048373 75485759 72958004 69739197
37839 69739197 73403491 83518541 85613665 73091624 59916779 60286628 69306463 75268182
37831 75268182 77871329 81116535 79837466 68454062 55088551 52402766 59434273 64954295
37823 64954295 64826581 64959249 69993950 78345909 86218888 89984677 87753600 82706571
37815 82706571 79305577 73780395 58448696 39496221 36540989 55766003 77291501
37808 77291501 81309342 74033034 73357503 80663718 84199153 81186984 77740420 73144484
37800 73144484 63133417 54708446 59329487 73835473 85186946 91209793 98852209 105035236
37792 105035236 99740430 87641781 85208545 93719937 96169924 85680105 75979188 76294151
37784 76294151 76511428 68202437 61720404 68454828 81235512 87318086 88578637 93452127
37776 93452127 98751382 95621096 86957815 83544835 86686169 88189799 84962110 81232213
37768 81232213 77977820 71844925 64151837 60262998 59312701 54164754 43511027 36050300
37760 36050300 39797342 52605194 65204064 69648408 64245937 54309464 48607257 51579730
37752 51579730 58896890 63434846 64356603 66443578 71581913 75758467 75073456 70954574
37744 70954574 68084364 69097155 71797712 70648514 61890282 48343942 37679130 34923604
37736 34923604 38995395 47330362 59235339 71585966 76452740 69357279 57235578 51499033
37728 51499033 54314879 58408490 59831962 62579271 68182001 69169905 59457398 46148074
37720 46148074 42570936 50496297 57206320 52544741 42302102 39607856 47266671 55608667
37712 55608667 56793001 53787600 53099711 55289230 57306379 59165932 62012325 62699727
37704 62699727 57465901 49847398 47734184 52243293 56551866 56943797 57332708 59849330
37696 59849330 58937168 50709046 41840389 41267717 46867418 49005258 45796913 45805908 54265019
37687 54265019 64854495 69079748 67672801 67593960 71919781 78223753 84249268 89308426
37679 89308426 91352980 88639726 84236276 82919314 82953025 77768593 67978865 63825329
37671 63825329 70573024 79209912 80027941 78888390 87995326 104067895 110547724 102704925
37663 102704925 95165489 98804400 104772598 101321079 93751204 94002212 99844024 100581521
37655 100581521 97979892 104121719 119500307 130032790 128528108 124317531 126867602 133098271
37647 133098271 137331639 141905220 149415556 153628739 147473915 134275502 123366604 119209192
37639 119209192 120969316 127568183 136498143 142248382 142698846 143455715 149635726 156793755
37631 156793755 156430300 148110834 140221894 139980759 146878652 154380977 155114120 146896902
37623 146896902 135963223 130752431 131224793 130245757 127188785 130852946 143677895 153142085
37615 153142085 148103635 135582378 130104561 132738190 133394425 129305244 126910689 127324836
37607 127324836 124755896 120188933 122233491 131283562 136271139 131629105 124498081 119354352
37599 119354352 109152425 91075788 79028190 87560820 110932748 130884617 140126936
37592 140126936 145522562 151394643 153320613 148875637 142645046 138014638 133398417 129153752
37584 129153752 129452228 133988116 135775049 131108293 124806447 121809684 120619945 119451520
37576 119451520 121548512 128423303 134458871 135499862 137149718 146198471 158469854 164702391
37568 164702391 165144178 167630245 172927032 173972621 170393307 171062332 178347842 182125724
37560 182125724 176572590 172222500 181486079 200104176 213984366 218773822 220736492 221831593
37552 221831593 217353908 208804836 206613184 216108178 230016427 239257223 243726948 248040554
37544 248040554 253312274 258255498 263179426 267806051 269108884 265792504 261386115 258813500
37536 258813500 255488827 248221159 239625706 234462824 231869980 226694449 217642505 208924200
37528 208924200 203427155 198935280 193065476 188460514 189327655 193439262 191676028 178581869
37520 178581869 161430588 153609289 158102400 163600162 160561009 154284343 154419817 157194253
37512 157194253 150053856 132557123 119141550 118006494 120006609 114900394 107047638 105576114
37504 105576114 108476290 108275757 106817189 110937116 116539659 110737599 90880595 69982907
37496 69982907 60315096 60745250 63429844 64455477 63403545 59592380 54492107 53245386
37488 53245386 58630598 66432083 70552053 69900154 67038020 63287886 59195003 57184417
37480 57184417 58919501 60996459 57809674 49210113 41790514 41333167 46666806 52636995
37472 52636995 56718756 59802483 61858066 61106874 58347196 57682787 59929151 59188546
37464 59188546 51035433 41240557 39267733 44065122 44899909 37824557 31823648 33859284
37456 33859284 36952946 31369576 20777303 16873900 21697399 26081813 24490058 21017870
37448 21017870 20050518 20739291 22894265 29321866 38714689 43873151 41193426 35617581
37440 35617581 32322962 29710143 24900767 20112967 18235464 16917315 12557679 6569494
37432 6569494 3052152 3708744 8780411 18259686 27858912 29756278 23586870 20510679
37424 20510679 27784387 35006191 27605610 10969437 6490290 21510862 37496708 34950062
37416 34950062 18318928 6139359 5155463 6811045 5001179 3638283 5656877 6119259
37408 6119259 1008217 -4745016 -3545614 4886185 14293183 19780926 21332227 21454517
37400 21454517 22327070 24262507 25477863 24577801 23358832 24455038 26198343 24062815
37392 24062815 18189727 14304730 14863250 15084729 12042925 12075397 22321012 38135842
37384 38135842 46387653 40531528 26378275 13350583 5785582 2948550 2057235 283651
37376 283651 -2060785 -218950 8924481 20007739 23604220 17560378 8912172 4496771
37368 4496771 4996705 8239675 12060068 12804885 7274497 -1748430 -7033469 -5519015
37360 -5519015 -574855 4812131 11031493 17180605 20117991 19619734 17898981 13223052
37352 13223052 1995174 -11762098 -18615085 -17535469 -16658233 -17141714 -9637401 6560584
37344 6560584 15251226 5790601 -8223770 -7335483 5758427 12885521 8853565 5407594
37336 5407594 9130254 13119835 12116006 10108993 9517742 6899047 3820246 8680314
37328 8680314 21574997 29157869 22181134 8613370 1544753 2345891 4245610 5594627
37320 5594627 9668750 15170072 16667793 14089490 14131368 20324267 26479900 23195291
37312 23195291 9652102 -3789059 -6574873 -277136 4184200 2083052 827612 6164200
37304 6164200 10299017 2966984 -11135185 -17838242 -13743249 -8022523 -4644373 2675073
37296 2675073 15037479 22370371 18969264 12606397 10948219 10296496 5939838 2703205
37288 2703205 5522571 9362234 9023469 9693443 15930052 19010286 9474169 -4531755
37280 -4531755 -7282409 398770 3700925 -1355530 -3524571 1502220 2737594 -5708417
37272 -5708417 -11909382 -4432132 8569028 11142654 2881516 -2278733 3029379 11603200
37264 11603200 14126372 9927919 3755649 -711630 -1554015 1837498 7137324 10444147
37256 10444147 11029129 11600474 12507478 9521954 184086 -10553352 -14805189 -10780988
37248 -10780988 -4077726 -435384 -422434 -1416939 -1288821 1140017 5823839 9228529 5398605
37239 5398605 -6853627 -19417057 -21651182 -11358803 4244457 17405472 25128121
37232 25128121 26266013 19935786 9464134 2653638 3969015 9563656 13159372 13159196
37224 13159196 10211298 2172648 -12040346 -25771421 -29129167 -20933748 -10405903 -5467587
37216 -5467587 -4545787 -2283896 1595942 3234251 1284165 -1994781 -4918623 -7218239
37208 -7218239 -6828560 -496226 10250246 17108209 12861670 394411 -9701157 -10842622
37200 -10842622 -6266863 -1977826 1534344 6440366 10110786 7769342 2512826 4703529
37192 4703529 17576907 29806503 28531379 15582515 3543347 -1484196 -4039708 -6529069
37184 -6529069 -3363307 7190478 14892087 10612997 1637459 2257035 11241372 12100568
37176 12100568 -1358333 -13227517 -7736712 7459234 13020606 6299195 2232573 7336019
37168 7336019 9944335 1402899 -8320125 -6489756 1969655 2794588 -5276002 -9748085
37160 -9748085 -3538781 7068386 13661073 14657381 11839836 6790946 2741278 2784989
37152 2784989 4761726 4109551 1741966 1803038 2201070 -3167676 -11869809 -13216137 -4268547
37143 -4268547 4705368 5495319 2795267 3742936 6244339 5671724 4638588 6608538 6970029
37134 6970029 1314941 -3025873 3940440 17259218 21374750 12182880 2674944 3961738
37126 3961738 11423875 14612635 12111899 9720249 9546367 8272156 4084853 -425175
37118 -425175 -2132842 -743409 1712605 2889525 2190384 1940425 4900799 8961457 6707820
37109 6707820 -5672631 -19449389 -18706075 1613621 26082431 33067058 18716403 687432
37101 687432 -4122796 1370033 3102926 -2985262 -8396852 -7768772 -5212153 -3576724
37093 -3576724 992253 8969268 12173873 5818704 -2400999 -3503638 -317310 204957
37085 204957 1382267 11176379 25313351 29626902 20498200 10808918 11405806 16840614
37077 16840614 15833852 8040233 2235488 2132529 2422033 -1533192 -6673017 -7038284
37069 -7038284 -1912370 3717931 5725013 5230447 5583064 6989263 6926169 5384678 5819023
37060 5819023 9400903 12102832 10453302 7032928 6380990 7953936 7683342 4674968
37052 4674968 1295602 -2124014 -6724919 -9293997 -3737277 9010877 18026785 13895637
37044 13895637 470261 -9008372 -6368423 4424942 14139984 18192825 17891683 14844481
37036 14844481 8699208 1190206 -1868857 3294653 11967618 15331757 11349960 6525355
37028 6525355 5668202 5165951 -347219 -8860796 -13124830 -9859919 -2965867 1423975
37020 1423975 441632 -3803783 -6165792 -3658517 300790 -435238 -6067783 -10109840
37012 -10109840 -8811021 -5913954 -5381116 -5670491 -5396045 -7830619 -13631025 -15756198
37004 -15756198 -9820106 -3738894 -7127132 -15498635 -16447207 -8893002 -3500932 -4268770
36996 -4268770 -3087198 4720579 12260995 13715508 13797801 17505821 20065320 15559354
36988 15559354 7905803 4108302 2733281 -1004039 -3427481 2857618 13953514 16026569
36980 16026569 4198586 -8918416 -8035372 7401872 24809618 32733793 28924285 17901261
36972 17901261 6468046 948867 3752855 10994508 15915610 15612172 12666115 10131009
36964 10131009 7829572 4774362 2254496 1904714 2479994 1347467 -1587671 -3514715
36956 -3514715 -1456889 5851866 16587435 24612287 23485152 15408653 11849059 19287394
36948 19287394 28486506 26355510 15263317 9389449 12966442 15681264 11890146 9325701
36940 9325701 12106040 10096129 -3244688 -14870849 -9340992 6086493 10213028 -2109681
36932 -2109681 -15026843 -16116461 -10409130 -7462398 -7739404 -6960496 -4563540 -2916786
36924 -2916786 -4198069 -10117103 -18862845 -22466685 -14818375 -2159184 3095653 -745410
36916 -745410 -3595870 -603016 556078 -6839653 -17411176 -21664633 -18137730 -12177787
36908 -12177787 -7584516 -3935669 803881 7134513 11391936 8031931 -1272814 -5277286
36900 -5277286 1882394 8178713 -1157948 -18575426 -20574692 -1026933 19015014 21037777
36892 21037777 12367684 9795222 14106305 14495030 8675442 4267744 5076266 7739974
36884 7739974 8999543 7378276 1129498 -7852018 -12333412 -9091661 -4875245 -5970796
36876 -5970796 -8264001 -6193809 -4572235 -10348383 -18011264 -15991850 -5001086 2538771
36868 2538771 774534 -3506139 -3696179 -1176956 1772697 6724484 13115401 15693504
36860 15693504 11951792 5842076 1117339 -2697440 -4674512 113395 12099897 21107089
36852 21107089 15467744 -3991185 -23740694 -31042998 -24601292 -12604152 -4075731 -3014316
36844 -3014316 -7531818 -11744644 -9816895 -1318658 7257195 8780797 3191174 -4082488
36836 -4082488 -10559459 -17671876 -22440054 -16983361 -1933658 7847162 368555 -16157120
36828 -16157120 -23546991 -16959916 -6413598 1182374 7307599 10735985 7210527 1828571
36820 1828571 5601031 15839195 16346618 3042890 -7520254 -3973713 2282386 -2577707
36812 -2577707 -12121817 -12595657 -6251233 -4657355 -7539084 -5763572 235429 1856199
36804 1856199 -940629 230190 6410927 9197071 4586525 -1945978 -4187586 -490083
36796 -490083 8028684 17192542 21020026 19853741 21238656 25742967 21658238 4573585
36788 4573585 -8780851 -1899689 15103528 18969048 7374466 -241334 6798808 18996244
36780 18996244 25864931 27530304 24998765 16342053 6159297 3751311 8905888 12920407
36772 12920407 14088354 17141107 18218198 8839485 -4268817 -3738181 10464133 18470809
36764 18470809 11587175 4308608 6777826 7410302 -3812035 -14526118 -9281425 5452625
36756 5452625 12549055 8817166 2645953 -2636928 -7788514 -9020715 -5044829 -4621649
36748 -4621649 -12876597 -18140890 -7537099 11186348 19220278 13266000 7051174 9367273
36740 9367273 15535698 19601067 21298450 20379306 15606451 10365025 9660891 11103321
36732 11103321 7542122 -1032376 -5999487 -1050102 11088326 22010495 23320928 12446423
36724 12446423 -1818728 -4330119 8860885 22623827 20207165 4094333 -9078528
36717 -9078528 -10156842 -4451657 -203917 -102821 -3376670 -8029930 -11087029 -11941473
36709 -11941473 -13333997 -15146219 -12994527 -8246886 -10798130 -23088358 -30482941 -19973426
36701 -19973426 -852333 7878096 4700907 3513243 8192515 7937313 -1781193 -11927065
36693 -11927065 -16959212 -22338693 -29492820 -28827105 -15603637 116053 7976454 10959937
36685 10959937 15708033 18630771 11875851 -2487795 -13162985 -12154727 -1831282 7776580
36677 7776580 6756831 -4897794 -14246573 -8497692 8259005 19597648 18541899 13807497
36669 13807497 11959145 7017299 -5065350 -14367603 -10652087 -15307 4194262 867385
36661 867385 -575500 2747101 4151182 150402 -4886926 -7724966 -10689212 -15006772
36653 -15006772 -16879879 -12857695 -4282125 5357094 13521269 17842352 15910735 7810759
36645 7810759 -2626778 -9897090 -10188601 -4459603 1039803 122944 -5840356 -8993711
36637 -8993711 -5510856 -929012 -1825758 -6533365 -8868549 -7632158 -6663474 -7217497 -5752797
36628 -5752797 718561 10328878 16933210 13964432 1333793 -9603436 -4202905 17173869
36620 17173869 35161550 33455003 19513121 12858240 16715015 15581655 2159169 -8782326
36612 -8782326 -1677860 15826166 22073145 9693506 -6533784 -9412769 2104748 15586318
36604 15586318 19461760 11900217 -47021 -7112834 -5943258 -2050246 -2519956 -5856026
36596 -5856026 -3680583 5744799 11663316 4256308 -9769316 -13338964 -915444 14166750
36588 14166750 17590533 11500992 7708119 9802997 11618926 10487623 10808254 13362970
36580 13362970 11856626 4485819 -145226 4906591 14148860 18357747 18030085 19384238
36572 19384238 21397854 17108850 6340460 -2697001 -5021214 -3386766 -51835 7059643
36564 7059643 16930543 22186393 18269433 10679906 8620792 14817913 24165482 28736823
36556 28736823 22911149 8913456 -1288349 3412439 17953791 24210532 13792761
36549 13792761 -796950 -4580618 -1040175 -4261831 -16369187 -25538863 -24280387 -17315124
36541 -17315124 -10856315 -5464066 -1675590 -2176306 -4652721 -1666548 7836456 14796627
36533 14796627 12415455 4987844 -237745 -2589311 -3911065 -2401001 2375988 4369236
36525 4369236 -1137848 -8917073 -10553054 -6242112 -2513461 -1396897 469752 4193306
36517 4193306 7348164 8549547 6979262 342152 -9472139 -12471494 -1974028 12420626
36509 12420626 14333928 2710163 -7073682 -5425040 353623 945587 -1050421 919758
36501 919758 5203749 6380885 5062553 4937062 5069881 2753254 -134496 -573129 -198394
36492 -198394 -852717 1441432 10195096 19207453 17903290 4830616 -10666533 -18653096
36484 -18653096 -14743312 327557 18935117 27023517 16633817 -1906780 -10029948
36477 -10029948 -4105816 1771653 -1529671 -4934169 2284049 13260335 12660264 -126541
36469 -126541 -9542581 -5525041 4354134 7717078 3553658 -510465 -1409592 -3216406
36461 -3216406 -8033501 -11602629 -9808633 -4399646 734539 4986169 8679915 8449422
36453 8449422 956068 -9345211 -12636808 -6246177 531581 -1790665 -9971270 -12342240
36445 -12342240 -4771757 3389937 1154630 -9986957 -17280422 -11499092 2484161 11843041
36437 11843041 10961089 6505165 6370620 8750179 7238212 3026327 3607536 9451011
36429 9451011 11206252 3835074 -4264008 -2137334 9166004 19016051 20078037 13019577
36421 13019577 2275359 -6620157 -8691489 -4890395 -3085229 -7648682 -11582011 -6431357
36413 -6431357 3376308 5692277 -1254877 -6390697 -2516859 4739268 8157778 9914646
36405 9914646 15473457 22914359 24857693 17794132 5018418 -6933788 -11504526 -5457734
36397 -5457734 6655630 13959483 9717647 -740392 -6149178 -2616490 2778957 1972905
36389 1972905 -4120996 -8260485 -7680415 -7690649 -12741832 -18433695 -17858582 -13286110 -13585382
36380 -13585382 -20077679 -24349118 -22457822 -20574546 -21398480 -17049043 -4631484 3254497
36372 3254497 -2692643 -9664953 -822379 15158814 14538541 -3827631 -15223052 -7096795
36364 -7096795 3087146 -2941297 -18208120 -26579764 -27131320 -27035495 -24458020 -15376971
36356 -15376971 -6748799 -6375083 -8124120 -3058691 2592970 -2629236 -13894019 -16381508
36348 -16381508 -9284159 -5487354 -8682288 -8675185 -911574 6043940 6224577 4618480 4823746
36339 4823746 1746522 -6774189 -12408961 -8442073 -1201464 -1288179 -8500017 -12625627
36331 -12625627 -7138320 2772729 6051941 -1482111 -10973351 -10097881 458198 6650864
36323 6650864 1189230 -4834727 833490 11237381 10323202 -2128222 -11196374 -10095085
36315 -10095085 -6655601 -6366541 -5061172 -1082702 421227 -824456 1699414 7798888
36307 7798888 9229357 5479962 5690099 10606909 9511166 937548 -2182526 3376887
36299 3376887 1859348 -13997356 -25938916 -17830957 -2713242 -1503290 -9569469 -8509063
36291 -8509063 118871 -237650 -8718691 -7753041 4276174 8015261 -4629522 -17110172
36283 -17110172 -14491865 -2280989 9493511 21486375 33400925 34344758 18291345
36276 18291345 -3178652 -15635005 -19043089 -20018632 -17742840 -9256320 400762 5356507
36268 5356507 8981398 15858840 20768639 16945355 8912335 5344711 4678258 190236
36260 190236 -5004104 -1540721 9255750 14862422 8942398 -1153861 -5673049 -2633580
36252 -2633580 4212875 9708852 8936344 1942089 -2966323 1994077 12301241 16218644
36244 16218644 11391581 6953990 8060184 8712908 3679304 -1940588 -954205 5055390
36236 5055390 9097725 7925840 2746285 -4397474 -9752888 -7692910 2768877 13960819
36228 13960819 17006368 11367700 3078411 -4114910 -11386451 -19915479 -27293332 -29025275
36220 -29025275 -22381404 -10023506 130357 2150497 -184788 2103210 9579185 12195311
36212 12195311 4553178 -4194199 -2816328 5717089 9697740 6379524 3526625 4756524
36204 4756524 4648378 72032 -3814586 -2380217 2251132 7589602 15088628 23471383
36196 23471383 26159841 21533980 17765822 19731299 19020834 7558442 -5272734 -3010872
36188 -3010872 12931709 23943203 21401552 17445782 22223288 25499910 13691634 -5060185
36180 -5060185 -9324354 5494908 21277299 22745007 14539981 7770887 2422130 -7216840
36172 -7216840 -18049898 -20693868 -13340678 -3338843 3960890 9237310 12065862 8635270
36164 8635270 -648828 -8174057 -7596494 -630284 7563724 14794346 19843352 18890890
36156 18890890 9894722 -1382338 -5110697 2531800 15946754 26462777 29799819 27751755
36148 27751755 24430612 20891442 13770500 1475109 -9092686 -7688683 5368002 16928919
36140 16928919 17197294 11722656 10439232 11275181 5346852 -5442893 -9312600 -3441523
36132 -3441523 1414260 -1113229 -2928392 3804838 12549498 12251582 3547556 -4557972
36124 -4557972 -8323311 -9645847 -7270754 1750457 13605169 19934113 17964132 11578069
36116 11578069 4442831 -929824 -922591 3553407 3002284 -8153347 -18342475 -11728169
36108 -11728169 7046767 16926693 10979601 5211799 10830581 16013507 7318345 -6524012
36100 -6524012 -9123974 -3843656 -7239896 -20213551 -25115253 -11962528 9044302 23960652
36092 23960652 29825518 29108126 22533845 13238340 7429144 4982726 -1391058 -12304508
36084 -12304508 -17025860 -9683013 -432453 -880903 -6160012 -3232210 7569340 12103664
36076 12103664 3283780 -8867701 -11095573 -2683958 6960711 11064020 10979372 11299377
36068 11299377 13401036 14308763 11121987 5981844 4827190 9815557 15210947 13877093
36060 13877093 6369084 -361955 -2791548 -4791074 -10528597 -17364433 -18900948 -13489493
36052 -13489493 -6744380 -5230710 -9312486 -13514629 -13502185 -10653240 -8395535 -6241708
36044 -6241708 -1353613 4427369 4510966 -2932961 -9908861 -7618170 1799429 7234790
36036 7234790 1696468 -10136126 -17330813 -13424932 -2439116 4516065 810283 -6481337
36028 -6481337 -3591192 10963970 21332680 15062051 2184205 2154526 15287212 21872555
36020 21872555 11404617 -2397553 -2613091 7801003 14520659 13624999 11812902 10938937
36012 10938937 6640896 558949 182336 4932204 4649703 -3956737 -9846680 -2840530
36004 -2840530 11529393 19280866 14712094 3480838 -6534936 -10646013 -6871333 2641045
35996 2641045 10857951 12757997 12320394 16611109 23460412 22563783 10803222 -1083326
35988 -1083326 -2260595 3256671 2568474 -7812643 -17675570 -17703064 -10645453 -4370542
35980 -4370542 -241831 5164357 10561759 10212263 3434707 -3460630 -6541265 -9075202
35972 -9075202 -13882316 -16993194 -13942112 -7619480 -3770815 -2097050 1390101 5382029
35964 5382029 4204085 -2632704 -8989442 -10989756 -10793868 -10463552 -8913516 -6819973
35956 -6819973 -7585697 -10665834 -10807820 -7219572 -6157620 -10121000 -12531821 -9355813
35948 -9355813 -7688789 -13772642 -19698238 -13890245 -349833 5855937 937199 -3219631
35940 -3219631 1745710 10126511 14406799 15628736 15594256 10084910 -1745613 -10351451
35932 -10351451 -7995115 -1495276 -2904499 -12122559 -18687660 -17814594 -14664896 -13601331
35924 -13601331 -12316867 -7733885 -1038035 4345168 5395311 892354 -5640170 -7001440
35916 -7001440 -1771784 938387 -6186070 -15102721 -11517902 3821608 14801049 12430848
35908 12430848 5643909 5193613 8043216 5390728 -2236518 -6827455 -4700566 1209839
35900 1209839 7044797 9521126 5749470 -1845265 -4365726 2441311 9227901 3591082
35892 3591082 -12139045 -22439735 -18234174 -6708638 503013 1190624 193238 -959499
35884 -959499 -5061108 -11143957 -11636519 -745249 16486584 27319390 24545324 13794237
35876 13794237 5471120 2608955 1406837 1166714 5504018 12688333 13707708 4706591
35868 4706591 -5799357 -8389848 -5586931 -6008275 -10607088 -13436009 -13033638 -13482341
35860 -13482341 -14706263 -10834353 47614 11809231 18556147 21575487 25366011 30518450
35852 30518450 32754898 27216532 13645214 -1171535 -8306536 -6657219 -4471833 -7232185
35844 -7232185 -9571698 -6087250 -3978857 -13209708 -27039787 -26902815 -9048980 7286602
35836 7286602 4655156 -10545491 -19079680 -13720613 -3417993 2360906 3242121 2609775
35828 2609775 860085 -3174604 -7671188 -7942276 -2046239 4605509 3629624 -5194968
35820 -5194968 -11274764 -6358345 3865369 8232957 5857500 3545334 871912 -8732772
35812 -8732772 -21983804 -25791702 -17293695 -9636262 -11311034 -13229694 -5307925 6203964
35804 6203964 9035746 3056615 -3082340 -5701354 -5825890 -2382322 3719224 5396550
35796 5396550 -412706 -5270238 -2138667 2350895 117260 -2912518 2018846 8201820
35788 8201820 3744424 -5824254 -4513996 7581111 14643066 11552693 9406563 12215784
35780 12215784 9020337 -4212649 -13970019 -10205781 -2124025 -2176103 -7464569 -8169190
35772 -8169190 -3621998 623938 2546944 1177267 -6324934 -16000242 -15263197 41218
35764 41218 15871027 18030110 11070057 7462685 7078970 2162823 -4289793 -2351217
35756 -2351217 5521667 6342685 -1224593 -2854912 8634707 20634665 18797835 7294330
35748 7294330 1558097 7288752 16298999 20332773 19790362 17712920 12423074 1063194
35740 1063194 -12085587 -16392233 -6355493 10226228 19129303 14467359 3517072 -3126675
35732 -3126675 -2239632 2397749 6820989 10100134 12916352 15826266 18401106 19334657
35724 19334657 18564931 18489135 20009210 18383449 8338964 -6099715 -13126380 -7182417
35716 -7182417 3870379 8918529 6118071 1563272 18407 1560962 4300124 6225229
35708 6225229 6253960 5889804 7467403 9673286 8776205 5237823 3602282 4306766 2329783
35699 2329783 -3482137 -7292157 -6147016 -4867258 -6187311 -4783623 1973204 5880931
35691 5880931 -478287 -11136983 -15644472 -14419539 -14614167 -16124280 -13575795 -8258067
35683 -8258067 -5619515 -3539115 3947135 12631705 11662511 1886346 -3092595 2728520
35675 2728520 9341536 7736665 3199079 3950124 6272272 749148 -12192903 -22192918
35667 -22192918 -22430559 -16384885 -11377521 -9945862 -8779074 -4763664 -852131 -3604796
35659 -3604796 -13370919 -20672072 -16950513 -5724320 3220348 7751290 12937800 18278573
35651 18278573 16145909 4966405 -6038773 -9542490 -9263605 -11381111 -14022950 -11661239
35643 -11661239 -5111194 -872435 -2688739 -7756913 -9925573 -5206065 3571860 7817379
35635 7817379 2856150 -4560693 -4472734 1774103 3749229 -1410170 -5370419 -3933214
35627 -3933214 -3752518 -8000715 -7501147 4300004 17441663 18321327 9413958 3694724
35619 3694724 4494112 4398412 1567109 2690802 8543812 10031616 3058466 -3758477 -2555414
35610 -2555414 1348888 -1677462 -10210870 -13930502 -8585863 -804855 2227692 1223651
35602 1223651 607605 793656 -1247228 -5925315 -9929308 -11206787 -11263438 -11218780 -9110658
35593 -9110658 -3847478 1016171 1406527 -1018301 -1109329 2025153 4007712 1805041 -3160798
35584 -3160798 -8616853 -13212451 -14137132 -8512226 1145747 8009321 9475386 9557677 10913971
35575 10913971 10598690 6818658 3450377 3120873 1583750 -5263985 -13716160 -17922208
35567 -17922208 -18741104 -19731124 -18224388 -9400528 2289256 5278800 -3976501 -15718455
35559 -15718455 -19516908 -15841857 -11296529 -7616728 -1213240 8190740 14158177 10771250
35551 10771250 668908 -7275028 -8376714 -6951761 -8342288 -9511524 -3478716 7739168
35543 7739168 12587819 5471911 -4437545 -5807790 -1063403 -1854055 -11587431 -21096832
35535 -21096832 -21678215 -14799992 -7140567 -2499930 -1640665 -4760059 -9635432 -10658387
35527 -10658387 -4887204 1916572 433755 -9436235 -15329192 -6607195 10025026 15884142
35519 15884142 3425776 -12825874 -14278674 -1684427 8363051 7155501 2786822
35512 2786822 4945168 12433690 19258222 22410227 18811274 5300530 -11804411 -17921517
35504 -17921517 -9587776 -2418745 -9360467 -21087010 -21195826 -11817596 -7502785 -9819696
35496 -9819696 -7280014 1234712 3016395 -5494021 -10838453 -4341918 4279490 4098483
35488 4098483 140498 2484701 8827953 9866756 4961941 992462 -183897 -3153716
35480 -3153716 -10009647 -17633692 -22348745 -21956079 -15817950 -7589917 -4164335 -6864240
35472 -6864240 -7777612 -479052 9704876 12666010 7451538 2245896 2594119 6656856
35464 6656856 11217155 15482207 18012707 15408043 6474805 -4838351 -12275652 -12611348
35456 -12611348 -8560240 -6514692 -9968724 -15421017 -16929509 -13378794 -7355740 908126
35448 908126 11406162 17601428 12101942 595922 -1625560 8470726 15663132 9581186
35440 9581186 626043 1413903 4902357 -2461015 -14763162 -13808338 1266355 11838860
35432 11838860 8050093 -48855 -3111386 -5300608 -9734004 -9357778 -2909009 -3836103
35424 -3836103 -19303663 -33122077 -26092492 -5001961 5668622 -3238888 -16744548
35417 -16744548 -18637424 -8733163 3716198 11132402 9629166 642778 -6443118 -2318701
35409 -2318701 9188461 14800936 10484170 6398334 9639521 12893366 7291360 -2330144
35401 -2330144 -4405939 2423136 8632916 7685055 2718899 138290 2610356 8209319
35393 8209319 11991051 9141646 458519 -6494711 -5302895 1918508 8444711 11413588
35385 11413588 11927759 9994710 5641509 2852698 5225599 8610573 5407323 -3803319
35377 -3803319 -10345987 -9878343 -7042575 -6166381 -5552409 -4142636 -5658351 -10992440 -13407109
35368 -13407109 -7578652 1704904 5948414 3857570 264845 -1681861 -1414262 2056329
35360 2056329 7731420 10348791 6549624 552129 -1603037 287101 4203942 11839745
35352 11839745 23050175 29364160 23043059 9539863 923134 -211560 381513 1974015
35344 1974015 7168476 9120224 -2205133 -19304032 -21431464 -5705677 5040126 -3780669
35336 -3780669 -14945777 -6316067 13286014 16410871 -2526248 -20999013 -20942671 -7862680
35328 -7862680 4323313 9744159 7519786 -1949690 -10957908 -7744530 6759216 16263595
35320 16263595 10683502 404711 542143 9792741 15135212 11395412 5444021 4055218
35312 4055218 7210031 12447673 17818835 20231688 17153083 10786485 6128312 4744500
35304 4744500 4322321 3959438 5505360 8955252 10171974 5159053 -4544820 -11769965
35296 -11769965 -9604838 1490070 12874395 16201684 12198620 7747658 5366866 1904190
35288 1904190 -1501700 3045954 17280974 28773508 24407861 7587973 -7031110 -13245128
35280 -13245128 -17399050 -22958517 -22454059 -9814088 7386912 15336790 10171476 869765
35272 869765 -2470119 1630817 7838432 11261858 10695373 6375632 -2038890 -13030792
35264 -13030792 -20457885 -17954406 -7648629 213116 -148595 -2544328 627144 5240792
35256 5240792 2080779 -5729759 -3871107 12057184 27731617 28561091 17955336 9145458
35248 9145458 6189697 3517929 -185518 192639 4577537 5004496 -1957098 -8285071
35240 -8285071 -4969030 5972285 14776805 15735197 11452005 7846289 8898951 14876681
35232 14876681 22214963 25662907 23027179 17355637 12814076 9777792 6230435 2362403
35224 2362403 148863 -1092508 -4178343 -7726854 -5121824 5925642 15920776 12514266
35216 12514266 -2564197 -12637616 -6443320 6385945 7737844 -3983691 -11159614
35209 -11159614 -993811 17118835 24073418 14360454 -523656 -7867785 -4823871 4365401
35201 4365401 13739263 17461646 13243796 5689404 1040023 -1846576 -8876480 -18347553
35193 -18347553 -19706734 -8722004 3769858 4785143 -4663935 -13566719 -16687837 -17703020
35185 -17703020 -18751883 -16467691 -9812650 -3923262 -2901566 -4516807 -5282447 -5661136
35177 -5661136 -6459991 -4815719 1123027 6899952 7038654 3856874 4717282 10589204 13940621
35168 13940621 10158202 4957051 5861436 10798236 11579705 6685391 3356256 6398622
35160 6398622 11841331 14273841 13942073 12188265 6222655 -4368204 -10682254 -3894965
35152 -3894965 9910616 14963012 7422996 995391 6181898 14210125 10301552 -4547344
35144 -4547344 -15981069 -16430763 -11322807 -6350317 -486213 5961915 7248977 1772869
35136 1772869 -2354133 1753902 8803796 8546063 414605 -6247090 -4929906 1650402
35128 1650402 7520381 9825174 8513645 4964288 2812966 6057288 13815959 19549323
35120 19549323 17674633 9355921 433473 -4620619 -5527889 -4966050 -5953249 -8763624
35112 -8763624 -9230012 -2369473 10360173 19798261 18258799 8565016 343877 -1742779
35104 -1742779 -1352616 -1634086 895980 9469867 18310010 17707400 7756013 533587 5533479
35095 5533479 17512693 23697685 20494807 16467480 17936644 18697194 9708156 -4964488
35087 -4964488 -10700568 -2259391 7235090 3481885 -8495894 -10650204 2676048 16524528
35079 16524528 15935198 4980446 -2109151 -1472946 -1073209 -5227084 -8816695 -7386779
35071 -7386779 -3495175 -646635 1346215 2404796 899223 -952639 1901449 7389420
35063 7389420 5867946 -4719511 -11701776 -4208874 9886323 14251086 7282054 2972553
35055 2972553 9072330 16416463 13853161 4489271 614523 7484859 18258639 23228385
35047 23228385 19661578 12411374 7278750 5355994 4470036 4637613 7970715 12119399
35039 12119399 9699258 -953484 -9473147 -5213165 7838795 16158987 14667295 10083850
35031 10083850 7007561 2095751 -5119474 -6997959 253396 8385619 8748938 5132042
35023 5132042 6079361 9659058 6403276 -4267290 -10712032 -4224375 9553768 17626044
35015 17626044 13949699 4072514 -2054635 302987 7351590 11957508 11735515 10909890
35007 10909890 13945308 19557779 22488856 19379554 11444733 3217668 -154280 3104172
34999 3104172 8524802 9190682 3917785 -1638653 -3456274 -3655959 -3457034 2060416 15421730
34990 15421730 27499937 25945878 11926912 -326308 -1869510 1425837 937358 -976906
34982 -976906 4115195 16473245 26239535 25193578 15168317 4367796 -423705 2817784
34974 2817784 11316220 18126785 15967634 4243625 -8932661 -14962881 -13932026 -11869493
34966 -11869493 -10377703 -5590044 1489653 2061771 -7349227 -15832489 -11227929 1871390
34958 1871390 8126945 3970316 1783628 9495388 18526648 18224873 11715170 8523831
34950 8523831 9210954 7366639 1877777 -2693580 -4975616 -6925715 -7021898 -1791745 6925107
34941 6925107 13786862 17888870 21789201 24467629 23377410 21959816 25811090 31671544
34933 31671544 30084259 20170580 11907547 11306215 13114092 11852215 10061257 9811805
34925 9811805 5411068 -6989575 -19240430 -20051687 -10240026 -518153 3566871 5924236
34917 5924236 9719658 11345357 7173872 672998 -938865 5188160 15036173 22029071
34909 22029071 22253227 15995178 5823686 -5143827 -12673405 -11840087 -1892714 9554794
34901 9554794 11612492 1478056 -11788670 -16305847 -8190496 6663458 17913907 17292886
34893 17292886 4744436 -9559228 -13512261 -6019331 2267448 3276483 1049924 3128331
34885 3128331 8502570 10755639 8827779 6713717 4846742 251846 -5085096 -4378598
34877 -4378598 3535032 10825841 10664390 5270090 1019810 263399 1622658 4755062
34869 4755062 10554512 18099171 24353419 26419743 23253133 16795174 11766668 11533495
34861 11533495 13367865 11146506 3977939 -1847143 -1601669 1681681 3327559 4878584
34853 4878584 10147233 16304608 16063219 8601298 1660590 1110334 4103530 5237560
34845 5237560 4343007 4134099 4191319 2540142 991605 3243226 7826144 7999038 156617
34836 156617 -11167473 -18423442 -18600914 -14123612 -8676649 -4393410 -1723741 204908
34828 204908 2798077 6299205 9226012 10179468 9460402 8300056 7623652 8385208 11692969
34819 11692969 17071835 21417089 21148382 15107556 4699715 -7547685 -18138476 -22672848
34811 -22672848 -18535847 -8239768 1366799 4391632 703444 -4207813 -4315837 834947
34803 834947 4745007 323991 -11254460 -19864266 -16799665 -4782295 5159105 6724502
34795 6724502 5146370 9341286 19554758 26194565 21335393 8420195 -1906948 -3878965
34787 -3878965 -616485 3663131 9736427 18445830 24826851 23460917 16981467 12179787
34779 12179787 9238275 3314074 -3208861 -415052 13646685 26845237 28475518 22818858
34771 22818858 20064137 21154970 20462823 17323640 14842871 11778985 6019615 2493062
34763 2493062 6674236 13062597 11718161 4039990 -560691 -1918186 -8167185 -17321996
34755 -17321996 -16802935 -5424752 1361373 -4220005 -9449860 -3590869 2891135 -2898930
34747 -2898930 -11792462 -6878234 6093243 5339496 -11689717 -22169728 -11706448 5356243
34739 5356243 8960090 1088071 -2560824 1757171 3531044 -2586774 -8901097 -7766643
34731 -7766643 -2565301 -1380137 -5693507 -10168895 -10684413 -7951460 -3848820 1554447
34723 1554447 7747460 11610323 10519612 6174465 2239943 -524792 -2743030 -1312208
34715 -1312208 7681285 19875117 23974646 16169957 6341504 4015006 4731458 -949578
34707 -949578 -9919530 -9634634 2153151 12647890 12019580 6054109 5316792 9835076
34699 9835076 12366662 11896748 14753192 22767746 27910659 21776604 6670479 -6152961
34691 -6152961 -8318368 -1992106 4315887 5321351 2882700 2068311 5957304 13676757
34683 13676757 20753115 22029217 17690910 15177639 19607463 23452084 14742780 -2982777
34675 -2982777 -10788330 -760688 9860593 2691431 -13764111 -16441421 -2092351 9945690
34667 9945690 8604291 4565237 8224523 13132354 10943353 7183206 9901381 14847127
34659 14847127 14971406 14577414 20002203 24508536 18049560 6682585 5905675 16670486
34651 16670486 23810727 19093339 11030218 8490178 7907497 2656540 -5151187 -8858697
34643 -8858697 -6236974 579572 7892938 9764412 1845051 -9916656 -11756087 1285527
34635 1285527 17425615 22333531 15512307 6795424 2306386 1009715 779628 211371
34627 211371 -2874150 -7790420 -8293228 -494438 8726899 8864179 119714 -7279560 -7598733
34618 -7598733 -4699838 -1632532 5131208 16581421 24384862 20147217 6731914 -6065049
34610 -6065049 -13694276 -18438555 -21625920 -21560528 -18775675 -16781859 -16448582 -14706821 -10014617
34601 -10014617 -4531464 277918 5351338 9646876 9248522 3843471 -677085 -141391
34593 -141391 1535393 -1083103 -5512289 -4810995 1369591 6097218 5490515 3058175 2216067
34584 2216067 691356 -4356094 -10193469 -11388034 -6368403 1503537 7434552 8426679
34576 8426679 5671422 4515138 8383771 12240081 7592180 -4418945 -12043624 -8811008
34568 -8811008 -2680528 -2899587 -5249129 -110683 10211774 14263180 9267423 3803562
34560 3803562 2625459 1393939 -1302855 403677 7058171 9056560 1815125 -4788940
34552 -4788940 -1069293 7493336 10027932 7106885 6347279 7571854 5072768 395517
34544 395517 -234079 1439147 -1008385 -4263296 1515338 14529312 21055777 16025297
34536 16025297 9457225 8125469 5841488 -1045571 -3428026 4813078 13737115 12571625
34528 12571625 7102860 7777140 9967806 2815710 -8861453 -10211361 -1425421 1736332
34520 1736332 -6239703 -12714171 -9650493 -6732928 -12615264 -17889037 -9725339 6299096
34512 6299096 13091305 5962949 -3353219 -5681897 -6099755 -13591469 -26245122 -31945736
34504 -31945736 -22543660 -4458206 7026846 4854674 -1772001 -890071 4137801 -784828
34496 -784828 -17954312 -31883753 -30897028 -23287054 -22469581 -25110781 -17173354 2714257
34488 2714257 19845885 23482811 18330079 13704717 11787411 10870921 11439238 12965428
34480 12965428 10716769 2046275 -7670082 -10659085 -6011308 1000344 6814113 12103468
34472 12103468 16951699 17899743 11573402 -462422 -11957549 -17065375 -14942562 -9251652
34464 -9251652 -3316002 3246040 12119474 21343326 24934532 18769545 6395566 -2436472
34456 -2436472 -579233 8571424 13305729 5586750 -9788653 -20000841 -17610331 -6835188
34448 -6835188 2584798 4273532 -1382286 -8052676 -7451353 2320566 11856575 10231918
34440 10231918 1040863 332412 14359302 28062083 23472596 3167435 -13878181 -15753224
34432 -15753224 -7483993 67081 1521560 -2481003 -7672060 -8204823 -2498237 3282884
34424 3282884 3190707 841961 3682600 10234061 11963820 6750324 912832 -2039920
34416 -2039920 -4595440 -6381744 -2990280 3671563 4462726 -3053656 -9066388 -5223889
34408 -5223889 4056656 9160695 6821731 -781428 -10808107 -18015631 -15855637 -6388065
34400 -6388065 -2876898 -14685315 -33679972 -42712880 -34943548 -19098077 -7817887 -5565195
34392 -5565195 -6886521 -4172644 1887349 1215268 -11394272 -23815273 -18599299 2564676
34384 2564676 18983692 18481383 10910611 8485113 7982280 2826484 -1534483 1253085
34376 1253085 3490501 -3970244 -13196155 -11212930 -3723169 -6771795 -18204079 -19014289
34368 -19014289 -4491703 7131607 3306707 -4356444 -451929 10269820 12397561 3955644
34360 3955644 -2336237 1821717 10711576 14258963 10357044 5287885 4269761 4141488
34352 4141488 -2028816 -13126426 -18514536 -12158058 -1715821 3261276 5111467 9547642
34344 9547642 9995668 -4109466 -25595867 -33277306 -20232427 -3174916 1182418 -4795755
34336 -4795755 -10116314 -11308293 -10364895 -8016613 -7147031 -12810666 -21376932 -20024225
34328 -20024225 -4931398 10616455 14759803 12418557 12190273 10163785 580944 -7786029
34320 -7786029 -3083655 7918756 7359286 -6573398 -16818576 -12754593 -3093506 134466
34312 134466 -2601875 -4393804 -3874767 -4123918 -5427461 -5170062 -2475629 476255 979874
34303 979874 -785031 -337620 6643644 16806441 20687087 15402018 10001396 12141304
34295 12141304 15376675 8512854 -6724860 -17512358 -17069122 -10038263 -2445130 3195236
34287 3195236 3447857 -4050885 -12756660 -11805368 -893955 8780306 10697936 10252022
34279 10252022 12570507 13449872 8186421 967128 -1361994 1189065 4507966 7470559
34271 7470559 10593100 11944295 9784079 6061222 3181204 641660 -1760962 -1514297
34263 -1514297 1929885 4006729 885291 -4678835 -7343014 -6312288 -4755721 -4356783
34255 -4356783 -3750706 -748433 5982855 15360758 22599066 22424062 15210857 7008535
34247 7008535 2303825 166840 -1598153 -2907313 -3473350 -3950016 -3428847 -363119 2738161
34238 2738161 957121 -4995354 -8311302 -5829127 -1950566 -342097 1083052 3227654
34230 3227654 1362873 -7158703 -17276394 -23656801 -27352161 -29718120 -27158038 -18937162
34222 -18937162 -12923475 -14907036 -18560570 -15461436 -9058174 -7791871 -9707132 -6832823
34214 -6832823 -1334728 -2596458 -8763766 -6783866 5708977 13108217 3681536 -12702545
34206 -12702545 -17830937 -8209597 4450366 10452832 10355315 8324408 5756309 2208150
34198 2208150 -2832954 -10323094 -20387511 -29821939 -33429957 -29214032 -21189690 -15634588
34190 -15634588 -13996147 -10703568 -602890 11421815 12916547 -858784 -18242546
34183 -18242546 -22997471 -12036216 4271680 16327843 21973358 20876928 12510148 1642585
34175 1642585 -3203208 -491863 2595251 2683100 6112794 16563028 24545041 18338794
34167 18338794 1720527 -8285821 -1531249 13765173 21345308 15071278 4432285
34160 4432285 2270973 8546297 9964847 -1550910 -15049255 -13503758 1758844 11538891
34152 11538891 5697774 -3803499 -3688222 -60451 -5870998 -17222825 -18328894 -6400842
34144 -6400842 4402223 4693982 1524907 4627482 12260981 15937284 11319790 373556
34136 373556 -10853971 -14440487 -7928881 -1045838 -6241597 -20379922 -26473877 -17726769
34128 -17726769 -7764209 -9274716 -14327838 -8004482 7285953 15988946 13195547 8694343
34120 8694343 8194471 5953411 -961277 -5135117 -1688707 2737193 1545751 -672442
34112 -672442 2676851 7778582 7547903 5382267 9950576 19142837 21692952 15120400
34104 15120400 9921852 12655661 16140923 12579395 6580733 6163385 8075246 3194788
34096 3194788 -7250387 -12654328 -9597007 -5740605 -5024242 -796132 10128167 16743626
34088 16743626 7400403 -11614442 -22152951 -17132906 -7133868 -3450802 -4476093 -2755658
34080 -2755658 2370316 5407133 3757341 592972 576251 6065982 15265888 21536961
34072 21536961 18021778 6375683 -3006622 -3968167 -3458488 -10816867 -22000505 -24143357
34064 -24143357 -14983082 -6540214 -6435798 -6797726 956118 9859418 7316650 -4231938
34056 -4231938 -9960166 -5043200 -790024 -5036394 -9186399 -2724559 9134555 13168222
34048 13168222 7594401 1822601 -578002 -5601954 -13768546 -13841956 1648449 22897292
34040 22897292 33104434 27925080 17441191 11635387 11052440 10771308 7122904 14941
34032 14941 -6632868 -6766611 944911 8488266 6104645 -4864791 -12069485 -6640231
34024 -6640231 7092184 17935000 19137666 11653729 1481525 -3530223 456481 7194186
34016 7194186 5589779 -5007331 -11303023 -4047107 7194664 6704182 -4858644 -12554970
34008 -12554970 -9751898 -5019878 -4954105 -4380199 423669 1750652 -6579224 -16228149
34000 -16228149 -15713045 -7564956 -2363231 -1830048 -1287303 -4013932 -16543341 -30593392
33992 -30593392 -27911867 -7596087 8331673 4851536 -5932390 -6270949 -493838 -4595565
33984 -4595565 -17315732 -21582024 -12434566 -3954459 -5131252 -6432174 1684665 11336402
33976 11336402 9945657 552263 -4056032 -2484138 -6239494 -20211811 -33805703 -35631308
33968 -35631308 -28258045 -22144975 -20245107 -15814944 -3898128 11358544 22033599 24900693
33960 24900693 22700867 19931240 19649065 22261444 24783473 22736228 15516970 8630547
33952 8630547 7552315 10715359 12399606 11075813 9337805 6267001 -2399671 -14443989
33944 -14443989 -19593684 -12584010 -984053 5862148 9075853 13916357 17609474 13964272
33936 13964272 6488930 5417731 12406493 18868396 20017899 20072572 21798059 21301054
33928 21301054 16570748 11887334 9798158 7247244 3691709 4435832 11005180 16204405
33920 16204405 13935150 6568921 -1796725 -10587093 -15967080 -9262285 9126890 23145479
33912 23145479 19085506 3870353 -4872793 -1357071 6259290 10895104 11601133 7122615
33904 7122615 -2892001 -11171709 -8714487 2358240 11508329 14693327 16451011 17853207
33896 17853207 14214566 6465867 3250454 7566187 10826446 5300142 -4869612 -10180724
33888 -10180724 -8180322 -5144573 -8220116 -17523823 -24125571 -18001519 -1739545 8458441
33880 8458441 2604401 -7942127 -6255147 4382429 6229555 -3132365 -5910633 6767563
33872 6767563 19516493 15784626 549639 -11779258 -18735476 -25261272 -28532659 -23050355
33864 -23050355 -14463916 -13278908 -17949515 -17181403 -7304090 3681857 7957465 4371673
33856 4371673 -4711637 -13957110 -15079317 -5454162 6068438 10637551 12106643 17664232
33848 17664232 21291164 11483132 -6813250 -14749310 -6008521 5141288 6711259 4714195
33840 4714195 8638883 14848135 14780724 9378479 4276311 -1443415 -10127135 -15082802
33832 -15082802 -7787157 6734678 13181150 5127094 -8105215 -14882174 -13714851 -10221729
33824 -10221729 -8416650 -8475491 -8885501 -7775933 -4673804 -2528645 -5334388 -12468889
33816 -12468889 -18130930 -17737929 -12233459 -4811250 3203392 10498557 12830021 6648025
33808 6648025 -4565663 -11730401 -9524657 -1796983 3804675 4004158 503494 -4763821
33800 -4763821 -10699032 -14422766 -12748448 -7342394 -3769212 -3362816 -869490 6307228
33792 6307228 11434812 7045853 -3011194 -7766962 -4692130 -3067383 -10011760 -20453875
33784 -20453875 -24742832 -20262269 -10931871 -594790 7188858 7270518 -1550738 -11317303
33776 -11317303 -12833236 -7811423 -5253799 -6079452 -1331249 11346472 19912261 14068283
33768 14068283 1358065 -2786205 3822785 10185252 11014828 12843149 19430365 23361384
33760 23361384 17991270 8154048 1554328 -3000090 -10492647 -18649866 -20846767 -16043715
33752 -16043715 -7605692 3691504 16354819 21897218 13398498 -1035959 -5270412 3547793
33744 3547793 11934836 10061900 2979304 -1647840 -4779501 -8554785 -8495397 -1774199
33736 -1774199 5071030 5467557 2806126 2395948 433164 -8580812 -18823666 -19294516
33728 -19294516 -10364746 -2961929 -1956791 -1052366 4495390 9580362 6996127 -3071375
33720 -3071375 -14347730 -20779217 -19751870 -12867996 -4860372 801095 4868920 8604359
33712 8604359 9661241 5827975 219708 -2629871 -3741074 -7057248 -11929821 -14457955
33704 -14457955 -14285241 -13141656 -8682416 1870564 13005332 15339043 9692193 7485197
33696 7485197 14737096 24417000 28061405 26376512 23276267 17179369 5429832 -7474508
33688 -7474508 -13289320 -9725108 -1826607 4574610 6767934 4357532 -1188521 -6462509
33680 -6462509 -8318281 -6258943 -1735609 3734051 8632670 10880889 8690670 2270122
33672 2270122 -4873242 -6633695 788511 12762884 18233160 11453468 -951289 -8673157
33664 -8673157 -10082465 -10242882 -10183272 -6800003 -2380148 -4458155 -13942546 -21667345 -20473195
33655 -20473195 -14059285 -9735254 -8144403 -5186708 -288599 2317592 -584265 -6881077
33647 -6881077 -10584559 -7888496 -2765836 -3814175 -12271336 -17154709 -8756761 6273554
33639 6273554 12182124 5065905 -3351139 -3321916 1966656 5284996 4946043 1621140 -5005881
33630 -5005881 -11542266 -11160792 -3531754 3143939 4451757 5878600 11691033 16438278
33622 16438278 13872430 6457252 -556087 -6865914 -12191604 -11682399 -4298899 1536241
33614 1536241 -600390 -4531016 -1385338 5943322 8118334 4354620 2096573 5033201
33606 5033201 10505619 16027035 20157177 19786543 14172642 8465378 6355218 3863933
33598 3863933 -2266815 -6375374 -3584397 -1282463 -9096823 -22503855 -29453211 -29174715
33590 -29174715 -29792423 -29963416 -19773670 -944392 10723669 7856449 1695517 3118157
33582 3118157 6589540 1859146 -8859339 -15698023 -16269892 -16116410 -17685735 -17305628
33574 -17305628 -12504545 -7206621 -8979387 -21567887 -38214058 -44000200 -30551487 -8135764
33566 -8135764 3986734 70438 -7277093 -6388286 -846537 278213 -2839827 -3849977
33558 -3849977 -1721313 -346479 -100789 1991592 5152023 5269094 2579683 2648270 7859515
33549 7859515 12489191 9417283 -299482 -8113999 -8845994 -7550454 -11775182 -18682397
33541 -18682397 -16976723 -4043765 6835389 3277111 -8544821 -12860356 -6800934 -1918154
33533 -1918154 -4463715 -7592951 -5941573 -5228599 -11140862 -18570147 -19172147 -12498025
33525 -12498025 -3622358 3533144 5336081 -1154293 -10540937 -9933115 4439316 18426332
33517 18426332 16793901 2970249 -7612534 -8639288 -6386891 -5636215 -4281232 -1714650
33509 -1714650 -1586068 -4337823 -5814269 -5309499 -7018251 -11166992 -11448717 -4889442 2211052
33500 2211052 2612347 -2320967 -5791796 -4953186 -2828079 -2564310 -3449371 -2718095 579418
33491 579418 4308355 5828513 5018544 2818357 -2835445 -14949112 -28889210 -31537701
33483 -31537701 -15761519 7121760 17394940 9477905 -3052151 -6385169 -2804246
33476 -2804246 -3917070 -13107981 -20748918 -15810105 1101010 16636273 16824215 1754538
33468 1754538 -13330871 -14931387 -7066270 -4326921 -11114028 -17149018 -14696216 -8941956
33460 -8941956 -5981194 -1759046 7339267 12145760 2401444 -14484125 -21220341 -15478739
33452 -15478739 -11562997 -15893115 -17199214 -7370683 2983124 508491 -10719641 -17535971
33444 -17535971 -17878476 -18956415 -20804854 -16476824 -6791274 -836723 -1030484 -404665
33436 -404665 3213957 2719511 -4680709 -10875262 -9659062 -6434167 -8304728 -12386456
33428 -12386456 -11262114 -4178040 3798855 9058119 10410781 7393981 2490986 692404
33420 692404 3129891 6126254 8920918 14834956 21825075 21902028 15102932 12511769 17356070
33411 17356070 15665075 -1778382 -19348892 -15143158 7183647 22775493 18558961
33404 18558961 4992216 -3708404 -4174535 1899895 11644683 16447051 8644440 -3866762
33396 -3866762 -4128053 9326796 19289063 15507374 7720082 6805265 8979308 7841649
33388 7841649 7141038 10025583 8568136 -2939910 -14812666 -15362041 -8474866 -4500467
33380 -4500467 -2103374 5710861 13925810 10641977 -2413087 -10085531 -5329065 2588648
33372 2588648 3652390 -268051 -1965013 289672 2489465 549159 -5952728 -12809229
33364 -12809229 -14504640 -10987298 -8038133 -7792388 -4691977 3457276 7397696 -1281417
33356 -1281417 -15104991 -19220701 -11836782 -4531964 -3882498 -5059487 -3939465 -3284161
33348 -3284161 -4487568 -4248322 -2791198 -5264567 -11080681 -11582365 -3200170 5845735
33340 5845735 7351326 3533909 -196002 -5007037 -13846590 -23060855 -26668111 -24605461
33332 -24605461 -19560865 -10044077 4873557 16928232 14847446 -11567 -12648556
33325 -12648556 -11907096 -2376513 4966266 7987327 12633175 19823998 21452701 11928519
33317 11928519 -2090665 -8660306 -4930510 572126 -297986 -6129997 -9771975 -7273907
33309 -7273907 -854290 4289572 4329493 221260 -2326864 978151 6881437 9014037
33301 9014037 8454204 12763042 22030835 24344906 11621363 -6682371 -14264356 -8370806
33293 -8370806 -636708 152387 -3046816 -3864334 -1502909 565794 -649651 -5605560
33285 -5605560 -11070245 -11467525 -5463243 317055 -953836 -6843042 -9755555 -8230020
33277 -8230020 -7010722 -7569637 -6831017 -4794656 -4733991 -5384969 -1999162 3427397 2660732
33268 2660732 -4821478 -7935554 373553 11457556 12005007 1514735 -8261860 -8303978
33260 -8303978 -687169 6640876 8776631 7434389 7515090 9993092 9396130 1503836 -7974663
33251 -7974663 -8533012 820150 9245789 8231593 1229490 -4127765 -6392854 -7820247
33243 -7820247 -7828388 -5719681 -5398206 -9804345 -13259253 -7322449 5846341 13273219 6813785
33234 6813785 -5996763 -10681196 -3281638 5104688 2184747 -10246601 -18533276 -14039910
33226 -14039910 -2840898 3560407 1958392 -2860891 -7462952 -11358945 -11968968 -6904792
33218 -6904792 -967199 -1875981 -7774423 -8007951 1002565 9713710 9535227 4319050 1803354
33209 1803354 1199603 -2961936 -9940362 -13738895 -11881868 -6563289 466050 8162822
33201 8162822 13497257 14001245 11313068 7860892 2855717 -3578128 -5858199 708129
33193 708129 11045698 15001183 10604676 5887358 6608839 8780682 6349750 1111286
33185 1111286 -68136 4059298 6558152 2120767 -4330426 -3559893 4258059 8310562
33177 8310562 2814981 -2911309 2342076 13257390 13878429 707381 -12639815 -16183180
33169 -16183180 -15930299 -19550688 -22473501 -18593128 -14697765 -20639000 -30826986 -29804356
33161 -29804356 -14841708 -218441 2171452 -4348396 -10171137 -11605996 -10219108 -7562974
33153 -7562974 -5471721 -6735055 -11240313 -14547544 -13239753 -9127844 -5997165 -4674045
33145 -4674045 -3530353 -2074376 -1719404 -3262455 -4938319 -3917811 -141888 2576064
33137 2576064 1250266 -1787251 -2867230 -4371948 -11713359 -21835227 -22833910 -9831095
33129 -9831095 5744518 9739367 3146681 -1314368 3035326 10772122 14485677 13131166
33121 13131166 10068012 8795584 11146652 15405707 16561969 11753572 3811249 -3429782
$$ [...]
##END NTUPLES=NMR SPECTRUM
##END=
