##TITLE=31Pdec_RV2403
 CD3CN, 124 sc
 27.3.2020
##JCAMPDX= 6.0         $$ Bruker NMR JCAMP-DX V2.0
##DATA TYPE= NMR SPECTRUM
##DATA CLASS= NTUPLES
##ORIGIN= UXNMR, Bruker Analytische Messtechnik GmbH
##OWNER= root
$$ XWIN-NMR		Version 3.5
$$ Fri Mar 27 13:57:30 2020 Russian Standard Time (UT+4h)  she@DPX200
##.OBSERVE FREQUENCY= 81.013821
##.OBSERVE NUCLEUS= ^31P
##.ACQUISITION MODE= SIMULTANEOUS
##.ACQUISITION SCHEME= undefined
##.AVERAGES= 124
##.DIGITISER RES= 17
##SPECTROMETER/DATA SYSTEM= spect
##.PULSE SEQUENCE= zgpg30
##.SOLVENT NAME= CDCl3
##.SHIFT REFERENCE= (INTERNAL, CDCl3, 0, 182.463)
##AUDIT TRAIL= $$ (NUMBER, WHEN, WHO, WHERE, WHAT)
$$ ##TITLE= Audit trail, XWIN-NMR		Version 3.5
$$ ##JCAMPDX= 5.01
$$ ##ORIGIN= Bruker BioSpin GmbH
$$ ##OWNER= she
$$ F:/spectra/data/she/nmr/P31/1/pdata/1/auditp.txt
$$ ##AUDIT TRAIL=  $$ (NUMBER, WHEN, WHO, WHERE, WHAT)
(   1,<2020-03-27 13:56:28.00 +0400>,<she>,<DPX200>,
      <continue with go, POWCHK disabled, PULCHK disabled
       configuration hash MD5:
       00 E9 B6 7A A2 85 ED C7 34 08 36 98 17 FE 4E 26
       data hash MD5: 32K
       B5 09 15 77 D4 AD AB FF 87 31 62 32 EA CE CB 97>)
(   2,<2020-03-27 13:56:30.18 +0400>,<she>,<DPX200>,
      <Start of raw data processing
       efp BC_mod = 2 LB = 1 FT_mod = 6 PKNL = 1 PHC0 = -1953.001 PHC1 = 621.6019 SI = 64K 
       data hash MD5: 64K
       91 CF BB C7 07 52 A2 A7 8D 32 80 F6 0E 82 75 90>)
(   3,<2020-03-27 13:56:54.32 +0400>,<she>,<DPX200>,
      <pk PHC0 = 73.76434 PHC1 = -55.6 
       data hash MD5: 64K
       A6 F1 81 A9 52 F2 23 62 C4 9D D9 6F 9E CE AB DC>)
(   4,<2020-03-27 13:56:58.12 +0400>,<she>,<DPX200>,
      <abs ABSG = 5 
       data hash MD5: 64K
       5E 8C AF B5 6B 62 BB 5A 83 29 7B F0 94 58 9C 2A>)
$$ ##END=
$$ 
$$ hash MD5
$$ 42 67 63 8D 61 87 D5 D0 C3 67 A4 B8 ED 47 4D D8
##$RELAX= 
##$RELAX= 
##$RELAX= 
##$RELAX= 
##$RELAX= 
##$RELAX= 
##$RELAX= 
##$RELAX= 
$$ Bruker specific parameters
$$ --------------------------
##$DU= <F:/spectra>
##$EXPNO= 1
##$NAME= <P31>
##$PROCNO= 1
##$TYPE= <nmr>
##$USER= <she>
##$AMP= (0..31)
100 100 100 100 100 100 100 100 100 100 100 100 100 100 100 100 100 100 
100 100 100 100 100 100 100 100 100 100 100 100 100 100 
##$AQSEQ= 0
##$AQ_mod= 1
##$AUNM= <au_zg>
##$AUTOPOS= <>
##$BF1= 81.014009
##$BF2= 200.13
##$BF3= 200.13
##$BF4= 200.13
##$BF5= 200.13
##$BF6= 200.13
##$BF7= 200.13
##$BF8= 200.13
##$BYTORDA= 1
##$CFDGTYP= 0
##$CFRGTYP= 5
##$CHEMSTR= <none>
##$CNST= (0..31)
1 1 145 1 1 1 1 1 1 1 1 1 1 1 1 1 1 1 1 1 1 1 1 1 1 1 1 1 1 1 1 1 
##$CPDPRG= <waltz16>
##$CPDPRG1= <>
##$CPDPRG2= <waltz16>
##$CPDPRG3= <>
##$CPDPRG4= <mlev>
##$CPDPRG5= <mlev>
##$CPDPRG6= <mlev>
##$CPDPRG7= <mlev>
##$CPDPRG8= <mlev>
##$CPDPRGB= <>
##$CPDPRGT= <>
##$D= (0..31)
0 1 0 0 0 0 0 0 0 0 0 0.03 2e-05 3e-06 0 0 0 0 0 0 0 0 0 0 0 0 0 0 0 0 
0 0 
##$DATE= 1585302790
##$DBL= (0..7)
120 120 120 11 120 120 24 19 
##$DBP= (0..7)
150 150 150 150 150 150 150 150 
##$DBP07= 0
##$DBPNAM0= <>
##$DBPNAM1= <>
##$DBPNAM2= <>
$$ [...]
##$SUBNAM3= <"">
##$SUBNAM4= <"">
##$SUBNAM5= <"">
##$SUBNAM6= <"">
##$SUBNAM7= <"">
##$SUBNAM8= <"">
##$SUBNAM9= <"">
##$SW= 369.568048894756
##$SWIBOX= (0..15)
0 1 3 0 0 0 0 0 0 0 0 0 0 0 0 0 
##$SW_h= 29940.119760479
##$TD= 32768
##$TD0= 1
##$TE= 0
##$TE2= 300
##$TE3= 300
##$TEG= 300
##$TL= (0..7)
0 120 53 12 22 120 120 120 
##$TP= (0..7)
150 150 150 150 150 150 150 150 
##$TP07= 0
##$TPNAME0= <>
##$TPNAME1= <>
##$TPNAME2= <>
##$TPNAME3= <>
##$TPNAME4= <>
##$TPNAME5= <>
##$TPNAME6= <>
##$TPNAME7= <>
##$TPOAL= (0..7)
0.5 0.5 0.5 0.5 0.5 0.5 0.5 0.5 
##$TPOFFS= (0..7)
0 0 0 0 0 0 0 0 
##$TUNHIN= 0
##$TUNHOUT= 0
##$TUNXOUT= 0
##$USERA1= <user>
##$USERA2= <user>
##$USERA3= <user>
##$USERA4= <user>
##$USERA5= <user>
##$V9= 5
##$VALIST= <valist>
##$VCLIST= <CCCCCCCCCCCCCCC>
##$VD= 0
##$VDLIST= <DDDDDDDDDDDDDDD>
##$VPLIST= <PPPPPPPPPPPPPPP>
##$VTLIST= <TTTTTTTTTTTTTTT>
##$WBST= 1024
##$WBSW= 4
##$XGAIN= (0..3)
0 0 0 0 
##$XL= 0
##$YL= 0
##$YMAX_a= 8986
##$YMIN_a= -55392
##$ZGOPTNS= <>
##$ZL1= 120
##$ZL2= 120
##$ZL3= 120
##$ZL4= 120
##$ABSF1= 182.463
##$ABSF2= -187.1042
##$ABSG= 5
##$ABSL= 3
##$ALPHA= 0
##$AQORDER= 0
##$ASSFAC= 0
##$ASSFACI= 0
##$ASSFACX= 0
##$ASSWID= 0
##$AUNMP= <proc_1d>
##$AZFE= 0.1
##$AZFW= 0.5
##$BCFW= 0
##$BC_mod= 2
##$BYTORDP= 0
##$COROFFS= 0
##$CY= -3
##$DATMOD= 1
##$DC= 0
##$DFILT= <>
##$DTYPP= 0
##$F1P= 0
##$F2P= 0
##$FCOR= 1
##$FTSIZE= 65536
##$FT_mod= 6
##$GAMMA= 0
##$GB= 0
##$INTBC= 1
##$INTSCL= 5.30512e-09
##$ISEN= 30
##$LB= 1
##$LEV0= 0
##$LPBIN= 0
##$MAXI= 10000
##$MC2= 0
##$MEAN= 0
##$ME_mod= 0
##$MI= 50
##$NCOEF= 0
##$NC_proc= -8
##$NLEV= 6
##$NOISF1= 182.463
##$NOISF2= 159.3651
##$NSP= 0
##$NTH_PI= 0
##$NZP= 0
##$OFFSET= 182.463
##$PC= 4
##$PHC0= -1879.237
##$PHC1= 566.002
##$PH_mod= 1
##$PKNL= yes
##$PPARMOD= 0
##$PSCAL= 0
##$PSIGN= 0
##$REVERSE= no
##$SF= 81.0140089999434
##$SI= 65536
##$SIGF1= 159.3651
##$SIGF2= -187.1042
##$SINO= 113.3802
##$SIOLD= 16384
##$SREGLST= <1H.CDCl3>
##$SSB= 0
##$STSI= 65536
##$STSR= 0
##$SW_p= 29940.119760479
##$SYMM= 0
##$S_DEV= 0
##$TDeff= 32768
##$TDoff= 0
##$TI= <>
##$TILT= no
##$TM1= 0
##$TM2= 0
##$TOPLEV= 0
##$USERP1= <user>
##$USERP2= <user>
##$USERP3= <user>
##$USERP4= <user>
##$USERP5= <user>
##$WDW= 1
##$XDIM= 65536
##$YMAX_p= 395395814
##$YMIN_p= -215187402
$$ End of Bruker specific parameters
$$ ---------------------------------
##NTUPLES= NMR SPECTRUM
##VAR_NAME=  FREQUENCY,     SPECTRUM/REAL,   SPECTRUM/IMAG
##SYMBOL=    X,             R,               I
##VAR_TYPE=  INDEPENDENT,   DEPENDENT,       DEPENDENT
##VAR_FORM=  AFFN,          ASDF,            ASDF
##VAR_DIM=   65536,         65536,           65536
##UNITS=     HZ,            ARBITRARY UNITS, ARBITRARY UNITS
##FACTOR=    0.456856943014862, 1,           1
##FIRST=     14782.0589164792, 0,            0
##LAST=      -15158.0608439998, 0,           0
##MIN=       -15158.0608439998, -215187402,  0
##MAX=       14782.0589164792, 395395814,    0
$$ Real data points
##PAGE= N=1
##DATA TABLE= (X++(R..R)), XYDATA
$$ [...]
39638g005440J2719688K5577939K2543087J1980544M933802J434759m122332j2716280
39630E5345767j9387510j7712670o069254P093646R178377k630n363227J755490
39622B4837989R092525K791223r553647j2103240p511380q966844j2307859k012741
39614a5733974J6658443J9847205L703466p487983r80797M822341m715608j3053089
39606C060004j923914J4381482J1805340k182978j008669J5186427J8181427k683731
39598E4815388k2807703j9302389k259197M781388j196278m956821k0205L749713
39590A2803896j320863q045507n590525L659689O386965k710609j1546749n839782
39582a2203485J0398640J8693074J0480991k753713p545822n979648p238460j0553351
$$ plain form
39638 -7005440 5714248 31292187 53835274 65815818 70749620 72184379 68062047 55345767
39630 55345767 35958257 18245587 12176333 19269979 28448356 28445726 23082499 24837989
39622 24837989 33930514 36721737 27168090 15064850 7553470 -1413374 -13721233 -15733974
39614 -15733974 924469 20771674 24475140 16987157 16006360 20828701 16113093 3060004
39606 3060004 1136090 15517572 27322912 25139934 24131265 39317692 57499119 54815388
39598 54815388 32007685 12705296 10446099 15227487 14031209 9074388 9054183 12803896
39590 12803896 11483033 3437526 -2152999 1506690 7893655 5183046 -6363703 -12203485
39582 -12203485 -1804845 16888229 27369220 24615507 17069685 11090037 3851577 -6701774
39574f701774p862849J302466Q666467Q933045L708231m010446j0544261r392961
39566a5902082J801232J3591344J3756574L350231n469393o610596m977996m846560
39558e307246m651211m498934p314546r706842l009148J2141769K2721364K0250731
39550B0625937J1128082M026470k837936j3025371j9147022j0915934P512335
39543b633439J9231036J4064501j072002j2157281j2711083o933815k202026j172721
39535e586830j238006o68511k148112p153617j0096852m897916L973514O057726
39527b1758604J243973P19671P991157J1073109J544995r679425p478804M547392
39519a1796536J0161856N021468N15205L880314Q298000N425454l115685j0305247
$$ plain form
39574 -6701774 -14564623 -13262157 -4595690 4337355 8045586 4035140 -6509121 -15902082
39566 -15902082 -14100850 -509506 13247068 16597299 11127906 4517310 -460686 -5307246
39558 -5307246 -9958457 -14457391 -21771937 -31478779 -34487927 -22346158 375206 20625937
39550 20625937 31754019 35780489 32942553 19917182 770160 -10145774 -2633439
39543 -2633439 16597597 30662098 29590096 17432815 4721732 -2212083 -4414109 -5586830
39535 -5586830 -6824836 -7493347 -9641459 -16795076 -26891928 -31789844 -27816330 -21758604
39527 -21758604 -20514631 -19794960 -11803803 -730694 814301 -8865124 -16343928 -11796536
39519 -11796536 -1634680 3386788 3901993 7782307 16080307 21505761 18390076 8084829
39511H084829j1673532o421659K260043P122592M243419l02739N75431K178493
39503F066877l699606j0427463l908361J0599640J0398696q350166j8850956l376184
39495b1547523J6073477R689541j3124363j7520760L392881K0190890J3582625
39488A0736768q92649l573765P58752j229j584307M176259R357115L060575o676287
39479A5361232m926890L576699J142859j3012178k0539790j2512318q87772K925538
39471b8872620L697092Q970752J4208055J1502882L633523p28773j73630j87763
39463A2049518k699788l155527K183745R735334J0445212n01262j4445017j4643113
39455a030898K758604J8369527J1597770r828708j7912033l482766J0785583M207011
$$ plain form
39511 8084829 -3588703 -10010362 -7750319 -627727 3615692 3312953 3888384 6066877
39503 6066877 2367271 -8060192 -11968553 -1368913 9029783 679617 -18171339 -21547523
39495 -21547523 -5474046 4215495 -8908868 -26429628 -23036747 -2845857 10736768
39488 10736768 9844119 6270354 7029106 7027877 5443570 9619829 18976944 22037519 15361232
39479 15361232 10434342 14011041 15153900 2141722 -18398068 -30910386 -31798158 -28872620
39471 -28872620 -25175528 -16204776 -1996721 9506161 13139684 12410911 12237281 12049518
39463 12049518 9349730 6194203 8377948 18113282 28558494 28057232 13612215 -1030898
39455 -1030898 1727706 20097233 31695003 21866295 3954262 471496 11257079 15464090
39447A5464090j2710308j7197132q465926l692759p258095n272993Q950912K2475279
39439g706932K1111701O949520q416422j7837398j9762725j3903105k580759Q489693
39431c3656427J5299397J7555646J3947118J983147j4159032k2437544j5272300
39424c6739995O68866J1407735R885848Q73777n119861j135690R353616J4060537
39416C254833N268539q345154j0604854N81256J0403297R018547M088305M220992
39408A7885761K940334p523215j6760697q928984R568288J5453306L045029o714488
39400H965334J378811J3918814J0921406l745654j0597499m676349L12081m490216
39392A1986728j1442652j0235164j373164P120671P837159k272967j7657488k3683588
$$ plain form
39447 15464090 2753782 -14443350 -22909276 -26602035 -33860130 -39133123 -30182211 -7706932
39439 -7706932 13404769 20354289 11937867 -5899531 -25662256 -39565361 -42146120 -33656427
39431 -33656427 -18357030 -801384 13145734 15128881 969849 -21467695 -36739995
39424 -36739995 -36071129 -24663394 -14777546 -13903769 -19023630 -20159320 -10805704 3254833
39416 3254833 8523372 178218 -10426636 -9845380 557917 9576464 13664769 17885761
39408 17885761 20826095 13302880 -3457817 -12386801 -2818513 12634793 15679822 8965334
39400 8965334 10344145 24262959 35184365 31438711 20841212 16164863 16476944 11986728
39392 11986728 544076 -9691088 -11064252 -3943581 3893578 1620611 -16036877 -39720465
39384c9720465j0780610J0029013J7274213O766556l893303k458637J883209j603295
39376b2503319n046352L003406J4345304J2615593J634592N93671J1529845J4101173
39368C0273913r41406j3939024n360204J2825723J3085564p807742k3857434j5362687
39360a1083297O489178J6773172P765280o587931j1851219q122317k871032K040736
39352g447430R178650J5540571J3234385J667712r185559j2074161j1769046j4716420
39344a5571298j6461762r079311L718023J0560973R227247P173170O125821J60408
39336d146729q915594r416652J063438Q491618L327658m042807m19679Q469814
39328e588933Q027428n31076k149521P299006J4188560Q424236j091743O00612
$$ plain form
39384 -39720465 -50501075 -40472062 -23197849 -16431293 -20324596 -22783233 -20900024 -22503319
39376 -22503319 -27549671 -24546265 -10200961 2414632 4049224 4642895 16172740 30273913
39368 30273913 29332507 15393483 10033279 22859002 35944566 28136824 4279390 -11083297
39360 -11083297 -4594119 12179053 19944333 13356402 1505183 -6617134 -9488166 -7447430
39352 -7447430 1731220 17271791 30506176 32173888 22988329 10914168 -854878 -15571298
39344 -15571298 -32033060 -41112371 -37394348 -26833375 -17606128 -10432958 -4307137 -4146729
39336 -4146729 -13062323 -22478975 -21415537 -12923919 -9596261 -13639068 -14058747 -5588933
39328 -5588933 2438495 1907419 -242102 7056904 21245464 29669700 28577957 29178569
39320B9178569J3137883K0197122R368262j1984633k3592792j5155941J280388
39313B2428858O179032l264798j2100638r984644k884338O26759J681886K413683
39305E095800k251868j2750491j5885243k399622J4304574J3490677l228596j4273033
39297a7897802q673428K427418O416214N313793N848015O495498K666748k922325
39289c25869k809389M835279J2337058R292829n474486j8917014j6855045l728356
39281b1644993J284416p084278j0370508L212135J5335849M947665j4515156j2904367
39273d1739237Q627470J8603891M572318j0278876o830672L811283O048972M152605
39265a3032246M943963P02817j1965980j7701749o896244M789131K586931o49638
$$ plain form
39320 29178569 42316452 62513574 71881836 59897203 36304411 21148470 22428858
39313 22428858 28607890 25343092 13242454 3257810 373472 1000231 2682117 5095800
39305 5095800 2843932 -9906559 -25791802 -28191424 -13886850 -396173 -3624769 -17897802
39297 -17897802 -26571230 -24143812 -17727598 -12413805 -6565790 -70292 2596456 -325869
39289 -325869 -3135258 1700021 14037079 23329908 17855422 -1061592 -17916637 -21644993
39281 -21644993 -20360577 -27444855 -37815363 -34603228 -19267379 -14319714 -28834870 -41739237
39273 -41739237 -33111767 -14507876 -9935558 -20214434 -27045106 -23233823 -17184851 -13032246
39265 -13032246 -8088283 -7385466 -19351446 -37053195 -43949439 -39160308 -36573377 -37223015
39257c7223015J1457232K5000306J5697584q414501j5834033P68683J5870523
39250G322779J1486782j270725o769043o829086q584002r338845m665956J386423
39242a7261673L390573K646489K270028K198299K487033L674811K464983m293415
39234b422872j1144020r362876o32078N209787N628651O830889R877465Q310980
39226A2295926Q01854o531807j1549274j6624909j7094627m811705J3873110K0214765
39218i426667Q734644m812566p534856n220860n598210k747649Q846935J8767533
39210A008304J4571061J467247o280013n559372k477973J702939P867283R059677
39202B1359153o31400j1671100j0046684n118J304905q538825j3130611l982626
$$ plain form
39257 -37223015 -25765783 -765477 14932107 6517606 -9316427 -8547744 7322779
39250 7322779 18809561 17538836 10769793 3940707 -4643295 -13982140 -18648096 -17261673
39242 -17261673 -13871100 -11224611 -8954583 -6756284 -4269251 -594440 1870543 -2422872
39234 -2422872 -13566892 -22929768 -23561846 -18352059 -12723408 -5892519 3984946 12295926
39226 12295926 13097780 6565973 -4983301 -21608210 -38702837 -43514542 -29641432 -9426667
39218 -9426667 -692023 -5504589 -13039445 -18260305 -23858515 -26606164 -17759229 1008304
39210 1008304 15579365 17046612 10766599 5207227 2729254 4432193 12299476 21359153
39202 21359153 20727753 9056653 -990031 -995149 309756 -8229069 -21359680 -25342306
39194b5342306O548552O525700K600269N702113J1503279R562696L365393M878712
39186B5344408J2493275J1012718m099392j6979377j2642161K603038J1028638
39179B8761147O913380N9629p77766K177577K714372q26591o444826j1872760
39171B0704162j4388106j1847388o274369k612691k358852k479799j538958j448861
39163b2244862j528218K532643J0223638J3172223N968627m804993q250661k548522
39155g480125M597242O257259K354550k443490l313313K73822K976148j21606
39147C100487n328578m743373P47184K391716l42500K864197J3955431J8475028
39139C1119592O890622q949435j3766043j1392242j3479328j6313474q459674
$$ plain form
39194 -25342306 -18793754 -12268054 -9667785 -3965672 7537607 17100303 20465696 25344408
39186 25344408 37837683 48850401 44751009 27771632 15129471 17732509 28761147
39179 28761147 35674527 35734156 34956390 37133967 39848339 39021748 32576922 20704162
39171 20704162 6316056 -5531332 -11805701 -14418392 -16777244 -19257043 -20796001 -22244862
39163 -22244862 -23773080 -21240437 -11016799 2155424 8124051 3319058 -4931603 -7480125
39155 -7480125 -2882883 3374376 5728926 3285436 -27877 245945 3222093 3100487
39147 3100487 -2228091 -6971464 -6224280 -3832564 -4175064 -1310867 12644564 31119592
39139 31119592 38010214 29060779 15294736 3902494 -9576834 -25890308 -34349982
39132c4349982N399711R294769J705865l455242m55965K789551K459496K900909
39124a3710888K708297l675424r440515j151687J6358391K1959676R404316m455066
39116A7997100p662831p372441r466786p160377N85806K120546m025102k068384
39108a7052469J2032266J7926269L693623j1512339p619335M548761M381568m275739
39100B122605n193745l97512k015272n971439j051197N550043q07351j3021924
39092b0785792j1332551L435459J2121520Q859730M559286K421778l171726o177341
39084a0069637M104644J6600066R515649j0529255j2993734P000430J7669593
39077B1297756J591188j5450039o645303J3164431J3060828n875444j6214704
$$ plain form
39132 -34349982 -28950271 -19655502 -17949637 -21404879 -21860844 -19071293 -16611797 -13710888
39124 -13710888 -11002591 -14678015 -24118530 -25270217 -8911826 13047850 22452166 17997100
39116 17997100 10334269 2961828 -6504958 -13665335 -13079529 -10958983 -14984085 -17052469
39108 -17052469 -5020203 12906066 16599689 5087350 -2531985 2016776 6398344 2122605
39100 2122605 -3071140 -3468652 -5483924 -11455363 -12506560 -6956517 -7763868 -20785792
39092 -20785792 -32118343 -28682884 -16561364 -7701634 -3142348 -720570 -3892296 -10069637
39084 -10069637 -5964993 10635073 20150722 9621467 -3372267 3628163 21297756
39077 21297756 22888944 7438905 793602 13958033 27018861 21143417 4928713
39070D928713o686388O906839R110708K011337n129039q092369p610191o051126
39062a0611516m819109j394773P099965J5327502J3280722K175036l821402K522334
39054A9758759J1082440J0835006M896826N21651l876565j0897859j4195797q478149
39046I646312n48071J459449J520902O482335J1477261P469426l093558j0423009
39038B3991047j1420870q530058j553292P596720R632502P73300o417943J15193
39030A4186599J1103402Q810525m756357j1389273n591009J29166q84314q23687
39022A0785052L525691L080301m747738p680038O56676P401338O47998j0283998
39014C385282r779231r27405J716414j750007K664541J5460080J6627466m852030
$$ plain form
39070 4928713 -1757675 5149164 14259872 16271209 11142170 3049801 -4560390 -10611516
39062 -10611516 -15430625 -16825398 -9725433 5602069 18882791 21057827 17236425 19758759
39054 19758759 30841199 41676205 46573031 47094682 43218117 32320258 18124461 9646312
39046 9646312 9098241 10557690 12078592 18560927 30038188 37507614 34414056 23991047
39038 23991047 12570177 4040119 2486827 10083547 19716049 20489349 14071406 14186599
39030 14186599 25290001 34100526 29344169 17954896 12363887 12493053 11608739 10785052
39022 10785052 14310743 17391044 12643306 4963268 5619944 13021282 13669280 3385282
39014 3385282 -6393949 -7321354 -5604940 -7354947 -4690406 10769674 27397140 22545110
39006B2545110k8638166k5188416M960841K9432368K3672170n98927j3977502
38999A2207478o394669O738559J0381131O426116K577674n24940l504764j355526
38991B6551059O717909R091158l445875j9509561j8286693J571708J8061282J4204295
38983C4955282j538860r567447m765481J078587j826586q929289r017929P89425
38975A177702J1029216J0573337o16652j1556853j2878214o083301J214691N155970
38967a984104P066719Q280495Q487251P869210O767740M175984m05755n335442
38959C4922098r635684j4396202j8336089j6365473p288050J514980L146851R87290
38951b5450279K634157P714034R456485N617071p1861m953591q097376o561645
$$ plain form
39006 22545110 -6093056 -31281472 -26320631 3111737 26783907 26184980 12207478
38999 12207478 5812809 12551368 22932499 29358615 31936289 31411349 27906585 26551059
38991 26551059 33268968 42360126 38914251 19404690 1117997 2689705 20750987 34955282
38983 34955282 33416422 23848975 19083494 20162081 18335495 9406206 388277 1177702
38975 1177702 12206918 22780255 22163603 10606750 -2271464 -8354765 -7140074 -1984104
38967 -1984104 5082615 13363110 21850361 29719571 36487311 40663295 40257540 34922098
38959 34922098 25286414 10890212 -7445877 -23811350 -31099400 -29584420 -26437569 -25450279
38951 -25450279 -22816122 -15102088 -5645603 -28532 -100393 -5053984 -13151360 -19713005
38943a9713005O24809P421028Q208288O574330P207084M659588o570907j6233481
38935g822266j0407556L361648M351840o964395p623047Q000849J4241217m421878
38927g283588k3259433j2932996J3801206K1071526M492537o340145K194856Q972483
38919G16446k653878j6378442j0161396R161967J8016852R949264j118324m027819
38911C504670l56118N002040R280550R166530L547351j927821j532801J395392
38903B8079793J79800l627589m054961l021927p154101j3400576j0782354J554154
38895a2227761J0527444P676850R6285k953166l155428m674388k933260O643527
38887i99897J5830677J2554651p73623j0095497r225932m651781j424089K792409
$$ plain form
38943 -19713005 -19088196 -11667168 -3458880 3115450 10322534 14982122 8411215 -7822266
38935 -7822266 -18229822 -14868174 -10516334 -17480729 -25103776 -17102927 -2861710 -7283588
38927 -7283588 -30543021 -43476017 -29674811 -8603285 -4110748 -10450893 -8256037 716446
38919 716446 -1937432 -18315874 -28477270 -19315303 -1298451 8650813 7532489 3504670
38911 3504670 3148552 8150592 17431142 26597672 30145023 28217202 26684401 28079793
38903 28079793 28259593 24632004 20577043 17555116 10401015 -2999561 -13781915 -12227761
38895 -12227761 -1700317 5976533 6072818 3119652 -35776 -4710164 -7643424 -999897
38887 -999897 14830780 27385431 26611808 16516311 7290379 2638598 1214509 4006918
38879D006918P436224N685245l274120r403242n862552J326406M624212O600201
38871A1139292J1243810J2467697L396833q786560j0976246m406862k573555q704421
38863B799988j0248108l62871R084379N347641m607262l761737R682669J9569313
38855B7504012J4365666J181932o631736o976018p020912r128517q038221j737081
38847C519125L506795K518969q79737q33477Q24112o82203k321520K616208J0536558
38838A8804830R628586j187184p733110j548097O482609L601461m509389m921139
38830A8618567m95748l826031j2432100j0558680K987455R865684J899797m223412
38822A835532N723501J8639472J3992460l320460j0407112j158171O983509J381395
$$ plain form
38879 4006918 11443142 17128387 13854267 4451025 -1411527 -85121 4539091 11139292
38871 11139292 22383102 34850799 38247632 29461072 18484826 14077964 11504409 2799988
38863 2799988 -7448120 -7810991 1273388 6621029 2013767 -1747970 7934699 27504012
38855 27504012 41869678 43051610 36419874 29443856 22422944 13294427 5256206 3519125
38847 3519125 7025920 9544889 8665152 7831675 8655787 7973584 5652064 8268272 18804830
38838 18804830 28433416 27246232 19513122 17965025 24447634 28049095 23539706 18618567
38830 18618567 18122819 14296788 1864688 -8693992 -5706537 4159147 6058944 1835532
38822 1835532 7559033 26198505 40190965 36870505 26463393 25305222 32288731 33670126
38814C3670126r451457j3017882j0702531r795386r155944l455883N050229R238556
38806g620172Q295544P236193O567477J095198r200833j4353698n841288J0006575
38798c815004J6116832M074227j4298120j9113271n487291J0634017J1773651
38791a14959q09902j0992874q569369R70141P073565O751027L446125l97775m057077
38782f701098n292313k384174J709845K368735K80856N62285M317735O054785
38774I16656J586141n769397r934422r568783p271753m375092q98986J833626
38766c3482010L579619P710446J4880347J6434253L695946j5675293k2132587
38759b4989279r694623M530642M720051q25030N250621J9529321K1473566N517601
$$ plain form
38814 33670126 24218669 11200787 498256 -9297130 -18453074 -21908957 -16858728 -7620172
38806 -7620172 675372 7911565 14479042 15574240 6373407 -7980291 -13821579 -3815004
38798 -3815004 12301828 16376055 2077935 -17035336 -22522627 -11888610 -114959
38791 -114959 -924861 -11917735 -20487104 -19516963 -12443398 -5692371 -2246246 -2644021 -6701098
38782 -6701098 -11993411 -14377585 -12667740 -10299005 -10018149 -9455864 -5138129 916656
38774 916656 2502797 -3266600 -13201022 -22769805 -30041558 -34416650 -35315636 -33482010
38766 -33482010 -29902391 -22191945 -7311598 9122655 12818601 -2856692 -24989279
38759 -24989279 -34683902 -30153260 -25433209 -26258239 -21007618 -1478297 19995269 25512870
38751B5512870r527092q028039K120952N436381J316425q75760J265040L765619
38743B0986396O210920Q620112M710321q416696j9053012j4467568k697562l653249
38735g760338j7845712k2569431n517258J5158044J6225868J556656o576671l84765
38727b7713607O634628M080884p62456K764271J2061770J6394457J1444066J896451
38719B6800464n979005q561873n136300Q38477L394806J426621J029308N555501
38711A9367999P946736Q17499r586696j0490285k551944N04653n398447p576730
38703f967215L76950M506708o082669j5505103k596445K1342993K3042817k940664
38695A5177372k2463777j0569249J2735750J4211725m034709j2275948P87591
$$ plain form
38751 25512870 15985778 7957739 10078691 15515072 16831497 15955737 17220777 20986396
38743 20986396 27197316 35817428 40527749 32111053 13058041 -1409527 -4107089 -7760338
38735 -7760338 -25606050 -48175481 -53692739 -38534695 -22308827 -20752171 -27328842 -27713607
38727 -27713607 -21078979 -16998095 -17760551 -14996280 -2934510 13459947 24904013 26800464
38719 26800464 20821459 12259586 7123286 7961763 11356569 12783190 13812498 19367999
38711 19367999 27314735 28132234 18545538 8055253 5503309 6007962 609515 -6967215
38703 -6967215 -6590265 -2083557 -8166226 -23671329 -26267774 -4924781 18118036 15177372
38695 15177372 -7286405 -17855654 -5119904 9091821 5057112 -7218836 -6431245
38688f431245J5584969J3699039q1103j1140661j2903330o730646K000936M047295
38680a954746m875710j3446055o801616R216295J2962953K65685p017958M630745
38672g020407J7366388R815636q178101j0686566L697809J0938949J81668j0189285
38664E926091k264315J3800346J4635685l746294k1600869k1609320q993388j827414
38656b5679478o478333j0115096k12796J5242003J7146028L542681n563300K589819
38648i528472J3792475Q950263n536793p693981N397641J3433011M109911j0811184
38640A2112871j5854874j1238753m233267L690143J0944604R848224j487743j0768129
38632f986924o773920M308626Q694140M435489J16261Q4008K238727N674054R509359
$$ plain form
38688 -6431245 9153724 22852763 22771660 11630999 -1272331 -8002977 -6002041 -1954746
38680 -1954746 -6830456 -20276511 -27078127 -17861832 -4898879 -4633194 -11651152 -7020407
38672 -7020407 10345981 20161617 11983516 1296950 4994759 15933708 16115376 5926091
38664 5926091 3661776 17462122 32097807 28351513 6750644 -14858676 -23852064 -25679478
38656 -25679478 -32157811 -42272907 -42485703 -27243700 -10097672 -6554991 -12118291 -9528472
38648 -9528472 4264003 13214266 7677473 -16508 5381133 18814144 22924055 12112871
38640 12112871 -3742003 -14980756 -19214023 -15523880 -4579276 5268948 3781205 -6986924
38632 -6986924 -13760844 -9452218 -758078 3677411 3793672 3877680 6116407 11790461 21299820
38623B1299820Q458529L44681o444042m045459J435798k875m198000L5735R793154
38614B6677341J1760208N454169L382295O544083Q42932j6102103k5620767j6339740
38606c401582l125203l393014j0553072q209200K074434O679584M756984O693926
38598h477143J2256705J0157849j109823r735456r422768o292755m922042k069111
38590a9614544K733159L999553J314260R33022L197371J445631l173140o54968
38582i819656Q576557R358342l888571j3758726m255551J3689298J7432072N171506
38574B2505271m393867j291245M409541J669722o150554r470290n181274L387650
38566E484954J0998792J1640425K898403p614283p951617K335044R858423N668352
$$ plain form
38623 21299820 29758349 30103030 23658988 19613529 21049327 21046452 16848452 16884187 26677341
38614 26677341 38437549 43891718 47274013 53818096 54661028 38558925 12938158 -3401582
38606 -3401582 -6526785 -9919799 -20472871 -28682071 -26607637 -19928053 -15171069 -8477143
38598 -8477143 3779562 13937411 12827588 3092132 -6330636 -12623391 -17545433 -19614544
38590 -19614544 -16881385 -12881832 -11567572 -10634550 -7437179 -5991548 -9164688 -9819656
38582 -9819656 -1243099 8115243 4226672 -9532054 -13787605 -98307 17333765 22505271
38574 22505271 18111404 16820159 21229700 22899422 16748868 7278578 2097304 5484954
38566 5484954 16483746 28124171 31022574 23408291 15456674 17791718 27650141 33318493
38558C3318493k036104n52702Q649176J3580083J0369162O926596P335378L917244
38550H1507326q994210k1215983j6620449M596260K2656958K0456396L204513
38543H5590811r197132o149479L506104N238393l549641j3337474j6154740j3301868
38535C2644974q969972k324618Q721635J8498509J6237167M16590j5927916j9720314
38527B9576055j2985968o551865l114930K845917J0177240R733321R27802l996441
38519B6611131J160243O275696K720264j411467L148548P878136L30717j1802190
38511C4911078j0944966P87585M508578l572264o537066K866038R334308J683537
38503C3036828q225539o066778K543026M826348K197542L304347O163812K512066
$$ plain form
38558 33318493 31282389 30729687 39378863 52958946 63328108 70254704 77590082 81507326
38550 81507326 72513116 51297133 34676684 39272944 61929902 82386298 85590811
38543 85590811 76393679 70244200 73750304 78988697 75439056 62101582 45946842 32644974
38535 32644974 23675002 21350384 30072019 48570528 64807695 65224285 49296369 29576055
38527 29576055 16590087 10038222 6923292 9769209 19946449 29679770 30607572 26611131
38519 26611131 27771374 34047070 36767334 35355867 38504415 46382551 46713268 34911078
38511 34911078 23966112 24753697 29262275 25690011 19152945 22018983 31353291 33036828
38503 33036828 24811289 18744511 21287537 26113885 28311427 31615774 37779586 40291652
38495D0291652o962708j4296362j5150440q612711N560200K0078397K0720108
38488D1628136N028740r602424q257327J677487N434043L360548L036717R70985
38480D3276905q837866j7554980j3182085k525436r48287o243895m286211M117552
38472f184303N143537j781870l250201K752941M089166j442394k479227K537420
38464f14931J700305o113610o677239L472398R204983L037057l021906p51783
38456B35274J435520j034419J399515J0081088R151632n558962j2121781L117605
38448F705472J8321972P976312j5228045j8626254O32519J3146660K191274j4892697
38440B27213j4612141K277596J5494296J0109633q101133j8663448r026084Q112530
$$ plain form
38495 40291652 33328944 19032582 3882142 -4730569 829631 20908028 41628136
38488 41628136 46656876 37054452 28797125 30474612 35908655 39269203 42305920 43276905
38480 43276905 34439039 16884059 3701974 1176538 228251 -6015644 -10301855 -6184303
38472 -6184303 -1040766 -2822636 -6072837 -3319896 769270 -673124 -3152351 -614931
38464 -614931 1085374 -5028236 -11705475 -8233077 971906 4008963 987057 235274
38456 235274 1670794 636375 2035890 12116978 21268610 15709648 3587867 6705472
38448 6705472 25027444 33003756 17775711 -850543 -218024 12928636 15119910 227213
38440 227213 -14384928 -12107332 3386964 13496597 5395464 -13267984 -22294068 -14181538
38432a4181538Q725439r046374k0133329q593444R394511J2316702N701415P969468
38424g847150J7669863J8320609P703386j021830k924451m249156m885934P95828
38416B3561165P263608K998256p685741q421262K244240P559209o87807j0930732
38408A5900936j1983914p530095n043017m917901n666794p090602m838815N555177
38400b5615025J6976725J6355662L987708o257537p351853n097517k488531N135491
38392d354877J5581020J6950743N331132q355432j3946767j1695298m055834P061128
38384B515815J2689818M116307q651520n324549J2116492J7029226k084416k1673114
38376A0734059j7919831j320327K960296o439517j0668824l140809M013728K615376
$$ plain form
38432 -14181538 -5456099 -14502473 -34635802 -43229246 -33834735 -21518033 -15816618 -7847150
38424 -7847150 9822713 28143322 35846708 34824878 31900427 27651271 22765337 23561165
38416 23561165 30824773 33823029 26137288 17716026 19960266 27519475 26831668 15900936
38408 15900936 3917022 -3613073 -8656090 -13573991 -19240785 -26331387 -31170202 -25615025
38400 -25615025 -8638300 7717362 11705070 5447533 -1904320 -7001837 -9490368 -4354877
38392 -4354877 11226143 28176886 33508018 25152586 11205819 -489479 -4545313 2515815
38384 2515815 15205633 19321940 10670420 5345871 17462363 34491589 32407173 10734059
38376 10734059 -7185772 -8506099 -5545803 -11985320 -22654144 -25794953 -21781225 -19165849
38368a9165849j617200k337949j009836N2945K346683O249257P962435L248835
38360d270679p724342j7648891j4920521L959979K4566277K7164488J1266417
38353B2392728l892302n984174k341893j649331m81955K843032q40796j3160442
38345c115133j7386026k969972J3773640J3096052L159338N205159J6795198J5747385
38337D4305641k348551j6107739j0981969J659952M604163k898912j0530792j2357717
38329d655924r773360o622700n489219m399156J579844J0600030J1983063K258086
38321d519336n229844O70258R380266N148499n053548k245942J0679942J1680819
38313B0511114k973395j1052318r66832R920996N384837m664217m980724o55611
$$ plain form
38368 -19165849 -20783049 -23120998 -24130834 -24077889 -21731206 -15481949 -7519514 -4270679
38360 -4270679 -11995021 -29643912 -44564433 -40604454 -16038177 11126311 22392728
38353 22392728 18500426 12516252 10174359 8525028 8043073 10886105 10045309 -3115133
38345 -3115133 -20501159 -23471131 -9697491 3398561 6557899 11763058 28558256 44305641
38337 44305641 41957090 25849351 14867382 16527334 21131497 18232585 7701793 -4655924
38329 -4655924 -14429284 -21051984 -26541203 -30940359 -29360515 -18760485 -6777422 -4519336
38321 -4519336 -9749180 -9078922 301344 5449843 396295 -1849647 8830295 20511114
38313 20511114 17537719 6485401 5518569 15439565 20824402 16160185 11179461 10523850
38305A0523850l140128o736820j53144R680589P052929n411551r474231P64403
38297C105897J1313585R673620l99953p665166o389501R11835O140334J952260
38289A8642911q144652j0429392K31144R294067K474099j0581420j0096960Q93124
38281g717079J33682j5375370j9851179J246295K4830459K3042845M799469o83607
38273A0425515Q707238O896766j4621903l0355592k0308146k1142O380968K881868
38265c0014428Q131129J8928619J4891430m608547j6009161q182696J357650l279611
38257a8785615j1478788o437537O452792J0025820L379226L91673N691372R947564
38249h13493P502762L014637q7145m122317q207407o628667Q79266O890222P125197
$$ plain form
38305 10523850 7383722 646902 493758 10174347 17227276 11815725 2341494 3105897
38297 3105897 14419482 24093102 23693149 16027983 9638482 10550317 16690651 18642911
38289 18642911 10498259 68867 300011 9594078 12068177 1486757 -8610203 -7717079
38281 -7717079 -7583397 -22958767 -42809946 -41563651 -16733192 6309653 11109122 10425515
38273 10425515 19132753 26029519 11407616 -18947976 -39256122 -39277264 -32896296 -30014428
38265 -30014428 -21883299 -2954680 11936750 7328203 -8680958 -16863654 -15506004 -18785615
38257 -18785615 -30264403 -36701940 -30249148 -20223328 -16844102 -16452429 -10761057 -813493
38249 -813493 6689269 9703906 9616761 5494444 -2712963 -9341630 -8462364 -1572142 5553055
38240E553055N400781N559424N807552L046489l138725j1209320j6815768j3276065
38232a9072577m28843R891815P112067j891541j968359O564825Q466507n77514
38224H096380n630529L141400J3359355R085571m975239j1561491o166163k35156
38216E114128j351285l069945K744365J2187208J3754140L935933o951181p394457
38208A8968906o22736q88077j1876558j8588227r087248M903913L684504r744318
38200b3249841j3246830O81717J4742566J4793210Q171371N653503L989740j322369
38192A0213067k731576M681445R320336N85630j1552852j1987236m752050k637889
38184h861125k149671Q452220K1901101J7746357m517775k1820602k0763347j2510024
$$ plain form
38240 5553055 10953836 16513260 22320812 25367301 22228576 11019256 -5796512 -19072577
38232 -19072577 -19501420 -9609605 -2497538 -4389079 -6357438 207387 8673894 8096380
38224 8096380 2465851 5607251 18966606 28052177 23076938 11515447 5349284 5114128
38216 5114128 3762843 692898 3437263 15624471 29378611 33314544 26363363 18968906
38208 18968906 18346170 17458093 5581535 -13006692 -22093940 -17190027 -13505523 -23249841
38200 -23249841 -36496671 -35814954 -21072388 -6279178 1892193 7545696 11535436 10213067
38192 10213067 7481491 12162936 21483272 22068902 10516050 -1471186 -6223236 -8861125
38184 -8861125 -11010796 -2558576 19342525 37088882 32571107 10750505 -10012842 -22522866
38176b2522866q566093l878809N635640R497650J851187k640163R186525K3297874
38168A1860945J6270338p435426j8749916n560340J0295831N707105j1192482
38161A196055j5221334o53301J3387472J1814754J807735k297869O06767K323300
38153A2963579Q90922K32999j274808q530492j6418812j2650847K470484J2306623
38145a0010352O968065j980820k95030O174615K140975j0459720j4226875m110813
38137b5799955M241000m67274o774595J820208J9919330K4934015P474554j4995384
38129A0351899j9897866p454528K095831k574039r133509k026379J2000917J2812509
38121c825165j785900j1238656l348505P168974K679863r199784q199552O824152
$$ plain form
38176 -22522866 -31088959 -34967768 -29332128 -19834478 -17983291 -20623454 -11436929 11860945
38168 11860945 28131283 20695857 1945941 -3614399 6681432 12388537 1196055
38161 1196055 -14025279 -14678580 -1291108 10523646 12331381 10033512 10640279 12963579
38153 12963579 13854501 14087500 12812692 4282200 -12136612 -24787459 -22316975 -10010352
38145 -10010352 -3042287 -5023107 -5318137 856478 2997453 -7462267 -21689142 -25799955
38137 -25799955 -21558955 -22026229 -28800824 -26980616 -7061286 17872729 25347283 10351899
38129 10351899 -9545967 -17000495 -14904664 -17478703 -26612212 -28638591 -16637674 -3825165
38121 -3825165 -5611065 -16849721 -20198226 -13029252 -10349389 -19549173 -27748725 -20924573
38113b0924573J7529840J3901391M275538k224494o004630p175653j673155P260723
38105D964987P578065m337569j5845151j4651553m283609L691526M960261L272219
38097a4650824K378311L405506N760834O425301K436461l790604o427307m045464
38089h507786N07210O834125J4885168J7691591Q369476n333478p829847M77686
38081B7094145K317794q125778j3907249k648485J1864214J0654985j367272n443714
38073B0438640J076652M148773k003057p880884o601307l139694l315998n464377
38065b741252n749294l217675J463669N587171M289584k298736n535968k59149
38057h461650M689088j213845j1910572j2107390k90469R796322J0007486N718758
$$ plain form
38113 -20924573 -3394733 10506658 14782196 12557702 6553072 -622581 -2295736 4964987
38105 4964987 12543052 8205483 -7639668 -22291221 -26574830 -22883304 -17923043 -14650824
38097 -14650824 -12272513 -8867007 -3106173 3319128 5755589 1964985 -4462322 -8507786
38089 -8507786 -8000576 -1166451 13718717 31410308 39779784 34446306 26616459 27094145
38081 27094145 29411939 21286161 7378912 4730427 16594641 27249626 25882354 20438640
38073 20438640 21515292 25664065 23661008 15780124 9178817 6039123 2723125 -2741252
38065 -2741252 -8490546 -11708221 -10244552 -4657381 -367797 -2666533 -8202501 -8461650
38057 -8461650 -3772562 -4986407 -16896979 -29004369 -29294838 -19498516 -9491030 -3772272
38049c772272K095540k697100p521992n820585J702570M514556j730407p734977
38041b0964667m949572L037682R106978J1906031J0514590J199810j2618846j7922226
38033b0690220r112499J764333J744485m749909n171799J718718Q188320J2446029
38025a3862542J6829806J5673479J291904j8323323k3870046j0541066M397737
38018b8404051N978065J196834M969154J5722205J7741408M851942j0326578j3244163
38010a515184m939417K524654K993111J538350L817580P284264O402919J779548
38002A9885825j623529l148637o556171j1276148j0737820k470856O165592P122715
37994b639029K152891j099566m1706J786796K232077K494472K183753j108291
$$ plain form
38049 -3772272 -1676732 -4373832 -11895824 -17716409 -16013839 -11499283 -13229690 -20964667
38041 -20964667 -25914239 -22876557 -13769579 -1863548 8651042 9850852 -2767994 -20690220
38033 -20690220 -29802719 -28038386 -26293901 -31043810 -36215609 -34496891 -26308571 -13862542
38025 -13862542 2967264 18640743 19932647 1609324 -22260722 -32801788 -28404051
38018 -28404051 -22425986 -21229152 -16259998 -537793 17203615 22055557 11728979 -1515184
38010 -1515184 -6454601 -3929947 -936836 601514 4419094 11703358 18106277 19885825
38002 19885825 18262296 15113659 8557488 -2718660 -13456480 -15927336 -9761744 -2639029
37994 -2639029 -486138 -1585704 -1627410 159386 2391463 4885935 7069688 5961397
37986E961397o139317p286505j638031O918436J2365330J1949072N648490n395094
37978B2383778j6736839k0189424j0426702P798082K2001353K2663237J0832581
37971C8326066m346438j3800089j4203550q258040j763042K00823l332645q468859
37963a5645774r878393n478409K525130J0106381J3085325Q026775l816313j3149069
37955a4224347r378715O089354J8816846J8053645Q934884K376736l38236l782563
37947B6547604n604266q36566M338152j033416j2194343j1819886K115162R576478
37939A1088919j502550j5415481j2261361K931670J0955736P144525J339532k408087
37931A872903o584769o202514N285450J8095521J4725265k507946j2084614m346690
$$ plain form
37986 5961397 -177920 -7464425 -9102456 -2184020 10181310 22130382 27778872 22383778
37978 22383778 5646939 -14542485 -24969187 -17171105 4830248 27493485 38326066
37971 38326066 33979628 20179539 5975989 -2282051 -4045093 -3844270 -7176915 -15645774
37963 -15645774 -25524167 -31002576 -28477446 -18371065 -5285740 2741035 -1075278 -14224347
37955 -14224347 -23603062 -17513708 1303138 19356783 28291667 30668403 30330167 26547604
37947 26547604 20943338 20106772 24444924 23411508 11217165 -602721 1512441 11088919
37939 11088919 9586369 -5829112 -18090473 -15158803 -4203067 2941458 4280990 1872903
37931 1872903 -4711866 -10914380 -5628930 12466591 27191856 24683910 12599296 8252606
37923H252606O828610P569177N52389p421591j5178151j7131166l676647J7567557
37915b637216K0972862j567023k2395045j4126079J1118524K0195050N492387
37908A7053460j0801442j2640415n913826N40452O713741J1005842P798228N60856
37900A4316896L73156O149776L092068j2217410k1788275j1844854N394369Q806661
37892g717613k536317j1637625r374557l579625k841821l708125J480849J1232673
37884b8682161J5562911Q606763l609092r803300o146883R04885M386890M402293
37876a4377694L515138O68037m395351n697763J519627J0710503J0622681J082885
37868C648063o792805o103024p89496L958250Q366154J2490501J2299662N251155
$$ plain form
37923 8252606 15081216 22650393 23202782 15781191 603040 -16528126 -20204773 -2637216
37915 -2637216 18335646 16768623 -5626422 -19752501 -8633977 11561073 17053460
37908 17053460 6252018 -6388397 -12302223 -11761771 -5048030 5957812 13756040 14316896
37900 14316896 14690052 20839828 23931896 11714486 -10073789 -21918643 -16524274 -7717613
37892 -7717613 -10253930 -21891555 -31266112 -34845737 -37687558 -41395683 -39914834 -28682161
37884 -28682161 -13119250 -4512487 -8121579 -17924879 -24071762 -23166877 -18779987 -14377694
37876 -14377694 -10862556 -10194519 -14589870 -20287633 -18768006 -8057503 2565178 3648063
37868 3648063 -3144742 -9247766 -10037262 -6079012 2287142 14777643 27077305 32328460
37860C2328460n521817j4409362j6504330r406456J557471L409728r173487k1828160
37852c9547953j6773290J043560J0219915N226200K735168J1141423J5534637
37845a0420340M487350p860732l505272J0308668J3065117K596459m826059j209840
37837B635351M424903L269457j882094l836019J49650O977932R301190J872747
37829B2913117r167201j1044325l747579k512264j2167091j4913449Q42132J5482965
37821a4313695M960153j9014019k3308018k667945J4697185J1577347K464577
37814b5604415L039508O264881J264921o329479p436964n360811m863714r19462
37806c9945535Q313585J2015528M298816k468425K745212R479490L026274q359230
$$ plain form
37860 32328460 26806643 12397281 -4107049 -13513505 -11956034 -8546306 -17719793 -39547953
37852 -39547953 -56321243 -55277683 -45057768 -39831568 -37096400 -25954977 -10420340
37845 -10420340 -5932990 -13793722 -17298994 -6990326 6074791 8671250 3845191 2635351
37837 2635351 7060254 10329711 8447617 4611598 4761248 11739180 21040370 22913117
37829 22913117 13745916 2701591 -1045988 -3558252 -15725343 -30638792 -29796660 -14313695
37821 -14313695 -9353542 -28367561 -51675579 -54343524 -39646339 -28068992 -25604415
37814 -25604415 -22564907 -16300026 -15035105 -21364584 -28801548 -34162359 -39026073 -39945535
37806 -39945535 -31631950 -19616422 -15317606 -17786031 -15040819 -5561329 -2535055 -10894285
37798a0894285m240071J4434324K3415786R371431j0787707j2334636N575204
37791A4540046J9722788J1639573j0503517k2301494j2971010K670714N989589
37784H786689m37770p71830P126278R380866M24938q335756q492893o187572o876289
37775e383339n102095J502210L801592k397545o133163P80739R631584J0668537
37767G368520Q532745Q787679M851328n946609r505700K783801J4312104P883263
37759C9067131m271425q65337J0443720N590030j3249831k0526327j0615931m560021
37751A012009j0465411j0737414K481467J1053673L798835l245204K737975O652906
37743C288836o416101j9695635q097399J9817984L0373642J1305128j2795423
$$ plain form
37798 -10894285 -15134356 -700032 22715754 32087185 21299478 8964842 14540046
37791 14540046 34262834 45902407 35398890 13097396 126386 2797100 8786689
37784 8786689 8348919 7577089 14703367 24084233 24509171 16173415 7680522 1492950 -5383339
37775 -5383339 -10485434 -8983224 -5181632 -7579177 -13712340 -12931601 -3300017 7368520
37767 7368520 15901265 24688944 29540272 23593663 14087963 16871764 31183868 39067131
37759 39067131 34795706 33930369 44374089 49964119 36714288 16187961 5572030 1012009
37751 1012009 -9453402 -20190816 -17709349 -6655676 -2856841 -6102045 -3364070 3288836
37743 3288836 -3127265 -22822900 -30920299 -11102315 19271327 30576455 17781032
37736A7781032j3604890P741899K4689229J4941818j5570691l6660850k5618442
37729b6300895N328848K2862430J4050248j606696n438486m092030q704985j0323298
37721a4224864L246953K0653159K0957081N904417n169056p055148j0878039j6920894
37713c486391j1499977N154718J2675273J560101j0522646n841437P435667J1314884
37705F790192O190081N408867J0107942P981157m818129j6483501j6567916q197234
37697i588541L95110O752703J1256584J0743641K327827r687865j6881006j5623327
37689b0304874q676239L85942R030006J3019307Q814632N20841k217478L075376
37681C647513P222684K546003n730935q077804m623837j408010J821605P969139
$$ plain form
37736 17781032 4176142 11918041 36607270 51549088 35978397 -682453 -26300895
37729 -26300895 -20972047 1890383 15940631 14333935 8895449 4803419 -3901566 -14224864
37721 -14224864 -10977911 9675248 30632329 36536746 31367690 24312542 13434503 -3486391
37713 -3486391 -14986368 -9831650 2843623 4403724 -6118922 -11960359 -4524692 6790192
37705 6790192 12980273 18389140 28497082 36478239 31660110 15176609 -1391307 -9588541
37697 -9588541 -9193431 -2440728 8815856 19559497 21887324 12199459 -4681547 -20304874
37689 -20304874 -28981113 -28595171 -19565165 -6545858 2268774 2789615 572137 3647513
37681 3647513 10870197 13416200 7685265 -392539 -5016376 -6424386 -4602781 3366358
37673C366358J0526362K59790j6142827k0171847p484384N871504Q057027N436519
37665a0281498M566506j054816j3314681j6330838M51298J9699257J8323938K473166
37657D532332l113011N469056Q656839n14044n251673L293926Q415226m286730
37649A7201921k0707629j7663478L049520J7611494J2320874j975795p478499
37642B358408p03254P377148P630864M281086P112399J3687549Q972479j0555751
37634D0160928k3470978j0025563J4592351J6000368r941382k8415021j4811305
37627a5910602J1486075J8261903N057627m937615l278555j784147o286377q598028
37619e989719m364075M70794K708664N441292P188668K433609n314550n424159
$$ plain form
37673 3366358 13892720 14152510 -1990317 -22162164 -29646548 -23775044 -15718017 -10281498
37665 -10281498 -5714992 -6769808 -20084489 -36415327 -35964029 -16264772 2059166 4532332
37657 4532332 1419321 6888377 15545216 15031172 9779499 13073425 21488651 17201921
37649 17201921 -3505708 -21169186 -18119666 -508172 11812702 9836907 2358408
37642 2358408 1655154 9032302 16663166 20944252 28056651 41744200 50716679 40160928
37634 40160928 16689950 6664387 21256738 37257106 27315724 -1099297 -15910602
37627 -15910602 -4424527 13837376 18895003 13957388 10678833 8894686 2608309 -5989719
37619 -5989719 -10353794 -9883000 -7174336 -1733044 5455624 7889233 2574683 -2849476
37611b849476K441254O535286J644415l859433l357757j468096l390306o596275
37603a0900388q179117r446659q641303p71810J0172703J1346706K76337q147497
37595b4291028k269127J0006209J4805966J1494772P694526M842751N98067k136909
37587B0745227k64538K000173Q85966M86764K201797k613333j5862438k0447712
37579a2868094l898291J5474119J0227061j3282617k0937933j215859J8639939
37572g861675J4838508j125454o919964k775037j755258m015269j310146M355496
37564f568799N436604L415911K252913l094881j4478895j7327952j74141K0911348
37556i627892K0654482K370079p378214k22487M552692m716913j4327168j1885411
$$ plain form
37611 -2849476 -408222 6127064 7771479 3912046 554289 -913807 -4304113 -10900388
37603 -10900388 -19079505 -28526164 -37167467 -37939277 -27766574 -16419868 -16143531 -24291028
37595 -24291028 -26560155 -16553946 -1747980 9746792 17441318 22284069 22882136 20745227
37587 20745227 20480689 22480862 23366828 23853592 26055389 23442056 7579618 -12868094
37579 -12868094 -16766385 -1292266 8934795 -4347822 -25285755 -26501614 -7861675
37572 -7861675 6976833 5851379 -1068585 -3843622 -5598880 -9614149 -10924295 -6568799
37564 -6568799 -1132195 2283716 4536629 1441748 -13037147 -30365099 -30539240 -9627892
37556 -9627892 11026590 13396669 6018455 5795968 10348660 5631747 -8695421 -20580832
37548b0580832o094000o325528l992671Q621932J8789353J2329543j167316k807808
37540a227327N502412O751659j444385n042144j81364K77757r077221j4798745
37532a9239358o131897O720540P445635k487956o924909J800838J3514923J4973988
37524I671804O644477O66968M649970J2017310J0516160j924556j4168641j5447594
37516A2625898p756386j973163m427937j0399495r826004J718211J6340116J9319848
37508A5621088N601350j0744741j1270714K562619J0434709J672244r803941p071594
37500b998980M870314Q294008j101428j1420263j3601389r311423j832491P622517
37492a9479135J4496206J3524129P383839K809218n69567o329430q747931P45205
$$ plain form
37548 -20580832 -26674832 -33000360 -36993031 -28371099 -9581746 2747797 1580481 -1227327
37540 -1227327 4275085 11026744 9582359 4540215 4358851 4636608 -4440613 -19239358
37532 -19239358 -25371255 -18650715 -11205080 -13693036 -20617945 -18817107 -5302184 9671804
37524 9671804 16316281 16983249 21633219 33650529 44166689 42242133 28073492 12625898
37516 12625898 4869512 2896349 -1531588 -11931083 -21757087 -20038876 -3698760 15621088
37508 15621088 21222438 10477697 -793017 1769602 12204311 13876555 4072614 -2998980
37500 -2998980 1871334 10165342 9063914 -2356349 -15957738 -25269161 -27101652 -19479135
37492 -19479135 -4982929 8541200 15925039 18734257 18164690 11835260 3087329 3832534
37484C832534J4474726J3313388m648090j7279474r247552N609278N695233o493106
37476E256937j0418869N42258J0344064M568127r982055j5738249o960091M884690
37468a7503188O610048r46298n619811r64867N241194L562740j778162L09190
37460a1089154Q038907O941178o811624j6380773o583325J3181293J9997736O554863
37452A3849101j2088146j8791976j0877507L485186J5113929J7222154P582469
37445A5495210p273438j4940904r437652J987097Q184953P274104N350714M464958
37437A1105042J29581p400922q424581K456128J4518534J3742598L897375R36288
37429C0960043O364090L559255j3079218k3908166j3082012M031354L133664j0062501
$$ plain form
37484 3832534 18307260 31620648 26972558 9693084 445532 6054810 11750043 5256937
37476 5256937 -5161932 -4619674 5724390 10292517 310462 -15427787 -22387878 -17503188
37468 -17503188 -10893140 -11839438 -17459249 -18424116 -13182922 -9620182 -11398344 -11089154
37460 -11089154 -3050247 3890931 -2920693 -19301466 -25884791 -12703498 7294238 13849101
37452 13849101 1760955 -17031021 -27908528 -24423342 -9309413 7912741 15495210
37445 15495210 8221772 -6719132 -16156784 -14169687 -5984734 1289370 6640084 11105042
37437 11105042 11234623 3833701 -4590880 -2134752 12383782 26126380 30023755 30960043
37429 30960043 37324133 40883388 27804170 3896004 -9186008 -5154654 -2020990 -12083491
37421a2083491q704699J0939406K1755346P311342j4212024j8868536q629198
37414b2491854O69732N915897J3052500J8248974J1916352l216163j3680416j2923856
37406b508834n404941M488909J5838182K4229939K2164079Q636810p958168j7681957
37398D1804019j6391674o882250L240031O355888J086697o826641j0701315q086924
37390C597831j173531L644330q58048j2933937j8712869q628220O620800R828796
37382a8614848L594373M811042J3964607J2940517k167675j1240282l354466N120332
37374E053600P19631l017319Q180465K0637928J4651513k504802j1058231j0896152
37366B1766633j2499533j0284757M669986J6792464M429701k0271544k3804576
$$ plain form
37421 -12083491 -20788190 -9848784 11906562 19217904 5005880 -13862656 -22491854
37414 -22491854 -21822122 -15906225 -2853725 15395249 27311601 24095438 10415022 -2508834
37406 -2508834 -7913775 -3424866 12413316 36643255 58807334 67444144 59485976 41804019
37398 41804019 25412345 18530095 21770126 28126014 29212711 22386070 11684755 3597831
37390 3597831 2424300 6068630 5210582 -7723355 -26436224 -35064444 -28443644 -18614848
37382 -18614848 -15020475 -10209433 3755174 16695691 14528016 3287734 -66732 5053600
37374 5053600 5773231 2755912 10936377 31574305 46225818 43721016 32662785 21766633
37366 21766633 9267100 -1017657 3652329 20444793 24874494 4602950 -19201626
37359a9201626j568905J7270714J5786807P387778M471780J490269l669246j917153
37351B0050418M506647L40174j2722525j3174042K755826J0414202k864393j5940824
37343f634517r423995M386438O607622J648800P43460j233443r595833j1431177
37335b4932645K364664J4989603Q528972n408511n155099N459654P243600q56607
37327B233631n025107l683399n022759n134346N294058J7922334J5684437J162811
37319B3431660p669553o839813q039125j3276602j1647728j575061N500061M755775
37311a5360386K228403j9945m292235n000562M108296J3205444Q287241k931074
37303B25182n99599J3618041J8360118Q238424n0821j14815m820058j6171652
$$ plain form
37359 -19201626 -20770531 -3499817 12286990 19674768 24146548 25636817 21967571 20050418
37351 20050418 24557065 24897239 12174714 -999328 1756498 12170700 9306307 -6634517
37343 -6634517 -16058512 -11672074 -5064452 -3415652 -2672192 -3905635 -13501468 -24932645
37335 -24932645 -22567981 -7578378 950594 -4457917 -9613016 -4153362 3090238 2233631
37327 2233631 -2791476 -6474875 -11497634 -16631980 -11337922 6584412 22268849 23431660
37319 23431660 15762107 8922294 883169 -12393433 -24041161 -25616222 -20116161 -15360386
37311 -15360386 -13131983 -13151928 -17444163 -22444725 -18336429 -5130985 3156256 225182
37303 225182 -374417 13243624 31603742 39842166 39791345 39676530 34856472 18684820
37295A8684820j6643118k259290M858960o991213j6911755n254353J4298308J8885421
37287H667780J1995290J0034709J0582111J483096j0344727p562193O389442J1732531
37279D2978039O198834R178293K9470552N1248120N8572287N5693926N3901272
37272C07241323N1187491L5348828J618172l8959085o6601173o8103276m9240537
37265A72491743l0429960k5176764k5936083j7505692K16290J2249252Q641033
37258I4549819n301263j7861060k1082750j3300353o33760M984112j578098r290849
37250C0485798m322559Q652258J1096641k458440j5976393j4954059m760638J719462
37242I482070L212657N970268Q832361N326948k705041n702644q77394L757607
$$ plain form
37295 18684820 2041702 -217588 4641372 -2349841 -19261596 -24515949 -10217641 8667780
37287 8667780 20663070 30697779 41279890 42762986 32418259 24856066 31245508 42978039
37279 42978039 49176873 58355166 87825718 139073838 197646125 253340051 307241323
37272 307241323 358428814 393777642 395395814 356436729 289835556 221732280 172491743
37265 172491743 142061783 116885019 90948936 73443244 73659534 85908786 94549819
37258 94549819 89248556 71387496 50304746 37004393 36370633 41354745 39776647 30485798
37250 30485798 26163239 34815497 45912138 43453698 27477305 12523246 7762608 9482070
37242 9482070 12694727 18664995 27497356 32824304 30119263 24416619 23539225 27296832
37234B7296832J891205k727952l845664j931660r82624p40476K014583O381230
37226B7355474P117032J713878o411684j2404540j3951696j0143144j267891P447023
37218e45548O844195n425086j7595605j4781074J762557J3527441O688544j0553395
37210b0077971j8436168r741373M183737J0705987J0304144R655757P799558j435893
37202g042222j4775969j8049075m731347J1497512J1913666k581329j2428227
37195c6196991n725679P482916J1855777P110751K916384J662986j499116n611783
37187a8004755m153201J889047L543147j284981l819987O08048M256887J98476
37179a6767319n062072j181319R094332J2185526K136961j0331180r714933N692678
$$ plain form
37234 27296832 29188037 26460085 22614421 20682761 19700137 18959661 20974244 27355474
37226 27355474 34472506 36186384 29774700 17370160 3418464 -6724680 -7992571 -545548
37218 -545548 6298647 873561 -16722044 -31503118 -29740561 -16213120 -9524576 -20077971
37210 -20077971 -38514139 -48255512 -44071775 -33365788 -23061644 -13405887 -5606329 -7042222
37202 -7042222 -21818191 -39867266 -44598613 -33101101 -21187435 -23768764 -36196991
37195 -36196991 -41922670 -34439754 -22583977 -15473226 -12556842 -10893856 -12392972 -18004755
37187 -18004755 -22157956 -20268909 -16725762 -18010743 -21830730 -21222682 -16965795 -16767319
37179 -16767319 -21829391 -23010710 -13916378 -1730852 406109 -9925071 -19640004 -13947326
37171a3947326J9652970J4965471m860571j6582481n373886J4130388J5944236
37164B3928801j746802j4711705p838941N247139N497536m511598r618109o175414
37156i929093j974410l517K304823K683104j969238m383514M904764J9058754
37148A0691673J9893067L354677j3541008j5000154m095817O053086Q195415L007356
37140A8558295n600878j1490805r492846k218716K183732J730051K629623O834321
37132C132777O903025j134533q525670n535818L762973P393410K531857k206251
37124F321770n96188K824075O140r508645j7099696j3671782N65369J5123264
37116a6035693J9413438J3170319M029935l357686r638381j2704111o770428O343787
$$ plain form
37171 -13947326 5705644 20671115 15810544 -771937 -6145823 7984565 23928801
37164 23928801 22181999 7470294 -368647 4878492 10376028 5864430 -3753679 -9929093
37156 -9929093 -11903503 -11907020 -9602197 -6919093 -8888331 -13271845 -8367081 10691673
37148 10691673 30584740 33939417 20398409 5398255 1302438 7355524 15550939 18558295
37140 18558295 12957417 1466612 -8026234 -10244950 -8061218 -6331167 -3701544 3132777
37132 3132777 10035802 8901269 375599 -5160219 -1397246 5996164 8528021 6321770
37124 6321770 5725582 8549657 8555797 -952848 -18052544 -31724326 -31158957 -16035693
37116 -16035693 3377745 16548064 20577999 17220313 7581932 -5122179 -11892607 -5548820
37108e548820J3779784P206955m269737n744014L058251Q990415N199464j297918
37100B1374380l011216k526783n140669r015745q952063m816438k35996L334844
37092h989686N526893L492017l770760r573190n699344N413095J2033138Q458388
37084F890551J892881P49863L173124K911105O53338J371166L716068J216776
37076B2574872o369728j1306483q705063j914081M133571P545802O204032j135913
37068A1027009p712773l187899R243119J1349831n005122k1451070j5610247P019414
37060a4327738K0415852J4294832M286464L844965N767462N97435m114784J737500
37052C2501988R098585J566376j6002017k0592226m905114J0026357M682096j0686379
$$ plain form
37108 -5548820 8230964 15437919 11168182 5424168 8482419 17472834 22672298 21374380
37100 21374380 18363164 15836381 10695712 1679967 -7272096 -12088534 -12324530 -8989686
37092 -8989686 -3462793 29224 -3741536 -13314726 -19014070 -13600975 -1567837 6890551
37084 6890551 8783432 9533295 12706419 15617524 16270862 17642028 21358096 22574872
37076 22574872 16205144 4898661 -3806402 -5720483 -1586912 5958890 12162922 11027009
37068 11027009 3314236 126337 9369456 20719287 15714165 -5736905 -21347152 -14327738
37060 -14327738 6088114 20382946 24669410 28514375 34281837 34879272 30764488 32501988
37052 32501988 41600573 43166949 27164932 6572706 1667592 11693949 16376045 5689666
37044E689666j1624281M446137J4758337M678873j1039163r439740Q072374J7945707
37036B3487910P444868q151609p026795R707773K0064679R947929j0120173j9645102
37028B5709480j2329453K49105N756646M314016K719002J884500k854264j0369712
37020A5079320j1583316k799430O089462M350319l787804n969346p57418K944046
37012C565833M186855J1138583K0420809J4497152r201823k4618878j1009880
37005H978651J2963826J2789588j1604894k6082853j2815612P273490J0491372
36998A993568K977868K115938O276721L630639k775048j045567N808924L580692
36990B2563735q208200j4820608j0462047n362269m926875K37851J4955138K5225233
$$ plain form
37044 5689666 -5934615 -1488478 13269859 17948732 6909569 -2530171 5542203 23487910
37036 23487910 30932778 22781169 15754374 25462147 45526826 55474755 45354582 25709480
37028 25709480 13380027 13629132 19385778 23699794 26418796 28303296 25449032 15079320
37020 15079320 3496004 696574 6786036 11136355 7348551 1379205 621787 3565833
37012 3565833 7752688 18891271 39312080 53809232 44607409 19988531 8978651
37005 8978651 21942477 34732065 23127171 -2955682 -15771294 -8497804 1993568
36998 1993568 4971436 7087374 13364095 16994734 14219686 13174119 18983043 22563735
36990 22563735 14355535 -465073 -10927120 -16289389 -21216264 -20978413 -6023275 19201958
36982A9201958J6272761m493826j6337502j2262363l798798k47822K525725Q635753
36974I495886J0579509J287687j0004831p308270Q073854J6297700N570946j1737971
36966B2254510j7459369j2402170j0803411j5894440j6052232n490085N657836
36959e0189361P108489L008798L226770Q168131J0698495Q170528M639792L787725
36951a380633N746814Q747680R085554K374239r981164j8400441j5094984m658891
36943b3561826J119640j808142n786526k984705M337211P698449L749406j540535
36935a8777028n69541N738280Q279830J609240p543174p738091K407317J2119816
36927d473351J1866401M070612j620205l09437L561136K620259l508222n964106
$$ plain form
36982 19201958 35474719 30980893 14643391 2381028 -1417770 -1665592 860133 9495886
36974 9495886 20075395 21363082 11358251 4049981 12123835 28421535 33992481 22254510
36966 22254510 4795141 -7607029 -18410440 -34304880 -50357112 -55847197 -50189361
36959 -50189361 -43080872 -40072074 -36845304 -28677173 -17978678 -9808150 -5168358 -1380633
36951 -1380633 4366181 13113861 22199415 24573654 14592490 -3807951 -18902935 -23561826
36943 -23561826 -22442186 -24250328 -30036854 -33021559 -28684348 -20985899 -17236493 -18777028
36935 -18777028 -19346569 -13608289 -5328459 -3719219 -11262393 -19000484 -16593167 -4473351
36927 -4473351 7393050 11463662 9843457 9534020 13095156 15715415 12207193 6243087
36919F243087K355033J4036867J3329105j503039j2560638p549852Q64830m546855
36911A0668538j6016799j2466536M682576J2092008J516441r110426o806716o26026
36903a6066940J051578N014382J2592405R540033p145106j6092543m650019P774576
36895g981634J960730p957446o13929J3672409J1746144j078348l168658K522578
36887I101846l273384j5389719j0846793P131151J1279227k403050q672773J086516
36879a1986979O294233j378535l485238N877050N349800j1970375j9640648k153268
36871c3093960J6790271J4635023N541069Q219130J0061285m332854j7260453
36864E59511p220976R111041L324557j4410870j2281959Q470833J7333932O490633
$$ plain form
36919 6243087 8598120 22634987 35964092 34461053 21900415 14350563 15215393 10668538
36911 10668538 -5348261 -17814797 -13132221 -1040213 476228 -8634198 -15440914 -16066940
36903 -16066940 -15015362 -10000980 2591425 12131458 4986352 -11106191 -15756210 -7981634
36895 -7981634 -6020904 -13978350 -14592279 -919870 10826274 9747926 6579268 9101846
36887 9101846 5828462 -9561257 -20408050 -13276899 -1997672 -4400722 -13073495 -11986979
36879 -11986979 -5692746 -7071281 -10556519 -4679469 670331 -11300044 -30940692 -33093960
36871 -33093960 -16303689 -1668666 3872403 12091533 22152818 17819964 559511
36864 559511 -6661465 2449576 5774133 -8636737 -20918696 -12447863 4886069 11376702
36856A1376702j433175L555255O152197m49339k906747L471481M937558l687240
36848B1016692r199127n046263j608647m174837l867919K398804M968346R09550
36840E396599q50213R70275k420889q209053k425257J1742959J2623677l550519
36832A3277579j2160583L47468J2822388L305163j6250706k0184072o223258Q614851
36824a6451170J5158474J5265877R355319p62092n735196j080964L230621j239683
36816A7741186p102388o114154m939013j0173763j1567619P54855J4470502J1733176
36808D802782j793097o772787j858365k091572r539206r407439L621751J6239824
36800f798109J7124545R468111m0532r078432j3740880r365236l10850L930303
$$ plain form
36856 11376702 9943527 13498782 19650979 19201640 16294893 19766374 24703932 21016692
36848 21016692 11817565 6771302 5162655 987818 -2880101 -481297 4487049 5396599
36840 5396599 4546386 5516661 3095772 -5113281 -7538538 4204421 16828098 13277579
36832 13277579 1116996 1464464 14286852 17592015 1341309 -18842763 -25066021 -16451170
36824 -16451170 -1292696 13973181 23328500 22566408 16831212 15750248 18980869 17741186
36816 17741186 10638798 4524644 -414369 -10588132 -22155751 -21400896 -6930394 4802782
36808 4802782 3009685 -3763102 -5621467 -7713039 -17252245 -26659684 -23037933 -6798109
36800 -6798109 10326436 19794547 19754015 10675583 -3065297 -12430533 -12741383 -8811080
36792h811080L687737O772070J0996831N303151q791419j3865931j522371J3819455
36784G588443J4735373L066835o503854o383698j067908J693529k068955j0071658
36776I88107j4484809r770473j299363P15795l097463j280384R612993J6943045
36768a672552R519470n482274j1755342m458494O692373J1452389Q461854K160311
36760A4917735k911113m026901j094091K566868K290019k987621p511250k562815
36752a319169J2879314K5721308J9514960m706783k4857978k2009689l239443
36745A982520Q452378L477041n872713n596522K709001P894948L960909n824582
36737A1182980j4036583j4707345p368599K298216P875695Q153644N990990L968130
$$ plain form
36792 -8811080 -5123343 1648727 12645558 17948709 9157290 -4708641 -6231012 7588443
36784 7588443 22323816 25390651 18886797 12503099 11435191 13128720 11059765 988107
36776 988107 -13496702 -23267175 -24566538 -23850743 -26948206 -28228590 -18615597 -1672552
36768 -1672552 7846918 2364644 -9390698 -13849192 -7156819 4295570 12757424 14917735
36760 14917735 12006622 7979721 6885630 9452498 11742517 8754896 1243646 -1319169
36752 -1319169 11560145 37281453 56796413 52089630 27231652 5221963 1982520
36745 1982520 10434898 13911939 8039226 2442704 5151705 13046653 17007562 11182980
36737 11182980 -2853603 -17560948 -24929547 -22631331 -14755636 -6601992 -611002 3357128
36729C357128L924062O568406P995248K517833o768709r056288l892552n990607
36721a345479k0401044k6498851n671821K5484220L3700160J5288677k480182
36714A8075680m736255m579950j0992300j1577723N82724R739121L768442m577237
36706d297498o54306P241038M958515k809424m790628m772735j0183350j2661525
36698b7969913k166605J0694245R259444q95601j080369R330347J3185878L255779
36690A3613205j0787711j9959025k1755960j2569216O348716J9508447J3774966
36683a1826578L13642o91282P596131N469028p349429j0033373L093380J2247809
36675a180672M992965n809308o509164k693156l491185n570625m330653l478902
$$ plain form
36729 3357128 7281190 13849596 21844844 24362677 17593968 8537680 4645128 -1345479
36721 -1345479 -21746523 -48245374 -53917195 -28432975 5267185 20555862 18075680
36714 18075680 13339425 8759475 -2232825 -13810548 -13227824 -3488703 279739 -4297498
36706 -4297498 -4951804 2289234 7247749 4438325 -352303 -5125038 -15308388 -27969913
36698 -27969913 -30136518 -19442273 -10182829 -11078430 -12158799 -2828452 10357426 13613205
36690 13613205 2825494 -17133531 -38889491 -51458707 -45109991 -25601544 -11826578
36683 -11826578 -11512936 -12204218 -4608087 860941 -6488488 -16521861 -13428481 -1180672
36675 -1180672 3812293 -1997015 -8506179 -11199335 -14690520 -20261145 -24591798 -28070700
36667b8070700k653008P052439K3780360K8478767J1201702j1278396j7968995
36660A0542169j0510773m004785l212982k112704K165728P440705J1148480Q705486
36652B0161324l113596j5129448j2161628K210196N098573j0538500k0411955
36645c3885034n401902J5897245J4170766o011505j5290592m270064Q388812R550282
36637a6851992P007340Q945208J0449452O286553K82715l345448n177690m572099
36629C024039l32743K225887k660722q814074n536863L398907L744455n498115
36621a0449229q907585J205250J2963048J3038081L713450m175831m633742K068473
36613D821915J1385969J4007518L476730j2056165j5959557m594124P784243R132995
$$ plain form
36667 -28070700 -30723708 -23671269 109091 28587858 39789560 28511164 10542169
36660 10542169 31396 -3973389 -7186371 -9299075 -7133347 307358 11455838 20161324
36652 20161324 17047728 1918280 -10243348 -8033152 -2934579 -13473079 -33885034
36645 -33885034 -39286936 -23389691 -9218925 -15230430 -30521022 -34791086 -26402274 -16851992
36637 -16851992 -9844652 -899444 9550008 15836561 16119276 12773828 7596138 3024039
36629 3024039 2691296 4917183 2256461 -6557613 -12094476 -8695569 -4951114 -10449229
36621 -10449229 -19356814 -18151564 -5188516 7849565 11563015 7387184 2753442 4821915
36613 4821915 16207884 30215402 33692132 21635967 5676410 1082286 8866529 17999524
36605A7999524L258501j364208m474201q398906r715868n535863j069525k266190
36597a1566736n353245j277731J1196349K1778963J8248978m52945j9608214k0634812
36589g669393k011604J6447335J7208616O698570K637499O598691N810046j308536
36581D4411224k364108M059344K585653j1825268k1363022j2671153R21925P56427
36573D511022p598900n572199O451364R588831k730412j3515198o619326J1022515
36565d462303J9453350J0975410k672088p124877k723440o41394m556643n170868
36557C077147L199999J0261880M011914r701637j5079110r026370j113580M829622
36549i540135J1223516J1993159p18606j4879758q468215J4574699K4619379J0474139
$$ plain form
36605 17999524 21258025 19893817 15419616 7020710 -2695158 -8231021 -9300546 -11566736
36597 -11566736 -16919981 -18197712 -7001363 14777600 33026578 32573633 12965419 -7669393
36589 -7669393 -9680997 6766338 23974954 30673524 33311023 39909714 45719760 44411224
36581 44411224 42047116 46106460 48692113 36866845 15503823 2832670 3754595 4511022
36573 4511022 -3087878 -8660077 -2208713 7380118 4649706 -8865492 -15484818 -4462303
36565 -4462303 14991047 25966457 23294369 16169492 13446052 12804658 8248015 3077147
36557 3077147 6277146 16539026 20550940 10849303 -4229807 -13256177 -14369757 -9540135
36549 -9540135 1683381 13676540 12957934 -1921824 -10390039 4184660 28804039 39278178
36541C9278178n016039n527104o354883j9519277k4932121m956143J8508854J5818630
36533G300095k081152m821008M096030k282341k0027432j7033485R111307K1925801
36525c812185N015070j1861166l349691J1938565O626571j0242040j1513851M552709
36517a2646018J6610362J3996552M599741l402900q152136p631457k244490L42681
36509A472335m881564j0331996o134705M794574J1081518P599072q80639n561087
36501b842492N74705J5102383K2432117R444221j2907745j9037234l948351R361808
36493A8179412M781732n529632n995033j849441k022547R96188J2655686J6411913
36485C7628278j860833k4111862k3026913m058318N217868K64967J528683J3258384
$$ plain form
36541 39278178 34262139 28735035 22380152 2860875 -22071246 -27027389 -8518535 7300095
36533 7300095 5218943 397935 4493965 2211624 -17815808 -34849293 -25737986 -3812185
36525 -3812185 1202885 -10658281 -14007972 -2069407 4557164 -5684876 -17198727 -12646018
36517 -12646018 3964344 17960896 22560637 19157737 11005601 3374144 1129654 1472335
36509 1472335 -3409229 -13741225 -19875930 -15081356 -3999838 3599234 2718595 -2842492
36501 -2842492 -2267787 12834596 35266713 44710934 31803189 12765955 8817604 18179412
36493 18179412 22961144 17431512 11436479 9587038 7564491 8560679 21216365 37628278
36485 37628278 35767445 11655583 -11371330 -15429648 -10211780 -9946813 -8418130 4840254
36477D840254J4541570k731495j8187233j6366112q691997p903181m673359J1834438
36469b7337115K8722258K5556331M779750j2508530j4559315p555031j017704
36462c919356J718155N84888k881122m626846k187455J571522K912490K328171
36454d499553J984932K344879L904948O965406P745817J682567p351254r565377
36446C212365l672572Q86846m16484o58510M090579O146620L12722n073543j701486
36437C126537M273097L008674k691095m123769j695479l93415J751724O700227
36429I956501O179766m908437j2376406m36543J9027157J8356590m482973k1229263
36421A0086392j5368826l596724l940509o690805M109677J9289745J8595324M654913
$$ plain form
36477 4840254 19381824 16650329 -1536904 -17903016 -26595013 -34498194 -39171553 -27337115
36469 -27337115 1385143 26941474 31721224 19212694 4653379 -2901652 -3919356
36462 -3919356 -2201201 -1616313 -4497435 -9124281 -11311736 -9740214 -6827724 -4499553
36454 -4499553 -2514621 -169742 3735206 10700612 18446429 20128996 12777742 3212365
36446 3212365 -460207 426639 10155 -648355 3442224 9588844 9901566 4828023 3126537
36437 3126537 7399634 10408308 7717213 3593444 1897965 1504550 3256274 9956501
36429 9956501 16136267 11227830 -1148576 -1585119 17442038 35798628 31315655 10086392
36421 10086392 -5282434 -8879158 -12819667 -19510472 -15400795 3888950 22484274 27139187
36413B7139187j929779L691920N990162j701752o244827J275104R859950O409927
36405D4489892n056414j2043616j0775242n473306O09093M480561J575419o370203
36397A1436184q477435J076857J2096121J1112725j62386r042564r936836p543320
36389E59346n427412k726318m12499R9131L118804J2027131J7857543Q224736
36381C3320462j1293058j9568551q245338O516988P768121R905k215619L335479
36373I628389P998304P801398M913648p86162r020648j2277676m524372N884602
36365I617483N082315n373647r519961j42830J1599137J2831613L971633p022871
36357B1042872j4676842j4806508l714194J3216539K0093742P574408j2981374
$$ plain form
36413 27139187 25209408 28901328 34891490 33189738 26944911 28220015 38079965 44489892
36405 44489892 39433478 27389862 16614620 11141314 11750407 16230968 17806387 11436184
36397 11436184 2958749 4035606 16131727 27244452 27082066 18039502 8102666 559346
36389 559346 -4868066 -7594384 -8006883 -7907752 -4788948 7238183 25095726 33320462
36381 33320462 22027404 2458853 -5786485 730503 8498624 8508529 6292910 9628389
36373 9628389 17626693 25428091 30341739 29555577 20534929 8257253 3732881 9617483
36365 9617483 14699798 9326151 -193810 -336640 11262497 24094110 28065743 21042872
36357 21042872 6366030 -8440478 -12154672 1061867 21155609 28730017 15748643
36350A5748643k1514821j2986610l96292M862894N841781R922089J4053072Q363376
36342B3894132p445911j9877755j7492628n258273L415326N251909P898337J2510394
36334B895531Q840987n829982j5559721o472777J0052597J1667795j582631p497252
36326c485453L165969J2025092J997752j6324668k0711384p913272O380593J0628174
36318a4237197O281367j635341r204350j1280028o386544k061441m344562m925028
36310d7793124P956046K7220248L1179514J3046404q261378j2845094k954125
36303G548491O058323O638328J327628o600076j3473563j2356143j197356R924248
36295b130120J0047468K617787p86181J368460J179021j455145K846593J4316263
$$ plain form
36350 15748643 -5766178 -18752788 -19149080 -14286186 -8444405 1477684 15530756 23894132
36342 23894132 16448221 -3429534 -20922162 -26180435 -22765109 -17513200 -9614863 2895531
36334 2895531 11736518 5906536 -9653185 -16125962 -6073365 5594430 4011799 -3485453
36326 -3485453 -319484 11705608 13703360 -2621308 -23332692 -31245964 -24865371 -14237197
36318 -14237197 -7955830 -9591171 -18795521 -30075549 -36462093 -38523534 -42868096 -47793124
36310 -47793124 -39837078 -12616830 18562684 31609088 23347710 10502616 7548491
36303 7548491 13606814 20245142 21572770 14972694 1499131 -10857012 -12054368 -2130120
36295 -2130120 7917348 10535135 9748954 11117414 12296435 10841290 13687883 28004146
36287B8004146J8159458M793226j5198022k5099022k2001931j3629538m089200
36280b9060883N713382J0420254O380897J366180M639051J0121644M154833j0919780
36272B815578j7323736q432045J778137J676747j527084K686827J0247446J1658246
36264C580116P662889L810982m87756n319587l047538Q262158J4098650K602555
36256C1162469j4034419j5665085m757702j13341m768660l756697O610176J1839907
36248F516648N690855O5133J696634J542502l831701l311016M579535K083979
36240A5032569j6653136k7095023q838680J9530021K5381071Q396264n035131
36233A0717955m462151l320066p658840o261020M223472R498405Q57877j1244790
$$ plain form
36287 28004146 46163604 50956830 35758808 10659786 -11342145 -24971683 -29060883
36280 -29060883 -23347501 -12927247 -6546350 -5180170 -541119 9580525 13735358 2815578
36272 2815578 -14508158 -22940203 -21162066 -19485319 -21012403 -18325576 -8078130 3580116
36264 3580116 11243005 15053987 14566231 9246644 6199106 14461264 28559914 31162469
36256 31162469 17128050 1462965 -3294737 -3408078 -8176738 -11933435 -5323259 6516648
36248 6516648 12207503 12272636 13969270 15511772 11680071 8369055 12948590 15032569
36240 15032569 -1620567 -28715590 -37554270 -18024249 7356822 15753086 10717955
36233 10717955 6255804 2935738 -4723102 -10984122 -6760650 2737755 3595632 -7649158
36225g649158j4361896q595144J593670J3847923K0754047J3191834k314362o422910
36217A0044004M862755J2218342L365137o755511j155670J0024616N812974j0370948
36209B8045699j4499221J548143J7993919J5394203j200826j3298312j3130366
36202B0853239q234664p380352r805636q638978j336858N981372O098802J021494
36194a441581r7045N602413R451815L445719p704591j2563451p540439M49922
36186a0397238L764971J361157k031101j40509R077904J8447232J6068546o68713
36178C5482249j9376512k5891248j9072260p265271M134943J3596469J7190636
36171a200994J2065146L703063n28224k916726r483008j5098841r082425M097484
$$ plain form
36225 -7649158 -22011054 -30606198 -29012528 -15164605 5589442 18781276 16466914 10044004
36217 10044004 14906759 27125101 30490238 23734727 22579057 32603673 38416647 28045699
36209 28045699 13546478 15094621 33088540 48482743 47281917 33983605 20853239
36202 20853239 12618575 5238223 -4567413 -13206391 -14543249 -8561877 -2463075 -1441581
36194 -1441581 -1538626 4063787 13515602 16961321 9256730 -3306721 -10847160 -10397238
36186 -10397238 -6632267 -5271110 -7302211 -7442720 1635184 20082416 36150962 35482249
36178 35482249 16105737 -9785511 -28857771 -36123042 -31988099 -18391630 -1200994
36171 -1200994 10864152 14567215 14038991 11122265 1639257 -13459584 -22542009 -18444525
36163a8444525O818812m141673r790221J498985J3652045P699325p241493q650354
36155a8599099K641796N098128n876057r057337P100160K3585050J9053692R57642
36147B4903975q478930m544136K61994N51119K615533P695157Q467348K898279
36139C4370339k835178o049916r182204r891179l569139L999082J920229o372571
36131B389463n945908L966363O060023o077520j4551449m507908J2727889J8746955
36123A2807908J4608512J0898398N307614q872493k2081448j9242611n607619
36116a2181739L29089l454718k169370P303710J0703305K410931m492373q33325
36108b384490M722031K515708l209507m792349l217365j936995k6118K495445
$$ plain form
36163 -18444525 -11625713 -15767386 -25557607 -24058622 -10406577 -2707252 -9948745 -18599099
36155 -18599099 -15957303 -10859175 -16735232 -25792569 -18692409 4892641 23946333 24903975
36147 24903975 16425045 11880909 12142903 12694022 15309555 23004712 31472060 34370339
36139 34370339 31535161 25485245 16303041 6411862 2842723 6841805 8762034 2389463
36131 2389463 -3556445 409918 6469941 392421 -14159028 -18666936 -5939047 12807908
36123 12807908 27416420 38314818 43622432 34749939 12668491 -6574120 -12181739
36116 -12181739 -11852650 -15307368 -17476738 -10173028 530277 2941208 -1551165 -2384490
36108 -2384490 2337541 4853249 1643742 -3148607 -6365972 -8302967 -8329085 -5833640
36100e833640L111850L963986Q591869J0310201m16718j5157800j3621738M515588
36092d536402J5419059P037995l554019j023321L584946l172785j0381857l021227
36084C52389Q572840N433801o707423p875382J263167K789596m866821m663612
36076e701445P403995J4320232O201248n568641q499889m981582j926436K8011
36068A275493J336839M41593o30052Q95399K6716q142393j3728101k616139J8018474
36059c122171K4283698R034913q637508j2551511q185445m638293J699513J2921403
36051A0804599J6553859L047925j5045690j7169214j890401J2315598R763155
36044A8379831p159594k2159149k0209230l052249R852002L767061r712664p214181
$$ plain form
36100 -5833640 -2721790 1242196 9834065 20144266 19727548 4569748 -9051990 -4536402
36092 -4536402 10882657 17920652 14366633 13343312 16928258 13755473 3373616 352389
36084 352389 8925229 14359030 7651607 -223775 1039392 3828988 -1037833 -5701445
36076 -5701445 1702550 16022782 22224030 16655389 8155500 3173918 1247482 1275493
36068 1275493 2612332 3053925 2423873 3319272 3345988 -4796405 -18524506 -21140645 -3122171
36059 -3122171 21161527 30196440 21558932 9007421 821976 -3816317 -2116804 10804599
36051 10804599 27358458 30406383 15360693 -1808521 -3698922 8616676 18379831
36044 18379831 11220237 -10938912 -31148142 -34200391 -24348389 -20581328 -30293992 -37508173
36036c7508173J0619740J7220800n98584k2041507k2439504n810997P409636R994032
36028d3154557Q640622O905918M397100M631983Q856629R549445K833267j804204
36020H56203K793430O830942p4046q670246m316169P317695Q627500j582626p925747
36011C856936l529049L002370M067404M58175n429636r278684k752880J2567882
36003B962518J6757097k967709k5680343k0541811P024019K1342635R033064n289135
35995B640335k233702M975398K42077o896545k839098K959428l443758j1284326
35987a5880191m63608K2969937L1653333J5140097p328753j4291707o403847J219080
35979B6614341J07583m478823l944445N18683j453286j3240124k1483563j2435469
$$ plain form
36036 -37508173 -26888433 -9667633 -10266217 -32307724 -54747228 -60558225 -53148589 -43154557
36028 -43154557 -34513935 -27608017 -23210917 -18578934 -9722305 -172860 2660407 856203
36020 856203 3649633 10480575 10406529 1736283 -2579886 4737809 13365309 11782683 3856936
36011 3856936 327887 3330257 7397661 7855836 2426200 -6852484 -9605364 2962518
36003 2962518 19719615 16751906 -8928437 -29470248 -22446229 -1103594 7929470 2640335
35995 2640335 406633 5382031 5624108 -1272437 -4111535 -1152107 -4595865 -15880191
35987 -15880191 -16343799 6626138 38279471 53419568 46090815 31799108 25395261 26614341
35979 26614341 26721924 22243101 18298656 18817339 17364053 4123929 -17359634 -29795103
35971b9795103N885366J3059798O735648M258617J1054201J1006802k258811r632959
35963A0313559J118952J0578959j637462k1087939k1198635o413972j120368n952365
35955c5399271k36644J5696186J7324923p21274j2734614l679735Q250982N321562
35947f177885j416816M031862J3854214J2529346L520613r86179k307707p072571
35939A5974877r683683l232652L264917q42866o275824J622800J4937531J3552195
35931B9317295j249305q150204j25778O625607J220665o856624p478165m518225
35923H785266k558624K831616J1388486J0851056m524593k0942129k2709875j2542701
35915b9421498l059736J874483N232572N486779Q62290j839720L618701J0107461
$$ plain form
35971 -29795103 -23909737 -10849939 -4114291 144326 11198527 22205329 19946518 10313559
35963 10313559 11432511 22011470 20374008 -713931 -21912566 -28326538 -29446906 -35399271
35955 -35399271 -35635915 -19939729 -2614806 -3336080 -16070694 -19750429 -11499447 -6177885
35947 -6177885 -7594701 -3562839 10291375 22820721 26341334 25355155 23047448 15974877
35939 15974877 6291194 3058542 6323459 5480593 -795231 827569 15765100 29317295
35931 29317295 28067990 19917786 19792008 26417615 27638280 20781656 13303491 8785266
35923 8785266 6226642 9058258 20446744 31297800 26773207 5831078 -16878797 -29421498
35915 -29421498 -32481234 -30606751 -25374179 -19887400 -19025110 -20864830 -17246129 -7138668
35907g138668P231320p2963J571470J0304920R201680o813477j9907767j3047203
35899a8670688O655522J8089216J2630017O73630m994989l280748j486185l873534
35891E742241o644406l473919N369485J1628529R013646K500357K535285R975524
35883C6646742J3297728L728865j2494960k1733020j8642399q721088J558866
35876f359266R759281J3213104Q006613l939955j2245297q473392K648040P963899
35868A0573027K134166o087817o055522J220429O586106O288900M411907K184860
35860B1256056n771840j9951095k8555809k0106722K91326J5961501J8225754
35853a8650829J2331612M983583l039006r455825p227246M322397J3828843J1995964
$$ plain form
35907 -7138668 92652 19689 1591159 11896079 21097759 14284282 -5623485 -18670688
35899 -18670688 -12015166 6074050 18704067 19377697 14382708 11101960 9615775 5742241
35891 5742241 -902165 -4376084 993401 12621930 21635576 24135933 26671218 36646742
35883 36646742 49944470 53673335 41178375 19445355 802956 -7918132 -6359266
35876 -6359266 3400015 16613119 24619732 20679777 8434480 -38912 2609128 10573027
35868 10573027 12707193 6619376 563854 1784283 8370389 14659289 19071196 21256056
35860 21256056 15484216 -4466879 -33022688 -53129410 -52838084 -36876583 -18650829
35853 -18650829 -6319217 -1335634 -4374640 -13830465 -21057711 -16735314 -2906471 9089493
35845I089493M734089K466229K100688p281195k2675253k6168920j0182106Q932341
35837c8984634J1438874Q9942n341372M545440J8085653J9920723R534240j857316
35829A7431550o669291o986459p415492p924525n760956j535761J79416k885494
35821b1567012o214421l211514N929164J3532152J3740181Q641094K699346l968118
35813I580872j1245392j2524856k187789J1536723J3003556J706571l903522P070630
35805A3036793J9436578J3058788o193631j4388057m890062M420018J608349k749324
35797B3339452J600910M980097l358025j2211537m730926J1615080J3806428j273155
35789C3768324j2371357o714157L516926L756247k417353n143118n543217q931319
$$ plain form
35845 9089493 13823582 16289811 18390499 11109304 -11565949 -37734869 -47916975 -38984634
35837 -38984634 -27545760 -27455818 -32797190 -28251750 -10166097 9754626 19288866 17431550
35829 17431550 10762259 3775800 -3639692 -11564217 -17325173 -18860934 -18681518 -21567012
35821 -21567012 -27781433 -30992947 -25063783 -11531631 2208550 10849644 13548990 9580872
35813 9580872 -1664520 -14189376 -16377165 -4840442 8163114 9869685 5966163 13036793
35805 13036793 32473371 45532159 39338528 24950471 20060409 24480427 26088776 23339452
35797 23339452 24940362 29920459 26562434 14350897 9619971 21235051 35041479 33768324
35789 33768324 21396967 14682810 18199736 21955983 19538630 14395512 8852295 -79024
35781g9024j1571549o614937L535927J0891105J2487225R632174K970024m234150
35773A7016795m950294J616432O093307K690008j752362j198768k261510j0305516
35765F948092j4519844l856366J0268618P827430p099906j0205014M918573J5627046
35757I908629M883183j3506516j6925929n324487M390034M179834l33331l922355
35749a6650938n952341m150094K997712R411241Q144758L662892O251476J4086639
35741A7801345J2804351l068428j8458020j5557243J990776J2081673J732207
35734I326661j6124039j8698799k176267J3976362J2767537N16528n070851m16461
35726e899329K326250l220337q551304n757806P37198M606842Q675948J6033946
$$ plain form
35781 -79024 -11650573 -18265510 -14729583 -3838478 8648747 18280921 21250945 17016795
35773 17016795 12066501 13682933 19776240 22466248 20713886 19515118 17253608 6948092
35765 6948092 -7571752 -11428118 -1159500 6667930 -431976 -10636990 -5718417 9908629
35757 9908629 14791812 1285296 -15640633 -20965120 -16575086 -12395252 -12728583 -16650938
35749 -16650938 -22603279 -26753373 -23755661 -14344420 -6199662 -2536770 3714706 17801345
35741 17801345 30605696 27537268 9079248 -6477995 -4487219 7594454 9326661
35734 9326661 -6797378 -25496177 -27672444 -13696082 -928545 -412017 -5482868 -5899329
35726 -5899329 -3573079 -6793416 -15344720 -21102526 -20365328 -15758486 -7082538 8951408
35718H951408J8990198R106723o694557j2689079n618409K166957J655334j739676
35710A4128899J12032M398616K441294o149307j1647381o578422M600092J0328550
35702A1634373N005183n159557j0012865o908196j642420M79592Q1773n452P88030
35693e739539J602046J604935m99255m244192m302608M168902J5511883J6491425
35685B4593597L111951j2629617j7709809j2758386o027330l95775N345059Q567744
35677g902566N946596N99134k613158m910473q135272o766818L521542J3656654
35669f604361J0783576j838685q421371l881532J362421J731663N151879J4770693
35661A3054283J7565748L300710j5704702j8060117j958367J2652888J0133862
$$ plain form
35718 8951408 27941606 37048329 30353772 17664693 12046284 14213241 15868575 14128899
35710 14128899 14240931 18639547 21080841 14931534 3284153 -3294269 1305823 11634373
35702 11634373 16639556 11479999 1467134 -5441062 -7083482 -6603890 -6522117 -6527569 -5739539
35693 -5739539 -4137493 -2532558 -3031813 -7276005 -11578613 -7409711 8102172 24593597
35685 24593597 27705548 15075931 -2633878 -15392264 -21419594 -21815369 -16470310 -7902566
35677 -7902566 -1955970 -1356836 -3969994 -8880467 -17015739 -23782557 -20261015 -6604361
35669 -6604361 4179215 2340530 -6080841 -9962373 -8599952 -6868289 -1716410 13054283
35661 13054283 30620031 33920741 18216039 155922 -1802445 10850443 20984305
35654B0984305l224664j0235854l912438P283025J1880698P814315J368016k509059
35646B9448344m152409m202895j489894J445814j543589q725253p640904O222544
35638I361758J6161114M866195j7093033k2898483q667823J597294m923099j0438293
35630c2034370J068771J5106208J1020682k546832k352304J0060281J1863560
35623A2185996j879002j1024166n307952M37543n211517j0845315n167303J282678
35615b5529038m315748j1588131k864175J5065926J8562675L753640p256477m67951
35607a4639279J0011378N542860q982471j4040877l411626J0301579J4196179
35600a022257P669886k061174p340686l430472O612611J0469091p38092j7385249
$$ plain form
35654 20984305 17759641 7523787 3611349 10894374 22775072 30589387 31957403 29448344
35646 29448344 25295935 21093040 19603146 21048960 19505371 10780118 3139214 9361758
35638 9361758 25522872 30389067 13296034 -9602449 -18270272 -16672978 -21596077 -32034370
35630 -32034370 -30965599 -15859391 -4838709 -7385541 -9737845 322436 12185996
35623 12185996 10306994 -717172 -6025124 -5587581 -10799098 -21644413 -26811716 -25529038
35615 -25529038 -29844786 -41432917 -44297092 -29231166 -10668491 -6914851 -14171328 -14639279
35607 -14639279 -4627901 914959 -8067512 -22108389 -25520015 -15218436 -1022257
35600 -1022257 6647629 4586455 -2754231 -6184703 427908 10896999 10158907 -7226342
35592g226342j9338157k003635J6408940J9048176J0629673M893623L004719k049498
35584B3367499p607239n057734J689209n13164j1144011j4114792l291485P331199
35576i340518O619426K728458N449707Q003410J938216l045260O082081J9336477
35568C7771997J4268532r196239k5720819j9396319k841429M868886K952997J990685
35560D698291M972910P131722P219481P863422P960701L355532n635036j2894102
35552B4672921j3035092p010508j243046p94807k603811J126478R879903J1441168
35544B2433206r50686j4670721j3226110r55259L917289j175983p51456Q609313
35536C229593Q671213r107079k3632089j3082443J1626073K2237550J1709830
$$ plain form
35592 -7226342 -26564499 -28568134 -12159194 6888982 17518655 22412278 25416997 23367499
35584 23367499 15760260 10702526 12391735 11878571 734560 -13380232 -16671717 -9340518
35576 -9340518 -2721092 7366 5457073 13460483 15398699 12353439 18435520 37771997
35568 37771997 52040529 42844290 17123471 -2272848 -5114277 -245391 2707606 4698291
35560 4698291 9671201 16802923 24022404 31885826 39846527 43202059 37567023 24672921
35552 24672921 11637829 4627321 3384275 2589468 -14343 1112135 10992038 22433206
35544 22433206 21482520 6811799 -6414311 -7369570 -3452281 -4628264 -5379720 3229593
35536 3229593 11900806 2793727 -20838362 -33920805 -22294732 -57182 11652648
35529A1652648k660244p662946n628232j149834M565167P151862L497361J365189
35521A1130971Q818228J6744896R776461p498830j5268211q946853k992068k873349
35513H891245K053919J2234890J1038597m631613j2602786m75397J1449843K753686
35505C0712384j3148710j2419950Q1220L643500o89226K613675Q415720j515251
35497A7693362j9185160j6183583P096692J5805077l800773j9263164k801445
35490b0638994K4316312K6054329N957957n208140j15844J599969o678912r356193
35482A5930484q66171L596899k721896m416291Q314532J9411874J0492311j0135668
35474C9606074j9197705j0669151J66543J687935M4393N401796J4292880J3160294
$$ plain form
35529 11652648 8992404 1329458 -4298774 -5448608 -883441 6268421 9765782 11130971
35521 11130971 19949199 36694095 46470556 38971726 23703515 14756662 11764594 8891245
35513 8891245 10945164 23180054 34218651 29587038 16984252 16508855 27958698 30712384
35505 30712384 17563674 5143724 5224944 8868444 8179218 10792893 19208613 17693362
35497 17693362 -1491798 -17675381 -10578689 5226388 1425615 -17837549 -20638994
35490 -20638994 3677318 29731647 35689604 30481464 30365620 31965589 25286677 15930484
35482 15930484 15064313 18661212 15939316 11523025 19837557 39249431 49741742 39606074
35474 39606074 20408369 9739218 9905761 11593696 11638089 17039885 31332765 44493059
35466D4493059k310020j7689303j4856865M251724J6858468P280072j1950395
35459B6076740j6765379l928760P122929L388665o707574j1100970j1282056j3152641
35451b6349046j3235301n505501O011962J2406162J2307094R995996O258817J60420
35443B050603m666431m494764k377552k440608k123235J120443J194372p285035
35435a9022207j5836427j1829017J158558P324979K846916M93312P013420J1725961
35427a6124505M914546o094607r310250n599695k279717J842850J1045520J7904773
35419c701085J0084038p973985j5377389k185064J5433209J6024438N76644j1393517
35411A487289r170647j661785J30574j148234J714646M941042o97330j2176978
$$ plain form
35466 44493059 42183039 24493736 9636871 13888595 30747063 38027135 26076740
35459 26076740 9311361 5382601 12505530 15894195 9186621 -1914349 -13196405 -26349046
35451 -26349046 -39584347 -45089848 -39077886 -26671724 -14364630 -4368634 1890183 2050603
35443 2050603 -2615828 -7110592 -9488144 -11928752 -14051987 -12931544 -11737172 -19022207
35435 -19022207 -34858634 -46687651 -45529093 -38204114 -35357198 -34863886 -27850466 -16124505
35427 -16124505 -11209959 -17304566 -26614816 -32214511 -34494228 -32651378 -21605858 -3701085
35419 -3701085 6382953 -1591032 -16968421 -19153485 -3720276 12304162 12880806 1487289
35411 1487289 -7683358 -9345143 -9214569 -10362803 -8648157 -3707115 -4404445 -16581423
35403a6581423j5138339m257313R228048J5134253J7783573K3091078K2761768
35396E2021645N716365j9465390k9498602j5701322M441452R741089m34671j0266281
35388c445715q557889J169381Q047009N901530j302165m314257K93728N627275
35380C418897M442608K75658J614500P293400P267126j863478j1906501j5157286
35372d615076j1827547m009137O658989J2809029N688980r269103j4344101m122778
35364b3030744N094997j11837r746702p240404M930816J1867684R588361N650877
35356b996952L265357Q63540J686905P544536Q955690p04673p486430N040265
35348A6168238K3920844J8801148j2471694l6748471l1214947j0690831J877264
$$ plain form
35403 -16581423 -31719762 -35977075 -26749027 -11614774 6168799 29259877 52021645
35396 52021645 57738010 38272620 8774018 -6927304 -2485852 7255237 6820566 -3445715
35388 -3445715 -12003604 -10834223 -2787214 3114316 1812151 -2502106 -2208378 3418897
35380 3418897 7861505 8137163 9751663 17045063 24312189 22448711 10542210 -4615076
35372 -4615076 -16442623 -20451760 -13792771 -983742 4705238 -4563865 -18907966 -23030744
35364 -23030744 -17935747 -18047584 -27794286 -35034690 -30103874 -18236190 -8647829 -2996952
35356 -2996952 268405 1131945 2818850 10363386 19319076 18614403 11127973 16168238
35348 16168238 40089082 58890230 46418536 9670065 -21544882 -32235713 -30358449
35341c0358449P139397J4362276J6668117M540650j0182997q036407P678833J5569568
35333A7380988P274128m771560q463458m355192K060823O185940L697051l728668
35325A5280052n357225L745106J0578230J901088j2384555j2505053p56747K520319
35317C021215o104597p767239M461899J2093088L091015o628167k06460J1178561
35309A3139315O742869j0340808j9347559j3485490m485496o15144O82482L80522
35301b7329309l918868p100076J3584J4508231K2747462J9730346J3591007Q915256
35293D1157633K84842j3185838k1329641j8227364j1689440r066916n144511N191849
35285c2009386J2510028N339908q752547j0272568M739515J8967764J8652223
$$ plain form
35341 -30358449 -23219052 -8856776 7811341 12351991 2168994 -5867413 1811420 17380988
35333 17380988 24655116 19883556 11420098 7064906 9125729 15311669 19008720 15280052
35325 15280052 9922827 13667933 24246163 26147251 13762696 1257643 500896 3021215
35317 3021215 -3083382 -10850621 -6388722 5704366 8795381 2167214 1960754 13139315
35309 13139315 19882184 9541376 -9806183 -23291673 -27777169 -28392313 -27709831 -27329309
35301 -27329309 -31248177 -38348253 -38334669 -23826438 -1078976 18651370 32242377 41157633
35293 41157633 41442475 28256637 6926996 -11300368 -22989808 -32056724 -37201235 -32009386
35285 -32009386 -19499358 -14159450 -22911997 -33184565 -28445050 -9477286 9174937
35278I174937J0724527P799930P247029k332096j8888939k5457700j2994764O601601
35270a8125475J6037639J2879620O719578K657087j985953p248929q131370l884144
35262a081947k86292j71067j16221R12425r85649m705363k092078P695813J2183793
35253A1353414L345913p800173o241244M672012R740580N716838K904007M788727
35245B8480074K716294o604659j3499595j0964065n533928n483509p978241n529422
35237b4397051J946657Q261282Q944516L552461m693503q466157k142686Q679914
35229h314567J0809470M81667j0695263j1104214k802027M969273Q107161P556235
35221i92265M017683n88643j883709J062069L459001K373376N79911k35983k399976
$$ plain form
35278 9174937 19899464 27699394 34946423 32614327 13725388 -11732312 -24727076 -18125475
35270 -18125475 -2087836 10791784 17511362 20168449 18182496 10933567 2802197 -1081947
35262 -1081947 -1368239 -1539306 -1655527 -743102 -1728751 -6434114 -8526192 -830379 11353414
35253 11353414 14699327 6899154 657910 5329922 15070502 20787340 23691347 28480074
35245 28480074 31196368 24591709 11092114 128049 -5405879 -10889388 -18867629 -24397051
35237 -24397051 -22450394 -14189112 -5244596 -1692135 -6385638 -14851795 -16994481 -8314567
35229 -8314567 2494903 2976570 -7718693 -18822907 -21624934 -16655661 -8548500 -992265
35221 -992265 3025418 2436775 553066 1615135 5074136 7447512 8027423 7791440 5391464
35212E391464n239763m555416k451856n913323j1201627m955425J1201560J5086036
35204b638350k964701j9017562q218196J5556357J8905438l90186j1614854J11288
35196a0270766J3350230P110325p953583j0063463J094152R637777Q780933L959563
35188A5645168j538821q176451j0977432l041540J1111414J6769802P120765p000841
35180A9912064j0364301k770592J171123p032620j5838636q616453J0767517K0352282
35172G580384J0688000k232791l295481j255758r371312j7301922o057920J6526658
35164d720142K2414487N468224r504975n008499O821136R454442O287387O156880
35156C7368940M174852o566123j8419695j9814909j1955636k877683M397716P633997
$$ plain form
35212 5391464 151701 -4403715 -6855571 -12768894 -23970521 -28925946 -17724386 -2638350
35204 -2638350 -5603051 -24620613 -32838809 -17282452 1622986 1232800 -10382054 -10270766
35196 -10270766 3079464 10189789 2236206 -7827257 -6733105 2904672 11685605 15645168
35188 15645168 14106347 5929896 -5047536 -8089076 3022338 19792140 26912905 19912064
35180 19912064 9547763 6777171 7948294 915674 -14922962 -23539415 -12771898 7580384
35172 7580384 18268384 16035593 12740112 11484354 2113042 -15188880 -21246800 -4720142
35164 -4720142 17694345 23162569 13657594 8649095 15470231 24924673 31212060 37368940
35156 37368940 41543792 34977669 16557974 -3256935 -15212571 -18090254 -13692538 -6058541
35148f058541K142920p422185o088935Q445533J6667162N130421j1712348j4007163
35140a2903136n802917k581477l612283M75572L989277m303788j5161158q951844
35132d8851754J0971182K0495258J0846817j319762k475918J466491J823946j57214
35124g200954k601606o946390q170526J123637J3243066J1401850k155568n219284
35116f525775R580678K0929800J1600238n595663j0553504o602251q539171j3239796
35108h945444n329442J3447662K2559454J1730637n483325j1692722o531436j309409
35100H445975j682647l516378k384663K1983O9078j621582j586069O87304K806803
35091A239804M767262Q338849J0774429P229633J353000K429532P437573N72897
$$ plain form
35148 -6058541 -3915621 -11337806 -17426741 -8981208 7685954 12816375 1104027 -12903136
35140 -12903136 -18706053 -21287530 -24899813 -24424241 -20434964 -24738752 -39899910 -48851754
35132 -48851754 -37880572 -17385314 -6538497 -7858259 -10334177 -8867686 -7043740 -7200954
35124 -7200954 -9802560 -16748950 -24919476 -23795839 -10552773 849077 -1306491 -6525775
35116 -6525775 3054903 23984703 35584941 29989278 19435774 12833523 4294352 -8945444
35108 -8945444 -14274886 -827224 21732230 33462867 27979542 16286820 9755384 8445975
35100 8445975 6763328 3246950 862287 884270 953348 -668234 -2254303 -1566999 1239804
35091 1239804 6007066 14345915 25120344 32349977 33702977 36132509 43570082 44142979
35083D4142979j9467496k8435759j0182498J3829017J3080875n292580q978460
35076a303922N803832R148750r906376k2969599r183232J0853369J0467848p99207
35068g888537K447499J8254730K3465480J1519918k596394q790228j0164636q871160
35060A7376672l611585J224499O5438l624161m653423o472832j0804662p623638
35052a8123692P485131J7647939P633093q196743o120019P206479N004625j3292398
35044g55585j9140868k214437J2331428N379183o949592l059437R362863R833905
35036D787460r44803n932060L9409P085197Q910476P351917K684078n412546j0336687
35027H232441n687921K363020K282601n249329r312820o839718n281531o345628
$$ plain form
35083 44142979 24675483 -3760276 -13942774 -113757 12967118 7674538 -1303922
35076 -1303922 4499910 13648660 3742284 -19227315 -28410547 -17557178 -7089330 -7888537
35068 -7888537 -5441038 12813692 36279172 47799090 45202696 36412468 26247832 17376672
35060 17376672 13765087 14989586 15055024 11430863 6777440 304608 -10500054 -18123692
35052 -18123692 -10638561 7009378 14642471 6445728 325709 7532188 12536813 -755585
35044 -755585 -19896453 -22110890 -9779462 -4400279 -11349871 -14409308 -5046445 4787460
35036 4787460 3842657 -2089403 -2049994 5035203 13945679 21297596 23981674 18569128 8232441
35027 8232441 2544520 4907540 7190141 1940812 -7372008 -14211726 -19493257 -25838885
35019b5838885j458534J1121028J7522707O914809r387364j0739148L438319J1367673
35011B940605j23001j5794240j4138440J60457L329288r799865j5876197J020423
35003d8280970K2032880J9137571l462728j4859330r04955J9074233K2306729
34996A5043430J0712012Q79762K01558L676569N493853L804958r80132n695729
34988C3136281o282919m044740m337929o465619l676899K779215J146319j1114208
34980A139501j6824831j860886J9915850K1863484K010293j3256769o315567Q733971
34972A5405046J0159311R95252P85516J2209588J5905536J139216j6069408j5577085
34964B4952972j444602O586520K783000m18804L141941K768160q992653k0446840
$$ plain form
35019 -25838885 -27297419 -16176391 1346316 8261125 -1126239 -11865387 -8427068 2940605
35011 2940605 2817604 -12976636 -27115076 -26954619 -23625331 -33425196 -49301393 -48280970
35003 -48280970 -26248090 -7110519 -10573247 -25432577 -26337532 -7263299 15043430
34996 15043430 25755442 26635204 26836762 30513331 36007184 39812142 38832010 33136281
34988 33136281 26853362 22808622 18470693 12005074 8328175 11107390 12253709 1139501
34980 1139501 -15685330 -17546216 2369634 24233118 26243411 12986642 6671075 15405046
34972 15405046 25564357 26559609 27345125 39554713 55460249 56599465 40530057 24952972
34964 24952972 23508370 30094890 32877890 32459086 35601027 38369187 29376534 8929694
34956H929694j6029131J531806J5257491J4472307K274670j1868383j7901797
34949c333343r449442P244799J3575102q10977k1276613k3930712n634572J3865691
34941b9750067J8363894J1041119L487387J237422K957134M497237J588336m376678
34933I045784m605776M629909J1906360N486459n742954l124440J1072994J4280824
34925D2949160o86180j1920520j495015J6001215J4437192o254067k1531328j6337503
34917A5162954j555709M307560j978894q330190m722192M698544Q341017L404259
34909A9327349j561551k495701p234504j8006900j9111453K10221K0468577J4540096
34901F136134q707852j3566701P044895J9017746J851514j8028891j0801459R660449
$$ plain form
34956 8929694 -7099437 -5567631 9689860 24162167 26436837 14568454 -3333343
34949 -3333343 -12782785 -5537986 8037116 7226139 -14050474 -37981186 -43615758 -29750067
34941 -29750067 -11386173 -345054 3142333 4379755 7336889 11834126 13422462 9045784
34933 9045784 4440008 9069917 20976277 26462736 20719782 17595342 28668336 42949160
34925 42949160 42262980 30342460 28847445 44848660 59285852 53031785 31500457 15162954
34917 15162954 13607245 17914805 15935911 7605721 2883529 7582073 15923090 19327349
34909 19327349 17765798 15270097 8035593 -9971307 -29082760 -28872539 -8403962 6136134
34901 6136134 -2571718 -16138419 -9093524 9924222 11775736 -6253155 -17054614 -7394165
$$ [...]
##END NTUPLES=NMR SPECTRUM
##END=
