##TITLE=31Pdec_RV2303
 CD3CN, 124 sc
 24.3.2020
##JCAMPDX= 6.0         $$ Bruker NMR JCAMP-DX V2.0
##DATA TYPE= NMR SPECTRUM
##DATA CLASS= NTUPLES
##ORIGIN= UXNMR, Bruker Analytische Messtechnik GmbH
##OWNER= root
$$ XWIN-NMR		Version 3.5
$$ Tue Mar 24 14:18:21 2020 Russian Standard Time (UT+4h)  she@DPX200
##.OBSERVE FREQUENCY= 81.013821
##.OBSERVE NUCLEUS= ^31P
##.ACQUISITION MODE= SIMULTANEOUS
##.ACQUISITION SCHEME= undefined
##.AVERAGES= 124
##.DIGITISER RES= 17
##SPECTROMETER/DATA SYSTEM= spect
##.PULSE SEQUENCE= zgpg30
##.SOLVENT NAME= CDCl3
##.SHIFT REFERENCE= (INTERNAL, CDCl3, 0, 182.463)
##AUDIT TRAIL= $$ (NUMBER, WHEN, WHO, WHERE, WHAT)
$$ ##TITLE= Audit trail, XWIN-NMR		Version 3.5
$$ ##JCAMPDX= 5.01
$$ ##ORIGIN= Bruker BioSpin GmbH
$$ ##OWNER= she
$$ F:/spectra/data/she/nmr/P31/1/pdata/1/auditp.txt
$$ ##AUDIT TRAIL=  $$ (NUMBER, WHEN, WHO, WHERE, WHAT)
(   1,<2020-03-24 14:15:10.84 +0400>,<she>,<DPX200>,
      <continue with go, POWCHK disabled, PULCHK disabled
       configuration hash MD5:
       00 E9 B6 7A A2 85 ED C7 34 08 36 98 17 FE 4E 26
       data hash MD5: 32K
       97 DE 46 A8 80 8A 18 05 AE E7 41 87 E0 AF 85 8C>)
(   2,<2020-03-24 14:17:43.45 +0400>,<she>,<DPX200>,
      <Start of raw data processing
       efp BC_mod = 2 LB = 1 FT_mod = 6 PKNL = 1 PHC0 = -1385.616 PHC1 = 190.6017 SI = 64K 
       data hash MD5: 64K
       F0 9B 08 56 1D 87 A5 CF B5 42 87 49 41 A9 53 41>)
(   3,<2020-03-24 14:17:57.40 +0400>,<she>,<DPX200>,
      <abs ABSG = 5 
       data hash MD5: 64K
       9F 31 F8 2C DC 28 A0 B1 5B 28 95 F4 1C 56 8E 5F>)
$$ ##END=
$$ 
$$ hash MD5
$$ 1C 5B FA D9 75 FB 5F 6F 6E 30 94 B2 07 36 62 95
##$RELAX= 
##$RELAX= 
##$RELAX= 
##$RELAX= 
##$RELAX= 
##$RELAX= 
##$RELAX= 
##$RELAX= 
$$ Bruker specific parameters
$$ --------------------------
##$DU= <F:/spectra>
##$EXPNO= 1
##$NAME= <P31>
##$PROCNO= 1
##$TYPE= <nmr>
##$USER= <she>
##$AMP= (0..31)
100 100 100 100 100 100 100 100 100 100 100 100 100 100 100 100 100 100 
100 100 100 100 100 100 100 100 100 100 100 100 100 100 
##$AQSEQ= 0
##$AQ_mod= 1
##$AUNM= <au_zg>
##$AUTOPOS= <>
##$BF1= 81.014009
##$BF2= 200.13
##$BF3= 200.13
##$BF4= 200.13
##$BF5= 200.13
##$BF6= 200.13
##$BF7= 200.13
##$BF8= 200.13
##$BYTORDA= 1
##$CFDGTYP= 0
##$CFRGTYP= 5
##$CHEMSTR= <none>
##$CNST= (0..31)
1 1 145 1 1 1 1 1 1 1 1 1 1 1 1 1 1 1 1 1 1 1 1 1 1 1 1 1 1 1 1 1 
##$CPDPRG= <waltz16>
##$CPDPRG1= <>
##$CPDPRG2= <waltz16>
##$CPDPRG3= <>
##$CPDPRG4= <mlev>
##$CPDPRG5= <mlev>
##$CPDPRG6= <mlev>
##$CPDPRG7= <mlev>
##$CPDPRG8= <mlev>
##$CPDPRGB= <>
##$CPDPRGT= <>
##$D= (0..31)
0 1 0 0 0 0 0 0 0 0 0 0.03 2e-05 3e-06 0 0 0 0 0 0 0 0 0 0 0 0 0 0 0 0 
0 0 
##$DATE= 1585044685
##$DBL= (0..7)
120 120 120 11 120 120 24 19 
##$DBP= (0..7)
150 150 150 150 150 150 150 150 
##$DBP07= 0
##$DBPNAM0= <>
##$DBPNAM1= <>
##$DBPNAM2= <>
##$DBPNAM3= <>
##$DBPNAM4= <>
##$DBPNAM5= <>
##$DBPNAM6= <>
##$DBPNAM7= <>
##$DBPOAL= (0..7)
0.5 0.5 0.5 0.5 0.5 0.5 0.5 0.5 
##$DBPOFFS= (0..7)
0 0 0 0 0 0 0 0 
##$DE= 6
$$ [...]
##$SUBNAM3= <"">
##$SUBNAM4= <"">
##$SUBNAM5= <"">
##$SUBNAM6= <"">
##$SUBNAM7= <"">
##$SUBNAM8= <"">
##$SUBNAM9= <"">
##$SW= 369.568048894756
##$SWIBOX= (0..15)
0 1 3 0 0 0 0 0 0 0 0 0 0 0 0 0 
##$SW_h= 29940.119760479
##$TD= 32768
##$TD0= 1
##$TE= 0
##$TE2= 300
##$TE3= 300
##$TEG= 300
##$TL= (0..7)
0 120 53 12 22 120 120 120 
##$TP= (0..7)
150 150 150 150 150 150 150 150 
##$TP07= 0
##$TPNAME0= <>
##$TPNAME1= <>
##$TPNAME2= <>
##$TPNAME3= <>
##$TPNAME4= <>
##$TPNAME5= <>
##$TPNAME6= <>
##$TPNAME7= <>
##$TPOAL= (0..7)
0.5 0.5 0.5 0.5 0.5 0.5 0.5 0.5 
##$TPOFFS= (0..7)
0 0 0 0 0 0 0 0 
##$TUNHIN= 0
##$TUNHOUT= 0
##$TUNXOUT= 0
##$USERA1= <user>
##$USERA2= <user>
##$USERA3= <user>
##$USERA4= <user>
##$USERA5= <user>
##$V9= 5
##$VALIST= <valist>
##$VCLIST= <CCCCCCCCCCCCCCC>
##$VD= 0
##$VDLIST= <DDDDDDDDDDDDDDD>
##$VPLIST= <PPPPPPPPPPPPPPP>
##$VTLIST= <TTTTTTTTTTTTTTT>
##$WBST= 1024
##$WBSW= 4
##$XGAIN= (0..3)
0 0 0 0 
##$XL= 0
##$YL= 0
##$YMAX_a= 9618
##$YMIN_a= -24915
##$ZGOPTNS= <>
##$ZL1= 120
##$ZL2= 120
##$ZL3= 120
##$ZL4= 120
##$ABSF1= 182.463
##$ABSF2= -187.1042
##$ABSG= 5
##$ABSL= 3
##$ALPHA= 0
##$AQORDER= 0
##$ASSFAC= 0
##$ASSFACI= 0
##$ASSFACX= 0
##$ASSWID= 0
##$AUNMP= <proc_1d>
##$AZFE= 0.1
##$AZFW= 0.5
##$BCFW= 0
##$BC_mod= 2
##$BYTORDP= 0
##$COROFFS= 0
##$CY= -3
##$DATMOD= 1
##$DC= 0
##$DFILT= <>
##$DTYPP= 0
##$F1P= 0
##$F2P= 0
##$FCOR= 1
##$FTSIZE= 65536
##$FT_mod= 6
##$GAMMA= 0
##$GB= 0
##$INTBC= 1
##$INTSCL= 5.30512e-09
##$ISEN= 30
##$LB= 1
##$LEV0= 0
##$LPBIN= 0
##$MAXI= 10000
##$MC2= 0
##$MEAN= 0
##$ME_mod= 0
##$MI= 50
##$NCOEF= 0
##$NC_proc= -8
##$NLEV= 6
##$NOISF1= 182.463
##$NOISF2= 159.3651
##$NSP= 0
##$NTH_PI= 0
##$NZP= 0
##$OFFSET= 182.463
##$PC= 4
##$PHC0= -1385.616
##$PHC1= 190.6017
##$PH_mod= 1
##$PKNL= yes
##$PPARMOD= 0
##$PSCAL= 0
##$PSIGN= 0
##$REVERSE= no
##$SF= 81.0140089999434
##$SI= 65536
##$SIGF1= 159.3651
##$SIGF2= -187.1042
##$SINO= 113.3802
##$SIOLD= 16384
##$SREGLST= <1H.CDCl3>
##$SSB= 0
##$STSI= 65536
##$STSR= 0
##$SW_p= 29940.119760479
##$SYMM= 0
##$S_DEV= 0
##$TDeff= 32768
##$TDoff= 0
##$TI= <>
##$TILT= no
##$TM1= 0
##$TM2= 0
##$TOPLEV= 0
##$USERP1= <user>
##$USERP2= <user>
##$USERP3= <user>
##$USERP4= <user>
##$USERP5= <user>
##$WDW= 1
##$XDIM= 65536
##$YMAX_p= 269274285
##$YMIN_p= -467284322
$$ End of Bruker specific parameters
$$ ---------------------------------
##NTUPLES= NMR SPECTRUM
##VAR_NAME=  FREQUENCY,     SPECTRUM/REAL,   SPECTRUM/IMAG
##SYMBOL=    X,             R,               I
##VAR_TYPE=  INDEPENDENT,   DEPENDENT,       DEPENDENT
##VAR_FORM=  AFFN,          ASDF,            ASDF
##VAR_DIM=   65536,         65536,           65536
##UNITS=     HZ,            ARBITRARY UNITS, ARBITRARY UNITS
##FACTOR=    0.456856943014862, 1,           1
##FIRST=     14782.0589164792, 0,            0
##LAST=      -15158.0608439998, 0,           0
##MIN=       -15158.0608439998, -467284322,  0
##MAX=       14782.0589164792, 269274285,    0
$$ Real data points
##PAGE= N=1
##DATA TABLE= (X++(R..R)), XYDATA
$$ [...]
4083A5022455n004096j7055827r805685Q033019J8146824J2631346R02202l678222
4075A9192016m40419M49739n141036q886178l700768M283559M796997r68172l422140
4066F163598r74325k412210j0813463j5361057n971897J0342424J6526064P061261
4058D560395n573783p465423M31139O932491P217749P517873J2598952J5767283
4050D1986676P710749p489620j3983829m735890O966267L847368j1643311j9725404
4042B933006r680754O277295J0456641K787798k321660J987544O944767L387235
4034B2771872m367461n831849k10913K826179k453447r735927j0023321m514162
4026a1539029k864728r732499j8107811j7332440m313993J4406939K8072587K7967356
$$ plain form
4083 15022455 10018359 -7037468 -16843153 -8810134 9336690 21968036 22870238 19192016
4075 19192016 18751597 19201336 14060300 5174122 1473354 5756913 10553910 9585738 6163598
4066 6163598 5189273 2777063 -8036400 -23397457 -29369354 -19026930 -2500866 4560395
4058 4560395 -1013388 -8478811 -8047672 -1115181 6102568 13620441 26219393 41986676
4050 41986676 49697425 42207805 28223976 23488086 30454353 34301721 22658410 2933006
4042 2933006 -6747748 -470453 9986188 12773986 10452326 12439870 19384637 22771872
4034 22771872 18404411 12572562 12361649 15187828 12734381 2998454 -7024867 -11539029
4026 -11539029 -14403757 -24136256 -42244067 -59576507 -63890500 -49483561 -21410974 6556382
4018F556382J3738891k987990p107353J934886O248473p759058k7942105l0307858
4010d7625732j1969589N525834P742047M584996Q603043J3759152R490151J373288
4002h516810J65567J231925n091684j1057971k781157J0624204N755987j5762583
3994b5432522k4232054n981500J5723300J6878285N526735P67368J157104l171251
3986a8764535m986282O455714J8785427J2245200n292383q261484N025550J0893318
3978A6100525J264458n090181J321873M244701o125840j3045764l227708P827861
3970C269925K264929q998013o122550N230100O217405p06261J542349J0861314
3962A3559198Q760609m805417q927617K393886R596293P30234r920297p952594
$$ plain form
4018 6556382 20295273 17307283 10199930 12134816 18383289 10624231 -17317874 -47625732
4010 -47625732 -59595321 -54069487 -46327440 -41742444 -33139401 -19380249 -9890098 -8516810
4002 -8516810 -8351243 -7119318 -12211002 -23268973 -26050130 -15425926 -9669939 -25432522
3994 -25432522 -49664576 -55646076 -39922776 -23044491 -17517756 -16750388 -15593284 -18764535
3986 -18764535 -23750817 -17295103 1490324 13735524 8443141 181657 5207207 16100525
3978 16100525 17364983 12274802 13596675 17841376 11715536 -1330228 -4557936 3269925
3970 3269925 5534854 -3463159 -9585709 -4355609 1861796 1155535 2697884 13559198
3962 13559198 22319807 17514390 8586773 10980659 20576952 21307186 11386889 3434295
3954C434295j314572k298632o161572m143268j843554o573725r351243Q43155
3946b7409116J4181418J1966080l564206j1557374l650488N827279L253867o499889
3938a7452429j0678223n187248M578548J1020021R162960J060123l782455M59900
3930a0818803N685422K82735j1732349j4406337l332393Q123964R152070M416622
3922a2629069J706340L99633n51601L572048J1932972J2701593L25740j2235060
3914E222596j0999309j410750K072224j898581m956700o601984j0646600j0022395
3906c9241499M370786K1960237K1627525M277295n946897J804948J0155479M557422
3898B3565296l902082k347872j566295j5380164l0385942k3047188J448900J5127477
$$ plain form
3954 3434295 2119723 -178909 -6340481 -10483749 -12327303 -18901028 -28252271 -27409116
3946 -27409116 -13227698 -1261618 -4825824 -16383198 -20033686 -14206407 -10952540 -17452429
3938 -17452429 -28130652 -33317900 -28739352 -17719331 -8556371 -7496248 -11278703 -10818803
3930 -10818803 -5133381 -4850646 -16582995 -30989332 -34321725 -26197761 -17045691 -12629069
3922 -12629069 -10922729 -10523096 -11074697 -7502649 4430323 17131916 17457656 5222596
3914 5222596 -5776713 -7187463 -5115239 -7013820 -11970520 -18572504 -29219104 -39241499
3906 -39241499 -34870713 -12910476 8717049 12994344 7047447 8852395 19007874 23565296
3898 23565296 19663214 17315342 15749047 368883 -30017059 -53064247 -51615347 -36487870
3890c6487870R513518M171920J0071691J2722446K375053m745524O651416K2377620
3882B6650270J9260513J459120p337131j188106L041148k880771o420503J72981
3874C2757521M007936n878633j6582095r497501Q857021J3433570l386564k0061419
3866C649836j5524407K622212R671492l145888j8832622j8084011k950596Q704212
3858c3889772P303704J252144J681809O503818O733902L121805N242994J4058701
3850A2009105J7502973Q754966j750461j974092K296490l271896j6966658k1037531
3842d437104p889670P940038R865527j86962r175283j1202173q308321m85741
3834b3879689J2496965K2371591J8100100J570063j2313309j3756255q154942
$$ plain form
3890 -36487870 -26974352 -22802432 -12730741 -8295 2366758 -2378766 4272650 26650270
3882 26650270 45910783 47369903 40032772 38844666 41885814 39005043 32584540 32757521
3874 32757521 36765457 30886824 14304729 4807228 13664249 27097819 23711255 3649836
3866 3649836 -11874571 -9252359 419133 -2726755 -21559377 -39643388 -42593984 -33889772
3858 -33889772 -26586068 -25333924 -23652115 -17148297 -10414395 -7292590 -2049596 12009105
3850 12009105 29512078 38267044 36516583 34542491 36838981 33567085 16600427 -4437104
3842 -4437104 -12326774 -4386736 5478791 5291829 -3883454 -15085627 -23393948 -23879689
3834 -23879689 -11382724 10988867 29088967 30659030 18345721 4589466 -3565476
3827c565476n101373n272621l477834J121934M421726M292821K519226R57238
3819d104359K50402J661885N634688Q196838L626403o835330j2871803o338890
3811a0780166P102285J3324537P307669q35523l45367O134856Q751856M726023
3803C5386170k172312j1346227k2343664k4890869q206327J7202606K4630535
3796H259912O422240j2010743n989329J4954057K3803914J4315330K147307m473758
3788D7428930j2092597k1932938k4839498j8634329j0942959k211412J3971319
3781b9253484L0163417K7183252M539849j3391644j2339115p322864j2918913
3774a3339502j6958389m389672J1833719R746959m143816l878475J5263622L0998741
$$ plain form
3827 -3565476 -8666849 -13939470 -17417304 -16295370 -11873644 -7580823 -5061597 -4104359
3819 -4104359 -3853957 -2192072 3442616 11639454 15265857 8430527 -4441276 -10780166
3811 -10780166 -3677881 9646656 16954325 16118802 15773435 21908291 30660147 35386170
3803 35386170 33213858 21867631 -476033 -25366902 -33573229 -16370623 8259912
3796 8259912 14682152 2671409 -3317920 11636137 35440051 49755381 51902688 47428930
3788 47428930 35336333 13403395 -11436103 -30070432 -41013391 -43224803 -29253484
3781 -29253484 909933 28093185 32633034 19241390 6902275 -420589 -13339502
3774 -13339502 -30297891 -34687563 -22853844 -13106885 -17250701 -21129176 -5865554 25133187
3766B5133187K7560847J1730211n076288j8647531k3667640j5015358k150784
3759a33356k513755j4545606j6246027J694821J9994300J8740550M559765l661147
3751G889545k539088j958896m388641k977674L352180O854865L061297l561284
3743E732304o600853m251516O17683K791856r27902o482386n402264L408897R562952
3734a551229M097642p716596j2654267n896941M765068R498485O007123p96449
3726d247164m591602k974506Q67649K086547P8412j609117j156439m13116l61602
3717a2320938M99711J584135o26230n798341p138968m2617J0201518J4246065
3709F04335J0262614M938874L246614J743400n214250j4506529j4765980j489689
$$ plain form
3766 25133187 52694034 64424245 59347957 40700426 17032786 2017428 -133356
3759 -133356 -2647111 -17192717 -33438744 -31743923 -11749623 6990927 11550692 7889545
3751 7889545 5350457 3391561 -997080 -3974754 -622574 6232291 9293588 5732304
3743 5732304 -868549 -5120065 -4502382 -1710526 -2638428 -9120814 -14523078 -11114181 -1551229
3734 -1551229 2546413 -5170183 -17824450 -23721391 -18956323 -9457838 -3450715 -4247164
3726 -4247164 -8838766 -11813272 -10945623 -8859076 -8780664 -10389781 -11546220 -11959336 -12320938
3717 -12320938 -11821227 -10237092 -10863322 -16661663 -23800631 -23843248 -13641730 604335
3709 604335 10866949 15805823 19052437 20795837 15581587 1075058 -13690922 -15180611
3701a5180611J2493405J0354856n297168j4080171o928763O99158n176313j2578050
3693c5693657k962305J5795638J9316388M936557n641625k504582O12299l595201
3685i736488j927371J0955441J6420187K534403j1836416o230524P047687M146899
3677A1373818r340948q799541O106947J0687315k440390j1319162k218552Q253246
3669B302733K266196r730041p047255P481234J1947509j205541j4106300q954112
3661a7045577P511974J3311540Q17168j2507270p076044J1786401K0102700P481421
3653B4382313r923372j3476968n919789j083189j107228J426043N747841L944363
3645C990014k471151k595403O075499J2921780R824046R89477n435802o977814
$$ plain form
3701 -15180611 -2687206 7667650 2370482 -11709689 -18638452 -17939294 -23115607 -35693657
3693 -35693657 -38655962 -22860324 -3543936 1392621 -4249004 -6753586 -6141287 -9736488
3685 -9736488 -11663859 -708418 15711769 18246172 6409756 179232 7226919 11373818
3677 11373818 2032870 -6766671 -659724 10027591 7587201 -3731961 -5950513 2302733
3669 2302733 4568929 -5161112 -12208367 -4727133 7220376 6014835 -8091465 -17045577
3661 -17045577 -9533603 3777937 4595105 -7912165 -14988209 -3201808 16900892 24382313
3653 24382313 14458941 981973 -4937816 -6021005 -7128233 -5702190 45651 3990014
3645 3990014 1518863 -1076540 4998959 17920739 27744785 28734262 23298460 16320646
3637A6320646n933538n597958q182004j1357559q812979N12882Q372081Q892474
3629e785955P365909Q665451O101914n266910j3546753n683479Q678209R123879
3621I652265l978531j1499557o965549k472487k762365J232523Q761055N396462
3613b636184q795331j2879895J136660J2768052O588058k546262K716942J1203093
3605G555133M423951q756058o770228O740590R052707k671912p361873L816026
3597F028336J3520236P216832n335673p768302n21411M682618L431412R56537
3589B2210585J138602J534216j670717p581707r897752l348220P943178J2317791
3581B2645976M556677o425799r305322n048905k633638m296313m265897k73063
$$ plain form
3637 16320646 10387108 4789150 -3392854 -14750413 -23563392 -23050510 -14678429 -5785955
3629 -5785955 1579954 10245405 16347319 11080409 -2466344 -8149823 528386 9652265
3621 9652265 5673734 -5825823 -12791372 -15263859 -18026224 -16793701 -8032646 -2636184
3613 -2636184 -11431515 -24311410 -23174750 -10406698 -3818640 -6364902 -3647960 7555133
3605 7555133 11979084 3223026 -3547202 3193388 12246095 9574183 2212310 6028336
3597 6028336 19548572 26765404 21429731 13661429 13140018 17822636 21254048 22210585
3589 22210585 23349187 24883403 23212686 15630979 5733227 2385007 10328185 22645976
3581 22645976 27202653 20776854 11471532 6422627 3788989 -507324 -4773221 -5046284
3573e046284K898008J661160j753889l373041q06232O353929J3963827J3380393
3565B7277871R34176j4178899j8717223j1404908k995535m80726J105870Q862344
3557i597030J9842207K2800662J0795838r670992k2938196j9204585m780362N870144
3549f882314P310207O346283Q266565R036354M625519r82766l003988l500918
3541B1214942n487762o187791k562227K526352N128014M882450J171118o662098
3533A4022998j1893884n473143O533054O024574q601556j5382158k979574Q310965
3525i438724q46319j4760381p985762J0843692J3229402k42981j798334J3963109
3517B963702K0347046N650403o180217L073525J5485846Q574231q143262j1853789
$$ plain form
3573 -5046284 -2148276 -487116 -2241005 -5614046 -6420278 -66349 13897478 27277871
3565 27277871 28212047 14033148 -4684075 -16088983 -19084518 -19565244 -18459374 -9597030
3557 -9597030 10245177 33045839 43841677 34170685 11232489 -7972096 -12752458 -6882314
3549 -6882314 427893 6774176 15040741 24077095 28702614 27719848 24715860 21214942
3541 21214942 15727180 9539389 6977162 9503514 14631528 19513978 20685096 14022998
3533 14022998 2129114 -3344029 3189025 9213599 612043 -14770115 -17749689 -9438724
3525 -9438724 -10285043 -25045424 -33031186 -22187494 -8958092 -9201073 -10999407 2963702
3517 2963702 23310748 28961151 22780934 25854459 41340305 49914536 41771274 29917485
3509B9917485k842966J873749k011030n847174q028855j3314247j8161300j4965790
3501c3380128o473109n54423M110768J2195949J7591329J1610692Q37704o40256
3493E298526N421007L709774q367311j4591118n129743P657799P555279k295039
3485g40826n698821K068246P413135j637600j6115375j4912359O563153K5732051
3477B671604J9573028l686652j3882344L38300J7346355J5191405O26492p206792
3469C0971396o525077p965019j0834792o107612K106011Q06164o504642j519459
3461e573030J7026194K5203118Q288376j4915745j7221167J49687J2670120P218727
3453C2846280n122971r250023m300266J016081J014622l180571o325157l007581
$$ plain form
3509 29917485 27074519 28948268 26937238 21090064 13061209 -253038 -18414338 -33380128
3501 -33380128 -39853237 -40407660 -36296892 -24100943 -6509614 5101078 5938782 5298526
3493 5298526 10719533 14429307 6061996 -8529122 -13658865 -6001066 1554213 -740826
3485 -740826 -6439647 -4371401 3041734 1404134 -14711241 -29623600 -23060447 2671604
3477 2671604 22244632 18557980 4675636 5013936 22360291 37551696 38178188 30971396
3469 30971396 24446319 16481300 5646508 -461104 1644907 2451071 -4053571 -5573030
3461 -5573030 11453164 36656282 44944658 30028913 12807746 12957433 25627553 32846280
3453 32846280 27723309 18473286 14173020 15189101 16203723 13023152 6697995 3690414
3445C690414O329237J2527826O634493p378645j5749729j2957013q252752r098646
3437b4254815p456275O346224K2119641J8452194n358825k2207201j1109992J3969484
3429i499565K2464023O798828j1723248j3845567l255809N554401O081228P03289
3421C277580o191937q997556k958743Q117541J2976324P137057r36645l044499
3413I379122k534069n496620q691996n659059P55816K137556k142555m441867
3405a6693672m48865O273620J0649780J0868547P458865K404220j765729n046654
3397A3700112r276039j1953151o608755N958645J3598929P369044n303908j0266543
3389b781666m744499L016837P863616J1261021J3192602J0731897M202243l273074
$$ plain form
3445 3690414 10019651 22547477 29181970 21803325 6053596 -6903417 -15156169 -24254815
3437 -24254815 -31711090 -25364866 -3245225 15206969 9848144 -12359057 -23469049 -9499565
3429 -9499565 12964458 19763286 8040038 -5805529 -9061338 -3506937 2574291 3277580
3421 3277580 -2914357 -11911913 -14870656 -6753115 6223209 13360266 12423621 9379122
3413 9379122 6845053 1348433 -7343563 -13002622 -12246806 -10109250 -12251805 -16693672
3405 -16693672 -17142537 -10868917 -219137 10649410 18108275 20512495 18746766 13700112
3397 13700112 4424073 -7529078 -14137833 -8179188 5419741 12788785 7484877 -2781666
3389 -2781666 -7526165 -4509328 3354288 14615309 27807911 38539808 42742051 39468977
3381C9468977j0938969j7734581j7864783q518576J144369N3561p378956o137367
3373b7906325P005742J8348865J6508926N331712n309594j0805839j0373307m513939
3365a1713759J944254L200387J929670N721975J1556296O294323j1540505k3144427
3357a5751786j2617111J0186042K0890069R390878j1714650k3306922j6455817
3350c9379297L082003J9403414J8482992K303975j1514722r045469M931703J5641614
3342C906213J5825500Q056348l622235j4790460j8031883r913755J443548N367081
3334a1759643L353844M785146R633912P867979k385845r102918m492860K287493
3326A87108m32845p829757n696083O929811J4832960Q487381j751309k88528J1179200
$$ plain form
3381 39468977 28530008 10795427 -7069356 -15587932 -14443563 -14390002 -21768958 -27906325
3373 -27906325 -20900583 -2551718 13957208 19288920 13979326 3173487 -7199820 -11713759
3365 -11713759 -9769505 -6569118 -4639448 1082527 12638823 18933146 7392641 -15751786
3357 -15751786 -28368897 -18182855 2707214 12098092 383442 -22923480 -39379297
3350 -39379297 -36297294 -16893880 1589112 3893087 -7621635 -16667104 -11735401 3906213
3342 3906213 19731713 27788061 24165826 9375366 -8656517 -18570272 -17126724 -11759643
3334 -11759643 -8405799 -3620653 6013259 13881238 11495393 2392475 -2100385 187108
3326 187108 -245737 -8075494 -13771577 -6841766 7991194 16478575 14727266 14438738 25617938
3317B5617938J5535397M015620j1566703j5088701p407116k599154o048697p680661
3309e222077P9489Q268453L929439r516477j5532901o988149N271494R072202
3301a0638527O652793P403107J1731774J1649479N317523R99069L685471N822772
3293D2623461k011733j5404664j9304108p158770J0124782J7144253J0667075
3286C6680296m51069p423010q042004m010428J241874K250093m370346j3508558
3278B366848j4414284k965102J2453372K0086644J6854698Q506236P20155n722797
3270C7885770j1578455j4816353j1806508k602445O406220P631981J312414l558823
3262H873801o52665M401608K110253n527393o695079J973376Q982819N152064
$$ plain form
3317 25617938 41153335 45168955 33602252 18513551 11106435 8507281 2458584 -5222077
3309 -5222077 -5142588 3125865 7055304 -2461173 -17994074 -24982223 -19710729 -10638527
3301 -10638527 -3985734 3417373 15149147 26798626 32116149 33115218 36800689 42623461
3293 42623461 40611728 25207064 5902956 -1255814 8868968 26013221 36680296
3286 36680296 36229227 28806217 20764213 16753785 17995659 20245752 15875406 2366848
3278 2366848 -12047436 -15012538 -2559166 17527478 34382176 42888412 43608567 37885770
3270 37885770 26307315 11490962 -315546 -2917991 3488229 11120210 12432624 8873801
3262 8873801 8221136 12622744 14732997 9205604 2510525 4483901 13466720 18618784
3254A8618784k148926q70703O728224Q732509L408467Q72693M596018N090312
3246D5027378l064560j0259290o785048N99563j343067j1221237j4982455p917984
3238i946700j651768n746473j3467921j2741789l378134N053218P663239P765369
3230b6450959Q325920Q436745Q035467Q491321P784324K375872m717436n353561
3222F927693J329200N466296J29803q277621r470435l521372J739186L278111
3214b399139M288206N403530L353209j807401n966663p881552r482294q971599
3206b3463703k101280P918740J0803893L412265m553962m046100J902426O205739
3198c921982Q811044J1081771P108417o569247j7459181r378254J1375886J8894660
$$ plain form
3254 18618784 16469858 15599155 22327379 31059888 34468355 35341048 39937066 45027378
3246 45027378 41962818 31703528 24918480 25518043 24174976 12953739 -2028716 -9946700
3238 -9946700 -11598468 -17344941 -30812862 -43554651 -46932785 -41879567 -34216328 -26450959
3230 -26450959 -18125039 -9688294 -1652827 6838494 14622818 16998690 12281254 6927693
3222 6927693 8256893 13723189 13852992 5575371 -3895064 -7416436 -5677250 -2399139
3214 -2399139 1889067 7292597 10645806 8838405 2871742 -5009810 -14492104 -23463703
3206 -23463703 -25564983 -17646243 -6842350 -3430085 -7984047 -12030147 -10127721 -3921982
3198 -3921982 4889062 15970833 23079250 16510003 -949178 -10327432 1048454 19943114
3190A9943114K650721j5935816j2936200N091089J3294642M877994m386562n011338
3182G587644n326671r947153p963920N980974J6416338R046059m837952m618287
3174F337032P874058J3259741N918282j668846m235685r757939j7283481j3126735
3166a2683573K692698R720575o41394q281238L239521J7883966J2716138m526665
3158B0120028r626886j813297m90930q258182p802571L943750Q555052o60049
3150C966915n799984M118367J3231584N687912p638848p392461M017004R146079
3142A9336568K903576m205253m511557o294N670657R818868Q099962m81771q820954
3133B7803802j0211398p677158p147506o830221k499067K060960O98386k798475
$$ plain form
3190 19943114 22593835 6658019 -6278181 -1187092 12107550 16985544 12598982 7587644
3182 7587644 2260973 -7686180 -15650100 -9669126 6747212 15793271 10955319 6337032
3174 6337032 14211090 27470831 33389113 31720267 27484582 17726643 443162 -12683573
3166 -12683573 -9990875 -270300 -911694 -9192932 -5953411 11930555 24646693 20120028
3158 20120028 10493142 8679845 8188915 -69267 -7871838 -3928088 4626964 3966915
3150 3966915 -1833069 2285298 15516882 21204794 13565946 6173485 10190489 19336568
3142 19336568 22240144 18034891 13523334 13517040 19187697 29006565 37106527 36624756 27803802
3133 27803802 17592404 9915246 2767740 -4062481 -6561548 -4500588 -3802202 -6600677
3125f600677M22195Q536099R440104j675473j4219535j5027531l878036O876117
3117a6126737O085233l978793r567892j644907J1286408J2769164J024607p516078
3109g668995j258512J0311284J1423455K405101l450159J34946O819437R396896
3101B8113453O919405Q27929p318243j3676254j4122920r182618l210216M14403
3093a1235061R24292P1580K291988R701054J5067604Q059201p924319j5836215
3085A120124q338070R84288m17565l900907L527535J3545211Q187452q610726
3077F097342j3855815o23305J1070200M488828j0880538j6025223q119252J549102
3069b6298661N910083P020168P190697M665570j812337q516802q125683K968735
$$ plain form
3125 -6600677 -6178482 2357617 11797721 10122248 -4097287 -19124818 -23002854 -16126737
3117 -16126737 -10041504 -14020297 -23588189 -25233096 -13946688 -1177524 -152917 -7668995
3109 -7668995 -8927507 1383777 12807232 15212333 11762174 11897120 18716557 28113453
3101 28113453 35032858 35860787 28542544 14866290 743370 -8439248 -11649464 -11235061
3093 -11235061 -10310769 -10239189 -7947201 1753853 16821457 24880658 16956339 1120124
3085 1120124 -7217946 -6233658 -6651223 -10552130 -7024595 6520616 14708068 6097342
3077 6097342 -7758473 -8381778 2688422 7177250 -3703288 -19728511 -27847763 -26298661
3069 -26298661 -20388578 -13368410 -6177713 -1512143 -3324480 -11841282 -19966965 -16998230
3061a6998230J7114526J9498810N372544j1174390j3786172n022161j33809k938831
3053h067713k298181O659173J3279728Q907963O28850o58525L848860N471879
3045B7772034J309327n347277j2204690j7463614j6097744m785221J0559762J8423882
3037B166459J3589976K154997n652602n637936k019520p07980k498422n179773
3029c784801r778394j7790706k2257923j2240509Q873318K0797291J1404034n818348
3021c0596038j1395237o844399n867575p329076J392135J7329536K1833182J0552107
3013a0925365J575340O755935J4694228J1854491L091911n55965J12640q11666
3005B5791549j527004J142330K180764l109785q650180n940974L351738J1134911
$$ plain form
3061 -16998230 116296 19615106 24987650 13813260 27088 -4995073 -5128882 -8067713
3053 -8067713 -10365894 -3706721 9573007 18480970 19109820 18451295 22300155 27772034
3045 27772034 29081361 23734084 11529394 -5934220 -22031964 -26817185 -16257423 2166459
3037 2166459 15756435 17911432 12258830 6620894 4601374 3893394 1394972 -3784801
3029 -3784801 -13563195 -31353901 -53611824 -65852333 -56979015 -36181724 -24777690 -30596038
3021 -30596038 -41991275 -48835674 -54703249 -62032325 -60640190 -43310654 -21477472 -10925365
3013 -10925365 -9350025 -2594090 12100138 23954629 27046540 26490575 26603215 25791549
3005 25791549 24264545 25406875 27587639 24477854 15827674 9886700 13238438 24373349
2997B4373349J2730642P066890m660129j4853162j3607295k620694N450438O292394
2989B0172433Q930500J5363928J2531092m395117j8112310j4030799l560007m304410
2981A2595310j0733027o359957N073059N138720p104797j2587344k635054R069363
2973g543727Q869186O18375m190466j216272N561685Q398782J290091j0989747
2965G97907j3370668j72444J2621089Q890252j770528Q47056J2723940J0720949
2957C1287553p840380j7823511n347205J1016996J0241616j631626p285818n371214
2949G246411m310577k980140L402005P833684R05068j0210454r827143K080457
2941e860689R806750N120784m029796q612041q645676n699194K279018J3432840
$$ plain form
2997 24373349 37103991 44170881 39510752 24657590 11050295 8429601 13880039 20172433
2989 20172433 29102933 44466861 56997953 52602836 34490526 20459727 16899720 12595310
2981 12595310 1862283 -4497674 575385 5714105 -1390692 -13978036 -16613090 -7543727
2973 -7543727 1325459 1943834 -2246632 -3462904 2098781 10497563 11787654 797907
2965 797907 -12572761 -12745205 -124116 8766136 6995608 7842664 20566604 31287553
2957 31287553 23447173 5623662 276457 11293453 21535069 19903443 12617625 7246411
2949 7246411 2935834 -44306 3357699 11191383 12096451 1885997 -7941146 -5860689
2941 -5860689 3946061 9066845 5037049 -3574992 -12220668 -17919862 -15640844 -2208004
2933b208004J8709357J2354198k9317q536174r494156n583630n87123J656852
2925F282003k354969j0723994j4216593n751669Q567726J3834961L444168j2733794
2917a3652161j9683461j2715280J453822J4300019K0053776J4085007l579370
2910B62352k1485182k2758697l997708J7400432K1528308Q345294m635185m699215
2902a0039601L384109P311989L022466l140133m837184l783110n812620j0784699
2894b4678783j1085864l109956M507253J623934o840584n759168P573589J7799871
2886a9969708J3591693L338083J24622K048118m88924o356116o719496j394755
2878a5826483J836819J301695J571432J919733j736945n048049j41360P645622
$$ plain form
2933 -2208004 16501353 28855551 28826234 20290060 10795904 5212274 4625151 6282003
2925 6282003 3927034 -6796960 -21013553 -26765222 -18197496 -4362535 -918367 -13652161
2917 -13652161 -33335622 -46050902 -44597080 -30297061 -10243285 3841722 262352
2910 262352 -21222830 -43981527 -47979235 -30578803 -9050495 -705201 -5340386 -10039601
2902 -10039601 -6655492 656497 3678963 538830 -4298354 -8081464 -13894084 -24678783
2894 -24678783 -35764647 -38874603 -34367350 -32743416 -39584000 -45343168 -37769579 -19969708
2886 -19969708 -6378015 -3039932 -2915310 -867192 -1356116 -7712232 -14431728 -15826483
2878 -15826483 -13989664 -12687969 -11116537 -9196804 -10933749 -15981798 -16123158 -8477536
2870h477536L727989j1968791k0450329r086057J1068814K0922530J6200886O866579
2862H804085J647433J064576J225302j032522m221199k504401N419407R612138
2854B0014819Q9147j6219198k1586732j1810085j016961J252926K764175J0967663
2846a5544246J7192193J0509506k998452q294291k586060L739808L600902l57409
2838E261951l971094o723351q559746q049410m459060J144832N874684O053545
2830a3427649K507152L580367J4350837K3400424J3755198r664056k0041713n354205
2822I106355J1575922N119298j5171319j9607187k637101J2278976J0248059K659896
2814A3572899K226540K935707l616219r653723m440795N582060O291720j168336
$$ plain form
2870 -8477536 -4749547 -16718338 -37168667 -46254724 -35185910 -14263380 1937506 8804085
2862 8804085 10451518 11516094 12741396 11708874 7487675 4983274 10402681 20014819
2854 20014819 20103966 3884768 -17701964 -29512049 -30529010 -29276084 -26511909 -15544246
2846 -15544246 1647947 12157453 9159001 864710 -1721350 2018458 5619360 5261951
2838 5261951 1290857 -5432494 -13992240 -22041650 -26500710 -25355878 -19481194 -13427649
2830 -13427649 -10920497 -7340130 7010707 30411131 44166329 34502273 14460560 9106355
2822 9106355 20682277 25801575 10630256 -8976931 -11614032 664944 10913003 13572899
2814 13572899 15799439 18735146 15118927 5465204 1024409 6606469 12898189 11729853
2806A1729853l405457J652448R04330j1009921j9798105j1305503O885901J5209757
2798i136697Q146911k044771o033455p896361j1456013r953282J378064J2879032
2790b4116572J2922377N729519L222632M560078r1972q202689o222632N842507
2782f356752J0662562O89343r490637p343610r34464n22636P02639R789636J3347700
2773A0543781l122662k4911879k3116299K589284K1441098J4928170n87506k514015
2765d750028O867784J0526202L557514m420496o313183n056970o686923j2650832
2757a8926932j7393583j2184742L785300J6842778J2582503l297133j0049755
2750b8641564n53854R574965P881017L812090R279234J5326923O791191r273929
$$ plain form
2806 11729853 8324396 9976844 10881174 -128747 -19926852 -31232355 -24346454 -9136697
2798 -9136697 -989786 -3034557 -9068012 -16964373 -28420386 -38373668 -36995604 -24116572
2790 -24116572 -11194195 -5464676 -2242044 2318034 2226062 -5976627 -12199259 -6356752
2782 -6356752 4305810 4995153 -4495484 -11839094 -12773558 -13296194 -12593555 -2803919 10543781
2773 10543781 7421119 -17490760 -40607059 -38017775 -16576677 -1648507 -2236013 -4750028
2765 -4750028 2117756 12643958 16201472 11780976 5467793 410823 -6276100 -18926932
2757 -18926932 -36320515 -48505257 -44719957 -27877179 -15294676 -18591809 -28641564
2750 -28641564 -29195418 -19620453 -11739436 -7927346 1351888 16678811 23470002 14196073
2742A4196073j1875554Q3278M975764o804066j6668769o711009J2561087J8419349
2734H176153Q259040j459646k441602k419824n963431n073958M700143J2304503
2726A6081378N632106j0091563j9147889j6344193j0618574q794352o264041L000164
2718d6546964J4890128J9274278J2338479K81990q029934q829424m273430J651374
2710a9243503O563866R555356R387122N045223j445632n252216l925310r48223
2702b63317j778085o956954j0839298o877976N930193K0219898K4750679J5868128
2694D0053268L935856J673942N917640J548945j3105321j9371076o992731N158391
2686A8818914m354450k3256012k1103667K657153J5350081J261262j4069596m810202
$$ plain form
2742 14196073 2320519 2403797 7379561 575495 -16093274 -22804283 -10243196 8176153
2734 8176153 16435193 14975547 12533945 10114121 4150690 -923268 3776875 16081378
2726 16081378 21713484 11621921 -7525968 -23870161 -34488735 -43283087 -49547128 -46546964
2718 -46546964 -31656836 -12382558 -44079 237911 -7792023 -16621447 -20894877 -19243503
2710 -19243503 -12679637 -3124281 6262841 11308064 9862432 4610216 684906 -263317
2702 -263317 -2041402 -8998356 -19837654 -26715630 -20785437 -565539 24185140 40053268
2694 40053268 43989124 45663066 51580706 53129651 40024330 20653254 13660523 18818914
2686 18818914 14464464 -8791548 -29895215 -27238062 -11887981 -10626719 -24696315 -29506517
2678b9506517J5105054J5883225j792537j1709463m702350J665666m090747j0082346
2670b9230015l554984Q926932J4677722J4450892J5995436J6221759L952582j9806656
2662B1633668l5583655k5949104J553752J9842056J2896079n776912j1662604
2655b3046720n51909R947387P974209J424755O30546J979076k105576q420145
2647a2168377r134489m450353O98196N150530Q032622N279963j342075j474698
2639i408681P416424J1858013K918281o882380k710775P826569P748627j151607
2631A7614471m475442j863445l879804p531272q15479J0290689P104082p664748
2623H779052r963206N197073J2907454k67001j2725889l831606J1482524P761986
$$ plain form
2678 -29506517 -14401463 1481762 -310775 -12020238 -16722588 -15056922 -19147669 -29230015
2670 -29230015 -32784999 -23858067 -9180345 5270547 21265983 37487742 41440324 21633668
2662 21633668 -13949987 -39899091 -38345339 -18503283 -5607204 -11384116 -23046720
2655 -23046720 -23598629 -13651242 -5677033 -4252278 -3621732 -1642656 -3748232 -12168377
2647 -12168377 -21302866 -25753219 -25055023 -19904493 -11871871 -6591908 -7933983 -9408681
2639 -9408681 -1992257 9865756 12784037 5901657 3190882 11017451 18766078 17614471
2631 17614471 13139029 11275584 7395780 -135492 -950971 9339718 16443800 8779052
2623 8779052 -1184154 4012919 16920373 16653372 3927483 95877 11578401 19340387
2615A9340387r835106j5543908k685011J1702300J5471906J1682782L854005p319666
2607B6667689j3150867l621698J2270782J1591302j0848190l1378710k6748011
2600c5217703l114610J3834749J0341798l419658r432687j668579J0826733J6085186
2592a764771J1934559O272595N357366N342835o51432r438153r194655L750322
2584A1608666J6524586J4585250J362678n459833K389622J2934244J1424315N02108
2576F5871636o096969m696232m220912q547827r961707m130335Q51880k290188
2568B6779346p651922n574762L258475J1059134J3027302P294809o154394j8452859
2560B3585129j4612572N482211J9375420R138718j3045121k1694610j1977267
$$ plain form
2615 19340387 9505281 -6038627 -8723638 2978662 18450568 30133350 33987355 26667689
2607 26667689 13516822 9895124 22165906 33757208 22909018 -8469692 -35217703
2600 -35217703 -38332313 -24497564 -14155766 -17575424 -27008111 -28676690 -17849957 -1764771
2592 -1764771 10169788 16442383 21799749 27142584 26491152 17052999 7858344 11608666
2584 11608666 28133252 42718502 44081180 38621347 41010969 53945213 65369528 65871636
2576 65871636 59774667 55078435 50857523 42309696 32347989 28217654 29069534 26779346
2568 26779346 19127424 13552662 16811137 27870271 40897573 48192382 42037988 23585129
2560 23585129 8972557 14454768 33830188 42968906 29923785 8229175 -3748092
2553c748092L49923N704644P819814Q154233K947458m770835p138738m848278
2545D470129m196155m080789n75913J399862k649503l756875N542390J3115402
2537I268548O349578k327725L731510J1784127Q75717j5216492q038842J0970419
2529A7396840N759562j7026866j3577527J7814140K6828495j476394j7009792
2522A8708458O446338K3045589L516864J637041O0141122J08121375M7657498
2515B69274285q5982492j51749667r0569278O595856L7072344R133677j0704891
2508a6930166l718702J576469o310935j1471609n956285L004132J1070211J6715095
2500a2021790J3408600O61104q147186l609262N566960P197237J215234p986269
$$ plain form
2553 -3748092 -3398169 2306475 10126289 18280522 21227980 16457145 9318407 4470129
2545 4470129 273974 -3806815 -4382728 -2982866 -5632369 -9389244 -3846854 9268548
2537 9268548 15618126 13290401 17021911 28806038 29681755 14465263 6426421 17396840
2529 17396840 23156402 6129536 -7447991 10366149 37194644 35718250 18708458
2522 18708458 25154796 48200385 51717249 53354290 113495412 221616787 269274285
2515 269274285 183291793 31542126 -59027152 -52431296 -15358952 -6225275 -16930166
2508 -16930166 -20648868 -19072399 -25383334 -36854943 -42811228 -39807096 -28736885 -12021790
2500 -12021790 1386810 2047914 -6099272 -9708534 -4141574 3055663 4270897 -3715372
2492c715372j9297134k6697687k0213602l693807N461847K322242J687829J1026531
2484e3119153J6572616P765556l738339k875481P073679J3807629J2936726N970970
2476D394203m094389p867271K961910J6715495J0398300j4593698k7989297j3350728
2468c3425475P758526R349917l023151q033182j638326N147353P012358N134549
2460a1717431p31491o803762m513900L870506M699115k291170N09069J6200439
2452g78625K1343345L691501j3650484q310381N512385L933061o448831n830115
2444e38144R18753k727399r912541l694101P262741K958573p886412q98173J6943779
2435B427076J4346706j0719696k5466362j5247459k525177l516415m177918N836047
$$ plain form
2492 -3715372 -23012506 -49710193 -69923795 -73617602 -68155755 -65833513 -64145684 -53119153
2484 -53119153 -36546537 -28780981 -32519320 -35394801 -28321122 -14513493 -1576767 4394203
2476 4394203 299814 -7567457 -4605547 12109948 22508248 7914550 -20074747 -33425475
2468 -33425475 -25666949 -16317032 -19340183 -27373365 -29011691 -23864338 -16851980 -11717431
2460 -11717431 -12448922 -19252684 -23766584 -19896078 -15196963 -17488133 -16979064 -778625
2452 -778625 20564720 24256221 10605737 2295356 7807741 11740802 5291971 -538144
2444 -538144 380609 -2346790 -12259331 -15953432 -8690691 -5732118 -13618530 -14516703 2427076
2435 2427076 16773782 6054086 -19412276 -34659735 -37184912 -40701327 -44879245 -39043198
2427c9043198J0642511o47695j0275918j761685J1306641R480295j61896M75414
2419a9985531Q876990R529841J820953j583101K899676P332015P027038L248188
2411A9166069l515242j1029334j2477183o662795l293345q208104j3063683j0425320
2403d9508937p375484j0413426q900819Q438213K9636316L2598543J7206979L689614
2395A5370999Q25645k713674j2652140j5936234k323802J6775621K2609368J2084836
2387C4040619l698147j5787481k1647042j8760185n839503R986868J6498211R824141
2379D617481m37519k426050M353602R433932M668217n718555j0321721m605020
2371d35633M108700P171665N527427N140248N120884p36535j0165124j0878448
$$ plain form
2427 -39043198 -28400687 -29048382 -39324300 -41085985 -29779344 -20299049 -20460945 -19985531
2419 -19985531 -11108541 -1578700 242253 -1340848 1558828 8890843 15917881 19166069
2411 19166069 15650827 4621493 -7855690 -14518485 -17811830 -26019934 -39083617 -49508937
2403 -49508937 -56884421 -67297847 -76198666 -67760453 -38124137 -5525594 11681385 15370999
2395 15370999 16196644 13482970 830830 -15105404 -17429206 -653585 21955783 34040619
2387 34040619 30342472 14554991 -7092051 -25852236 -31691739 -21704871 -5206660 4617481
2379 4617481 4179962 1753912 6107514 15541446 20209663 14491108 4169387 -435633
2371 -435633 3673067 10844732 16372159 21512407 26633291 25896756 15731632 4853184
2363D853184J031346J0294862J393370j6607041j8868830L50238J7091229R992189
2355I530547r768946j4756081O2391J2219321M941276j1312019j6606258q006044
2347c3695813J497605K969295N6753M861M015965P187459M770001j352962k701635
2338a7248471N421389J4118059R163347q522712j9770804j0734181Q174509J5687196
2330c711668O857361l270862j570329P211221R037939m85894j0227876p025003
2322c185111O670753J3508920L455755j0783680j0723048p9081O33430j1744811
2314a2246873j4988637L464173K3782005K2372440O585826k68460L982636L297886
2306C5980996l908999l087290N599016K945400j5399651k5961142j1919955R430134
$$ plain form
2363 4853184 5884530 16179392 17572762 965721 -17903109 -17552871 -461642 9530547
2355 9530547 -238399 -14994480 -14932089 -2712768 2228508 -9083511 -25689769 -33695813
2347 -33695813 -32198208 -29228913 -29172160 -29167299 -25151334 -17963875 -13193874 -14546836 -17248471
2338 -17248471 -11827082 2290977 11454324 2931612 -16839192 -27573373 -19398864 -3711668
2330 -3711668 3145693 -125169 -1695498 5515723 14553662 14067768 3839892 -3185111
2322 -3185111 3485642 16994562 20450317 9666637 -1056411 -1135492 -502062 -12246873
2314 -12246873 -27235510 -23771337 10668 22383108 28968934 28700474 32683110 35980996
2306 35980996 32071997 28984707 34583723 37529123 22129472 -3831670 -15751625 -6321491
2298f321491J1346149l710002r625868M976119K2160510K0167066N59317j6105380
2290B3446420j5760492n196761k44766m371340n766342L398464J3767613J1991796
2282B1264592R6056q915926j0148180q949516o751829K96156P786608L971725
2274a350314j0536466j7965923o655574J1599282J6997640O974128l495605k247406
2266f680238P817633J4931845J0979596j572435j2135471j2046989k934167O286338
2258D646112R332267O465599J060112k879851k267252P07508p70283p173550p926501
2249A194161L466932J5733438J3587790M77353o774346k776678K862901M667455
2241C2439006O223227O224160j201544j0199769p240304M593538O371654n497345
$$ plain form
2298 -6321491 5024658 1314656 -8311212 -3335093 18825417 38992483 39551800 23446420
2290 23446420 7685928 2489167 2244401 -2126939 -7893281 -4494817 9272796 21264592
2282 21264592 21360648 12444722 2296542 -6652974 -13404803 -13108647 -5322039 -1350314
2274 -1350314 -11886780 -29852703 -36508277 -24908995 -7911355 -937227 -4432832 -6680238
2266 -6680238 1137395 16069240 27048836 25476401 13340930 1293941 -1640226 4646112
2258 4646112 13978379 20443978 21504090 18624239 16356987 17064495 16294212 9120662 1194161
2249 1194161 4661093 20394531 33982321 34459674 27685328 24908650 27771551 32439006
2241 32439006 38662233 44886393 43684849 33485080 26244776 30838314 37209968 31712623
2233C1712623j1316416j204666O683265m047333k0247963j9747232l904558R177718
2225a2894562J1266438N903901m499676j5324712j4321879J791035J4970821Q901702
2217d206932n035975n098693O260501Q301495k856104r629650l328425L837221
2209a1756562R36562o660421r713666p121999q64148P935321J4277165J2089955
2201h77793L875092k577514o070013q975012n854552Q665979K2299799J5008474
2193B5494460j0234256k5638513j4635528O850058J4158226M756057n129885l871044
2185h250425O030855J4503381J2160825j954450j5986946j5723558k710322P176939
2177d753701O061252K706657L885053K015819q098629j3695709j156771J9112517
$$ plain form
2233 31712623 20396207 19191541 25874806 21827473 1579510 -18167722 -22072280 -12894562
2225 -12894562 -1628124 4275777 -223899 -15548611 -29870490 -28079455 -13108634 -4206932
2217 -4206932 -9242907 -14341600 -8081099 220396 -2635708 -12265358 -15593783 -11756562
2209 -11756562 -10820000 -17480421 -27194087 -34316086 -35180234 -27244913 -12967748 -877793
2201 -877793 2997299 419785 -5650228 -14625240 -20479792 -11813813 10485986 25494460
2193 25494460 15260204 -10378309 -25013837 -18163779 -4005553 750504 -4379381 -8250425
2185 -8250425 -2219570 12283811 24444636 22490186 6503240 -9220318 -11930640 -4753701
2177 -4753701 1307551 4014208 7899261 9915080 1816451 -11879258 -13036029 6076488
2169F076488K2500456L581034j5762647j4750237J786562J3233910R303177j576367
2161B4392376o747318m526360k810977o562160j1256546r347940L6518J0200791
2153f621616J3913114R159512l23239p690986p761011j739062M085829N684206
2145H706747M319456J080997n770777j4395848j7163187j1128360m293522l529700
2137d2174194k881263N776851J6580892J7490515J0142822O443394O962254L59997
2129A8701268j3240783j6952908l218156J1094886Q162224m135909m005989J2187204
2121H591837K4826036J7765102j789174j4019610j0276864p36654L12806p769701
2113A6903778j2970421q592600k794741n087479j0504781p490758K728289P857849
$$ plain form
2169 6076488 28576944 32157978 16395331 1645094 3431656 16665566 25968743 24392376
2161 24392376 17645058 13118698 10307721 3745561 -7510985 -16858925 -16822407 -6621616
2153 -6621616 7291498 16451010 16127771 8436785 675774 -1063288 3022541 8706747
2145 8706747 13026203 14107200 8336423 -6059425 -23222612 -34350972 -38644494 -42174194
2137 -42174194 -45055457 -39278606 -22697714 -5207199 4935623 11379017 18341271 18701268
2129 18701268 5460485 -11492423 -14710579 -3615693 4546531 410622 -3595367 8591837
2121 8591837 33417873 51182975 49393801 35374191 25097327 24360673 24673479 16903778
2113 16903778 3933357 -4659243 -7453984 -12541463 -23046244 -30537002 -27808713 -19950864
2105a9950864M893425M246778J0416985J2981892M119775o891958o512089L842255
2097G146199J0972274P114259l748755j2649403j2621745l055803P814153Q962296
2089I933475p15448j0238038j0077821j990432P321497J4375062J6350840Q895113
2081C3854248o659296j9938292k1528863j1895800K563535J5278786J8946183
2074A0620501R623614l783261n413209N559880J0929617N1053j2851964j0417832
2066D318399J307016M629415q43220m57888Q764171J3339246N613839o237622
2058C0433356j3053216j4762735j2215573k664213J1001971J7397338R596430
2051B5733358n714129j6104059j5275890n795313M161150O338134L63706m901609
$$ plain form
2105 -19950864 -15057439 -10810661 -393676 12588216 16707991 9816033 3303944 7146199
2097 7146199 18118473 25232732 21483977 8834574 -3787171 -6842974 971179 9933475
2089 9933475 9218027 -1020011 -11097832 -13088264 -5766767 8608295 24959135 33854248
2081 33854248 27194952 7256660 -14272203 -26168003 -23604468 -8325682 10620501
2074 10620501 20244115 16460854 11047645 16607525 27537142 27588195 14736231 4318399
2066 4318399 5625415 10254830 9411610 8953722 17717893 31057139 36670978 30433356
2058 30433356 17380140 2617405 -9598168 -12262381 -1260410 16136928 25733358
2051 25733358 20019229 3915170 -11360720 -17156033 -12994883 -6656749 -6293043 -11194652
2043a1194652l623855k211426p258919j0191480J223655J8810027K0104887J501367
2035G159604j3600041p918300N528808N075549p209171j0977583J857515J7774904
2027b308715K0844831R286877o694546j4702947q669005N134175J2384222P230506
2019B2505398L17144K419752O162741k882636k0080047k3778438o857153J0374680
2011a1818559Q127258n646279r672867j201858M329141J471607K289152J1836317
2003b86088J5573845L029301j0970113o048295J1460360J6171734J310154j2424556
1995A7816342r753181j901892l989064r319844l411610Q549698Q997519k449370
1987D538598p330396L096935J5864816J6880529P845280k945778j2306787j7272971
$$ plain form
2043 -11194652 -14818507 -17029933 -24288852 -34480332 -33256677 -14446650 5658237 7159604
2035 7159604 -6440437 -14358737 -8829929 -3754380 -10963551 -21941134 -20083619 -2308715
2027 -2308715 18536116 27822993 21128447 6425500 -2243505 2890670 15274892 22505398
2019 22505398 22822542 25242294 31405035 28522399 8442352 -15336086 -22193239 -11818559
2011 -11818559 -3691301 -9337580 -19010447 -20212305 -15883164 -14411557 -12122405 -286088
2003 -286088 15287757 18317058 7346945 1298650 12759010 28930744 30240898 17816342
1995 17816342 8063161 6161269 2172205 -7147639 -10559249 -2009551 6987968 4538598
1987 4538598 -2791798 305137 16169953 33050482 40895762 37949984 25643197 8370226
1979H370226j1659516K817769J2454973Q647986K06072j291302P43336l179121
1971A7110423j0122727j0051507m644602m427265q514520m294715R577477J6020079
1963F52643L340454j5992544k0784783p658542Q166980J4090846J1895348R244596
1955B954998Q263201N573144n03094o200323o117531k27028M887901L971204r2050
1946A2510422j911591l342925r408814j5330555r359474P603114J7427303Q111264
1938F298744q830125j5334190j1613798r554100q953201N52165J5946843K0011569
1930a1476093Q399138j363136L366587J1045195N602455p933580j2624542n775360
1922a0759336n1842k542813p183511p249493l277212K399555R298533J5248045
$$ plain form
1979 8370226 -3289290 -471521 11983452 20631438 20837510 19546208 20289544 17110423
1971 17110423 6987696 -3063811 -7708413 -12135678 -20650198 -24944913 -15367436 652643
1963 652643 3993097 -11999447 -32784230 -40442772 -32275792 -18184946 -6289598 2954998
1955 2954998 11218199 16791343 16288249 10087926 3970395 3743367 8631268 12602472 12510422
1946 12510422 10598831 7255906 -2152908 -17483463 -26842937 -19239823 -1812520 6298744
1938 6298744 -2531381 -17865571 -29479369 -39033469 -47986670 -47434505 -31487662 -11476093
1930 -11476093 -3076955 -4440091 -1073504 9971691 15574146 7640566 -4983976 -10759336
1922 -10759336 -10811178 -13353991 -20537502 -27786995 -31064207 -28664652 -19366119 -4118074
1914d118074J6284136J1460585L457017m361263p789030l015662O343506Q975772
1906B7236987M84951p360255j966998J0600705J3777229M784616l248565k898947
1898D1409723j606076o133841j0598249n959717O572014J6186985J2058792p217170
1890D4712461k7851469k8548135m174294K2058578K3215003K424162j3594037
1883A8242269j2223031n962268m641363n84964J0068140J4062618L396047p765177
1875A4592271n391768R37756m226702j4092384j0937899K976098Q793180K261062
1867e088386q29139P221312J2430641J610591j5999555k0571734q038520N658158
1859b3606632N797732l096493m922809M865303J2058839M389427q772885r088116
$$ plain form
1914 -4118074 12166062 23626647 27083664 22722401 14933371 11917709 18261215 27236987
1906 27236987 27721938 20361683 18394685 28995390 42772619 47557235 44308670 41409723
1898 41409723 39803647 33669806 23071557 17111840 23683854 39870839 51929631 44712461
1890 44712461 16860992 -11687143 -15861437 6197141 29412144 31836306 18242269
1883 18242269 6019238 56970 -4584393 -5169357 4898783 18961401 22357448 14592271
1875 14592271 9200503 10138259 5911557 -8180827 -19118726 -16142628 -7349448 -5088386
1867 -5088386 -5917525 1303787 13734428 15345019 -654536 -21226270 -29264790 -23606632
1859 -23606632 -17808900 -20905393 -25828202 -20962899 -8904060 -4514633 -13287518 -22375634
1851b2375634L160185J0077716M219375k542249j647236l1945k507043j580895
1843a3227726M591166L681701p607791j1016208N256560K3524570K1596522N367352
1835C2166146m837174n967852p052734n855836L369224J0091185K626772p069169
1827A7470562k506832L729315j0831181l3195254k8118668L481921K0818161O037941
1819b3114035r719575R61410J9905869J7286289k505130j5426016j5632238j2132378
1811d0375804m753197J0187331K1696668J5809705j198854j0788164p528033o0593
1803a7010941O640665J3255273J5183735N880031r969820j8705459j3184215R72794
1795a6937937J2268833J1982811Q98597r081674o569036M216467R062671M851384
$$ plain form
1851 -22375634 -19215449 -9137733 -4918358 -7460607 -9107843 -9139788 -11646831 -13227726
1843 -13227726 -8636560 -4954859 -12562650 -23578858 -18322298 5202272 26798794 32166146
1835 32166146 27328972 21361120 14308386 8452550 11821774 21912959 24539731 17470562
1827 17470562 14963730 18693045 7861864 -25333390 -53452058 -49970137 -29151976 -23114035
1819 -23114035 -32833610 -31872200 -11966331 5319958 2814828 -12611188 -28243426 -40375804
1811 -40375804 -45129001 -34941670 -13245002 2564703 1365849 -9422315 -16950348 -17010941
1803 -17010941 -10370276 2884997 18068732 23948763 13978943 -4726516 -17910731 -16937937
1795 -16937937 -4669104 7313707 8212304 -869370 -7438406 -3221939 5840732 10692116
1787A0692116J619834K417007j078453q521539p022565M445433Q402988j463957
1779I490864o485339M767410J2978090q54933k0439830j7790387K114776J0183488
1771f035861j115365j1054536p427772r82980K85642M930697J7358094K4218598
1763B0176517J3410359o817642j8340297j4420469l069375M882788N501433K610987
1755C934301J509829J279256l730920j2781214j5876506p721371K488782L320143
1747b7577700k843700m836124J289855R952361J5028705J3197907L576540q217563
1739d29719j1589613m339949K228839n18264n469947k438990M504414M249406
1731a3803823k984118o618368j719681N725462P568385J642935n996685n223628
$$ plain form
1787 10692116 12311950 14728957 13650504 5128965 -1893600 2551833 10954821 9490864
1779 9490864 3005525 7772935 20751025 19896092 -543738 -18334125 -16219349 -6035861
1771 -6035861 -7151226 -18205762 -25633534 -26616514 -26330872 -21400175 -4042081 20176517
1763 20176517 33586876 26769234 8428937 -5991532 -9060907 -4178119 1323314 3934301
1755 3934301 5444130 6723386 2992466 -9788748 -25665254 -33386625 -30897843 -27577700
1747 -27577700 -30421400 -35257524 -33967669 -24015308 -8986603 4211304 7787844 -429719
1739 -429719 -12019332 -16359281 -14130442 -14648706 -20118653 -22557643 -18053229 -13803823
1731 -13803823 -16787941 -23406309 -25125990 -19400528 -11832143 -10189208 -16185893 -21409521
1723b1409521N639833J2928405M710141q165056o138102O045799N699806o830578
1715g519273n560861J4297278K2845438N382745j0996582m293859N307984m510594
1707A4952276j5996608n811587R675076M294321j0556540j0603060l742215o703073
1699b4491410n493264J3245614K2862415K278498j4298019L927239J6475984j8007343
1691c500286m7091915p654141L0907134n0511132j95195578j94238404J1024546
1684d56259776K08458187J95342855M5852891l0105764J1278349M4881401J0783705
1677C0231848k0747204n975106O728674r350666r319667K2274554K9552542j0890900
1669C2504075l8775315j2993604J7374917J217084k7635173j4953643K0579937
$$ plain form
1723 -21409521 -15769688 -2841283 1868858 -6296198 -12434300 -6388501 -688695 -7519273
1715 -7519273 -13080134 1217144 24062582 29445327 18448745 14154886 19462870 14952276
1707 14952276 -1044332 -6855919 2819157 7113478 -3443062 -14046122 -17788337 -24491410
1699 -24491410 -29984674 -16739060 6123355 8401853 -5896166 -1968927 14507057 -3500286
1691 -3500286 -50592201 -58246342 -27339208 -77850340 -273045918 -467284322 -456259776
1684 -456259776 -247801589 -52458734 -6605843 -36711607 -25433258 19448143 30231848
1677 30231848 9484644 3509538 10238212 887546 -8432121 13842433 43394975 32504075
1669 32504075 -6271240 -19264844 -1889927 -672843 -28308016 -43261659 -22681722
1662b2681722K6082447L788802n052470L565822m1504j6444684j6432599K827622
1654b4388286J1379134k126056j3840447n609159R953265J3836189O655571J518305
1646b621484N288433J2904107J3703592L433970p914036p444809O04089L37537
1638A8291399q049684o623763P494640J3104439J133500p071889K685777R010750
1630B9975169q105760k5956713j1132336K2699128K9869990R39436k4153861j6264594
1622b129541N393923Q941739n577474j5665245j1200731q59557N816766P270347
1614h009773N600515L668499M013699N346918L396470k257495p211628r792733
1606e245528j3017749j6499916j3517362o47063J4996964K3125134K1649181J6539020
$$ plain form
1662 -22681722 3400725 7189527 2137057 5702879 5661375 -10783309 -27215908 -24388286
1654 -24388286 -13009152 -15135208 -28975655 -34584814 -24631549 -10795360 -4139789 -2621484
1646 -2621484 2666949 15571056 29274648 32708618 24794582 17349773 17953862 18291399
1638 18291399 10241715 3617952 11112592 24217031 25350531 18278642 20964419 29975169
1630 29975169 21869409 -4087304 -15219640 7479488 37349478 38288914 14135053 -2129541
1622 -2129541 3264382 12206121 6628647 -9036598 -20237329 -21096886 -15280120 -8009773
1614 -8009773 -2409258 1259241 5272940 10619858 14016328 11758833 4547205 -5245528
1606 -5245528 -18263277 -34763193 -48280555 -48927618 -33930654 -10805520 10843661 27382681
1598B7382681J2628357Q925723K860217m452159r320065j0400755r482653p272424
1590A0868922k714771J397396k001840j3292739k0262558j2293240L319438J0405857
1582b4573535O655354L678239N439743L561580l215130l588893N266722R982855
1574C206935M888154M554112J7247688K4298159P389255j7885050k1640431m466262
1566A7592560N359904l015696r727256r13412Q740466K799334r498206j0039369
1558A298325j281720K34294p898052j0894072j312234Q716409N032014p976690
1550a4081726j2217134P34118J7810941J9720909N021865q122367n893324L772876
1542F746158M554521m345500r056775l305904L182486J165956m504322l865259
$$ plain form
1598 27382681 40011038 48936761 51796978 47344819 38024754 27623999 18141346 10868922
1590 10868922 8154151 9551547 7549707 -5743032 -26005590 -38298830 -34979392 -24573535
1582 -24573535 -17918181 -14239942 -8800199 -5238619 -8453749 -12042642 -6775920 3206935
1574 3206935 8095089 12649201 29896889 54195048 61584303 43699253 22058822 17592560
1566 17592560 22952464 19936768 10209512 9296100 18036566 20835900 11337694 1298325
1558 1298325 16605 250899 -7647153 -18541225 -19853459 -11137050 -6105036 -14081726
1550 -14081726 -26298860 -25564742 -7753801 11967108 16988973 8866606 2973282 6746158
1542 6746158 11300679 6955179 -2101596 -5407500 -2225014 -1059058 -5563380 -9428639
1534i428639L277365Q570597P082918J935614j443650j654417k107751o646480
1526d14443j3669515j5836607q538172K920181R195622Q652783P165667O940614
1518c583870L684414l266017o533461j279509O495147Q377911N333024M335852
1510A3563491O837484Q160647O604490M949078K421289o187663j9520807k5338455
1502h510446j4712727L618686J2072819O253098j677904l019743m007616j0665011
1494b0648844j4036073l892062J0223198R082078o395431j3726733j496698J4067317
1486b6823248J4159237L745064k17613M665733O940679J703465m817874p531500
1478h176057n952226J984451J6349803K6492919J9033978l391097k1465592j9905789
$$ plain form
1534 -9428639 -6151274 2419323 9502241 11437855 9994205 8339788 6232037 -414443
1526 -414443 -14083958 -29920565 -38458737 -35538556 -26342934 -17690151 -10524484 -3583870
1518 -3583870 100544 -3165473 -9698934 -10978443 -4483296 3894615 9227639 13563491
1510 13563491 20400975 28561622 35166112 40115190 42536479 36348816 16828009 -8510446
1502 -8510446 -23223173 -19604487 -7531668 -1278570 -2956474 -5976217 -9983833 -20648844
1494 -20648844 -34684917 -38576979 -28353781 -19271703 -25667134 -39393867 -40890565 -26823248
1486 -26823248 -12664011 -8918947 -9136560 -4470827 2469852 4173317 -644557 -8176057
1478 -8176057 -14128283 -12143832 4205971 30698890 49732868 46341771 24876179 4970390
1470D970390k444686J3795561J3492703m096732k1027117j5119494J2293944L0546485
1462C2411054J5130151j7741971l0198412j2578959P765799R075819K267531N719109
1454A1850121J4573670J2242298j067933r762935o827029j136934k445744r819458
1446G606056j4908904j0493386K721679J4211782J2644037J77297q119886l294328
1438E44347N832724N493823m964985j4272118j3611690m253273N172170N435573
1430a4623429m306030j2312595o379984Q175290J3204834L856166l359695L819148
1422a1926295J3587228Q400046p688525j5213082o466921P980701J6109997J4606482
1414A9389631M697722r832698k1102978k3064919j7758447r094309L952449J9201219
$$ plain form
1470 4970390 2525704 16321265 29813968 25717236 4690119 -10429375 1864569 32411054
1462 32411054 47541205 29799234 -399178 -12978137 -5212338 3863481 6131012 11850121
1454 11850121 26423791 38666089 37598156 27835221 21008192 19871258 17425514 7606056
1446 7606056 -7302848 -17796234 -15074555 -862773 11781264 11958561 3838675 544347
1438 544347 6377071 11870894 6905909 -7366209 -20977899 -25231172 -20059002 -14623429
1430 -14623429 -18929459 -31242054 -37622038 -29446748 -16241914 -12385748 -15745443 -11926295
1422 -11926295 1660933 10060979 2372454 -12840628 -19307549 -11326848 4783149 19389631
1414 19389631 24087353 14254655 -6848323 -29913242 -47671689 -56765998 -52813549 -33612330
1406c3612330K4387136J2027622m593992o060684N636217J0741189K129313n613228
1398E041243q42993P769926O042111n261938j3234975r754043O7391L508656o024169
1389a2688791j8052583j3308153J0018350K7192016J7640547l915407p237373
1382c51394P910481J2312256m981827j8698293p938429J2077531J6507686P015245
1374B3853256n1896l679860j1574754j6313752n173901J2491994J3952774k148160
1366A1355701j3853073j0150135l766782m730823l888908O592823J4887679O407062
1358B853544j2434666k1404096j1325098Q835112K5043221K9149068K0187909
1351D0904994L624007j0702311j5097842r445591L80638P112358N384754m208743
$$ plain form
1406 -33612330 -9225194 2802428 -1791564 -7852248 -2216031 8525158 10654471 5041243
1398 5041243 4198250 11968176 18010287 12748349 -486626 -10240669 -10173278 -6664622 -12688791
1389 -12688791 -30741374 -44049527 -34031177 -6839161 10801386 6885979 -351394
1382 -351394 7559087 19871343 14889516 -3808777 -11747206 330325 16838011 23853256
1374 23853256 23801360 20121500 8546746 -7767006 -12940907 -448913 13503861 11355701
1366 11355701 -2497372 -12647507 -16414289 -21145112 -25034020 -18441197 -3553518 2853544
1358 2853544 -9581122 -30985218 -42310316 -33475204 -8431983 20717085 40904994
1351 40904994 44529001 33826690 18728848 9283257 9663895 16776253 22161007 17952264
1343A7952264j2807885j0487306J842280J2493700J2626926M431168n424437j3063714
1335G562996j5262947q350487M831865J2966243P916971n149143j4041508j2393868
1327b1919878k669634Q899075J6116962J5892282J1172491O741507J045991r954772
1319B5324024j9472801j3357690O783297J8309679P247751r860568r872987K723728
1311G824433O241237j880893m530614J837068J210783j0293487j4000673m80624
1303a4072770J2828027J0278244K088167K307297L435655n530350j3812948o696631
1295i175309N870974N908381O49036Q404970K0021050J0042683j6024901k4140260
1287A556624o751633L846805r453823j8851767L20958K6268711K6282684Q302296
$$ plain form
1343 17952264 5144379 -5342927 -3500647 8993053 21619979 26051147 20626710 7562996
1335 7562996 -7699951 -16050438 -11218573 1747670 9664641 4515498 -9526010 -21919878
1327 -21919878 -24589512 -15690437 426525 16318807 27491298 34232805 35278796 25324024
1319 25324024 5851223 -7506467 -723170 17586509 24834260 14973692 5100705 7824433
1311 7824433 14065670 12184777 7654163 9491231 10702014 408527 -13592146 -14072770
1303 -14072770 -1244743 9033501 11121668 13428965 16864620 11334270 -2478678 -9175309
1295 -9175309 -3304335 2604046 3253082 11658052 31679102 41721785 25696884 1556624
1287 1556624 -5195009 -1348204 -10802027 -29653794 -29332836 -3064125 23218559 31520855
1279C1520855J278835M483974l854029j9738749j7381190K964480J1720793j002085
1271I992884j0784593k977081M296386l209053r010653K302688J3958672M816009
1263I385259j2169473r380184R989458J6366868m94568j7980019j5390805J73504
1255a9499960R307722N465803l088221o339347j518442N476386N847527r28849
1247e277381m480891K076372J0511140R326269J630950j037811J471979r70634
1239A3249993r262757j2503602o993296k611095n400300p453718j078892Q449553
1231b3604114J2177173J0037392O056810p55396j1640114k0005257j7199056l867699
1223d8800261J0593992J7721147J5180598N957256l440109p079973n171273k629886
$$ plain form
1279 31520855 32799690 37283664 33429635 13690886 -3690304 -725824 10994969 9992884
1271 9992884 -791709 -3768790 527596 -2681457 -11692110 -9389422 4569250 9385259
1263 9385259 -2784214 -12164398 -2174940 14191928 13697360 -4282659 -19673464 -19499960
1255 -19499960 -10192238 -4726435 -7814656 -14154003 -15672445 -10196059 -4348532 -5277381
1247 -5277381 -9758272 -7681900 2829240 12155509 13786459 12748648 14220627 13249993
1239 13249993 3987236 -8516366 -15509662 -18120757 -23521057 -30974775 -32053667 -23604114
1231 -23604114 -11426941 -1389549 4667261 3911865 -7728249 -27733506 -44932562 -48800261
1223 -48800261 -38206269 -20485122 -5304524 652732 -2787377 -9867350 -15038623 -17668509
1215a7668509j110003K104112O264559O218292K193042J567425O236245P850785
1207A3655948K256738j654213K849177O217105k865466j6213555j5735999j038504
1199a2528769R858253Q046382M443727Q044941J0273302J227395j1564146j4054172
1191C746913p030968k406052k875562j68354P185941R467543L137815r57934M947626
1182A5046968J0723425L165750j1041311j2303755K792475J4864922R022455n127873
1174B7143056j0200349o286516n677445r741330q200909n2992K227835o532733
1166a7321383j4386884j0503288n48109N127685P581028J2704131J7583984J5649617
1158A5886781R023106L841731j136287q952067j3005999n730038M881306L644064
$$ plain form
1215 -17668509 -18778512 -16674400 -10409841 -4191549 -1998507 -431082 5805163 13655948
1207 13655948 15912686 14258473 17107650 23324755 20459289 4245734 -11490265 -12528769
1199 -12528769 -2670516 5375866 9819593 17864534 28137836 29365231 17801085 3746913
1191 3746913 -3284055 -5690107 -8565669 -8734023 -1548082 7919461 11057276 10099342 15046968
1182 15046968 25770393 28936143 17894832 5591077 8383552 23248474 32270929 27143056
1174 27143056 16942707 10656191 4978746 -4762584 -12963493 -13016485 -10788650 -17321383
1166 -17321383 -31708267 -42211555 -42759664 -37631979 -30050951 -17346820 237164 15886781
1158 15886781 24909887 28751618 27615331 18663264 5657265 -72773 4808533 8452597
1150H452597p535524j0528625J509794J4074587J4028104O764551K848073J735068
1142C1348625j040050k659822p16547k062080j1385726j9010129j3167066J742670
1134a6950125J1959536J3756974J2584895Q482389j419850r101536k968084J0111135
1126B6455334R204338q954949k1068374r819268J0971970J7208941P215835l008061
1118B8205766p321258j2269174j6662235r829921O714924J4838105N093467q276820
1110D92854p900315K699735P350782Q56468q239248j2479674j0260866l38678
1102b7818942J4449326K0802981Q230202j0946301j2053602P177612K0112473
1095A9953749Q480935j1251423j3668620j840649J949337n947598p123403M648192
$$ plain form
1150 8452597 917073 -9611552 -8101758 5972829 20000933 26765484 29613557 31348625
1142 31348625 30308575 27648753 26932206 24870126 13484400 -5525729 -18692795 -16950125
1134 -16950125 -4990589 8766385 21351280 29833669 28413819 19312283 16344199 26455334
1126 26455334 35659672 26704723 5636349 -4182919 6789051 23997992 31213827 28205766
1118 28205766 20884508 8615334 -8046901 -17876822 -11161898 3676207 8769674 492854
1110 492854 -7407461 -4707726 2643056 3499524 -4739724 -17219398 -27480264 -27818942
1102 -27818942 -13369616 7433365 15663567 4717266 -7336336 -158724 19953749
1095 19953749 28434684 17183261 3514641 1673992 3623329 -2324269 -9447672 -4799480
1087d799480J0957661p90016j5277750j2260867K812598Q608535L79433n433935
1079a5803821K131262J3114244J2434969O41924q242179n320307K762603K734704
1071D453399q188744j7251532j1027654O754045J8663281J5389888N721843J022992
1063A5537518o49827o485199j2893694j0178620l9301N047551J099739j150634
1055i712467O030244J3931234R695477m272965j2335197n541360P660564J2087414
1047A7542944L023276r558770j2320494j987494J2463235J9017454J2576251k415988
1039C8340414j5787118j8505988j0032823M54474M299072M518882R843411J7229122
1031C0359446J1763995r989448k8424984k4411546n589352N447519K849404k69276
$$ plain form
1087 -4799480 6158181 5368165 -9909585 -22170452 -19357854 -10749319 -10369886 -15803821
1079 -15803821 -13672559 -558315 11876654 12518578 4276399 -1043908 1718695 4453399
1071 4453399 -3735345 -20986877 -32014531 -25260486 -6597205 8792683 14514526 15537518
1063 15537518 14887691 8402492 -4491202 -14669822 -14709123 -9661572 -8561833 -9712467
1055 -9712467 -3682223 10249011 19944488 15671523 3336326 -2205034 5455530 17542944
1047 17542944 20566220 11007450 -1313044 -3300538 9162697 28180151 40756402 38340414
1039 38340414 22553296 4047308 -5985515 -5531041 -1231969 3286913 13130324 30359446
1031 30359446 42123441 32133993 3709009 -20702537 -26291889 -20844370 -17994966 -18264242
1023a8264242J874573K76836p029613o960994N631718J5495234J0523525J990090
1015C537127N072789J2321546O575453q270639j2248969k544520J780395p678839
1007a455657j3711276k098387J2876391Q385423j2088920k2664943j0869393P838343
999c3788419J4266460R411675O057812P052018M384898l746811p852896k014617
991f229880N949235N680099n90772k240494L587774Q953066Q086918M667151L598512
982C1461609L163996P1055l268355k200595K413331M605222O1730r828602j8425011
973H054380j7588322n712000O714833O315232n557815j2538799n332183N604349
965b0040325P521636N023454Q941034J3944306N810359j1555654j6933901l616282
$$ plain form
1023 -18264242 -16389669 -16112833 -23142446 -30103440 -24471722 -8976488 1547037 3537127
1015 3537127 8609916 20931462 27506915 19236276 6987307 4442787 6223182 -1455657
1007 -1455657 -15166933 -17265320 -4388929 3996494 -8092426 -30757369 -41626762 -33788419
999 -33788419 -19521959 -10110284 -4052472 2999546 7384444 3637633 -4215263 -6229880
991 -6229880 -280645 5399454 4808682 2568188 6155962 15109028 23195946 27863097 31461609
982 31461609 34625605 34696660 31428305 29227710 31641041 36246263 36307993 26479391 8054380
973 8054380 -9533942 -15245942 -8531109 -2215877 -7773692 -20312491 -25644674 -20040325
965 -20040325 -12518689 -7495235 1445799 15390105 21200464 9644810 -7289091 -10905373
957a0905373Q885027M156133o927854n101167P059937J1077614J680839p978527
949A946629q564513n377655m425428k288920L882997P571527K656148n285528
941i884743o443818j504053p884n048185q178851k332181O607047P128648j229453
932b0893473n668061K593015J4259562J2221327n185778j9411940j3841403N673687
924c0253064J8580117J3802710j064991j2274946j3170795m936400P092698J4859882
916g364789J2448106L810925K17743N768084J0808648N011305q082130j6673387
908E944505j7273419j6767113j8412989j5238754j578546J5140994K0892712J2090285
900a5202325O95944P9668Q562655J1504489P76487j3001320j3494724r60044Q133410
$$ plain form
957 -10905373 -2020346 2135787 -4792067 -9893234 -2833297 8244317 9925156 1946629
949 1946629 -6617884 -11995539 -16420967 -18709887 -14826890 -7255363 -4599215 -9884743
941 -9884743 -16328561 -17832614 -17840498 -22888683 -31067534 -33399715 -26792668 -19664020 -20893473
932 -20893473 -26561534 -23968519 -9708957 2512370 -2673408 -22085348 -35926751 -30253064
924 -30253064 -11672947 2129763 1064772 -11210174 -24380969 -29317369 -22224671 -7364789
916 -7364789 5083317 8894242 9111985 14880069 25688717 30700022 22617892 5944505
908 5944505 -11328914 -28096027 -46509016 -61747770 -63326316 -48185322 -27292610 -15202325
900 -15202325 -14506381 -14426713 -5864058 5640431 6416918 -6584402 -20079126 -21039170 -12905760
891a2905760M951625j15636L589666Q404768J950951r075620p011055O926671
883c284390J0858532m948614k1842701j9273225k493576R186511J0063101Q633811
875a3100551Q399780M580118k954950p950775q452814p534769m426909L646389
867b7794481J1849689J1962570O073097M019135O780265N214152k857047p596378
859G651002l262274K836679K911632o19548k848714m669309o845876m932832K743395
850g035845R415165Q575032K118707m692961r365097r761815m175706K464878
842a2457642K068687l207920k244246O181846R419888J990490m708632k444172
834e401701P75848n50243M175911J9502093K5874478O810373j9699994k3785662
$$ plain form
891 -12905760 -7954135 -8069771 -4480105 3924663 5875614 -3200006 -10211061 -3284390
883 -3284390 7574142 2625528 -19217173 -38490398 -40983974 -31797463 -21734362 -13100551
875 -13100551 -4700771 -120653 -3075603 -11026378 -19479192 -27013961 -31440870 -27794481
867 -27794481 -15944792 -3982222 2090875 6110010 12890275 18104427 15247380 7651002
859 7651002 4388728 7225407 10137039 9517491 6668777 1999468 -4846408 -9779240 -7035845
850 -7035845 2379320 10954352 13073059 8380098 -984999 -10746814 -14922520 -12457642
842 -12457642 -10388955 -13596875 -15841121 -9659275 -239387 1751103 -2957529 -5401701
834 -5401701 -4625853 -5176096 -1000185 18501908 44376386 51186759 31486765 7701103
826G701103q007109N21285l595704M44113J6334491J8817499k943767k2032080
818G239831j3421424P895149J1786573k122663r881218k585434N147877K629600
810F688291l285095m246129k995119m822313p834267o925964q56014P562151J3767571
801b946888J3004492L935549q225608j5018831j1982767k098358O805118Q284512
793h242781L525654O08154L996755P203002K378543n534484m563199M793045Q404165
784A2568854r4153r425537q122305m25527K881536n0468l641835l751577J496121
775h564891J1295006J7144969Q822578q463472j5379129m969395O013039K793480
767H692185n464710l690188L929527N392340M568163J0886857J5006087J038998
$$ plain form
826 7701103 -306006 215279 -3380425 -2936312 13398179 32215678 29271911 7239831
818 7239831 -6181593 1713556 13500129 11377466 1496248 -1089186 4058691 6688291
810 6688291 3403196 -842933 -3838052 -8660365 -16494632 -23420596 -24276610 -16714459 -2946888
801 -2946888 10057604 13993153 5767545 -9251286 -21234053 -23332411 -16527293 -8242781
793 -8242781 -4717127 -4108973 -112218 7090784 9469327 3934843 -628356 4164689 12568854
784 12568854 12474701 3049164 -5073141 -5498668 -2617132 -2667600 -6309435 -10061012 -8564891
775 -8564891 2730115 19875084 28697662 20234190 4855061 -114334 5898705 8692185
767 8692185 3227475 -462713 3466814 8859154 13427317 24314174 39320261 40359259
759D0359259k1012745k2770472J04296J8865151J2510380m969317r138122J711917
751A5660347J1128143Q693222k965713j5734901k0351310j1332006M147776J0115468
743f38974J392037q999521q184420L49258N944842O142285M041322n95119p567377
734h115667j0897901p110298k401531k166189m91798Q805098J7270394J1791443
726F683551l903936j2428623p595328j814280n079775r923443n170269N451074
718c3781029R454665M958508J821378M131929L729580m246132r751363j461449
710b5143913J3982226J8660345Q158939l127247m000121o08684k064881m591257
702A265407j065589L586494L24359p420734r655304p437565q967499j1470869
$$ plain form
759 40359259 19346514 -3423958 -3319662 15545489 28055869 23086552 13948430 15660347
751 15660347 26788490 35481712 32515999 16781098 -3570212 -14902218 -10754442 -638974
743 -638974 753063 -8246458 -16430878 -16081620 -10136778 -3994493 46829 -548290 -8115667
734 -8115667 -19013568 -26123866 -28525397 -30691586 -31183384 -22378286 -5107892 6683551
726 6683551 2779615 -9649008 -17244336 -19058616 -24138391 -34061834 -39232103 -33781029
718 -33781029 -24326364 -19367856 -17546478 -13414549 -9684969 -13931101 -23682464 -25143913
710 -25143913 -11161687 7498658 15657597 12530350 8530229 7921545 5856664 1265407
702 1265407 199818 3786312 4110671 -3310063 -12965367 -20402932 -29370431 -40841300
694d0841300m615604Q405806J1894869K884698k907243L556834J0733405O824702
686d063833j852812m034432j424465q50927N9731N789615J0484689O295707k432913
677G970360n888869l979657k893692k198221J918743N088399m8380r247193j0008739
668a9287249M89953J1429612J2828445N267761m762353j1162829r965126k002922
660a7164708O067276Q633479P226639N284761J669086l953468n254893J636018
652D144190Q117395L610628p274810j0408240l110246L730830M411641N107701
644H329089Q984321Q805608J150821m092909J429930Q505321J573680j6730026
636A7955835k4716921r253294J4403861J9121420j01777j9021271j5248468L261649
$$ plain form
694 -40841300 -45456904 -37051098 -25156229 -22271531 -25178774 -21621940 -10888535 -4063833
686 -4063833 -5916645 -9951077 -11375542 -12226469 -12166738 -6377123 4107566 10403273 7970360
677 7970360 2081491 -1898166 -4791858 -6990079 -5071336 17063 -31317 -9278510 -19287249
668 -19287249 -18797296 -7367684 5460761 10728522 5966169 -5196660 -15161786 -17164708
660 -17164708 -11097432 -2463953 4762686 10047447 11716533 7763065 2508172 4144190
652 4144190 12261585 15872213 8597403 -1810837 -4921083 -1190253 3221388 8329089
644 8329089 17313410 26119018 27269839 23176930 24606860 33112181 34685861 17955835
636 17955835 -6761086 -16014380 -1610519 17510901 17409124 -1612147 -16860615 -13598966
628a3598966J1682001L905921k146009M628290J1465810M288790r094484j2341187
620a209834n307291K67007J276056L020334M448117N58219l864129M33241R439246
611I060966R380954j691437j0476592p871682J235231Q622593J0916783O798599
603B5975415j872677o508382j410150M877426R51101q211086r384380m468581
595e1314n670765r855186k111759J3528527J4192262l899090j5201908m976517
587a4045750P132555J376772q913156j921575J4545550J6863882M653125j739729
579A7951674L916592P529120J402112n960154q170174r683475j3134945j3444375
571a9593625p812575n5373O103617Q683416M769393l725320o185334K914922J1854694
$$ plain form
628 -13598966 -1916965 1988956 -157053 4471237 15937047 20225837 11131353 -1209834
620 -1209834 -6517125 -6250118 -4974062 -1953728 2494389 3052608 -811521 -378280 9060966
611 9060966 18441920 16750483 6273891 -1597791 -362560 8260033 19176816 25975415
603 25975415 24102738 17594356 16184206 21061632 22012733 13801647 4417267 -51314
595 -51314 -5722079 -15577265 -17689024 -4160497 10031765 6132675 -9069233 -14045750
587 -14045750 -6913195 -5536423 -14449579 -16371154 -1825604 15038278 19691403 17951674
579 17951674 21868266 29397386 30799498 24839344 16669170 6985695 -6149250 -19593625
571 -19593625 -27406200 -27461573 -21357956 -12674540 -7905147 -11630467 -17815801 -14900879 -3046185
562c046185P290438l837147m887186K824165K944960p032930j1510797l916986
554b1171668L105211P33572k268146K664505R651649J1569171J1561293J0856972
546B6702559J045326j8009016k7085949j1765908J2534591J8486960L925339q239255
538b405353n244499O19438l173195q188329o36744J3610241J5389897N11047j3027200
529b544697r676851L100196P056549j074499p090576r71683R973207J2420471
521A1192117L073994j0502835j8221652j3247875L026851J7889894J7539034M983001
513A5732529k026156L514094P151030k772130j4492980j2061278k722079m032603
505a1709573j1874779o482771J1497579J7559526J361069j5884844j2821639K824596
$$ plain form
562 -3046185 4244253 407106 -4480080 -1655915 1289045 -5743885 -17254682 -21171668
554 -21171668 -18066457 -17332885 -19601031 -16936526 -7284877 4284294 15845587 26702559
546 26702559 27747885 9738869 -17347080 -29112988 -16578397 1908563 5833902 -2405353
538 -2405353 -7649852 -7030414 -10203609 -18391938 -19028682 -5418441 9971456 10482503 -2544697
529 -2544697 -12221548 -9121352 -2064803 -3139302 -10229878 -11201561 -1228354 11192117
521 11192117 14266111 3763276 -14458376 -27706251 -24679400 -6789506 10749528 15732529
513 15732529 13706373 17220467 24371497 21599367 7106387 -4954891 -7676970 -11709573
505 -11709573 -23584352 -30067123 -18569544 -1010018 351051 -15533793 -28355432 -25530836
497b5530836R840111L405528m835628o286734k042516L432632N671161K387763
489a3958519j998020m72587M905997M920843p30783j985898L096859L543732m387413
480g065789q512315j487913N826666L341104j625955j82283J101732n055302r359797
471b3019852j833278P715669N255507k428030m3402Q120879O368854k495458j062146
462c421257J0995310J4591503K712605r076297q398150j823759R18378K27925
454F726258j826845o645496j0101148l969691Q433448J3046479O126532m76959
446A1312578Q26734M031635M196842M666788M739040k343697j3102619j3454826
438H72475j575313O983589M234235L59917J327794k201243j2543391j4920475
$$ plain form
497 -25530836 -15690725 -12285197 -17120825 -23407559 -25450075 -22017443 -16346282 -13958519
489 -13958519 -15956539 -16429126 -11523129 -6602286 -7333069 -9318967 -6222108 -2678376 -7065789
480 -7065789 -15578104 -17066017 -11239351 -7898247 -9524202 -9706485 -8604753 -13660055 -23019852
471 -23019852 -24853130 -17137461 -11881954 -14309984 -14353386 -6232507 136347 -2359111 -3421257
462 -3421257 7574053 22165556 24878161 15801864 7403714 5579955 6498333 6726258
454 6726258 4899413 -1746083 -11847231 -15816922 -7383474 5663005 11789537 11312578
446 11312578 12139312 16170947 20367789 25034577 29773617 27429920 14327301 872475
438 872475 -702838 6280751 10514986 10874903 12202697 10001454 -2541937 -17462412
430a7462412m609881l22830j1230139j4619954Q001633L3712791K8594784P8229
422B2142221j5630779q959533l172558q313418p105130P419999J5617389N799348
414G797539m282812K315877J3481474R300705n978051j2952314o378738K341443
406E645123M603434J634382l091638o694086n669187l95291K945572R86134j634345
397a669902p65620M97710j064116k557956j692820j858289m431275m300346L21224
388a7521390K237628k960960p693351l252780P436968J5740879J8364203J4841663
380B7192860L075807j2977752k0067803j1666027K09968J226809m360191k597818
372a9964147O533906J0145282M132291j958028j812848J18724k96639n79913J228644
$$ plain form
430 -17462412 -22072293 -22395123 -33625262 -48245216 -40243583 -6530792 22063992 22142221
422 22142221 6511442 -2448091 -5620649 -13934067 -21039197 -13619198 1998191 7797539
414 7797539 3514727 5830604 19312078 28612783 22634732 9682418 3303680 5645123
406 5645123 10248557 11882939 8791301 2097215 -3571972 -3967263 -1021691 -35557 -1669902
397 -1669902 -2435522 -1937812 -3001928 -5559884 -7252704 -9110993 -13542268 -17842614 -17521390
388 -17521390 -15283762 -18244722 -25938073 -29190853 -21753885 -6013006 12351197 27192860
380 27192860 30268667 17290915 -2776888 -14442915 -14232947 -13006138 -17366329 -19964147
372 -19964147 -13430241 -3284959 847332 -1110696 -2923544 -2804820 -3101459 -3681372 -2452728
363b452728L379594N782801R243509R552227K605059n476842n237648j91346k295596
354A4909030j0506490j0112252K426022J0713467K685892j1130817j4322986p224553
346b2562687q11184J789943M413254O180617M327605L265187P461627R396839
338A3461201j193975j7728566k1058212n440167J2487142J5308515N232873l143599
330b074788k664251J369311J979965j062388l777244m450587n157688p265560
322b3103230p462988j261326Q992848J3724750P177248m115893q457775k879458
314a7385824M692892N942290J1574q365476j3262299r858617K185635J5732128
306b0307697K0593212J3428471J056219p236290q379369n675289k950486o65790
$$ plain form
363 -2452728 926866 6709667 15953176 25505403 28110462 22633620 17395972 17204626 14909030
354 14909030 4402540 -5709712 -3283690 7429777 10115669 -1015148 -15338134 -22562687
346 -22562687 -23373871 -21583928 -17170674 -10990057 -6662452 -3397265 4064362 13461201
338 13461201 12267226 -5461340 -26519552 -31959719 -19472577 -4164062 1068811 -2074788
330 -2074788 -4739039 -3369728 -1389763 -2452151 -6229395 -10679982 -15837670 -23103230
322 -23103230 -30566218 -31827544 -22834696 -9109946 -1932698 -6048591 -14506366 -17385824
314 -17385824 -12692932 -6750642 -6739068 -15104544 -28366843 -38225460 -36039825 -20307697
306 -20307697 285515 13713986 14770205 7533915 -845454 -6520743 -9471229 -10137019
298a0137019K620946N941669M581502m193982j3970954j2958643J349479J5913029
290a0853973J6617604N711515k716806k413480m87763k907496n321602k836991
282e208992M38660r10234l013944J243213R154428J0316526J378958r040067j1497316
273g138768n870133J381662N063994L945566l31871l914716k832888K575657O662367
264d59130M374674k383467o293040k758102M603833P308019J071877q720098j1940557
255a5195991m998665M559649P002326K166785j997073j873023k490994o784246
247a9611232p817665J022555J2697891J3493097K754325n111771j434465M513559
239E06294R78177p778821r088674k089769K576169J351135K261942Q442957J0217133
$$ plain form
298 -10137019 -7516073 -1574404 3007098 -1186884 -15157838 -28116481 -26767002 -10853973
290 -10853973 5763631 11475146 8758340 6344860 5857097 2949601 -2372001 -5208992
282 -5208992 -4770332 -5680566 -8694510 -7451297 1703131 12019657 13398615 4358548 -7138768
273 -7138768 -13008901 -11627239 -6563245 -2617679 -2949550 -6864266 -9697154 -7121497 -459130
264 -459130 3915544 1532077 -4760963 -7519065 -2915232 4392787 5464664 -3255434 -15195991
255 -15195991 -20194656 -15635007 -8632681 -6465896 -8462969 -10335992 -12826986 -19611232
247 -19611232 -27428897 -26406342 -13708451 -215354 2538971 -2572800 -4007265 506294
239 506294 1484471 -6294350 -15383024 -17472793 -14896624 -13545489 -11283547 -2840590 7376543
230G376543L92073j2387881j4404530m818465N576507R300960P648659L802902
222B486768j325083o387607q668733o727762j131745O122784J0606684P526791
214B502097j217571o059112j185618O691380P139561L22681m473029k218082L188614
205D690921N941606L122826n630711j6039055j8929497j0169903J191556L716574
197c2105683M10767L865793J5482525K2316714J6507703N022687l896467j1274253
189A6329786j8225535j8315056q003556M475018R743764R405773R373673Q724092
181A3507959M352507q7314J19944J467919j635114o101263n152830N3961L236798
172I762567L417808L172631J020238m074892n478695J582408P660684R91561j0884078
$$ plain form
230 7376543 7768616 -4619265 -19023795 -23842260 -18265753 -8964793 -1316134 2486768
222 2486768 1161685 -5225922 -13894655 -20622417 -21754162 -15631378 -5024694 2502097
214 2502097 1284526 -4774586 -5960204 731176 7870737 8193418 3720389 1502307 4690921
205 4690921 10632527 13755353 8124642 -7914413 -26843910 -37013813 -35822257 -32105683
197 -32105683 -31694916 -27829123 -12346598 9970116 26477819 31500506 27604039 16329786
189 16329786 -1895749 -20210805 -28214361 -23739343 -13995579 -4589806 4783867 13507959
181 13507959 17860466 17773152 17893096 19361015 17725901 11624638 6471808 6525769 9762567
172 9762567 13180375 16353006 17373244 13298352 7819657 9402065 17062749 18054310 7170232
163G170232q838548P347915J4984230J337709j6902078j7954710m580673M454678
155a2981245K134223l188417n544655o496568m850541L028024J1387377Q264417
147h247385n097489j1281457p02570J2755562J0964131j825633n491444O012502
139b913783J6056869R165466r272070k2936814k3858593j4166066K015546J7690901
131b8218544K0901281O743543j1282476j4697704l748690N195417N255224O062289
123a3789660J2185159J2544559O64867j0360363o892894L284259L716117m878264
115c526220q498586l708125L22509Q66981M476621J0154891P517709m059477j0362546
106f816243l233457O511838N159658m976017j0828762n503027O727615J6490695
$$ plain form
163 7170232 -1668316 5679599 20663829 22001538 5099460 -12855250 -17435923 -12981245
155 -12981245 -10847022 -14035439 -19580094 -26076662 -30927203 -27899179 -16511802 -8247385
147 -8247385 -13344874 -24626331 -25328901 -12573339 -1609208 -3434841 -8926285 -2913783
139 -2913783 13143086 22308552 13036482 -9900332 -33758925 -47924991 -45909445 -28218544
131 -28218544 -7317263 -573720 -11856196 -26553900 -30302590 -25107173 -19851949 -13789660
123 -13789660 -1604501 10940058 11604925 1244562 -5648332 -2364073 1352044 -3526220
115 -3526220 -12024806 -15732931 -15410422 -14543441 -10066820 88071 7605780 3546303 -6816243
106 -6816243 -10049700 -3537862 1621796 -3354221 -14182983 -19686010 -12958395 3532300
98C532300J5629080L374219j0164341j2952148n995604j868179o211582j0322508
90b4978763n856973L418644R998167J2708997J1931398M800671o650931j1684245
82f313035m611738N125799N947832J75940k555238j044510o61126j164898J841520
73c259454O501871O703684K606361l14628q15019j761555k924918k582854l404889
64G48599p534089q975752j231978J0030056J3098705P418035L162387M459232
56B1175195N185605J983367q70614j499620l503063o445650m993283o08364j835026
47H588547q742256j0069482j963321L864513n28648m969539J567661J0673668
39a578857P296874m769421q221601j26572M322214j987371o419490J127063R777466
$$ plain form
98 3532300 19161380 22535599 12371258 -580890 -6576494 -8444673 -14656255 -24978763
90 -24978763 -30835736 -27417092 -17418925 -4709928 7221470 12022141 5371210 -6313035
82 -6313035 -10924773 -5798974 148858 324798 -2230440 -3274950 -3936076 -5100974 -3259454
73 -3259454 3242417 9946101 12552462 12237834 11422815 9661260 6736342 4153488 748599
64 748599 -6785490 -15761242 -16993220 -6963164 6135541 13553576 16715963 21175195
56 21175195 26360800 28344167 27473553 25973933 22470870 16025220 11031937 10423573 8588547
47 8588547 -153709 -10223191 -12186512 -8321999 -8850647 -13820186 -12252525 -1578857
39 -1578857 5718017 948596 -7273005 -7399577 -3077363 -5064734 -11484224 -10357161 -579695
30e79695M404248r314599j2153211j1196J0078306M889108o991681q921172Q23473
21a7776419R051523O664748j456660n629462l302857O01329J039756k179779n086746
12a8074567l961191L55979L337700K788460J297394N67803k239512p598622p979852
3c1506408K319878J4726115J4701252
0B40837
$$ plain form
30 -579695 3824553 -5490046 -17643257 -17654453 -7576147 -2687039 -9678720 -18599892 -17776419
21 -17776419 -8724896 -2060148 -3516808 -9146270 -12449127 -11847798 -10808042 -12987821 -18074567
12 -18074567 -22035758 -21679779 -18342079 -15553619 -14256225 -13688422 -15927934 -23526556 -31506408
3 -31506408 -29186530 -14460415 240837
0 240837
$$ Imaginary data points
##PAGE= N=2
##DATA TABLE= (X++(I..I)), XYDATA
65535a068698K993421O617068K634059j52291j595615o477229j0283670n004386
65527a2337341L928444L650212l913767m021379M876408O685437m820994j3477156
65519a9430136o338262N207781M100679n861534q086663J136068J0550993J2100413
65511f620661P691998J650615k270426j31977O204523P296636l41704n770192
65503G708812L01845Q697961N071912o409748r231964p21631N572926L032300
65495A4022413l07299M73410j057068p480450r402780j006846Q028892N571375
65487H841647n909831j3484326r595383K176883J2636293J4143789O713085n83110
65479A4939047P33638O653821N441841m856083j2806290j0164578k305019K502296
$$ plain form
65535 -1068698 1924723 8541791 11175850 11023559 9427944 2950715 -7332955 -12337341
65527 -12337341 -8408897 -4758685 -8672452 -12693831 -7817423 -1131986 -5952980 -19430136
65519 -19430136 -25768398 -20560617 -16459938 -22321472 -30408135 -29272067 -18721074 -6620661
65511 -6620661 1071337 2721952 451526 319549 6524072 13820708 13479004 7708812
65503 7708812 8010657 16708618 21780530 15370782 6138818 5417187 10990113 14022413
65495 14022413 13715114 14188524 13131456 5651006 -3751774 -4758620 3270272 8841647
65487 8841647 2931816 -10552510 -20147893 -17971010 -5334717 8809072 15522157 14939047
65479 14939047 15672685 22326506 27768347 22912264 10105974 -58604 -2363623 138673
65471A38673M646288P380505P920806K865074l312695l913117p62875j514864
65463A3447795p898402j3230328j1374140l509797M271705P278282N815787L512577
65455a686521K282889O26074j572569m19783N075805P719857J686037o037398
65447G674391m385093L578192M514730k704451m234922M560833R095726p59029
65439A7340377j2573333j0856249j976116k363888j0513329j0198778J818471
65432b9322845J0596269P022230J40246O93140N968364P452410L358327k653984
65424C254157p296985p185149L5559R509445J1487009M468419j683643j083198
65416A1505614j380054r565947j6546704q907838P825782J3142338R77335r766388
$$ plain form
65471 138673 4784961 12165466 20086272 22951346 19638651 15725534 14962659 13447795
65463 13447795 5549393 -7680935 -19055075 -22564872 -18293167 -11014885 -5199098 -1686521
65455 -1686521 596368 1222442 -350127 -769910 4305895 12025752 13711789 7674391
65447 7674391 3289298 6867490 11382220 8677769 4442847 9003680 18099406 17340377
65439 17340377 4767044 -6089205 -8065321 -10429209 -20942538 -31141316 -29322845
65432 -29322845 -18726576 -11704346 -11564100 -10870960 -4902596 2549814 5908141 3254157
65424 3254157 -4042828 -11227977 -11192418 -1682973 9804036 14272455 12588812 11505614
65416 11505614 10125560 559613 -15987091 -24894929 -17069147 -3926809 -2949474 -12715862
65408a2715862k361642J2469590J2388369k708971j0901294k539914N234718k921479
65400d056485j4603212q892003R411976J5886130L426423q852607o834040m32026
65392a4945844k249097n790416L74994J0265190R685996j39764n251449j313438
65384i363828K635790J471654P1217R72336n26109n472847o573352Q59843J1195625
65375d729671J5752509J2081500L919076k769627k986983K378013M989383j406876
65367B7227324j0979266j2798511o489884j701544k527738l326546j281890j255214
65359a3133269m268539k728077O347537J3164605Q434781k480000p132951k471417
65351d267330M174407O700566N225517J712765k732291o629170q308903o902369
$$ plain form
65408 -12715862 -15077504 -2607914 9780455 7071484 -3829810 -6369724 -1135006 -4056485
65400 -4056485 -18659697 -27551700 -18139724 -2253594 1172829 -7679778 -14513818 -14945844
65392 -14945844 -17194941 -22985357 -22610363 -12345173 -2659177 -2798941 -8050390 -9363828
65384 -9363828 -6728038 -5256384 -5185167 -4212831 -4738940 -10211787 -16785139 -15925296 -4729671
65375 -4729671 11022838 23104338 27023414 24253787 21266804 23644817 28634200 27227324
65367 27227324 16248058 3449547 -3040337 -4741881 -7269619 -10596165 -11878055 -13133269
65359 -13133269 -17401808 -20129885 -13782348 -617743 7817038 5337038 -1795913 -4267330
65351 -4267330 -92923 6607643 11833160 13545925 10813634 4184464 -4124439 -11026808
65343a1026808j744684O394917J2380171R853991k27528r117423j0887657p976748
65335a2351769l631790L592437J2818308J6073721Q306479l367019q583500p452968
65327E403899o865179p156994k799425N173572Q186559L112936k868536l500564
65319a313732j847607k985542m400899q7597Q356584J1213287K774493r833876
65311A875111j3799705o179290K239531J541406l379583o60763Q857371J0592731
65303A086809j982861j5363916j3882049j357299N939988K972907K01817N210229
65295a7174375J2064386J1850218M815866k009018l237133J716279Q675281R973251
65287B6674755J247206j0953690j4088425m905340N556897N519301l841710j1995698
$$ plain form
65343 -11026808 -12771492 -6376575 6003596 15857587 15630059 6512636 -4375021 -12351769
65335 -12351769 -15983559 -12391122 427186 16500907 24807386 21440367 12856867 5403899
65327 5403899 -1461280 -8618274 -11417699 -6244127 1942432 5055368 2186832 -1313732
65319 -1313732 -3161339 -6146881 -10547780 -10635377 -2278793 8934494 11708987 1875111
65311 1875111 -11924594 -18103884 -15864353 -14322947 -17702530 -18363293 -9505922 1086809
65303 1086809 -896052 -16259968 -30142017 -31499316 -25559328 -22586421 -22384604 -17174375
65295 -17174375 -5109989 6740229 11556095 9547077 6309944 8026223 16701504 26674755
65287 26674755 27921961 16968271 2879846 -2025494 3531403 9050704 5208994 -6786704
65279f786704j2091337n944787J021980N132275N716048M331398K773005Q64041
65271d984081k486232n455328l259853N787701J5638860J6655384N457615r704152
65263A7649914j5025900n102527R474101J2704303K545312o353947k839897N481473
65255A8532832M949678l198483o707778l178327k209447o514302o624324J171437
65247c778714O488586K117317l548309j242521L537592J490316l436716j492737
65239A34814N158800O130234l4347n629713p745596r666134j0421058n588097
65231b7661097K500620P138455Q490951J0597305R493036j320794j4541863j4526270
65223a9829657r77525R043901O338828L10075n56253j330993n580126n119085
$$ plain form
65279 -6786704 -18878041 -24822828 -23800848 -18668573 -12952525 -8621127 -5848122 -4984081
65271 -4984081 -7470313 -12925641 -16185494 -10397793 5241067 21896451 27354066 17649914
65263 17649914 2624014 -2478513 6995588 19699891 22245203 15891256 13051359 18532832
65255 18532832 23482510 20284027 13576249 10397922 8188475 1674173 -4950151 -3778714
65247 -3778714 2709872 4827189 1278880 36359 3573951 5064267 1627551 134814
65239 134814 5293614 11423848 11389501 5759788 -1985808 -11651942 -22073000 -27661097
65231 -27661097 -25160477 -18022022 -9531071 1066234 10559270 9238476 -5303387 -19829657
65223 -19829657 -20807182 -11763281 -5424453 -5114378 -5670631 -7001624 -12581750 -17700835
65215a7700835L495966P926152l86476r184863l712279R356378J3120479O023234
65207H937756j285174o196907j2204333j3416552j948571J2644746J2417132j191235
65199b243138q972149l871763J566209K0436j49123N170805O762853J395312K37531
65190h3027P521505R932641J3327q018801j275971R288938P287907j807621j533598
65181B1325300P671434J1802323P439193K720489q25554p876762j3908620r511681
65173A8836122J030521L852519j970050m017875Q76533K379969k729323m793896
65165A3464520o74045j08780n921269o267520L913343J0996017M304388n787973
65157A3918681n796718j804770p010189j6417652j3535504J719422J0904822M375338
$$ plain form
65215 -17700835 -14204869 -6278717 -6665193 -15850056 -19562335 -10205957 2914522 8937756
65207 8937756 7652582 1455675 -10748658 -24165210 -26113781 -13469035 -1051903 -2243138
65199 -2243138 -11215287 -15087050 -13520841 -13500405 -13649528 -8478723 -1715870 -320558 -83027
65190 -83027 7438478 17371119 17384446 9365645 8089674 17378612 24666519 22858898 21325300
65181 21325300 28996734 40799057 48238250 50958739 50133185 42256423 28347803 18836122
65173 18836122 19866643 23719162 21749112 17731237 18607770 20987739 18258416 13464520
65165 13464520 12790475 12681695 6760426 492906 4406249 15402266 19706654 13918681
65157 13918681 8121963 6317193 -692996 -17110648 -30646152 -28926730 -18021908 -13646570
65149a3646570n331203l044766P758643J1421874K047381q991615p621599N169163
65141a2238692J3824295P413610n886862r586927j869237K597423m053394j0223771
65133b0023555l541855Q604712J0052864O22441n216155k040613J45894m343361
65125a5739628o062963K945800J3553759J1832998J04826o657290l157005J5686
65117c163817n001565r944717l491256R759710J4699858P860648J684668L894452
65109A6297981N126006m350694j5687806j2767345K380157J0730839L296668p389585
65101b363779p026326J747728P066938M114034l924363j2854521j7572343j2312305
65093d3124937J130069J1413088J1404786P847810R628843J3291289J0083367
$$ plain form
65149 -13646570 -18977773 -22022539 -14263896 -2842022 -794641 -9786256 -17407855 -12238692
65141 -12238692 1585603 8999213 3112351 -6474576 -8343813 -5746390 -9799784 -20023555
65133 -20023555 -23565410 -14960698 -4907834 -4285393 -9501548 -11542161 -11396267 -15739628
65125 -15739628 -21802591 -18856791 -5303032 6529966 6634792 -22498 -3179503 -3163817
65117 -3163817 -8165382 -18110099 -21601355 -11841645 2858213 10718861 12403529 16297981
65109 16297981 21423987 17073293 1385487 -11381858 -9001701 1729138 5025806 -2363779
65101 -2363779 -9390105 -7642377 -575439 3538595 -385768 -13240289 -30812632 -43124937
65093 -43124937 -41994868 -30581780 -19176994 -11329184 -1700341 11590948 21674315
65086B1674315J837713j680077J513245L522846m90993o540070r011006o263158
65078D562815K50495N938215M235168n023248j0996832l860298J0592061J6978190
65070B2676566R641705k342812q145008n021854L162453Q975065N072782o656491
65062B7362406j2846698n342803M456862J010728r898606q600384O321072J3708555
65054A6171132K545118j1106504r894899j72101K716322j61861K540071J0209599
65046A2846877J1373847K652071p948173j4169312j5762490j2333850m683290
65039b8024320J92622k831335o217371N74570J2442216J3824929L115039l302362
65031a0226012M205670J3923102J0914231j607902r218847o824717j560872M83044
$$ plain form
65086 21674315 23512028 21831951 23345196 26868042 26377049 19836979 10825973 4562815
65078 4562815 4813310 10751525 14986693 9963445 -1033387 -4893685 5698376 22676566
65070 22676566 32318271 29975459 21830451 16808597 19971050 28946115 34018897 27362406
65062 27362406 14515708 9172905 13629767 14640495 4741889 -3858495 2462577 16171132
65054 16171132 18716250 7609746 -2285153 -2457254 259068 97207 2637278 12846877
65046 12846877 24220724 26872795 18924622 4755310 -11007180 -23341030 -28024320
65039 -28024320 -27831698 -30663033 -36880404 -36305834 -23863618 -10038689 -6923650 -10226012
65031 -10226012 -6020342 7902760 18816991 17209089 7990242 1165525 -395347 87697
65023H7697N19690J578269M384310Q015152R284988L554264q348864j6965933
65015B109573j4662366o376401k055511j375126L392780J0643226R257768j783963
65007h50020p791727l4959R623579O939129k470310l505800L276640L773013n660683
64998C298862j3513235j2702741q411376m030310M258692J4060328J4028284K135781
64990h75715p559786m949797K552540N168397N462448P400143N145233l907281
64982H436182q461160j231570N010441k941967j4571732j1694904P72916L524838
64974b1156956l793130l394821Q192162J4227866P060161p92353m40065Q49972
64966G52836j663632k29402O995790P014893o744105k0557980j9764451q204596
$$ plain form
65023 87697 607387 2185656 6569966 14585118 23870106 27424370 19075506 2109573
65015 2109573 -12552793 -18929194 -20984705 -22359831 -18967051 -8323825 933943 -850020
65007 -850020 -8641747 -8676706 946873 7886002 5415692 1909892 5186532 8959545 3298862
64998 3298862 -10214373 -22917114 -31328490 -35358800 -31100108 -17039780 -3011496 -875715
64990 -875715 -8435501 -13385298 -10832758 -5664361 -201913 7198230 12343463 8436182
64982 8436182 -24978 -1256548 3753893 811926 -13759806 -25454710 -24681794 -21156956
64974 -21156956 -24950086 -28344907 -20152745 -5924879 1135282 342929 -97136 752836
64966 752836 -910796 -1140198 5855592 12870485 6126380 -14431600 -34196051 -42400647
64958d2400647K309013Q590780J1824763R902156M692561M632970J0015295Q537352
64950A8104243m176295j3518064p649875L093649K974474m378568l617673Q055244
64942a112865J8690529J7898342M431730j5458679k8021932k0196609J840483
64935b1929001J3360903J905765j4679732j4385126j887417L912745J037532J828639
64927c0835692P009458N129768m336604q015295l37575Q274490P524340q49047
64919a6436157q627156r062603l49969J0717586J2268499K259727o629909n199585
64911b1059567j079548l314292n534080J081489R629868R215365M204490L743498
64903c112777L169086l988313p142246M476889J6620029Q707685j0494128j5155233
$$ plain form
64958 -42400647 -40091634 -31500854 -19676091 -9773935 -5081374 -448404 9566891 18104243
64950 18104243 13927948 409884 -7239991 -4146342 -1171868 -5550436 -9168109 -1112865
64942 -1112865 17577664 35476006 39907736 24449057 -3572875 -23769484 -21929001
64935 -21929001 -8568098 -6662333 -21342065 -35727191 -37614608 -33701863 -32664331 -30835692
64927 -30835692 -23826234 -18696466 -23033070 -31048365 -31385940 -23111450 -15587110 -16436157
64919 -16436157 -25063313 -34125916 -34475885 -23758299 -11489800 -9230073 -15859982 -21059567
64911 -21059567 -22139115 -25453407 -30987487 -29905998 -20276130 -11060765 -6856275 -3112777
64903 -3112777 56309 -3932004 -11074250 -6597361 10022668 18730353 8236225 -6919008
64895f919008m224379P14747m207073j694712R047249P758986p395945j1813893
64887a8734028K856036J2336127J315168j0696842m098731R113573J0103358M515162
64879F709823N711316P821577n32452j2291196j4061903q507097n266296k711443
64871b3127671L672363Q118765O135763N188204Q705032N545068q770422j8162018
64863a2694916j0869519L14132J434628P62295P404924Q594492n170758j3843463
64855b4068185J198773J8778196Q043919j7097287j5893863J3455344K9983444
64848A4400341J3912863q036066j0561817l933372m633737n673038L254361J2168260
64840A0897795Q756383L86390j034252O3649n081127j0969714q899690m957498
$$ plain form
64895 -6919008 -11143387 -10428640 -14635713 -16330425 -7283176 475810 -6920135 -18734028
64887 -18734028 -15877992 -3541865 -2226697 -12923539 -17022270 -7908697 2194661 6709823
64879 6709823 12421139 20242716 19710264 7419068 -6642835 -15149932 -20416228 -23127671
64871 -23127671 -19455308 -11336543 -5200780 -12576 8692456 14237524 5467102 -12694916
64863 -12694916 -23564435 -23250303 -21815675 -21053380 -13648456 -5053964 -10224722 -24068185
64855 -24068185 -22869412 -4091216 3952703 -13144584 -29038447 -15583103 14400341
64848 14400341 28313204 20277138 9715321 5781949 1148212 -4524826 -1270465 10897795
64840 10897795 19654178 20040568 19006316 19069965 13988838 3019124 -5880566 -10838064
64832a0838064r431588j6584053j1802554N286922J8951173J7528845N644179
64825a245140l691378l131275L123512N600749K200931J319495P689874J1473364
64817B3340132K630331r124302n377827J1269069J8039815O008898o891950m985964
$$ plain form
64832 -10838064 -20269652 -36853705 -48656259 -43369337 -24418164 -6889319 -1245140
64825 -1245140 -4936518 -8067793 -4944281 656468 2857399 4176894 11866768 23340132
64817 23340132 25970463 16846161 11468334 22737403 40777218 46786116 39894166 34908202
$$ [...]
##END NTUPLES=NMR SPECTRUM
##END=
