##TITLE=31Pdec_PhPM1709
 CDCl3, 24 sc
 18.9.2019
##JCAMPDX= 6.0         $$ Bruker NMR JCAMP-DX V2.0
##DATA TYPE= NMR SPECTRUM
##DATA CLASS= NTUPLES
##ORIGIN= UXNMR, Bruker Analytische Messtechnik GmbH
##OWNER= root
$$ XWIN-NMR		Version 3.5
$$ Wed Sep 18 13:59:00 2019 Russian Standard Time (UT+4h)  she@DPX200
##.OBSERVE FREQUENCY= 81.013821
##.OBSERVE NUCLEUS= ^31P
##.ACQUISITION MODE= SIMULTANEOUS
##.ACQUISITION SCHEME= undefined
##.AVERAGES= 24
##.DIGITISER RES= 17
##SPECTROMETER/DATA SYSTEM= spect
##.PULSE SEQUENCE= zgpg30
##.SOLVENT NAME= CDCl3
##.SHIFT REFERENCE= (INTERNAL, CDCl3, 0, 182.463)
##AUDIT TRAIL= $$ (NUMBER, WHEN, WHO, WHERE, WHAT)
$$ ##TITLE= Audit trail, XWIN-NMR		Version 3.5
$$ ##JCAMPDX= 5.01
$$ ##ORIGIN= Bruker BioSpin GmbH
$$ ##OWNER= she
$$ F:/spectra/data/she/nmr/P31/1/pdata/1/auditp.txt
$$ ##AUDIT TRAIL=  $$ (NUMBER, WHEN, WHO, WHERE, WHAT)
(   1,<2019-09-18 13:58:18.78 +0400>,<she>,<DPX200>,
      <created by zg, POWCHK disabled, PULCHK disabled
       configuration hash MD5:
       00 E9 B6 7A A2 85 ED C7 34 08 36 98 17 FE 4E 26
       data hash MD5: 32K
       D9 FA EA B0 51 EA BB 5F 92 9E 59 EB B9 1D B6 24>)
(   2,<2019-09-18 13:58:21.64 +0400>,<she>,<DPX200>,
      <Start of raw data processing
       efp BC_mod = 2 LB = 1 FT_mod = 6 PKNL = 1 PHC0 = -394.3124 PHC1 = 103.8003 SI = 64K 
       data hash MD5: 64K
       30 A0 07 54 BA B4 A6 85 1C 76 25 19 8C 69 CF 47>)
(   3,<2019-09-18 13:58:30.95 +0400>,<she>,<DPX200>,
      <pk PHC0 = 2.918666 PHC1 = 0 
       data hash MD5: 64K
       8D E2 60 5F 30 1B 4D 09 1A B1 49 7A D3 19 31 A7>)
(   4,<2019-09-18 13:58:34.28 +0400>,<she>,<DPX200>,
      <abs ABSG = 5 
       data hash MD5: 64K
       8A 8D 0A E4 2A 82 6C A3 34 1C D7 5B 80 91 8A 2F>)
$$ ##END=
$$ 
$$ hash MD5
$$ D7 F1 44 54 10 25 57 4E 55 30 E8 BF 8E 0C DC B9
##$RELAX= 
##$RELAX= 
##$RELAX= 
##$RELAX= 
##$RELAX= 
##$RELAX= 
##$RELAX= 
##$RELAX= 
$$ Bruker specific parameters
$$ --------------------------
##$DU= <F:/spectra>
##$EXPNO= 1
##$NAME= <P31>
##$PROCNO= 1
##$TYPE= <nmr>
##$USER= <she>
##$AMP= (0..31)
100 100 100 100 100 100 100 100 100 100 100 100 100 100 100 100 100 100 
100 100 100 100 100 100 100 100 100 100 100 100 100 100 
##$AQSEQ= 0
##$AQ_mod= 1
##$AUNM= <au_zg>
##$AUTOPOS= <>
##$BF1= 81.014009
##$BF2= 200.13
##$BF3= 200.13
##$BF4= 200.13
##$BF5= 200.13
##$BF6= 200.13
##$BF7= 200.13
##$BF8= 200.13
##$BYTORDA= 1
##$CFDGTYP= 0
##$CFRGTYP= 5
##$CHEMSTR= <none>
##$CNST= (0..31)
1 1 145 1 1 1 1 1 1 1 1 1 1 1 1 1 1 1 1 1 1 1 1 1 1 1 1 1 1 1 1 1 
##$CPDPRG= <waltz16>
##$CPDPRG1= <>
##$CPDPRG2= <waltz16>
##$CPDPRG3= <>
##$CPDPRG4= <mlev>
##$CPDPRG5= <mlev>
##$CPDPRG6= <mlev>
##$CPDPRG7= <mlev>
##$CPDPRG8= <mlev>
##$CPDPRGB= <>
##$CPDPRGT= <>
##$D= (0..31)
0 1 0 0 0 0 0 0 0 0 0 0.03 2e-05 3e-06 0 0 0 0 0 0 0 0 0 0 0 0 0 0 0 0 
0 0 
##$DATE= 1568800698
##$DBL= (0..7)
120 120 120 11 120 120 24 19 
##$DBP= (0..7)
150 150 150 150 150 150 150 150 
##$DBP07= 0
##$DBPNAM0= <>
##$DBPNAM1= <>
##$DBPNAM2= <>
$$ [...]
##$SUBNAM3= <"">
##$SUBNAM4= <"">
##$SUBNAM5= <"">
##$SUBNAM6= <"">
##$SUBNAM7= <"">
##$SUBNAM8= <"">
##$SUBNAM9= <"">
##$SW= 369.568048894756
##$SWIBOX= (0..15)
0 1 3 0 0 0 0 0 0 0 0 0 0 0 0 0 
##$SW_h= 29940.119760479
##$TD= 32768
##$TD0= 1
##$TE= 0
##$TE2= 300
##$TE3= 300
##$TEG= 300
##$TL= (0..7)
0 120 53 12 22 120 120 120 
##$TP= (0..7)
150 150 150 150 150 150 150 150 
##$TP07= 0
##$TPNAME0= <>
##$TPNAME1= <>
##$TPNAME2= <>
##$TPNAME3= <>
##$TPNAME4= <>
##$TPNAME5= <>
##$TPNAME6= <>
##$TPNAME7= <>
##$TPOAL= (0..7)
0.5 0.5 0.5 0.5 0.5 0.5 0.5 0.5 
##$TPOFFS= (0..7)
0 0 0 0 0 0 0 0 
##$TUNHIN= 0
##$TUNHOUT= 0
##$TUNXOUT= 0
##$USERA1= <user>
##$USERA2= <user>
##$USERA3= <user>
##$USERA4= <user>
##$USERA5= <user>
##$V9= 5
##$VALIST= <valist>
##$VCLIST= <CCCCCCCCCCCCCCC>
##$VD= 0
##$VDLIST= <DDDDDDDDDDDDDDD>
##$VPLIST= <PPPPPPPPPPPPPPP>
##$VTLIST= <TTTTTTTTTTTTTTT>
##$WBST= 1024
##$WBSW= 4
##$XGAIN= (0..3)
0 0 0 0 
##$XL= 0
##$YL= 0
##$YMAX_a= 62176
##$YMIN_a= -67313
##$ZGOPTNS= <>
##$ZL1= 120
##$ZL2= 120
##$ZL3= 120
##$ZL4= 120
##$ABSF1= 182.463
##$ABSF2= -187.1042
##$ABSG= 5
##$ABSL= 3
##$ALPHA= 0
##$AQORDER= 0
##$ASSFAC= 0
##$ASSFACI= 0
##$ASSFACX= 0
##$ASSWID= 0
##$AUNMP= <proc_1d>
##$AZFE= 0.1
##$AZFW= 0.5
##$BCFW= 0
##$BC_mod= 2
##$BYTORDP= 0
##$COROFFS= 0
##$CY= -3
##$DATMOD= 1
##$DC= 0
##$DFILT= <>
##$DTYPP= 0
##$F1P= 0
##$F2P= 0
##$FCOR= 1
##$FTSIZE= 65536
##$FT_mod= 6
##$GAMMA= 0
##$GB= 0
##$INTBC= 1
##$INTSCL= 5.30512e-09
##$ISEN= 30
##$LB= 1
##$LEV0= 0
##$LPBIN= 0
##$MAXI= 10000
##$MC2= 0
##$MEAN= 0
##$ME_mod= 0
##$MI= 50
##$NCOEF= 0
##$NC_proc= -6
##$NLEV= 6
##$NOISF1= 182.463
##$NOISF2= 159.3651
##$NSP= 0
##$NTH_PI= 0
##$NZP= 0
##$OFFSET= 182.463
##$PC= 4
##$PHC0= -391.3937
##$PHC1= 103.8003
##$PH_mod= 1
##$PKNL= yes
##$PPARMOD= 0
##$PSCAL= 0
##$PSIGN= 0
##$REVERSE= no
##$SF= 81.0140089999434
##$SI= 65536
##$SIGF1= 159.3651
##$SIGF2= -187.1042
##$SINO= 113.3802
##$SIOLD= 16384
##$SREGLST= <1H.CDCl3>
##$SSB= 0
##$STSI= 65536
##$STSR= 0
##$SW_p= 29940.119760479
##$SYMM= 0
##$S_DEV= 0
##$TDeff= 32768
##$TDoff= 0
##$TI= <>
##$TILT= no
##$TM1= 0
##$TM2= 0
##$TOPLEV= 0
##$USERP1= <user>
##$USERP2= <user>
##$USERP3= <user>
##$USERP4= <user>
##$USERP5= <user>
##$WDW= 1
##$XDIM= 65536
##$YMAX_p= 494987955
##$YMIN_p= -38884587
$$ End of Bruker specific parameters
$$ ---------------------------------
##NTUPLES= NMR SPECTRUM
##VAR_NAME=  FREQUENCY,     SPECTRUM/REAL,   SPECTRUM/IMAG
##SYMBOL=    X,             R,               I
##VAR_TYPE=  INDEPENDENT,   DEPENDENT,       DEPENDENT
##VAR_FORM=  AFFN,          ASDF,            ASDF
##VAR_DIM=   65536,         65536,           65536
##UNITS=     HZ,            ARBITRARY UNITS, ARBITRARY UNITS
##FACTOR=    0.456856943014862, 1,           1
##FIRST=     14782.0589164792, 0,            0
##LAST=      -15158.0608439998, 0,           0
##MIN=       -15158.0608439998, -38884587,   0
##MAX=       14782.0589164792, 494987955,    0
$$ Real data points
##PAGE= N=1
##DATA TABLE= (X++(R..R)), XYDATA
$$ [...]
45811 -3012262 -3553923 -3877560 -4107802 -3744210 -2584636 -1307249 -789588 -1214883 -2090536
45802 -2090536 -2757561 -2651129 -1588159 -233966 208342 -625462 -1565850 -1254649 116710
45793 116710 1149285 1065009 321569 -480000 -1277141 -1938491 -1930940 -1099545 -184211 -106976
45783 -106976 -1085880 -2594889 -3709273 -3440749 -1489051 1027611 2248093 1352167 -811430
45774 -811430 -2987122 -4610279 -5417962 -5030923 -3646825 -2364944 -1985361 -2013462 -1558811
45765 -1558811 -649296 110228 602721 994812 906374 -163465 -1672031 -2146443 -581716
45756 -581716 2634395 5962225 7604352 6792570 4728520 3540462 3653171 3119133 529554
45747 529554 -2502645 -3340862 -2017028 -963782 -1367268 -1907611 -1355452 -380826 -72804
45738 -72804 -336150 -608930 -803121 -771111 -164857 437683 -304955 -2302533 -3444912 -2370551
45728 -2370551 -515946 -59954 -962217 -1527010 -965922 166838 1324440 2124113 1746157
45719 1746157 -126287 -2073499 -2220402 -607426 1058074 1694488 1420957 223298 -2115610
45710 -2115610 -4701823 -5904336 -5379519 -4292467 -3396704 -2478204 -1803182 -2173138 -3083459
45701 -3083459 -2871690 -1503585 -1118062 -2581913 -3595620 -2040464 566941 1264786 38728
45692 38728 -565801 407402 1255588 740442 -245441 -738361 -1230527 -2149681 -2647416 -2175880
45682 -2175880 -1854632 -2855935 -4447073 -5055593 -4549388 -4017700 -3740728 -2876893 -1151865
45673 -1151865 458265 1064449 965885 1040586 1663407 2504029 2908426 2327863 862165
45664 862165 -507573 -732111 150860 1163617 1701716 2034156 2400802 2465991 2065776
45655 2065776 1711892 1754321 1696296 1055539 374644 562364 1590428 2626229 3134727
45646 3134727 3046296 2210687 716844 -467143 -353720 554236 797818 127059 -177433
45637 -177433 514858 1127173 746422 193397 580520 1373937 1288636 431808 126037 946921
45627 946921 2218775 3226193 3713579 3370048 2065172 545574 -266832 -599727 -1261655
45618 -1261655 -1901575 -1335809 272817 1200233 604872 -370340 -653837 -881235 -1917356
45609 -1917356 -3036497 -2900266 -1484933 163667 1335486 1673402 630539 -1664304
45601 -1664304 -3587756 -3590876 -2279998 -1476425 -1436539 -643589 1529970 3614213 4029062
45592 4029062 2887897 1102127 -1054170 -3438162 -5009080 -4633636 -2717099 -1015940
45584 -1015940 -688009 -1145143 -1007475 229655 1723762 2278833 1545430 185728 -922646
45575 -922646 -1320079 -889517 229309 1328209 1341836 26087 -1474037 -1946193 -1599461
45566 -1599461 -1352339 -1091595 -701 1465222 1598852 -28323 -1601692 -1613972 -1033392
45557 -1033392 -1539810 -2659876 -2503210 -919518 51266 -847362 -2365702 -2714514 -1906370
45548 -1906370 -1139656 -852198 -617100 -400657 -572065 -716928 299225 2630869 4697164
45539 4697164 4824703 3207071 1589472 1259393 2008019 2955758 3554781 3479255 2321816
45530 2321816 183215 -1800687 -2429526 -1953924 -1771014 -2388531 -2628575 -1478104 125280
45521 125280 486336 -264032 -155201 1819690 4122380 4590197 3037703 1043896 -177518
45512 -177518 -551928 -164875 1067239 2487818 2732273 1444162 136398 414478 1811693
45503 1811693 2348083 1043622 -1075958 -2511939 -2867709 -2534648 -1668850 -294173 913770
45494 913770 855947 -652202 -2200478 -1987397 155405 2286574 2359291 630560 -590175
45485 -590175 150330 1622400 1786152 771401 579190 1952460 3206765 2747080 1248613
45476 1248613 242091 -276456 -1312024 -2643069 -2820067 -1315452 744351 2127754
45468 2127754 2557600 2112747 937969 -50816 471490 2411829 3887130 3550058 2327406
45459 2327406 1839566 2002876 1576195 536654 276533 1352997 2494025 2386937 1398200
45450 1398200 804811 1044027 1487165 1502816 1014449 232652 -526153 -854546 -626346 -282047
45440 -282047 -243388 -168293 543944 1517288 1558457 428294 -393275 539652 2732289 4523595
45430 4523595 5294380 5681174 5784493 4742401 2561006 890603 935660 1653171 1279155
45421 1279155 -101753 -874760 -282794 959749 2175491 3271304 3728149 2697150 637608
45412 637608 -536234 255619 1847582 2443779 1726162 600875 -280359 -851403 -1141897
45403 -1141897 -1316373 -1736990 -2345305 -2527063 -2136062 -1889488 -2067038 -1730217 -224882
45394 -224882 1366542 1507573 337171 -786176 -1388308 -2077170 -2881650 -2929232 -1919869
45385 -1919869 -639919 176879 360929 -369202 -2226629 -4210925 -4559093 -2975789 -1226005
45376 -1226005 -758021 -799155 261395 2437720 4160875 4276392 3101404 1686636 746403
45367 746403 297328 -73512 -615108 -1057588 -1095464 -1081549 -1597740 -2329097 -2218158 -987404
45357 -987404 345276 827360 579020 18863 -924246 -2138978 -2783397 -2309667 -1380863
45348 -1380863 -947004 -1045376 -1313250 -1920000 -2935907 -3428654 -2457323 -648981 374739
45339 374739 -15937 -997775 -1543629 -1171442 158891 1730496 1975149 48394 -2589368
45330 -2589368 -3507301 -2268083 -774156 -610576 -1458178 -2349701 -2986180 -3310375 -3139974
45321 -3139974 -2800261 -2863731 -2800263 -1398896 814790 1373470 -694272 -2879674 -2419831
45312 -2419831 -304962 25112 -2588675 -5642723 -6270946 -4179206 -1066130 1402206
45304 1402206 2588177 2898630 3204235 3664347 3302498 1521890 -453467 -919742 -130442
45295 -130442 168257 -468202 -660141 231281 900799 260257 -827205 -1038853 -483381
45286 -483381 25437 399380 773512 656933 -81009 -336728 637141 1592672 923069 -643723
45276 -643723 -886939 524506 1444368 428804 -1219578 -1421677 -93045 1065536 851513
45267 851513 -247193 -861494 -179450 1348187 2536531 2704213 2144023 1198117 -422948
45258 -422948 -2648870 -4128073 -3646534 -2090139 -1414010 -1787143 -1624936 -666709 -773608
45249 -773608 -2675295 -4076834 -2774320 -71268 1024167 -33440 -1224934 -1457379
45241 -1457379 -1749875 -2853052 -3911697 -4121438 -3926304 -3752946 -3029555 -1399696 270654
45232 270654 1064565 1262459 1527323 1690111 1321248 869246 1228528 2490281 3829026
45223 3829026 4318456 3399361 1127533 -1434339 -2702721 -2205970 -1206836 -998381 -1248428
45214 -1248428 -931251 -196857 -71111 -708102 -1249343 -1240646 -937649 -345811 670049 1324198
45204 1324198 487935 -1364294 -2272374 -1376466 22389 591490 610307 578462 -166676
45195 -166676 -1937476 -3132303 -2111628 126390 1103443 295633 -549233 -422649 -348369
45186 -348369 -1288908 -2573567 -3113484 -2750581 -1738955 -213343 1167570 1369335 504608
45177 504608 -58315 211380 258816 -400239 -516756 596074 1357444 368375 -930869
45168 -930869 -361546 1360706 1784262 877911 1013331 2715790 3514602 1923023 -188932
45159 -188932 -653409 -141463 -427008 -1331537 -1482108 -895625 -715191 -1055346 -992531 -364131
45149 -364131 20389 -208454 -647176 -952320 -837911 353809 2723116 4734960 4553546
45140 4553546 2485186 763171 765914 1698954 2256588 2306652 2392345 2598359 2655220 2587787
45130 2587787 2649621 2889768 3112445 3058590 2497963 1368139 -103939 -1532739 -2557061
45121 -2557061 -2920275 -2737465 -2662349 -3138273 -3480635 -2735062 -1572532 -1753767 -3100252
45112 -3100252 -3014590 -466194 1609551 289470 -2581322 -2702081 564225 3855285 5235002
45103 5235002 6051599 6876039 5758267 2284371 -331543 169815 1365200 6520 -2781595
45094 -2781595 -3548544 -2010849 -806458 -730251 -18840 1686077 2245222 665782 -1067872
45085 -1067872 -948277 511881 1825797 2715441 3489681 3720376 2856834 1296999 -48765
45076 -48765 -614404 -196874 1002068 2042989 1962716 1114090 740532 1050509 1059611 628711
45066 628711 987013 2461177 3303056 2010747 -412073 -1867125 -1902795 -1663340 -1795654
45057 -1795654 -1866370 -1547510 -1067555 -522698 225771 957725 1252383 1242056 1460721 1956272
45047 1956272 2265610 2286126 2469406 3018533 3480701 3329867 2515675 1282721 -132798
45038 -132798 -1376794 -1858856 -1162783 360625 1637026 1785799 1046388 491395 612878
45029 612878 589106 -540565 -2295238 -3129673 -2325830 -662113 897257 2223439 3367570
45020 3367570 3825541 3182852 1940240 1049535 981512 1649515 2726253 3569045 3416973
45011 3416973 2270348 1112759 722663 787126 753809 906907 1780494 3013124 3714940
45002 3714940 3680925 3395627 3065406 2444556 1445175 239908 -966657 -1639785 -942630
44993 -942630 982903 2302247 1364703 -932698 -2028797 -907555 1014435 2311773
44985 2311773 3169834 3976245 3946894 2392625 273947 -881518 -1047185 -1473822 -2709790
44976 -2709790 -3927050 -4151427 -3328540 -2174205 -1571792 -1979104 -2840853 -2814159 -1281378
44967 -1281378 532958 750746 -874473 -2637449 -2922388 -1778000 -262071 922966
44959 922966 1604237 1618023 952250 239868 368287 1374737 2132994 1480695 -387162
44950 -387162 -1863163 -1430256 736170 2795983 3053589 1701189 512169 751986 1742390
44941 1742390 1814899 461421 -1028484 -1222715 -301149 374169 169500 -144620 165988
44932 165988 473684 -371115 -2258263 -3750359 -3793068 -2703774 -1303988 95584 1406175
44923 1406175 2199841 2157955 1666993 1298254 1011561 535023 199167 539019 1209189 1241970
44913 1241970 513140 67823 645157 1604438 1763756 740136 -989628 -2832171 -4305633
44904 -4305633 -4864038 -4121140 -2283573 -127508 1431376 1825620 1287552 818715 1158853
44895 1158853 1732379 1368292 220302 -88474 1203904 2641880 2550094 1452233 1098382
44886 1098382 1690265 1750738 633311 -540657 -779182 -527709 -462995 -326215 144556
44877 144556 186383 -971916 -2681198 -3476196 -2812442 -1446268 -327971 234464 448930
44868 448930 568749 526649 -50337 -1152470 -1786187 -826850 1308529 2700948 2103068
44859 2103068 323430 -984852 -1034766 94891 2030688 3734359 3570190 1031515 -2158891
44850 -2158891 -3770929 -3355173 -1857099 149325 2361522 3599219 2702949 548965
44842 548965 -573204 131430 1155990 1101676 442021 350071 1026301 1874540 2405268 2393765
44832 2393765 1900567 1512940 1812155 2364503 2082802 783877 -531941 -1135853 -1314029
44823 -1314029 -1461200 -1481311 -1325126 -1075122 -341733 1229473 2711584 2583349 945779
44814 945779 -492601 -1014938 -1696999 -3000320 -3599763 -2752331 -1895512 -2318446 -2932783
44805 -2932783 -2209041 -892600 -679659 -1257230 -908290 564241 1671478 1667970 1185151
44796 1185151 643499 -99245 -605445 -154138 796429 1099421 876817 1317359 2470638
44787 2470638 2987729 2310531 1464421 1319154 1618132 2085464 2867682 3361416 2252136
44778 2252136 -447627 -2756289 -3002213 -1660795 -209897 693154 1075295 809526 -17022
44769 -17022 -615110 -318320 547817 1234747 1491139 1410939 962899 225753 -407358 -742364
44759 -742364 -1088888 -1718751 -2422557 -2793896 -2548942 -1591382 -297508 470120 391153 406032
44749 406032 1362553 2312243 1579600 -697623 -2810794 -4159516 -5551067 -6581306 -5341922
44740 -5341922 -1840333 835958 624193 -377413 795153 3256975 3697794 1550715
44732 1550715 -311820 27149 1230170 1387830 651227 116754 -156089 -681791 -1178564
44723 -1178564 -937344 -100904 381450 6778 -618165 -496169 481874 1153336 358249
44714 358249 -1365830 -2081543 -843988 1029224 1773999 1354591 757051 27092 -1364915
44705 -1364915 -2721493 -2639917 -1416974 -1005767 -2017255 -2558402 -1062645 1257075 2209679
44696 2209679 1798660 1872532 3045764 3735541 2571404 368321 -1090048 -1355775 -1380012
44687 -1380012 -1645688 -1422469 -214526 998194 849840 -469100 -1339323 -803968 368905
44678 368905 951137 716622 198625 -234940 -468215 -436238 -438888 -1037839 -2019880 -2172090
44668 -2172090 -901047 590307 715708 -465395 -1680859 -2357394 -2824443 -2999536 -2392934
44659 -2392934 -1456753 -1464837 -2642430 -3582119 -3047840 -1470564 -145439 360307 522273
44650 522273 1032251 1954779 2507425 1862167 496702 128164 1472363 2760556 1826622
44641 1826622 -810717 -2635382 -2689066 -2415680 -2679940 -2157829 241956 3122548 4175117
44632 4175117 2882723 551115 -1260861 -1368850 650927 3423815 4336587 2582593
44624 2582593 566088 738304 2165060 2148355 334063 -1091737 -865050 106922 996110
44615 996110 2149620 3383741 3388151 1836160 311630 37878 255899 37715 135142
44606 135142 1422026 2744901 2278991 390827 -754274 -230256 784477 1255979 1635107
44597 1635107 2384423 2678189 1583772 -382542 -1870306 -2319450 -2137516 -1669136 -846158
44588 -846158 254904 1184079 1518598 1184084 511335 208753 900327 2251690 2933734
44579 2933734 2046726 282228 -975748 -1376739 -1585284 -1793094 -1402081 -336330 485086
44570 485086 496525 378522 966367 2022911 2773020 2994689 2875687 2426590 1815303 1638661
44560 1638661 1904045 1317915 -1186910 -4469501 -6002095 -4784423 -2389683 -906834
44552 -906834 -775199 -929282 -249080 1478192 3359836 3899281 2376607 -12697 -1080704
44543 -1080704 -18880 1754513 2364000 1438150 22832 -755967 -513125 325035 821853
44534 821853 359487 -509885 -571703 359594 886487 -283184 -2541322 -3892036 -3117571
44525 -3117571 -1058888 200558 -667883 -2870251 -4172660 -3269372 -1268528 -286899 -890077
44516 -890077 -1837804 -2125803 -1949110 -1512653 -444941 951875 1332747 256573 -691730
44507 -691730 -28124 1290606 1119242 -837669 -2724861 -3083231 -2368676 -1848523 -2038574
44498 -2038574 -2454402 -2246943 -1027544 517963 1129465 539335 -60804 212320 531805
44489 531805 -184782 -1237495 -1116124 4250 583991 413891 954734 2566119 3407165
44480 3407165 2143962 150562 -377594 591505 1300204 896873 296272 536314 1489900
44471 1489900 2345852 2562473 2181950 1684163 1536507 1569344 1050476 -214344 -1275702
44462 -1275702 -1206029 -532491 -615830 -1694140 -2517197 -2128047 -1104494 -598619 -923242
44453 -923242 -1678056 -2551956 -3136958 -2500111 -151215 2639558 3743130 2749085 1527731
44444 1527731 1605858 2090196 1256673 -699089 -2005658 -1999259 -1795832 -2199211 -2597362 -2471169
44434 -2471169 -2466422 -3033442 -3273013 -2344946 -1090745 -923986 -1712440 -2089840 -1531110 -859482
44424 -859482 -801440 -1105261 -1065863 -101369 1945928 4187836 4774051 2804741 -64591
44415 -64591 -1243948 -345404 725032 832784 1026535 2309837 3679940 3583107 2232511
44406 2232511 1185684 1212308 1677845 1662425 780522 -768268 -2106246 -1962694 -2198
44397 -2198 2266839 2854969 1651671 585117 1177560 2719097 3397051 2660736 1625594
44388 1625594 1241777 1022010 138528 -878413 -631126 917610 1839836 571879 -1878444
44379 -1878444 -3003996 -1736542 622278 2245747 2569058 2159180 1777732 1956921 2784339
44370 2784339 3612747 3405618 1778410 -498372 -2188876 -2601190 -1955436 -1049377 -519660
44361 -519660 -240900 299600 904936 669148 -437937 -1005140 -268977 279974 -885610
44352 -885610 -2310354 -1213027 1906113 3133910 518532 -3055694 -3987305 -2659213
44344 -2659213 -1781324 -1856212 -1195784 410418 1093970 125966 -850019 -511243 273687
44335 273687 204199 -494978 -983653 -1353161 -2029814 -2583065 -2395591 -1896544 -1876007 -1941806
44325 -1941806 -974457 861159 1827105 827541 -1041120 -1917181 -1500371 -973588 -935603
44316 -935603 -656904 370589 1370218 1557416 1536425 2269308 3244734 3068881 1715049
44307 1715049 750297 1118474 2023004 2419479 2346935 2173254 1731145 1038363 837555 1459795
44297 1459795 1987849 1486373 294430 -830315 -2024561 -3670551 -5166236 -5624118 -5336248
44288 -5336248 -5312362 -5662359 -5560263 -4553793 -2873209 -774593 1315642 2345546 1604606
44279 1604606 37029 -577484 302796 1772432 3096012 4203655 4607878 3309238 248837
44270 248837 -3177294 -5481487 -6250602 -5861820 -4876554 -3824915 -2863950 -1723740 -657414
44261 -657414 -873977 -2805287 -4510808 -3597817 -592331 1570534 1597283 1219920 1913784
44252 1913784 2506293 1394184 -713134 -1974395 -2036688 -1811034 -1671230 -1553888 -2032823
44243 -2032823 -3557144 -5117972 -5284343 -4246301 -3369847 -3050256 -2547472 -1764231 -1539099
44234 -1539099 -2024741 -2301501 -2004558 -2004567 -2869884 -3700184 -3188657 -1187944 1250275 2834302
44224 2834302 2765652 1210934 -598926 -1343564 -1002984 -713528 -1059102 -1297592 -672588
44215 -672588 325707 650895 26730 -1093781 -2328071 -3312499 -3316402 -1953171 -185941
44206 -185941 388251 -516378 -1459739 -1146375 5519 633810 136457 -1031679 -2248291
44197 -2248291 -3042648 -2764974 -958159 1695993 3560210 3591954 2282697 853445 71404
44188 71404 78025 617475 911666 31997 -1846824 -3160112 -2816481 -1809966 -1825409 -2617140
44178 -2617140 -2273734 -202889 1713048 1627295 146828 -748121 -333806 422665 563070
44169 563070 155000 -283370 -450570 -187570 654926 1977545 3212767 3419175 1758582
44160 1758582 -1620552 -5022927 -6187471 -4390337 -1245401 968826 1335943 307058
44152 307058 -1513138 -3657832 -5369880 -6042163 -6040749 -6117326 -6008437 -4694072 -2265966
44143 -2265966 -394209 -299098 -1135835 -1218745 -231650 698265 723222 50602 -858754 -1774638
44133 -1774638 -2175294 -1287003 758303 2557354 2949919 2344460 1779647 1259489 135419
44124 135419 -1210398 -1517513 -653459 -22132 -383749 -626486 314796 1487544 1198315
44115 1198315 -526382 -2145032 -2710376 -2386178 -1368995 108017 997215 416954 -606036
44106 -606036 -155198 1627099 2449304 1148628 -824620 -1863151 -2198734 -2451065 -2138190
44097 -2138190 -1094140 -667918 -1735187 -2892524 -2546568 -1620646 -2016409 -3244536 -3014472
44088 -3014472 -893250 991239 1136326 502352 635716 1654715 2779332 3502463 3516356
44079 3516356 2503798 661388 -1199238 -2324105 -2243161 -603142 2190575 4396033
44071 4396033 4359763 2615067 1303003 1410051 1890412 1631397 814780 49587 -351339
44062 -351339 148266 1995887 4194312 4821900 3559094 2136307 1574931 774245 -1104557
44053 -1104557 -2684930 -2350983 -682514 770960 1834271 2969792 3379028 2031740
44045 2031740 -149349 -1362676 -1751943 -2909037 -4771320 -5461261 -4515583 -3856723 -4683006
44036 -4683006 -5500077 -4513824 -2297956 -612916 125504 602017 783973 101885 -969016
44027 -969016 -1161049 -314049 303045 -137994 -886175 -783564 208260 1168056 1377195 845999
44017 845999 62176 -316549 186228 1275090 1795563 903326 -549344 -501989 1892830
44008 1892830 4827741 5680481 4148504 2491347 2380828 2710890 1483700 -1037791 -2562350
43999 -2562350 -1941137 -582533 -341554 -1260296 -2058187 -1864188 -670885 1130249 2791314
43990 2791314 3403505 2901265 2321044 2270431 1914917 619012 -231715 1193255 4089328
43981 4089328 5541223 4405889 2648704 2073904 1826930 601545 -538793 218373 2079372
43972 2079372 2411252 597032 -1178570 -1170034 41138 1351463 2673458 3725843 3272275
43963 3272275 1059758 -945307 -935237 125639 -58336 -1759400 -3047553 -2664275 -1426860
43954 -1426860 -676923 -704742 -1052631 -1390220 -1702949 -2164240 -2913637 -3601618 -3489127 -2517897
43944 -2517897 -1702179 -1694854 -1686795 -792147 282734 448717 406393 1626238 3447922 3479228
43934 3479228 1173672 -1264377 -2258419 -2871751 -4221850 -5045722 -3761811 -1414500 -356085
43925 -356085 -866773 -1228744 -723739 -426417 -916822 -1119438 -55776 1591469 2425239
43916 2425239 1995582 873916 -323842 -1333595 -1927274 -1790884 -936719 -84862 -209678
43907 -209678 -1315079 -1960952 -796021 1467382 2618987 1744401 311889 -71279 289857
43898 289857 369641 486955 1666332 3552273 4462885 3349863 622870 -2623475 -5127669
43889 -5127669 -5734886 -4501752 -3163955 -3141098 -3495699 -2464142 -603090 -329434 -2223923
43880 -2223923 -4001218 -3838782 -2705748 -2306246 -2513364 -2317494 -1912907 -2109319 -2544060
43871 -2544060 -2184906 -1157822 -516490 -364046 345933 1963876 3282895 2957804 1049712
43862 1049712 -1222059 -2774074 -3384980 -3467760 -3492304 -3664365 -4015081 -4507006 -4803421
43853 -4803421 -4222350 -2530295 -726369 -281964 -1400400 -2713330 -2931311 -2062898 -753619
43844 -753619 649564 1864777 2415481 2301691 2158833 2098074 1317559 -311292 -1377069
43835 -1377069 -900095 -143897 -758480 -1891687 -1338228 633093 1071592 -1394243 -4319192
43826 -4319192 -4722175 -2806705 -799936 455051 1677249 2765506 2572521 1100274
43818 1100274 -88442 -184490 -222933 -1081471 -1798531 -1020713 846952 2207378 2439043
43809 2439043 2264253 2203090 1890389 1085639 375472 469408 1368727 2479010 3088167 2654855
43799 2654855 1192062 -503211 -1536912 -1901367 -2191192 -2415083 -2009386 -1116417 -639675
43790 -639675 -579611 334326 2408421 3641874 2090761 -1234069 -3474785 -3487578 -2601928
43781 -2601928 -2030453 -1423244 -331881 663919 1081365 1426793 2103282 2521835 2131097
43772 2131097 1357835 712345 -81508 -1156341 -1603317 -597733 1167504 2159814 1722370
43763 1722370 427906 -711238 -767646 558454 2154008 2200810 660716 6383 2112195
43754 2112195 5388279 6780768 5942531 5303456 6178166 7069378 6335465 4558423 3286208
43745 3286208 2860951 2536709 1767440 540748 -772662 -1312757 -332853 1573175 2763490
43736 2763490 2548528 1876900 1550761 1045783 -98002 -1032018 -908459 -337608 -226626
43727 -226626 -123690 757466 1613071 937706 -922764 -1835488 -680991 1312018 2363660
43718 2363660 2139906 1572709 1576305 2291661 2982085 2589648 991851 -492804 -665029
43709 -665029 -155674 -369471 -972164 -105771 2594530 4927047 4907264 3178659 1542869
43700 1542869 364896 -1034885 -2224882 -1739199 627203 3024108 3609906 2655372 2005944
43691 2005944 2703667 3640500 2895430 376873 -1540744 -747222 1746318 3028985 2301357
43682 2301357 1853421 3365022 5141093 4560129 1798876 -878691 -2539369 -3981469
43674 -3981469 -5211119 -5059781 -3587801 -2553849 -2711240 -2570096 -864009 1378091 2388395
43665 2388395 1976966 1116961 318463 -385774 -728289 -649811 -756115 -1326083 -1554401 -718872
43655 -718872 630139 1569739 2079663 2428261 2205474 1205755 454740 947320 1999940
43646 1999940 2283607 1902100 1908405 2286988 2142701 1566464 1487578 1783452 1404562 461029
43636 461029 267893 999386 1219148 306562 -523070 -401149 -177320 -563583 -652845 307217
43626 307217 1122195 292072 -1581990 -2679352 -2507617 -1955167 -1340169 -118738 1565382
43617 1565382 2587141 2386300 1713157 1511913 1841979 2150042 2011958 1419520 751762
43608 751762 521886 842531 1230715 1223301 971810 915217 1142285 1447142 1774717 2266816
43598 2266816 3026270 3977567 4726921 4658634 3687402 2725231 2561423 2492892 1333682 -300545
43588 -300545 -510085 701139 881455 -1141566 -3095807 -2566565 -654729 -133358 -1368327
43579 -1368327 -2573410 -3088121 -3652016 -4006835 -3108563 -1634965 -1484777 -2550073 -2710147
43570 -2710147 -1490147 -931416 -1984823 -2816487 -2019909 -957729 -1191797 -1804430 -1286256
43561 -1286256 -283382 -302618 -1042690 -1144530 -570813 -206998 86362 1016980 2015833
43552 2015833 1749447 205851 -1306923 -1955967 -1783388 -764195 1011026 2522471 2664303
43543 2664303 1729853 844869 313760 -225553 -594373 -510186 -627135 -1434095 -1703463 -82282
43533 -82282 2163429 2369436 444519 -910368 -368857 323665 -179750 -376460 1216095
43524 1216095 2961325 2363084 41231 -1215780 -738582 -632178 -1981412 -2886721 -1355748
43515 -1355748 1573558 3113038 2292397 758357 159842 125406 -523162 -1466519 -1090397
43506 -1090397 968221 2766814 2439626 818420 336360 1581369 2481914 1279963 -1099595
43497 -1099595 -2459377 -2001929 -584765 783899 1447643 732137 -1396050 -3360581 -3101641
43488 -3101641 -612266 1694306 1741795 144761 -857838 -221216 1011110 1371416 580957
43479 580957 -678799 -1762589 -2227248 -1576454 202141 1941497 2167461 956257 -90175
43470 -90175 -263434 -930904 -3140133 -5189106 -4608454 -2134579 -1235032 -3154192 -4868446
43461 -4868446 -3384152 -29803 1646255 869389 -28683 279789 366337 -1131957 -3119971
43452 -3119971 -3547868 -1959052 424268 2197235 2566510 1518325 44373 -387402 683087
43443 683087 2129329 2575398 1821641 583879 -533472 -1286282 -1587636 -1630924 -1800687
43434 -1800687 -2035587 -1755142 -795636 185610 720742 1325416 2689684 4592806 6165218
43425 6165218 6699868 5768932 3357945 578321 -663130 271227 1778472 2217517 2201533
43416 2201533 3160800 4414314 3849570 1402375 -485042 -443178 -3203 -753847 -1680502
43407 -1680502 -1013948 782505 1860860 1839713 1735310 1629482 610333 -1035169 -1744924
43398 -1744924 -1208582 -976410 -1799990 -2277825 -1353848 -427063 -1172651 -2487945 -1860055
43389 -1860055 668463 2260716 1393052 63563 749882 2745266 3216621 1189391 -1226952
43380 -1226952 -1607784 99924 1983628 2300598 774747 -1521901 -3053868 -2965762 -1688286
43371 -1688286 -203200 1185102 2698093 3800584 3294326 1277482 -160121 648734
43363 648734 2613957 3329757 2351238 1416530 1495128 1431287 91617 -1730614 -2602832
43354 -2602832 -2516597 -2483940 -2809363 -2909909 -2396643 -1323700 278920 2178899 3558722
43345 3558722 3782898 3322602 3094460 3184724 3098558 2874143 2836987 2532891 1227100 -542043
43335 -542043 -1268135 -598470 115072 -196694 -1009008 -1487080 -1900231 -2810199 -3679951 -3349579
43325 -3349579 -1551763 748224 2211331 1904240 -165857 -2679711 -3759264 -2868311
43317 -2868311 -1570996 -1696848 -3136056 -4207657 -3883679 -2772802 -1980767 -1817914 -1841680
43308 -1841680 -1659565 -1377971 -1334640 -1467321 -1171617 -182606 574135 -182839 -2283058
43299 -2283058 -4112299 -4809373 -5285452 -6244729 -6420327 -4270934 -736722 1425984 1001383
43290 1001383 -469761 -998420 -330931 561573 981580 828243 235530 -425242 -630187
43281 -630187 -291267 -18909 -540473 -1999921 -3785730 -4816949 -4270620 -2471871 -760888
43272 -760888 22970 445732 1207981 1720796 1167456 389049 998027 2697209 3298682
43263 3298682 1783842 -338129 -1320649 -1224436 -886966 -393416 394144 1122564 1814278
43254 1814278 3121159 4619568 4398925 1890935 -384215 23136 1704534 1244476 -1674180
43245 -1674180 -3682204 -2433961 567096 2575974 2861511 2194403 881865 -1057420
43237 -1057420 -2748157 -3019985 -1824150 -204301 835921 888239 114429 -725521 -746200
43228 -746200 -5302 439151 37152 -404031 -57665 481541 45491 -1357086 -2699669
43219 -2699669 -3516111 -4184782 -4704352 -4345637 -2875091 -1288514 -801257 -1506882 -2361569
43210 -2361569 -2244612 -912096 800989 1649280 1158112 191378 43914 981371 2033006
43201 2033006 2177268 1264965 -204608 -1586433 -2190211 -1543067 -131 1347688 1824475
43192 1824475 1860126 2083875 2178580 1382669 -83092 -1013688 -833563 -382902 -591046 -1025193
43182 -1025193 -586400 634694 1199571 285193 -1002757 -953400 517305 1773491 1582000
43173 1582000 504499 -204920 -384538 -837515 -1716809 -2078952 -1370241 -515562 -775043
43164 -775043 -1944270 -2580971 -1961903 -911586 -414177 -260253 262839 945956 892698
43155 892698 19749 -656866 -458150 60070 83340 -301912 -605669 -1054311 -2251185 -3837680
43145 -3837680 -4501729 -3677757 -2510092 -2543058 -3837747 -4961928 -4695714 -3257988 -1830529
43136 -1830529 -1194085 -911254 203324 2627970 5099789 5567716 3632222 1486234 1535693
43127 1535693 3377971 4362114 3271996 2004674 2781561 4941882 5901247 4585621 2322354
43118 2322354 583531 -462178 -971765 -730656 -138083 -393788 -1644838 -2174653 -733460
43109 -733460 1332420 1826353 817031 162378 295338 -336172 -2264415 -3581766 -2676566
43100 -2676566 -765568 -123205 -834905 -1090946 -227195 405594 -183325 -1019591 -729759
43091 -729759 387062 906905 366902 -247739 -55043 566950 725635 381668 408749 1356649
43081 1356649 2598477 2939304 1918083 270893 -891564 -1148428 -884172 -508702 74900
43072 74900 991963 1588971 673270 -2062193 -5145811 -6474152 -5459680 -3577681 -2627897
43063 -2627897 -2948278 -3594113 -3678242 -2985005 -1715673 -358031 391740 273615 -37573
43054 -37573 305336 1114178 1353104 553380 -560921 -947371 -268187 934025 1586610
43045 1586610 763084 -1313637 -3023924 -2847119 -1079261 665513 1502482 1840773 2005804
43036 2005804 1612896 631896 -163848 -380301 -622520 -1415715 -2481802 -3499363 -4416704
43027 -4416704 -4554233 -2869020 77014 1953462 1617045 739133 1065345 1612571 580113
43018 580113 -1228586 -1401147 284843 1614911 1397893 744703 639020 553148 63870
43009 63870 -295726 -585362 -1830645 -3837806 -4559924 -2965991 -864949 -330788 -742799
43000 -742799 -158662 1479001 2504855 2287678 1814331 1608328 918363 -602618 -1890199
42991 -1890199 -1911276 -1184834 -1032754 -1749755 -2223512 -1330369 722416 2589031 3137151
42982 3137151 2397583 1205468 272620 -125588 56677 543115 592012 -359463 -1850174
42973 -1850174 -2765891 -2572279 -1634952 -467981 564587 964950 572562 324150 1326498
42964 1326498 2983700 3431630 2302670 1575033 2821627 4999338 6130808 5966074 5535456
42955 5535456 5008332 3680691 1642012 -90333 -953915 -1133978 -714040 222823 849923
42946 849923 285899 -968789 -1517072 -1072844 -793204 -1410661 -2181939 -2077866 -1071964
42937 -1071964 178630 1166745 1650480 1555667 1121322 731901 473185 211951 -42587
42928 -42587 -384692 -1277251 -2736399 -3582566 -2675637 -808754 -24017 -816143 -1397037
42919 -1397037 -283621 1679056 2688492 2250640 1074030 -336313 -1726496 -2368831
42911 -2368831 -1671276 -337785 258678 -147438 -626264 -772364 -1299761 -2515641 -3358865
42902 -3358865 -2836269 -1654959 -1351324 -2153833 -2799774 -2393657 -1327893 -186001 1059356
42893 1059356 2207284 2399367 1546163 1183831 2500927 4174089 3831684 1374775 -950359
42884 -950359 -1760941 -1828726 -1857908 -1239442 -11817 93185 -1821154 -3934794 -4152741
42875 -4152741 -3007505 -2232680 -1816125 -723430 563120 782577 430795 890148 1515153
42866 1515153 485186 -1558733 -1875621 -77896 945343 -368089 -1707763 -605327
42858 -605327 1851629 3046481 2570835 1823469 1444434 1235230 1433145 2125627 2363095
42849 2363095 1543290 674652 680559 639056 -522893 -1827456 -1801697 -1114955 -1316986 -1826769
42839 -1826769 -817374 1343125 2294281 1396250 602913 1141763 1763457 1176665 142427
42830 142427 25997 864612 1894290 2640423 2606757 1202731 -1106940 -2767242 -3092908
42821 -3092908 -3109432 -3643250 -3872465 -2846917 -1286618 -584923 -876891 -1356335 -1825466
42812 -1825466 -2650990 -3657837 -4301395 -4659178 -5141121 -5415075 -4692276 -3008964 -1235561
42803 -1235561 175821 1436218 2256770 1520155 -1219098 -4510303 -6107656 -5306353 -3686968
42794 -3686968 -3307094 -4393647 -5194967 -4140971 -1699677 277808 739083 354486 326258
42785 326258 932871 1482358 1265926 297767 -667068 -803501 -126531 460601 416208 433009
42775 433009 1221069 1785335 322782 -2950780 -5377523 -5040708 -3089853 -1788902 -1383847
42766 -1383847 -516698 865889 948618 -1307962 -4420563 -6005995 -5298034 -3393658 -1633964
42757 -1633964 -530971 -53563 -155228 -651937 -893439 -120759 1566144 2895874 2616678
42748 2616678 1015676 -260939 -12938 1411915 2909616 3760630 3671917 2583265 1150519
42739 1150519 696471 1735365 3015339 2993465 1890534 1215128 1494859 1718216 1110032
42730 1110032 253515 38983 466267 1036147 1587826 2136713 2375630 1931862 935182
42721 935182 7685 -221462 400846 1287608 1454398 535981 -724366 -1506759 -2074998
42712 -2074998 -3070204 -3989214 -3604293 -1875177 -80402 1142749 2366633 3563426 3524857
42703 3524857 2089934 1215696 2255486 3582326 2896589 903319 413239 2209181 4135264
42694 4135264 4415647 3705351 3300603 3214399 2882073 2305187 1653530 879516 286416 292474
42684 292474 313124 -572182 -1489662 -383134 2399991 3519673 1277798 -1423294 -1136254
42675 -1136254 1001573 1250133 -843566 -2109068 -1066081 66638 -551347 -1536701 -1028403
42666 -1028403 288170 736974 299065 -125507 -551988 -1199005 -1223043 37947 1585819
42657 1585819 2215441 2462043 3365724 4266149 3820023 2501637 1958855 2295094 2182779
42648 2182779 1528249 1706994 2861571 3248353 2061337 901274 1282035 2303932 2211014
42639 2211014 1098503 569540 1324402 2420904 2722777 2107966 1263792 897756 1145225
42630 1145225 1467854 1271687 700669 493561 1088137 2356918 4046911 5641736 5939494
42621 5939494 4068916 1229393 34702 1359919 3003629 2452837 2695 -1975972
42613 -1975972 -2070076 -891679 320054 868784 616506 -17391 -105427 847982 2064648
42604 2064648 2312395 1388685 86155 -990118 -1680177 -1639342 -588328 733835 898413
42595 898413 -550347 -2383936 -2933765 -1690077 351138 1531392 804400 -1371620 -3445609
42586 -3445609 -4317579 -4168316 -3571829 -2602621 -1479834 -1146676 -1989411 -2660265 -1669973
42577 -1669973 256996 1075022 464109 81087 588240 537103 -948595 -2281589 -1597490
42568 -1597490 515598 2002597 2163625 2006565 2342667 2918708 3177527 2725954 1234396
42559 1234396 -1097303 -3082475 -3461718 -2261800 -631085 420817 493825 -488557 -2054145
42550 -2054145 -2946585 -2159915 -199938 1486662 2223867 2461206 2662790 2821535 2952959
42541 2952959 3042634 2550199 1035871 -712601 -1325372 -713820 -73391 114345 639078
42532 639078 1714193 2168357 1351085 390635 371677 561399 -69207 -706189 -12142 1086341
42522 1086341 168880 -3022920 -5723497 -5560322 -3237169 -1034360 -29426 175896 73150
42513 73150 -158562 -245969 -37781 183580 282808 691216 1570761 2139751 1683049 737707
42503 737707 315495 339892 -70386 -981306 -1445271 -952293 -57140 574550 817371 648619
42493 648619 36710 -472796 -18023 1335689 2459893 2653189 2376338 2058575 1218881
42484 1218881 -415607 -1791673 -1606460 -44543 1484815 2001894 1547620 569027 -295340
42475 -295340 -122559 1461543 3340540 3826783 2704207 1443417 1141448 1232109 816633
42466 816633 413835 1312734 3356680 4450201 2887644 -293906 -2196417 -1490018 -55824
42457 -55824 -382661 -2055292 -2401126 -588161 884953 -284688 -2932950 -4337324 -4128722
42448 -4128722 -4125161 -4855797 -4691070 -2731793 -433954 514947 383367 491119 1250297
42439 1250297 1988479 1879435 420493 -2155519 -4424274 -4691901 -2953687 -1010348 -156854
42430 -156854 132013 665683 1065535 795329 428512 665446 1062138 1003016 1095839 2228926
42420 2228926 3838762 4439186 3510966 1824849 353828 -205712 491806 1797459 2238188
42411 2238188 1437020 985238 2137939 3713717 3964424 3483377 4068260 5395782 5340957
42402 5340957 3418076 1389445 292896 -646157 -1705661 -1768268 -524745 721216 1360471
42393 1360471 2322657 3591411 3343629 1104761 -563146 479202 2757317 3629381 3180822
42384 3180822 3211829 3776596 3530458 2662487 2655267 3452505 3464596 2330701 1272888 681089
42374 681089 -244374 -1272178 -1079998 78386 152850 -1355388 -2194401 -773395 1383562
42365 1383562 2182837 2026398 2342932 2604947 1248737 -1191662 -2318724 -1255611 241918
42356 241918 474769 -97357 -214936 41622 -344368 -1365368 -1631999 -190256 1989625
42347 1989625 2905592 1775754 -185303 -1462833 -2051615 -2833489 -3655189 -3352963 -1848137
42338 -1848137 -817260 -1489320 -2859073 -3176737 -2424890 -1991875 -2286941 -2147451 -796508
42329 -796508 817626 1217287 260037 -739535 -486147 977180 2303910 2192077 839283
42320 839283 -186389 156557 993063 653617 -1108015 -2879523 -3505826 -3248191 -2799559
42311 -2799559 -2178525 -1266027 -659252 -1014754 -1828562 -1782387 -375093 1453940 2480960
42302 2480960 2424335 1808160 1167776 850167 1213544 2343916 3584128 3953299 3254754
42293 3254754 2297533 1734747 1186241 29049 -1350525 -1852050 -1082237 270358 1473019
42284 1473019 2340161 2662921 2023800 684381 -160445 263552 1253408 1586932 1006384
42275 1006384 55114 -967760 -1945949 -2273096 -1358985 285707 1436028 1606788 1274213
42266 1274213 789692 128531 -266121 422051 2088600 3473247 3612685 2721764 1400734
42257 1400734 -21524 -988085 -704222 677321 1809161 1844310 1529239 1852295 2528224
42248 2528224 2781708 2757703 2966485 3039001 2389974 1630489 1856061 2742697 2813775 1625832
42238 1625832 290779 -363064 -767550 -1350969 -1595119 -994781 91574 1192623 2338793
42229 2338793 3238265 2894261 1080190 -584936 -248469 1867542 3831595 4368267 3727513
42220 3727513 2392371 389458 -1643465 -2025786 113295 3053021 3855863 1774953
42212 1774953 -667731 -626768 1722104 3747633 3930344 3457231 3827257 4312159 3182689
42203 3182689 702318 -861808 -233001 1475029 2728866 3350339 3500676 2425758 -292586
42194 -292586 -3161217 -4150308 -3338617 -2681679 -3189034 -3791728 -3293313 -2115238 -1472102
42185 -1472102 -1750569 -2364120 -2558381 -1835052 -182952 1619008 2510159 2438071 2523670
42176 2523670 3398115 4083104 3360907 1714832 838109 1404593 2400301 2765225 2679572
42167 2679572 2817889 3157132 3179988 2795329 2414342 2295726 2275376 2036227 1354664 302322
42157 302322 -501809 -227906 1020861 1729006 498086 -1920177 -3045516 -1527299 1186730
42148 1186730 2672932 2410294 1949568 2513408 3484951 3504332 2257586 654574 -398999
42139 -398999 -943723 -1725303 -3175297 -4653976 -4877943 -3311950 -905969 914063 1709360
42130 1709360 1953421 1856578 1193059 232332 -225198 7576 299610 453651 1087866 2253232
42120 2253232 2799544 1938528 482412 -355858 -460899 -175709 734451 2178847 2837509
42111 2837509 1842646 610652 1121664 2883808 3648080 2854488 2127395 2350907 2716472
42102 2716472 3088984 4676389 7299391 8494108 6932032 4623537 3887306 4037615 3227378
42093 3227378 1874858 1624332 2054417 1299996 -538574 -1426261 -871789 -724334 -1970907
42084 -1970907 -3087076 -2493857 -771739 598309 1189323 1332519 1156533 929024 1331842
42075 1331842 2462581 3359604 3262812 2606537 2167019 2030764 2014820 2308254 3019403 3732829
42065 3732829 4106762 4369016 4809553 5353489 5897203 6371225 6280095 5040616 3030798
42056 3030798 1430362 830404 931088 1598004 2893948 3995093 3786706 2928253 3420384
42047 3420384 5396381 6406179 5035013 3123486 2759348 3072294 2164290 539759 83256
42038 83256 817902 1295539 1363929 1924229 2593341 2334765 1949888 3032872 4647220 4181034
42028 4181034 1731392 352648 1212063 1865451 743469 83152 2159546 5240715 6021080
42019 6021080 4288278 2485922 1904867 1928895 2216943 3036739 3714039 3012843 1125434
42010 1125434 -480636 -1200781 -1708668 -2281568 -2241156 -1173084 540860 2380994 3752428
42001 3752428 3674575 1780358 -545806 -1456515 -995240 -756196 -1317255 -1651494 -1199467
41992 -1199467 -768225 -903801 -1000323 -706942 -720908 -1319002 -1453334 -358641 1058132
41983 1058132 1555731 1361568 1473148 1933838 2073026 1911698 1987677 2056028 1312983 -40812
41973 -40812 -705366 -82521 864440 1065720 789670 904020 1333924 1240009 550337 323032
41963 323032 1301932 2829286 3649636 3285657 2150064 846019 46130 509959 2114460
41954 2114460 3128711 1862494 -757114 -1728927 266208 3060404 3941620 3056568 2451968
41945 2451968 2874371 3442564 3846077 4664480 5475893 4745022 2183588 -449375 -1646498
41936 -1646498 -1877674 -2270629 -2836232 -2899137 -2269475 -1108790 510079 2118989 2774567
41927 2774567 2284777 1759266 2124446 2788554 2593221 1450776 246655 -284054 142559
41918 142559 1485497 2983511 3322685 2143062 798857 659463 1226320 1040331 12444
41909 12444 -417432 646866 2460841 3768246 4159067 4055145 3930555 3813999 3389201
41900 3389201 2625535 2239158 2938917 4098729 4169949 2958226 2364935 3818307 5933235
41891 5933235 6165263 4210257 2210676 1827898 2633617 3428602 3709743 3534731 3124037
41882 3124037 2963717 3375608 3784321 3323297 2257308 1754855 2087704 2197058 1400085
41873 1400085 441825 325440 1008052 1849724 2631097 3507139 4396215 4866013 4441985
41864 4441985 3069846 1639623 1662786 3586879 5748386 6136934 5015804 4408410 4986811
41855 4986811 5164474 3779278 2033248 1790115 3164388 4806320 5625878 5360687 4370429
41846 4370429 3731129 4608437 6668514 8054487 7825016 7359980 8280282 10056509 11017100
41837 11017100 10793727 10261411 9831053 9465031 9805281 11468231 13501534 14364364 14354710
41828 14354710 15158105 16816419 17211081 15287671 12909126 12272962 12941504 12939099 11771767
41819 11771767 10641552 10169414 9741283 9285980 10006782 12437641 14902712 15260289 13808782
41810 13808782 13060764 14333190 15808183 14888089 11638664 8605762 7570049 7962335
41802 7962335 8599021 9342413 10245535 10443706 9238614 7507921 6688568 6760581 6469947
41793 6469947 5311759 4072120 3425347 3134160 2838001 2703658 3001103 3697362 4657128
41784 4657128 5715237 6519482 6829761 6918298 7166160 7454454 7499733 7414665 7200346 6171873
41774 6171873 3955530 1710331 1102454 2217102 3781209 5314436 7466085 10049933
41766 10049933 11494459 10913756 9253607 7630948 5987760 4341481 3898029 5487081
41758 5487081 7868865 9030592 8517500 7264642 5898377 4696237 4634845 6643547 9751116
41749 9751116 11552166 10955626 9321060 8463247 8613122 8939884 9128912 9489241 9921310
41740 9921310 9751750 8788639 7999503 8672394 10908599 13304090 14397143 14189505 13776779
41731 13776779 13672883 13301135 12275186 11254865 10987936 11246197 11406943 11478271 11761818
41722 11761818 12009592 11793980 11362411 11292617 11632295 12198150 13281841 15019903 16468563
41713 16468563 16647668 16388106 17637787 20637593 23241638 23723801 23007711 23096527 24180796
41704 24180796 24558294 23151527 21052195 20342614 21835114 24167539 25147017 24115973
41696 24115973 22767282 23081942 24686537 25295017 23928443 22379492 22701295 24386824
41688 24386824 25261622 24385112 22623695 20812211 19003740 17559279 17303156 18026699 18184821
41679 18184821 16876302 15049497 13872885 12943068 11299909 9429593 8740303 9317425
41671 9317425 9723289 9188768 8605727 8851181 9354844 9104730 8100663 6911055 5618724
41662 5618724 4288405 3819323 5002464 7010336 8137217 7968540 7485092 6988799 5588061
41653 5588061 3352471 2346058 4194222 7622532 9853766 9912786 9193717 9079617 9428167
41644 9428167 9481725 9021747 8270843 7533738 7186748 7269528 7017224 5711409 4096550
41635 4096550 3836469 5214901 6532954 6412828 5598408 5565159 6294829 6620904 6145478
41626 6145478 5473832 4812121 3677097 2112677 1028756 974525 1488802 2055834 2848832
41617 2848832 3990977 4852928 4854570 4448750 4431367 4544321 3763217 2079766 991796
41608 991796 1605876 2940275 3062153 1688180 591768 1171554 2631030 3301692 2983889
41599 2983889 2827115 3238767 3270528 2276946 959025 262101 315865 1107128 3052096
41590 3052096 5845742 7732190 7392666 6005862 5830312 6957136 7212881 5513214 3552680
41581 3552680 3387535 4791634 6102113 6591061 6734750 6852734 6772283 6499394 6163032
41572 6163032 5580187 4810410 4718183 5835038 7004556 6602082 5127865 5019835 7334296
41563 7334296 9994963 10348408 8516456 6999695 7398982 8726632 9013303 7661356 5832173
41554 5832173 4977627 5377668 6056573 5995398 5316843 5073223 5844716 6933017 7253619
41545 7253619 6754661 6454877 7034502 7799040 7389848 5524347 3706012 3770109 5676470
41536 5676470 7330878 7045220 5596009 4972567 5518252 5683473 4669517 3665494 3711159
41527 3711159 3905192 3153163 2507674 3836008 6675347 8473519 8077287 7070286 7090343
41518 7090343 7580287 7238646 6309389 6038568 6649048 7192802 7058372 6534249 6049025
41509 6049025 5731592 5620089 5609072 5334831 4718416 4388182 4932778 5992543 6736619
41500 6736619 6907392 6628897 5585109 3511138 1425889 1153119 3224650 6114773 7931672
41491 7931672 8163121 7502420 6825929 6805021 7679023 8699013 8407944 6247141 3518468
41482 3518468 2100317 2513950 3808838 4949133 5625559 6027575 6566286 7603430 8760907
41473 8760907 8833616 7297518 5613891 5805571 7703315 8975905 8299582 7064478 7050057
41464 7050057 7742985 7439958 6155219 5587802 6360576 7108199 6745319 6080032 6300585
41455 6300585 7046088 7146528 6585980 6517739 7547060 9010365 10025431 10514634 10974918
41446 10974918 11653678 12142024 11715251 10224123 8682297 8497271 9872507 11540174 12461174
41437 12461174 13084061 14286282 15846240 16987981 17855856 19173096 20742159 21679193
41429 21679193 22115055 23230252 25331526 27257357 28196329 28851411 30093968 31495099
41421 31495099 31983142 31188640 29515406 27651194 26521513 26765403 27565812 26945418 24042166
41412 24042166 20262636 17444467 15857225 14857659 14312350 14086465 13191252 11077678 9073364
41403 9073364 8826396 9767469 9847175 8538690 7295425 6979075 6640965 5330953 3657819
41394 3657819 2919930 3670119 5477656 7215571 7544815 6221576 4922556 5482708 7276790
41385 7276790 7828638 6193946 4125191 3526915 4451409 6120854 8060577 9370590 8797370
41376 8797370 6818684 5937874 7361580 8948368 8280279 6365739 6025109 7527563 8390429
41367 8390429 7316440 5887930 5886113 6920772 7562144 7399235 7052752 7022075 7221668
41358 7221668 7135305 6145184 4278590 2686754 2645205 4038819 5659041 7004115 8739327
41349 8739327 11130280 13084260 13332913 11903745 9970209 8745638 8736653 9467906 9748439
41340 9748439 8872325 7694897 7723384 8988242 9845076 9297114 8412087 8678734 9918183
41331 9918183 10853750 11052652 11099311 11195408 10838829 9968097 9406351 9844921 11042102 12282133
41321 12282133 13121071 13525203 13776115 14369342 15471990 16354910 16043443 14852725 14534066
41312 14534066 16210218 18662499 19545064 18132885 16003815 14967556 15215650 15803778
41304 15803778 16072838 15951907 15486526 14856871 14508350 14540463 14298715 13405808 12917819
41295 12917819 14337538 17342600 19551374 19038150 16376105 13770140 12826512 13595661
41287 13595661 15082589 16031751 15708004 14605135 14132731 15103134 16786656 17846989 17842279
41278 17842279 17378353 17187289 17573452 18456707 19469522 20229445 20821759 21669815 22732827
41269 22732827 23469656 23956984 25226172 27801136 30599890 32123740 32200363 31758933 31479711
41260 31479711 31601074 32514900 34453072 36865260 39003082 40777779 42307015 43353343
41252 43353343 44265342 46575285 51111048 56208850 59642793 61847036 65116921 69878373
41244 69878373 74262852 77642791 81811179 87592853 92930255 96217909 99504886 106038098
41236 106038098 115855560 126141715 135260974 144182107 154122579 164954149 176339079
41229 176339079 188717866 202391897 216710137 230899917 245067365 259835303 275416904
41222 275416904 291507431 307928093 325037270 343300545 362352072 380752084 397220460
41215 397220460 412031321 426394142 440347306 452291851 461024171 467065566 471108577
41208 471108577 472118218 468113408 458219915 442970949 423303452 400470873 376366728
41201 376366728 352561547 329284321 306450685 285098927 266282910 248999751 231183866
41194 231183866 212890255 196558160 183549701 172245074 160583188 148963166 139223164
41187 139223164 131746656 125122250 118272511 111567593 105762102 100773971 95821454 90367988
41179 90367988 84771916 80036809 76732439 74222175 71486388 68726734 67272642 67504890
41171 67504890 67813926 66405944 63416548 60308528 57816221 55664216 53899186 53060647
41163 53060647 52972417 52702868 52057287 51874777 52325358 52162073 50555042 48614007 47910433
41154 47910433 48269156 48392550 48118792 48411062 49243264 49321869 48358550 47934866 49208373
41145 49208373 51166779 52309019 52842970 53806940 55039454 55767043 56536423 58559203 61285090
41136 61285090 62624004 61890542 60741902 60696417 61459555 62427500 64066393 66595869 68767448
41127 68767448 69433415 69322240 69851486 71033790 72006366 72892331 74476839 76393871 77289342
41118 77289342 76885997 76589996 77792119 80460161 83497415 85708641 86402994 85728643 84398831
41109 84398831 82749018 80625979 78685447 78621355 80779964 82542613 81047727 77137891
41101 77137891 74512090 74882373 76099281 75635259 73881590 72868419 73311891 74360061
41093 74360061 75280762 76032538 76629880 76972413 77121278 77228345 77500758 78428960 80406598
41084 80406598 82910261 84851631 85970135 86961343 88066125 88798640 89459214 91389604
41076 91389604 94887446 98347624 100660807 103092181 107226361 112173930 115728105 117680489
41068 117680489 120045293 124158964 129341635 134539931 139658635 144906234 150202598 155673477
41060 155673477 161572693 167381719 172208759 176489387 181959347 189227125 196599242 202297109
41052 202297109 206839433 212088387 218761967 226264769 234436499 243815860 254139340 264177301
41044 264177301 273623147 283840981 295883619 308855271 321412583 334077683 348531486
41037 348531486 364927417 381573351 397432085 413191504 429175868 443948585 456366696
41030 456366696 467606396 479150152 489480274 494987955 494177378 488951895 481390640 471276399
41022 471276399 457639209 440844234 421769960 400389133 376875879 353183152 331694601
41015 331694601 312645863 294438248 276380425 259619502 245145994 232216223 219410951
41008 219410951 206516550 194723136 185182799 177648558 170517596 162347005 153427270 145481563
41000 145481563 139555956 134739681 129425281 123212552 116822021 110655146 104462495 98266728
40992 98266728 92657355 88095433 84611975 82168761 80627228 79357362 77555872 75070397
40984 75070397 72444245 70159896 68244661 66465202 64465167 61959500 59288593 57431357
40976 57431357 56854529 56723826 55965147 54695462 53744894 53154603 52188488 50600663 48825303
40967 48825303 47059159 45235545 43784106 43247467 43157387 42463943 41107305 39955698 39160087
40958 39160087 37954670 36287019 35175592 35013124 34913138 34286595 33702191 33553552 33258006
40949 33258006 32537751 32117126 32274626 32120644 31363328 31330330 32892058 34737598 35314178
40940 35314178 35229246 35839014 36543691 35790798 34122276 33645939 34469062 34203053 31681064
40931 31681064 28973171 28579039 30259981 31869925 32077232 31076670 29632640 28681858
40923 28681858 29195311 31214743 33330767 34004141 33176481 31981672 31292412 31205352 31531074
40914 31531074 32036230 32393350 32408076 32099077 31356947 30142408 29311857 30206285 32596996
40905 32596996 34046519 32616914 29544120 27728188 28005139 28665455 28589257 28821800 30364668
40896 30364668 32184390 32651791 31774771 30717880 29956131 29204034 28568458 28425885 28444380
40887 28444380 27938110 27059966 26571487 26564043 26511374 26523833 27360830 29063315 30697895 31677103
40877 31677103 32219464 32242010 31096411 29020487 27636947 28051220 29323656 29813333 29344518
40868 29344518 29016954 29404425 30037889 30431617 30687682 31175266 32251565 34026868 35819257
40859 35819257 36372152 35449145 34661807 35610169 37611507 38575368 37927405 37186342 37508051
40850 37508051 38202509 38289149 38196737 38928720 40369720 41455360 41679067 41662008 42339433
40841 42339433 44022945 46179734 47956977 49075752 50148750 51776221 53551261 54614041
40833 54614041 55011532 55598232 56617753 57455830 57940070 58682690 59795737 60576016 61050741
40824 61050741 62439526 65136679 67586316 68517045 69174666 71605276 75379539 77911831
40816 77911831 77946729 77027569 77220988 78798590 80657474 81899067 82349964 82241996 81907932
40807 81907932 81426580 80460245 78877831 77359215 76654416 76421720 75735993 74626965 73930426
40798 73930426 73520704 72083236 69203448 66455867 65542621 66214234 66882100 66550465 65266118
40789 65266118 63332944 61134602 59352462 58344415 57431692 55603310 52853973 50199034
40781 50199034 48536268 48088616 48665345 49688126 50168158 49541397 48480170 48040831 48070658
40772 48070658 47471034 46154757 45542476 46506237 47782933 47371047 45019958 42456031 41320733
40763 41320733 41581157 41931617 41233178 39533107 37961312 37505913 37725170 37116856 35139192
40754 35139192 33212193 32885690 33550883 33251072 31661681 30727566 31763886 33295158 32963942
40745 32963942 30773981 29002265 29053934 29734348 29053470 26852171 24932359 24849794 26127920
40736 26127920 26845830 25865449 24119086 23314722 23606102 23411251 21765457 19787356 18986214
40727 18986214 19021141 18446234 17154651 16479648 16868312 17072991 16128761 14715332 13796548
40718 13796548 13140224 12210355 11554318 12043889 13252362 13777360 13036052 11853439 11334015
40709 11334015 11794095 12654268 12844280 11618585 9575217 8480038 9323733 10894492 11165790
40700 11165790 9865395 8651215 8754331 9505321 9502516 8376713 6900043 5916048 5691480
40691 5691480 6058581 6764937 7631898 8450410 8867520 8744070 8707900 9699699 11490133
40682 11490133 12342655 11028526 8647590 7288039 7177632 6569827 4528244 2318327
40674 2318327 1501162 1979918 2750663 3424038 3923471 3617927 2127411 522966 386713
40665 386713 1773664 3210706 3667395 3412372 2863961 1882033 696400 386730 1525156
40656 1525156 3070031 3629096 3419597 3904491 5568387 7119881 7172687 5840011 4208531
40647 4208531 2974761 2219047 1921033 1906357 1669620 1077883 966018 2100719 3719784
40638 3719784 4223339 3441239 3027192 4135957 5817208 6488826 6092920 5778368 6034962
40629 6034962 6213815 5656235 4433081 3112813 2460237 3092269 4734281 6099514 6205925
40620 6205925 5502007 5012774 4874752 4634386 4472400 4894995 5512349 5498892 5170941 5625138
40610 5625138 6672683 6724668 5250723 3854501 4037854 5142729 5610845 5346283 5547993
40601 5547993 6644917 7562807 7058720 5097258 2840852 1580912 1597408 2007662 1986119
40592 1986119 1909987 2588932 3562260 3399736 1963077 999200 1732480 3071750 3264684
40583 3264684 2373377 1879640 2507553 3683425 4689078 5138478 4654622 3317409 2289759
40574 2289759 2810461 4508098 5728562 5647077 5151295 5472327 6748677 8175995 8952035
40565 8952035 8873431 8436937 8390681 8848511 9078246 8607058 8078345 8258254 8639787 8107054
40555 8107054 6781403 5996753 6351669 6963086 6952097 6546553 6201360 5654932 4632691
40546 4632691 3751815 3852192 4795182 5644375 5843151 5647014 5508233 5521515 5506635 5344814
40536 5344814 5145062 5109288 5198137 5064935 4574535 4238727 4660896 5542546 5800831 4878881
40526 4878881 3455979 2547236 2282161 1947875 993750 -368068 -1421396 -1491601 -320089
40517 -320089 1748833 3796459 4724140 3982916 2180887 819838 962704 2038829 2430629
40508 2430629 1484420 396169 637764 2025803 3062364 2855565 1911560 1216527 1350517
40499 1350517 2397335 3842959 4535117 3642886 1822331 609926 520018 677939 577462
40490 577462 1064754 2884470 5139212 6122971 5214672 3187536 1058428 -575238 -1332440
40481 -1332440 -1047857 -91009 781156 1000236 511197 -231260 -453537 255780 1118368
40472 1118368 614521 -1618863 -3826875 -3906760 -1897492 156317 748725 418170 549436
40463 549436 1526665 2548549 2739528 1941484 700443 -121179 91136 1179254 2345185
40454 2345185 3016535 3401368 3933176 4397368 4081473 2816241 1412776 803920 1020293
40445 1020293 1338133 1276966 1039562 971791 1057553 1170299 1423763 1859487 2024341 1387804
40435 1387804 193067 -549348 -61077 1478354 3229831 4356358 4335035 3139386 1463243
40426 1463243 364758 162163 -110038 -1514918 -3469147 -3934166 -1827448 1279368 2667384
40417 2667384 1536445 -330116 -1120924 -1118130 -1534441 -2288829 -2417121 -2181290 -2828545
40408 -2828545 -3995576 -3413309 -303196 2683512 2638710 259967 -1484931 -1639139 -1686757
40399 -1686757 -1982580 -690743 2803206 5912302 5951688 3551414 1251460 18716 -923526
40390 -923526 -1761116 -1775441 -1070943 -600777 -348149 718008 2523763 3470588 2854344
40381 2854344 2144712 2750265 3749478 3289985 1499535 394232 1034012 2242540 2452522
40372 2452522 1568377 368793 -888120 -2229477 -2950100 -2102860 -43987 1553111 1590150
40363 1590150 696000 99719 114766 363360 817662 1647325 2347166 2078114 955298
40354 955298 90467 86085 272743 -136038 -805854 -829082 -122073 428161 201137 -311675
40344 -311675 -165193 756897 1503848 1272556 562201 592668 1595674 2398488 2007625 852735
40334 852735 -113673 -793761 -1574784 -2284876 -2629701 -3071928 -3899570 -3903248 -1756810 1369371
40324 1369371 2567318 1005307 -933931 -1137091 -525200 -1075040 -2679283 -3658308 -3347453
40315 -3347453 -2453364 -1435698 -115201 1356090 2397956 2766448 2572759 1883637 1014016
40306 1014016 599366 603362 104126 -974846 -1010259 1005182 3248310 3043682 587825
40297 587825 -1198656 -432395 1857135 3631572 3915936 2749329 680932 -1197053 -1920664
40288 -1920664 -1685465 -1233609 -371724 1496113 3486281 3718162 2031229 467800 427864
40279 427864 960121 651520 -317129 -962754 -1021702 -677566 57916 690127 90411 -1871080
40269 -1871080 -3445470 -2870813 -448437 2097312 3543543 3627033 2541978 1092213 602630
40260 602630 1537436 2729691 2923560 2438368 2286403 2329913 1594141 28556 -1300679
40251 -1300679 -1684705 -1444838 -1184710 -1180581 -1446616 -1738823 -1607062 -962535 -353131 -240979
40241 -240979 -410906 -500985 -511664 -325185 448384 1491083 1621325 546409 -226418 579522
40231 579522 2025015 2436480 1952646 1783556 1650336 230931 -1970557 -2576790 -705047
40222 -705047 1650672 2440380 1981605 1516488 966903 -406695 -2172940 -3091929 -2851869
40213 -2851869 -2282739 -2094800 -2232118 -2200270 -1408254 393670 2390884 2943718 1346449
40204 1346449 -1028089 -2134858 -1533303 -509498 -192709 -427291 -493915 -127031 425531
40195 425531 813812 800432 394784 -57664 -158175 54871 73604 -507270 -1439716 -1913525
40185 -1913525 -1326441 -105197 426757 -578591 -2291535 -2940817 -1888907 -320145 462245
40176 462245 652742 1141032 1734606 1357105 -24798 -835626 201714 2278830 3327330
40167 3327330 2417719 773113 333640 1669844 3531224 4318167 3680411 2496504 1572346
40158 1572346 936968 508916 720251 1821512 2972813 2937351 1724495 718633 878058
40149 878058 1529990 1463197 630816 43546 282041 910690 1360168 1671619 2111095 2540981
40139 2540981 2539172 1937820 1015848 264395 47361 355267 831920 1115884 1071176 602021
40129 602021 -398526 -1515415 -1639495 -150303 1860167 2558303 1728238 1051777 1570804
40120 1570804 2086117 1037678 -1064427 -2451124 -2644343 -2594494 -2574725 -1732740 -27443
40111 -27443 1036550 389656 -1083727 -1878256 -1811682 -1727976 -1922595 -1804091 -833053 850921
40101 850921 2532998 3317132 2821771 1764323 1300123 1495784 1188025 -235560 -1776972
40092 -1776972 -2189068 -1584789 -898135 -508131 -362789 -783108 -1916582 -2747817 -1925519
40083 -1925519 385804 2469073 2990956 2192306 1056781 62372 -928331 -1973462 -2590047
40074 -2590047 -2086531 -545527 696941 287437 -1277755 -1964937 -831218 687810 821720
40065 821720 -270289 -1228839 -1430718 -1018227 -27451 1079285 949359 -931162 -2827727
40056 -2827727 -2849219 -1697376 -1349031 -1764188 -1351623 -223685 -101138 -889070 -387453
40047 -387453 1877967 3447708 2690292 1040896 51437 -1076172 -3061582 -4167728 -2816500
40038 -2816500 -720685 -653686 -2338868 -3193498 -2253193 -783393 352155 1316584 1588715
40029 1588715 177074 -2281134 -3783801 -3626491 -3010012 -2837001 -2671875 -2067907 -1186432
40020 -1186432 111882 2052668 3593060 3125055 981523 -548297 -308285 361385 112081
40011 112081 -303521 458589 2127669 3409615 3770806 3452126 2530141 1111425 -137831
40002 -137831 -677806 -866678 -1222276 -1402090 -793752 220611 473323 -523341 -1865147
39993 -1865147 -2117175 -807055 831915 842723 -1204437 -3213344 -2752115 -179807 1592640
39984 1592640 669767 -1793330 -3586228 -4079777 -3991108 -3750461 -3327380 -2879796 -2419858
39975 -2419858 -1448469 61620 1009863 614578 -167921 29889 834060 843619 141397 301804
39965 301804 1743723 2829164 2261484 940758 477958 973280 1420299 1527487 1770142
39956 1770142 1930366 1016023 -1022664 -2577547 -2103183 20531 2026518 2750770 2331960
39947 2331960 1278901 -26920 -797486 -95927 1662822 2531281 1420016 -152600 -39243
39938 -39243 1423839 1956938 747211 -584948 -668827 -80810 342593 994849 2113390
39929 2113390 2525560 1306519 -532156 -1563773 -2071238 -2976621 -3664371 -2914193 -1410536
39920 -1410536 -1158555 -2508993 -3742029 -3706982 -3003676 -2309216 -1411115 -406587 -128554
39911 -128554 -677936 -1014261 -651738 -288806 -89317 1015754 3267880 4802854 3814088
39902 3814088 1015461 -1294216 -1859238 -1126889 -122898 212960 -705638 -2378637 -3317687
39893 -3317687 -2824294 -2005235 -2080196 -2511550 -2005435 -631747 421419 695730 727358
39884 727358 861060 1073976 1597219 2430083 2626421 1411318 -370912 -1325149 -1556303
39875 -1556303 -2017414 -2301097 -1216784 501820 493174 -1635901 -3268674 -2356423 -42223
39866 -42223 1532821 2135082 2518035 2296912 909366 -333364 533822 3124633 4849211
39857 4849211 4149937 2062415 438987 18007 508148 1323786 1749351 1243969 10767
39848 10767 -1256077 -2235871 -2968922 -3092602 -1978488 227090 2452824 3787478 4164610
39839 4164610 3968702 3581746 3274046 2891584 1781923 -203421 -1821292 -1560933 335413
39830 335413 1998651 2162793 1203220 -146771 -1788970 -3514518 -4557841 -4681050 -4684264
39821 -4684264 -5030731 -4919704 -3619767 -1800774 -482782 488576 1635989 2224147 1065759
39812 1065759 -1220476 -2377356 -1313592 478690 853489 -553131 -2389917 -3357027
39804 -3357027 -3215083 -2469999 -1766945 -1566188 -1980121 -2739755 -3316641 -3121577 -1864628
39795 -1864628 -32044 1196561 1023376 37334 -357775 349482 1116145 644694 -1034713
39786 -1034713 -2633507 -3047870 -2397155 -1693714 -1761936 -2548985 -3347169 -3542809 -3091891
39777 -3091891 -2333047 -1522907 -682720 192917 965503 1458301 1682922 1870161 2164289
39768 2164289 2313995 1954798 1366879 1563853 3146192 5315494 6636245 6602064 5747146
39759 5747146 4467316 2843728 1611678 1823807 3034746 3303868 1933246 782204
39751 782204 1542994 3041252 3039346 1678066 911747 1123118 821707 -315668 -765784
39742 -765784 -155787 -392529 -2512754 -4554367 -4265539 -2256246 -583746 423861 1780185
39733 1780185 3185791 3117770 1415224 -265910 -836246 -976365 -1589155 -2438128 -2809888
39724 -2809888 -2425673 -1266031 510641 2054105 2209722 1003520 -21489 449058 1972503
39715 1972503 3054436 2877411 1840811 802803 318714 427774 785428 1045849 1233035
39706 1233035 1557263 1816571 1325311 -308860 -2473597 -3807107 -3242321 -963545 1549086
39697 1549086 2631750 1839903 146622 -1295363 -2177149 -2654854 -2638298 -2057677 -1307629
39688 -1307629 -681789 197833 1573351 2642876 2506890 1679538 1436122 1836599 1775160
39679 1775160 1016802 641217 1091865 1325108 606196 -256093 -404996 -390120 -962319 -1508211
39669 -1508211 -1084606 -221740 -175201 -828632 -846588 225925 1405167 1870312 1859254 1738589
39659 1738589 1336766 644763 259164 574655 1151840 1348027 1116788 829629 716649
39650 716649 818019 1164151 1677179 2055200 1959821 1289620 305306 -440867 -511105 -109364
39640 -109364 80651 -176300 -335648 -34588 254557 245956 831829 2818806 4993129 4999123
39630 4999123 2454112 -216951 -761593 246230 717637 112191 -163250 854744 2242228
39621 2242228 2562246 1834850 1355780 1752405 2027757 1019790 -644399 -1023521 532530
39612 532530 2322373 2599197 1969282 2174909 3155666 3161294 1758222 712327 1210544
39603 1210544 2022753 1621174 677474 906762 2353362 3401304 3011168 1626723 223850
39594 223850 -377979 332861 1898034 2746842 1938597 712407 1013538 2762529 3985677
39585 3985677 3499854 2018536 653339 -148344 -110283 777785 1389043 350141 -1713115
39576 -1713115 -2484991 -1171842 322358 365525 -46433 669797 1861845 1783162 555737
39567 555737 -76232 459806 928470 420105 -555563 -1323854 -1932360 -2386692 -2238466 -1489257
39557 -1489257 -955602 -1142612 -1439389 -989651 93225 863278 696031 25403 -84819
39548 -84819 821402 1838606 1699737 700405 722163 2618516 4517336 4045344 1661412
39539 1661412 117805 699977 1752500 1333439 -309762 -1709094 -2234271 -2120290 -1494011
39530 -1494011 -576110 -162265 -726075 -1441511 -1132084 70477 941388 832171 231787
39521 231787 -215749 -346554 -98967 614028 1393237 1424681 470254 -676227 -1132980 -1035764
39511 -1035764 -1282742 -2277084 -3303221 -3283880 -1982472 -287428 627339 223925 -1279557
39502 -1279557 -3309580 -5161013 -6096771 -5738342 -4432615 -2945621 -1739846 -703217
39494 -703217 532832 2214043 4167465 5596014 5524484 3930042 2081430 1168539 1001591
39485 1001591 813753 793578 1583364 2569345 2280195 695879 -425384 -81615 592275
39476 592275 275359 -605931 -968509 -900655 -1147718 -1702725 -2158200 -2657054 -3254574 -3140138
39466 -3140138 -1876721 -704420 -1067433 -2341718 -2599994 -1285841 468079 1913668
39458 1913668 3316458 4493513 4510255 3265525 1923986 1292538 1012527 753843 930378
39449 930378 1708848 2443905 2627411 2407601 1801532 527765 -919626 -1214169 123450
39440 123450 1945041 2941265 2978087 2521123 1790149 1076022 889090 1145539 1081805 452845
39430 452845 -163158 -594556 -1317927 -2032966 -1631015 -402239 -481524 -2754778 -4971283
39421 -4971283 -4685529 -2703341 -1589660 -1877647 -2081051 -1739179 -1881129 -2586349 -2562590
39412 -2562590 -1542541 -945444 -1532038 -2306731 -2495873 -2826835 -3870004 -4705736 -4441375
39403 -4441375 -3787911 -3862514 -4405297 -4439818 -3926898 -3494099 -3094575 -2240852 -1296851 -1287672
39393 -1287672 -2341981 -3293874 -3104547 -2052236 -1238300 -1271986 -1652791 -1362293 -88349
39384 -88349 1153391 932500 -931425 -3017265 -3855348 -3390082 -2560480 -1948679 -1448442
39375 -1448442 -927660 -486516 -135018 142239 -35087 -1190199 -3116900 -4742137 -5168074
39366 -5168074 -4556466 -3703937 -3023457 -2385074 -1883919 -2183352 -3670496 -5474207 -5887025
39357 -5887025 -4019334 -778184 2035023 3390390 3538034 3120856 2315853 981753 -665612
39348 -665612 -1810997 -1594748 -28458 1735486 2464888 2292107 2527200 3696297 4523774
39339 4523774 3671203 1852329 992982 1573592 2252964 2200303 2122295 2309204 1325004 -1907550
39329 -1907550 -5741652 -7260201 -5811245 -3599239 -2724646 -3011028 -3101790 -2447026 -1446736
39320 -1446736 -466731 365192 752345 447670 -135873 -136668 749838 1823598 2174367 1761029
39310 1761029 1436621 1891156 2824693 3338225 2941016 1896125 778292 165057 621144
39301 621144 2218008 3875529 4010287 2377324 589742 136165 546436 442014 -204973
39292 -204973 -200271 685249 1186709 586942 -55144 481212 1690693 2025996 934695 -616255
39282 -616255 -1331075 -679191 861752 2099750 2029011 963436 351135 934472 1660236
39273 1660236 1120190 -533273 -2036247 -2818324 -3186972 -3107269 -2202501 -893272 -111256
39264 -111256 235810 1041390 1986350 1429697 -984497 -3213270 -3367604 -1979477 -502530
39255 -502530 1018040 3082404 4696795 4341429 2506267 1251268 1386049 1924101 2201675
39246 2201675 2504870 2484091 1183072 -768123 -1184234 420746 1597029 329986 -2116502
39237 -2116502 -3350476 -3280891 -3409332 -3861343 -3401830 -1903040 -660713 -310634 -259710
39228 -259710 -282962 -1001317 -2474662 -3758300 -4219559 -4107272 -3612227 -2614342 -1611540
39219 -1611540 -1597745 -2579269 -3351192 -3192442 -2725354 -2670006 -2807681 -2671495 -2295090 -1823262
39209 -1823262 -1313208 -1247434 -2132835 -3234535 -3062927 -1721671 -1263598 -2692717 -4061871
39200 -4061871 -3050101 -353328 1266211 734931 -314066 -152860 1054599 2149570
39192 2149570 2530757 2307475 1844224 1663613 2162401 3016778 3326230 2616632 1325442
39183 1325442 167059 -538364 -756633 -454776 211129 645975 125400 -1492563 -3362728
39174 -3362728 -4110598 -2991824 -689748 1265643 1939377 1620498 1079549 685763 361751
39165 361751 -90798 -802988 -1564276 -1763147 -1243250 -1097159 -2499755 -4573646 -4832776
39156 -4832776 -2469197 155805 407634 -1421712 -3169073 -3935314 -4331243 -4325391 -3079048
39147 -3079048 -985157 155027 -424535 -1397316 -1418145 -940599 -1136173 -2007403 -2482885
39138 -2482885 -1834700 -385607 794124 601739 -1165968 -3375583 -4562546 -4417607 -3664605
39129 -3664605 -2645475 -1068630 792554 1872544 1673943 835966 1717 -814648 -1389053
39120 -1389053 -1087944 -118169 259134 -451190 -1120298 -853057 -503181 -1201737 -2483462
39111 -2483462 -3218574 -3421240 -3586945 -3110895 -1270445 708683 684334 -1231343 -2522236
39102 -2522236 -1742018 -298069 10595 -490446 -539203 -271537 -723897 -1739093 -2066156
39093 -2066156 -1413586 -920332 -1339429 -2002243 -2101790 -1948626 -2128799 -2181058 -1240582 265168
39083 265168 755776 -410019 -1978380 -2524657 -2331952 -2640725 -3525074 -3700587 -2464482
39074 -2464482 -701297 448058 978913 1429628 1653487 1141230 253701 136617 1213392
39065 1213392 2393017 2140984 134092 -2326912 -3488308 -2714963 -960226 333010
39057 333010 706094 843247 1360767 1946913 1923108 1223902 429602 45253 50871 33540
39047 33540 -365976 -928454 -803334 535417 2235948 2695643 1528878 123443 -231924
39038 -231924 121857 329609 722699 2062067 3557794 3236691 526762 -2707131 -4127253
39029 -4127253 -3111219 -756962 1389460 2245988 1685545 660735 295384 533516 317785
39020 317785 -651050 -1252559 -640760 253525 -120942 -1735089 -2958114 -2675104 -1571195
39011 -1571195 -1079305 -1596472 -2110944 -1498373 -5655 789480 -217754 -2095562 -2813036
39002 -2813036 -1822339 -746360 -989652 -1727419 -1338529 22606 859258 938529 1576961
38993 1576961 3097489 3961079 3315626 2583148 2979598 2977699 484391 -3262470 -4674269
38984 -4674269 -2886649 -1187332 -2217721 -4055670 -3137371 414056 2945192 2302344
38976 2302344 205083 -789981 -500178 -224073 -317791 -255478 -257597 -1228164 -3132327 -4604011
38966 -4604011 -4416902 -2681159 -465788 1180116 1689016 1041732 -222165 -1288578 -1726928
38957 -1726928 -1897649 -2493657 -3536491 -3998008 -2812362 -343906 1658130 1932889 1030948
38948 1030948 177057 -597208 -2080426 -3922718 -4532432 -3294262 -1578219 -853593 -908179
38939 -908179 -754485 -242584 274135 945087 1817673 1939036 523494 -1362257 -1784230
38930 -1784230 -584282 332956 -423863 -2036673 -2721094 -1745164 168042 1736917 2099314
38921 2099314 1415730 645415 353538 6528 -917259 -1613745 -926341 566530 873128
38912 873128 -720331 -2566354 -2796862 -1495532 -146801 181766 -502403 -1522225 -2026683
38903 -2026683 -1671683 -1138214 -1302845 -1782338 -1365476 -154692 127985 -1269307 -2584638
38894 -2584638 -1787845 648806 2587137 3072355 2839772 2422810 1414457 -239262 -1558302
38885 -1558302 -1639470 -669154 469900 964370 289978 -1569850 -3689351 -4478809 -2984781
38876 -2984781 26669 2478048 2688358 904889 -902880 -1082901 -67405 403221 -275703
38867 -275703 -870683 -385356 294173 -209670 -1522344 -1958609 -943261 254177 338394
38858 338394 -484208 -1180245 -1336423 -1344546 -1449869 -1190529 -27913 1605672 2380910 1625997
38848 1625997 433466 374148 1271312 1446375 328630 -684307 -606896 -445261 -1130840
38839 -1130840 -1434632 92028 2142276 2002875 -451434 -2478677 -2372627 -1384850 -1112970
38830 -1112970 -1084288 -125107 1462341 2477562 2540820 2034724 1121129 -120678 -1202248
38821 -1202248 -1781471 -2176495 -2645994 -2849286 -2698099 -2877890 -3638412 -3942050 -2939328
38812 -2939328 -1537201 -1174885 -1627963 -1602789 -1242755 -2194384 -4734710 -6472657 -5047853
38803 -5047853 -1251720 1732822 1929296 425385 -407661 326384 1581728 2174300 2204112
38794 2204112 2447661 2955143 2951823 2033126 785661 37657 29722 572000 1433899 2112251
38784 2112251 1751771 84374 -1726506 -2018002 -621581 712669 307711 -1479130 -2911556
38775 -2911556 -3263927 -3618909 -4900735 -6041276 -5275246 -2960446 -1582509 -2461763 -3875602
38766 -3875602 -3547767 -1840634 -877171 -1257218 -1658494 -1524588 -1944302 -3335535 -4315441
38757 -4315441 -3966419 -3526287 -4405327 -5836853 -6055520 -4787353 -2954621 -813567 1725750
38748 1725750 3531624 3178796 1438838 756344 1787601 2384172 866770 -1444376 -2305016
38739 -2305016 -1819376 -1908181 -3167845 -4099945 -3583384 -2567541 -2610856 -3725177 -4589664
38730 -4589664 -4437415 -3801536 -3424830 -3242699 -2771328 -1964180 -1220903 -844055 -915422 -1468016
38720 -1468016 -2310768 -2883992 -2820456 -2481225 -2327924 -1947587 -545800 1564649 2918316
38711 2918316 2668517 1620512 1113272 1570698 2532871 3406504 3757725 3514909 3226778
38702 3226778 3427450 3572903 2626248 941480 173009 738233 988200 -76061 -958895
38693 -958895 -90183 1452511 1650927 741571 380373 531198 -190739 -1571472 -2013944
38684 -2013944 -1665015 -2426727 -4399105 -5201755 -3795225 -2250977 -2338368 -2844147 -2009510
38675 -2009510 -388605 748289 1864398 3631789 4594704 3113446 646573 232636
38667 232636 2019294 3015207 1535242 -571212 -928352 110505 453061 -686452 -2006850
38658 -2006850 -1999755 -774879 112748 -485909 -1793796 -1883638 -101175 2013445 2630012
38649 2630012 1595980 -60982 -1477965 -1893909 -571247 1688756 2097980 -999903
38641 -999903 -5232971 -6633918 -4633910 -2299499 -1702704 -1771761 -1302301 -1283293 -2727146
38632 -2727146 -4378668 -4472257 -3287814 -2212801 -1496296 -670961 -118892 -337168 -463386
38623 -463386 511352 1626358 1116188 -541272 -920907 714347 2142781 1375467 -608488
38614 -608488 -1559850 -1149021 -924686 -1651842 -2215169 -1346984 593651 2075986 2154462
38605 2154462 1295229 559010 347808 210082 -210713 -475854 60234 1227534 2176142
38596 2176142 2520093 2694960 2944531 2655249 1327920 -254088 -714601 124214 1012059
38587 1012059 1019666 624300 537428 320826 -812386 -2290908 -2567367 -1281880 160462
38578 160462 587905 510121 823523 1085739 277842 -1279304 -2128436 -1727218 -1082536 -1115188
38568 -1115188 -1448890 -1292074 -705265 -367182 -550140 -882866 -948401 -819464 -1072676 -2188361
38558 -2188361 -3623903 -3759950 -1556949 1718605 3371659 2267252 123240 -725044
38550 -725044 -74237 451053 -101811 -904767 -755366 282820 1042638 645541 -667561
38541 -667561 -2006365 -2813358 -3195264 -3428217 -3550106 -3604033 -3834189 -4210389 -4117451 -3084522
38531 -3084522 -1542695 -247160 706517 1516099 1758859 993623 25582 133923 961420
38522 961420 724152 -1101697 -2904250 -3388519 -3255563 -3465938 -3492127 -2725373 -2179292
38513 -2179292 -2997520 -4300154 -4394614 -3359615 -2505959 -1926483 -760860 434890 -10297
38504 -10297 -1966040 -3160762 -2467660 -1539733 -2144282 -3543151 -3801878 -2467464 -638962
38495 -638962 747099 1466481 1452036 847870 349839 625507 1502448 2221996 2264864 1617092
38485 1617092 616950 -200042 -603990 -1203064 -2759451 -4711820 -5296995 -3688059 -1152599
38476 -1152599 602934 1402829 2041350 2544028 2243374 1283761 791171 1342754 2162554
38467 2162554 2227461 1622057 1325201 1809541 2265775 1532380 -202028 -1130890 188413
38458 188413 2852656 4390274 3494323 1158476 -946047 -2173948 -2672675 -2609691 -2407256
38449 -2407256 -2886485 -4252341 -5457423 -5354073 -4044624 -2449970 -1085703 -4847
38441 -4847 572327 466285 105149 130700 587164 990551 919208 176444 -1118419 -2214588
38431 -2214588 -2222875 -1411192 -1105814 -1669623 -1748077 -545712 458598 -311478 -1737670
38422 -1737670 -1546579 -25475 325489 -1058681 -1614138 484889 3469042 4424291 2976749
38413 2976749 926479 -569920 -1625735 -2122633 -1494575 -66724 870626 725429 329188
38404 329188 564143 1045382 743924 -516086 -1757646 -1951196 -1032261 212917 1014608
38395 1014608 1248448 1363407 1861765 2760100 3384886 2855172 1128464 -507717 -491626
38386 -491626 1370202 3769169 5394427 5871834 5177753 3252499 769731 -783567 -726127
38377 -726127 -58160 169208 344847 981968 1102442 -227731 -1635867 -1054740 759054
38368 759054 935791 -1036808 -2300796 -1025684 831158 843344 -45128 677321 2910724
38359 2910724 4116827 3068301 1160899 93410 143370 872270 1882872 2515794 2093515
38350 2093515 854625 -337373 -1383733 -2991422 -5093791 -6341664 -5724392 -3930757
38342 -3930757 -2524854 -2231552 -2464222 -2254441 -1358249 -540827 -725457 -1734433 -2278026
38333 -2278026 -1665083 -1019413 -1862392 -3722001 -4375877 -2761096 -520006 66427 -1098411
38324 -1098411 -2101429 -1629672 -384533 218027 -108866 -533022 -496304 -342614 -540893
38315 -540893 -967585 -1299539 -1583536 -1900373 -1916052 -1466270 -1201680 -1688419 -2071103 -872614
38305 -872614 1690908 3503049 3238608 2073619 1827130 2427676 2425237 1339446 143678
38296 143678 -375866 -536173 -896607 -1349226 -1357990 -684420 264985 711773 305048 -370088
38286 -370088 -586423 -692684 -1568173 -2765950 -2653862 -1040602 -46952 -1125811 -2680153
38277 -2680153 -2334642 -388349 974101 984285 567527 -43451 -1465388 -3084363 -3359499
38268 -3359499 -2498432 -2427556 -3568136 -4044901 -2943886 -1946869 -2405776 -2988282 -2017319
38259 -2017319 -419330 -297567 -1700868 -2785653 -2533258 -1586401 -785463 -339850 -214943
38250 -214943 -178159 294356 1253909 1858391 1566117 1137238 1474236 2109366 1946451 931631
38240 931631 -174783 -1170406 -2319895 -3302629 -3502740 -3064048 -2500919 -1631515 -191686
38231 -191686 849810 179751 -1656036 -2550302 -1702423 -723650 -1221775 -2549733 -2948588
38222 -2948588 -2099044 -1397753 -1940008 -3145239 -3561134 -2531866 -769202 557450 938508
38213 938508 583735 -270869 -1529193 -2736021 -3122143 -2454474 -1332438 -422108 15879
38204 15879 -284156 -1524799 -2962766 -3172197 -1916587 -743042 -838126 -1387445 -1230938
38195 -1230938 -1017829 -2058076 -3818820 -4475245 -3608674 -2489553 -1804934 -1021534 -150555
38186 -150555 -192494 -1262766 -1943799 -1223494 281367 1599166 2468627 2532288 1098375
38177 1098375 -1254040 -2261349 -551177 2280356 3431662 2070862 -339688 -2205048
38169 -2205048 -3031713 -2898036 -1974310 -689987 416268 1210457 1983542 2947604 3798921
38160 3798921 3618746 1463164 -2256901 -5198273 -5082158 -2456273 -172635 242135 120725
38151 120725 832656 1274404 -257872 -3099418 -5098844 -5613496 -5614033 -5377096 -4282823
38142 -4282823 -2818264 -2555423 -3665368 -4348917 -3441774 -1950311 -1198411 -993647 -654471
38133 -654471 -453458 -729093 -666241 528136 1937678 1966175 719825 -95683 403335
38124 403335 1327859 1660398 1557326 1550598 1567834 1442460 1525302 1970546 2099360 1422814
38114 1422814 802295 1460985 3000002 3582479 2313333 392661 -540983 -284044 334687
38105 334687 857030 1273052 1313666 783121 351178 935060 2272425 3034584 2467034 1102953
38095 1102953 -220187 -1147470 -1431134 -728451 799832 2414897 3660945 4606487 5051909
38086 5051909 4501472 3329843 2830372 3332786 3339668 1636829 -576105 -1035083 522978
38077 522978 2029002 1805827 427905 -397718 112797 1279348 1892385 1347609 144041
38068 144041 -625700 -465375 -38645 -303937 -1339943 -2387831 -2807738 -2597533 -2162934
38059 -2162934 -1864707 -1558692 -539097 1432463 2958772 1998939 -1387721 -4495820 -5146219
38050 -5146219 -4221580 -3753762 -3771042 -2999694 -1763322 -1682899 -2700791 -2946035 -1900887
38041 -1900887 -1246765 -1784911 -1877044 -227422 1839935 2517505 2270037 2636387 3561588
38032 3561588 3856191 3408282 2975792 2330267 556907 -1941228 -3480385 -3275507 -2181947
38023 -2181947 -1134264 -169942 734370 1069425 533979 -415223 -1092394 -1120607 -433921
38014 -433921 604357 1175460 850098 336284 547053 1111088 884838 -120110 -620156
38005 -620156 -130794 166528 -730279 -2045789 -2378884 -1682125 -1119898 -1387715 -2052715
37996 -2052715 -2368939 -2040108 -1270093 -626835 -780959 -1841950 -2925103 -2841458 -1393915
37987 -1393915 266363 764881 -67652 -993423 -659983 918862 2332663 2312990 1064528
37978 1064528 -169957 -577691 -338049 110717 713497 1541603 2345736 2606661 1874635
37969 1874635 154700 -1731468 -2426497 -1337835 412317 1090734 464511 -14945 713435
37960 713435 2057367 2990032 3444793 3681473 3221424 1645323 -83097 -473790 357542
37951 357542 654692 -622284 -2438105 -3116609 -2296926 -901459 194959 782890 970574
37942 970574 871601 583597 136991 -423991 -736125 -256254 925938 1796612 1549909 805642
37932 805642 932486 2090128 2778302 1796779 -10469 -754641 74261 1130325 1258229
37923 1258229 1058718 1789344 3316788 4092554 3121223 1186666 -125433 -107036 670934
37914 670934 1223225 999902 93394 -942011 -1425646 -990304 141337 1349031 2140718
37905 2140718 2528462 2905594 3506229 3983326 3698925 2551533 1273898 637260 599243
37896 599243 648041 724150 1104581 1444676 855304 -727924 -2069429 -2114773 -1307386 -734439
37886 -734439 -530957 -53296 704183 951392 400709 -256161 -460189 -551400 -942709 -1155740
37876 -1155740 -356588 1374743 2889302 3161665 2342360 1475853 1278138 1416876 1153641
37867 1153641 465080 9592 -16028 -211164 -802273 -1010956 -363678 186928 -370802 -1258276
37857 -1258276 -968800 194140 556553 93604 733370 2893260 4076124 2526326 253037
37848 253037 116445 1385600 1021638 -1343734 -2815694 -1785412 -86714 330287 237161
37839 237161 1089570 2296724 2514895 2160373 2493079 3138910 2671338 1229894 551875
37830 551875 1400029 2663595 3187692 2993077 2406365 1385755 187654 -444341 -256066
37821 -256066 252280 808954 1594984 2229810 1776374 298342 -798173 -717523 -405583
37812 -405583 -792757 -1067180 -54796 1509881 1714245 171847 -1502034 -1915732 -1241071
37803 -1241071 -172666 1088109 2319100 2916747 2802527 2878981 3829752 5054689 5483980
37794 5483980 4934617 3955023 2804316 1458668 372355 259817 996648 1513934 1111832
37785 1111832 356524 311542 1218312 2280412 2546347 1731919 369643 -528998 -103507
37776 -103507 1599448 3368019 3685650 2178160 75810 -1056363 -951843 -635993 -861149
37767 -861149 -1232885 -1268487 -1625304 -3285122 -5652749 -6601706 -4905270 -1831384 359144
37758 359144 917272 807506 885347 991728 830381 593592 284382 -670756 -2451672 -4121975
37748 -4121975 -4660664 -4323820 -4172734 -4493804 -4603994 -4226656 -4065434 -4607136 -5164686
37739 -5164686 -4797459 -3683747 -2806813 -2548743 -2452481 -2357959 -2809949 -3909818 -4556471
37730 -4556471 -3641332 -1621644 -28233 488351 678805 1114200 1188602 413175 -222244
37721 -222244 545498 2050095 2169655 244271 -1842698 -2156404 -1047166 50636 1040591
37712 1040591 2729359 4517858 4540554 2433804 218046 -386991 -101894 -494399 -1513717
37703 -1513717 -2060587 -2111622 -2501504 -2928829 -2020806 363219 2506985 3154160 3150728 3911074
37693 3911074 5254555 5829677 5096692 3851077 3015916 2772965 2877443 3213189 3901358
37684 3901358 5077740 6506345 7443268 7355930 6865355 7203347 8331088 8466108 6271555
37675 6271555 2819902 385221 -204132 97627 437084 890069 1428483 1490346 1041485
37666 1041485 968409 1801974 2823737 2969473 1994903 364800 -1307516 -2277202 -1876588
37657 -1876588 -357869 934743 773502 -832897 -2868813 -4117202 -3683937 -1639367
37649 -1639367 544410 1200121 593395 747866 2494148 4012444 3463593 1839533 1521201
37640 1521201 2790689 3688377 3055842 1835966 1227820 1284459 1755767 2785446 4110765
37631 4110765 4759379 4209969 3004446 1864131 1123479 1183641 2262738 3354240 2825237
37622 2825237 664550 -1154263 -1230423 -371515 39671 -114053 -411123 -963044 -1500845
37613 -1500845 -800054 1416497 3180646 2594325 461356 -1134814 -1871833 -2773281 -3643854
37604 -3643854 -3358976 -2282339 -1855241 -1857128 -689696 1371350 1975518 498668 -671730
37595 -671730 78496 1051038 262449 -1171160 -941628 701829 1527152 762629 -272148
37586 -272148 -545511 -370722 -229883 -126618 -49922 104874 767816 1773404 1855071 370488
37576 370488 -1213739 -1168304 -150392 -126132 -1183641 -1632270 -1101491 -1112936 -2216164
37567 -2216164 -2926889 -2331777 -1615421 -1882649 -2346610 -2002175 -1438801 -1473455 -1392044 -239104
37557 -239104 1247077 1761087 1671185 2287534 3384930 3359200 1826800 340354 158398
37548 158398 697457 754562 181284 -372671 -699598 -1284127 -2496962 -3921976 -4502930
37539 -4502930 -3398212 -857110 1835058 3441995 3646810 2784731 1230614 -539403
37531 -539403 -1771325 -2023636 -1771068 -1821153 -2178902 -1978859 -553173 1775566 3956397
37522 3956397 5083313 5147282 5030464 5519090 6349125 6708895 6602149 6847077 7609349
37513 7609349 8089581 8107127 8673331 10155260 11223438 10866928 10182432 10549050 11196491
37504 11196491 10679249 9900987 11099048 14063399 16105131 16194716 16472490 18668132 21443980
37495 21443980 22741196 22705258 22551951 22250451 21284393 20347637 20193678 19828822 18010526
37486 18010526 15768615 15118500 15707922 15258763 13432476 12672906 14403382 16684679 17066106
37477 17066106 16003034 15654612 16444005 16840871 16161805 15623594 16246620 17222569 17210224
37468 17210224 16355780 16057357 17077073 18708848 19744669 19573302 18259635 16245983
37460 16245983 14304617 13186533 12770918 11972057 10110306 8046352 7191040 7597157 7972966
37451 7972966 7619746 7322485 7958724 9138359 9784745 9355664 7946439 5887727 3878117
37442 3878117 2865331 3061684 3583287 3691937 3748723 4178776 4255026 3075872 1306171
37433 1306171 662792 1721913 3298137 4040364 3748762 3094376 2846542 3345880 4011692
37424 4011692 3595539 1770214 83252 181482 1444253 1874338 1180046 1121636 2494745
37415 2494745 3778783 3689990 3211231 3617988 3975945 2533584 -200200 -1767290 -1010498
37406 -1010498 690248 1673563 2074062 3053997 4894198 6573904 6926126 5815622 4247744
37397 4247744 3354671 3236919 3071396 2492228 2281571 3151345 4330959 4204780 2256354
37388 2256354 -287699 -1750786 -1466610 -57365 1259225 1715883 1708333 2274744 3606013
37379 3606013 4571517 4187793 2914517 1769000 863451 -108922 -567456 295434 1800032
37370 1800032 2345442 1808157 1757439 2863301 3700675 2894135 973301 -916779 -2741822
37361 -2741822 -4607257 -5215641 -3174714 551354 3238258 3561519 2802961 2674943 3188538
37352 3188538 3237964 2445307 1734990 2328940 4405661 6600009 7033650 5290227 3121026
37343 3121026 2590981 3808199 5227948 5800669 5682016 5056127 3796034 2559168 2622052
37334 2622052 3868932 4363476 2982521 1206986 920762 1532317 1094307 -390516 -921608
37325 -921608 249426 1445936 1280121 694769 1187006 2458868 3285448 3693639 4563144
37316 4563144 5517348 5008868 2750001 601417 366904 1667285 2749617 2704520 1993351
37307 1993351 1165911 113850 -1203895 -2119708 -1984559 -1217855 -918328 -1356603 -1546406
37298 -1546406 -752145 181595 -104136 -1306603 -1506816 267970 2618758 3692306 3599810
37289 3599810 3724577 4238978 3936150 2562106 1642506 2288507 3500021 3688577 2909781
37280 2909781 2344649 2254836 1925898 1371029 1489702 2253310 2207711 572124 -1253645
37271 -1253645 -1335060 287923 1828510 2172328 1972324 2301163 3200763 3939397 4069339
37262 4069339 3829802 3854520 4650138 5960804 6603686 5583951 3585510 2593352 3586334
37253 3586334 5358284 6247083 6174635 5944566 5315064 3430225 993870 123003 1413290
37244 1413290 2728749 1975738 -127795 -1339623 -1013543 -385296 -269946 -184534 218655
37235 218655 428890 208148 133323 397239 205483 -812220 -1539241 -804974 701014
37226 701014 1175169 266688 -260068 1142791 3594112 4646507 3130637 418141 -1341834
37217 -1341834 -1630127 -1594440 -2032746 -2362319 -1863695 -946997 -390319 -32656 723234 1539269
37207 1539269 1483264 612488 -14346 -7679 -102573 -637424 -781129 163059 1683212 2867841
37197 2867841 3385724 3150496 2042428 626394 99467 711906 1243548 912202 667804
37188 667804 1451989 2309363 1739502 36948 -1388647 -2286570 -3257019 -3704313 -2354949
37179 -2354949 133973 1330624 388734 -669675 135785 2211521 3719520 3944060 3234682
37170 3234682 1914636 523732 110444 958387 1758908 1209763 -255652 -1409892 -2069358
37161 -2069358 -2671343 -2763702 -1580943 183358 882551 310038 61727 1135007 2527989
37152 2527989 2839067 2087660 1103998 37775 -1408564 -2685205 -2473185 -277419 2643211
37143 2643211 4235885 3435752 1075008 -744754 -310964 2233925 4922631 5731944 4540295
37134 4540295 3134661 3045167 3676304 3186201 1171502 -438036 253164 2558220 4049632
37125 4049632 3640500 2583868 2248088 2214671 1346288 -221041 -1226641 -956984 217259
37116 217259 1725657 3248937 4293512 4221556 3013872 1450095 251560 -591088 -1454801
37107 -1454801 -2385510 -3001525 -2947481 -2296604 -1508628 -957988 -525636 133531 893861 1118822
37097 1118822 531137 -283849 -600246 -401242 -53665 489264 1493092 2627153 3103483
37088 3103483 2762017 2408419 2758307 3432755 3399865 2302202 984125 512170 832359
37079 832359 819322 -158584 -1206631 -991641 499549 2107966 3160748 3855916 4024652
37070 4024652 2993074 1152713 142041 552133 876354 -73539 -1169870 -1007145 -529520
37061 -529520 -1387976 -2697763 -2206602 -343196 -40562 -2052655 -3472019 -2212387 -293538
37052 -293538 -642256 -2629095 -3241961 -1552089 455505 1146112 1198946 2069371 3962261
37043 3962261 5737261 6046631 4530267 2417811 1562409 2254730 2669639 1367211 -491510
37034 -491510 -756878 559194 1491751 1274210 1350069 2759040 4172499 3562342 859464
37025 859464 -2034606 -3362819 -2878269 -1473402 -205648 292539 -99724 -1181306 -2540643
37016 -2540643 -3492931 -3340456 -2127907 -900697 -708988 -1469051 -2235323 -2416622 -2249448
37007 -2249448 -2263404 -2790712 -3816727 -4809831 -4924679 -3873510 -2296905 -822486 633862
36998 633862 1916436 1830680 -361867 -3165319 -4218643 -3370773 -2710961 -3329875 -3848820
36989 -3848820 -2853971 -1124280 -283629 -457268 -565542 -161832 247798 273912 48496
36980 48496 -163897 -104349 366436 849114 704429 193062 448134 1711065 2627836 2185845
36970 2185845 1287208 1199891 1444479 795434 -332895 -359603 842363 1658639 1263797
36961 1263797 762591 1291513 2368406 2801186 2175106 823443 -780622 -2057863 -2552265
36952 -2552265 -2580502 -2896792 -3432167 -3329792 -2541734 -2148507 -2467668 -2190647 -483943
36943 -483943 1223067 1032437 -605959 -1533819 -1004098 -430828 -853671 -1254496 -101033
36934 -101033 2510085 5015618 5994817 5041486 2732853 424713 -474625 173137 906429
36925 906429 313367 -1218498 -2050699 -1378907 19827 1107575 1781742 2421863 2944266
36916 2944266 2883552 2062553 699538 -888844 -2246810 -2715708 -1995032 -697808 158032
36907 158032 189197 -267535 -980054 -2057177 -3294463 -4026509 -3946225 -3450843 -2814428 -1690055
36897 -1690055 1317 1312486 1235626 103197 -800229 -865708 -607537 -574880 -695617
36888 -695617 -840615 -1206886 -1769890 -1988495 -1516775 -799929 -538255 -805915 -1035721 -750821
36878 -750821 -125017 105533 -699343 -2331880 -3738003 -4038617 -3388576 -2486684 -1568250
36869 -1568250 -512479 365040 579826 461150 780163 1275783 802036 -618823 -1233130
36860 -1233130 48761 1825402 2009220 676115 -257690 245936 1347117 1910913 1790747
36851 1790747 1417525 1206536 1562019 2510127 3149467 2424454 689841 -439267 -119031
36842 -119031 787828 1233136 1433619 2062646 2821766 2838071 2068337 1277521 694251 -335822
36832 -335822 -2041464 -3328930 -2904091 -1066489 387124 321672 -321954 39688 1250574
36823 1250574 1670830 849866 393570 1372915 2401577 1844930 727276 1213002 2795240
36814 2795240 2681552 209613 -1893005 -1677506 -758995 -1170434 -1786644 -468855 1865685
36805 1865685 2415339 1026299 403941 1707382 2940225 2520222 1722281 2133966 2913754
36796 2913754 2471410 1276756 935201 1494883 1728981 1504179 1806704 2531532 2215542
36787 2215542 371336 -1518548 -1988886 -1331690 -669095 -396981 -400457 -885181 -1909096
36778 -1909096 -2652894 -2272853 -1229785 -737787 -989774 -1016333 -454835 -288087 -1199048
36769 -1199048 -2157199 -1714157 -254471 246566 -1187250 -3188640 -3740227 -2535182 -1106128
36760 -1106128 -1036936 -2564904 -4620752 -5694592 -4889954 -2739608 -951199 -829500 -1911787
36751 -1911787 -2580005 -1979877 -789048 -19828 276475 719979 1484036 2046167 1963646
36742 1963646 1447528 1048335 996018 981390 494268 -735898 -2573647 -4512140 -5727095
36733 -5727095 -5385616 -3443295 -1174488 -258390 -953004 -1721468 -1209224 -47297 108080
36724 108080 -1111500 -2512332 -3183511 -3332027 -3110654 -2003859 -55190 1466741 1634928
36715 1634928 1288741 1832829 3204153 4148916 4123863 3744630 3490521 3111311 2436661
36706 2436661 1822623 1590050 1761879 2417509 3485532 4126143 3313710 1345309 -144239
36697 -144239 -119470 702274 1102296 930206 743508 576788 -55676 -1245977 -2444179
36688 -2444179 -2901258 -1987882 380192 3072117 4161879 2929479 1003779 518612 1471255
36679 1471255 2060517 1442375 713857 896866 1378089 1138029 455673 362527 1042348 1739195
36669 1739195 1847794 1256172 4728 -1479374 -2115028 -1167175 572140 1605680 1742198
36660 1742198 2185320 3403150 4148093 3283204 1543156 433407 60436 -684905 -2009079
36651 -2009079 -2570543 -1269075 1239433 3299062 3897409 3093408 1406260 -483541 -1674359
36642 -1674359 -1514275 -393764 400908 4027 -1063789 -1606825 -1323544 -1159097 -1919177
36633 -1919177 -3091800 -3652045 -3709762 -4403883 -5995560 -7056207 -6217746 -4034155 -2237189
36624 -2237189 -1587211 -1411969 -1002047 -401110 158055 565689 486654 -272802 -913882 -346989
36614 -346989 917183 901388 -1117842 -3292240 -3590968 -2330215 -1061162 -71732 1244454
36605 1244454 2293336 1736823 20929 -639663 641652 2074383 1750585 118886 -1050322
36596 -1050322 -981418 -146160 810831 1308290 747884 -769687 -2245390 -3112155 -3952325
36587 -3952325 -4983754 -4945787 -2995266 -820440 -855329 -2697143 -3470569 -2029033 -601211
36578 -601211 -1290487 -2855213 -2643609 -563134 812038 -195696 -2335705 -3229054 -2074926
36569 -2074926 -126349 816498 -27331 -1894260 -3140200 -2667861 -947982 465952 480156
36560 480156 -630035 -1802361 -2348174 -2350962 -2128891 -1701309 -1001189 -398327 -480849 -1097191
36550 -1097191 -1151014 19084 1375989 1201691 -620667 -2346358 -2683246 -2311597 -2477298
36541 -2477298 -3107652 -3343891 -3133004 -2986040 -2662054 -1582171 -403726 -599447 -2168116
36532 -2168116 -3190449 -2267060 -227147 1258422 1644437 1250724 124420 -1597744 -2855675
36523 -2855675 -2546856 -1084307 -2443 -11774 -326064 27696 1033467 2011696 2534143
36514 2534143 2775954 3224207 4041038 4571319 3825938 1809010 -71795 -472825 374569
36505 374569 1184591 1183545 438388 -862541 -2449848 -3584705 -3656787 -3001447 -2197495 -922318
36495 -922318 1284209 3466891 4051355 3164767 2461227 2432203 1768897 -56480 -1593319
36486 -1593319 -1827838 -1847231 -2575975 -2609070 -380117 2715066 3695547 1955455 -316208
36477 -316208 -1446385 -1867663 -2233338 -2017691 -786245 573054 781469 -425646 -2228754
36468 -2228754 -3378435 -2876561 -904411 902337 1064856 110266 -235056 463899 1032314
36459 1032314 832756 589369 710949 430822 -677423 -1746763 -1999693 -1865897 -1955880
36450 -1955880 -2124293 -2310167 -3014904 -4065987 -4240463 -3137443 -2038209 -1710623 -905159
36441 -905159 1271587 2902614 1483764 -2139784 -4459931 -3796218 -1908402 -935207 -834936
36432 -834936 -536506 136797 716104 1098934 1408395 1595947 1753453 2114364 2395715 1974459
36422 1974459 1053599 707961 1307314 1822196 1292361 171415 -436193 -182012 512815
36413 512815 1211161 1595593 1468034 1307987 2253797 4674060 7112452 7550872 5674793
36404 5674793 3176629 1747669 1375063 875192 -292962 -1223816 -712771 1017858 2241798
36395 2241798 1679568 109158 -614944 54925 811473 423565 -673398 -1114931 -210953
36386 -210953 1671240 3660591 4707009 3953345 1634741 -646144 -1323908 -525197 259000
36377 259000 89773 -488994 -569443 -290779 -616921 -1886209 -3096515 -2905449 -1177206
36368 -1177206 829215 1879030 1957798 1770961 1514607 812018 -296984 -1077928 -955797
36359 -955797 -81147 1029678 1804652 1540109 -99787 -2147627 -2713218 -902811 2170018
36350 2170018 4718821 5948003 5864428 4361819 1642278 -911774 -1643093 -584821 453243
36341 453243 85390 -1136559 -1805911 -1534496 -1040606 -748188 -199203 925178 1877042
36332 1877042 1590570 165094 -1143501 -1598188 -1893382 -2824555 -3712137 -3183088 -1300211
36323 -1300211 231205 176192 -899064 -1772434 -2142472 -2502831 -3103916 -3609697 -3412906
36314 -3412906 -2079873 -4048 1412113 1159062 245839 612410 2141742 2477997 655285
36305 655285 -992364 -130770 2011993 2562075 1291225 379077 485495 -9898 -1612702
36296 -1612702 -2411560 -1208997 387549 447620 -532947 -952096 -703093 -689365 -771492 -52688
36286 -52688 1272441 1970846 1482562 283414 -1227196 -2863383 -3773426 -2878731 -574073
36277 -574073 1145127 859447 -692856 -1726291 -1508040 -760394 -344611 -225549 194009
36268 194009 1132484 2111569 2532504 2339938 1929363 1507248 889961 36704 -576712 -430378
36258 -430378 363830 1172830 1578349 1739459 2001182 2377862 2587737 2520226 2424737 2467487
36248 2467487 2293999 1463661 335576 -83941 489726 1016249 528299 -379017 -359105
36239 -359105 685254 1504326 1398824 1045793 1088699 998523 52528 -1284435 -1760795 -815431
36229 -815431 861457 2042110 2004750 1169494 755095 1341478 1872936 906061 -1166175
36220 -1166175 -2301742 -1552535 -354700 -399522 -1449049 -2265843 -2586939 -2840154 -2747031
36211 -2747031 -1767177 -505769 -167105 -728044 -998093 -504153 -74676 -427157 -1296175
36202 -1296175 -2149059 -2756470 -2866065 -2282742 -1502014 -1357919 -1810970 -1944917 -1344893
36193 -1344893 -537757 162323 1171023 2512492 3176548 2349368 634249 -650257 -918073
36184 -918073 -484965 230393 986063 1448299 1304299 708080 269207 467329 1115538 1443562
36174 1443562 898139 -27226 -121743 1033406 2300785 2312814 1173329 65457 -487438
$$ [...]
##END NTUPLES=NMR SPECTRUM
##END=
