##TITLE=31Pdec_PhPA1911
 CDCl3, 88 sc
 20.11.2019
##JCAMPDX= 6.0         $$ Bruker NMR JCAMP-DX V2.0
##DATA TYPE= NMR SPECTRUM
##DATA CLASS= NTUPLES
##ORIGIN= UXNMR, Bruker Analytische Messtechnik GmbH
##OWNER= root
$$ XWIN-NMR		Version 3.5
$$ Wed Nov 20 14:04:43 2019 Russian Standard Time (UT+4h)  she@DPX200
##.OBSERVE FREQUENCY= 81.013821
##.OBSERVE NUCLEUS= ^31P
##.ACQUISITION MODE= SIMULTANEOUS
##.ACQUISITION SCHEME= undefined
##.AVERAGES= 24
##.DIGITISER RES= 17
##SPECTROMETER/DATA SYSTEM= spect
##.PULSE SEQUENCE= zgpg30
##.SOLVENT NAME= THF
##.SHIFT REFERENCE= (INTERNAL, THF, 0, 182.463)
##AUDIT TRAIL= $$ (NUMBER, WHEN, WHO, WHERE, WHAT)
$$ ##TITLE= Audit trail, XWIN-NMR		Version 3.5
$$ ##JCAMPDX= 5.01
$$ ##ORIGIN= Bruker BioSpin GmbH
$$ ##OWNER= she
$$ F:/spectra/data/she/nmr/P31/1/pdata/1/auditp.txt
$$ ##AUDIT TRAIL=  $$ (NUMBER, WHEN, WHO, WHERE, WHAT)
(   1,<2019-11-20 14:03:19.25 +0400>,<she>,<DPX200>,
      <created by zg, POWCHK disabled, PULCHK disabled
       configuration hash MD5:
       00 E9 B6 7A A2 85 ED C7 34 08 36 98 17 FE 4E 26
       data hash MD5: 32K
       16 26 76 72 5F 1C E3 82 A3 EF 02 A4 6D C7 4D 5C>)
(   2,<2019-11-20 14:03:21.67 +0400>,<she>,<DPX200>,
      <Start of raw data processing
       efp BC_mod = 2 LB = 1 FT_mod = 6 PKNL = 1 PHC0 = -1285.276 PHC1 = -33.79901 SI = 64K 
       data hash MD5: 64K
       1C 3B 4E 76 86 E0 B4 D5 23 78 00 90 C1 40 3B FD>)
(   3,<2019-11-20 14:03:44.01 +0400>,<she>,<DPX200>,
      <pk PHC0 = 19.40067 PHC1 = -12.8 
       data hash MD5: 64K
       2D 8D 6F 7F C3 87 04 DE 4E 6D C1 DD AC B9 0C 59>)
(   4,<2019-11-20 14:03:47.09 +0400>,<she>,<DPX200>,
      <abs ABSG = 5 
       data hash MD5: 64K
       A7 FB 66 75 4A 60 D3 26 C6 13 43 01 A6 6C CF A9>)
(   5,<2019-11-20 14:04:13.45 +0400>,<she>,<DPX200>,
      <pk PHC0 = -4.251789 PHC1 = 8.599998 
       data hash MD5: 64K
       42 F9 95 15 2B 7E B2 C7 A8 84 DA AB 65 F0 1B 46>)
(   6,<2019-11-20 14:04:17.32 +0400>,<she>,<DPX200>,
      <abs ABSG = 5 
       data hash MD5: 64K
       26 97 17 00 24 D1 97 E3 11 A0 71 92 BB 9C 24 78>)
$$ ##END=
$$ 
$$ hash MD5
$$ CB 4F EF E9 F1 FE 85 B7 73 9E 56 67 2C B0 38 22
##$RELAX= 
##$RELAX= 
##$RELAX= 
##$RELAX= 
##$RELAX= 
##$RELAX= 
##$RELAX= 
##$RELAX= 
$$ Bruker specific parameters
$$ --------------------------
##$DU= <F:/spectra>
##$EXPNO= 1
##$NAME= <P31>
##$PROCNO= 1
##$TYPE= <nmr>
##$USER= <she>
##$AMP= (0..31)
100 100 100 100 100 100 100 100 100 100 100 100 100 100 100 100 100 100 
100 100 100 100 100 100 100 100 100 100 100 100 100 100 
##$AQSEQ= 0
##$AQ_mod= 1
##$AUNM= <au_zg>
##$AUTOPOS= <>
##$BF1= 81.014009
##$BF2= 200.13
##$BF3= 200.13
##$BF4= 200.13
##$BF5= 200.13
##$BF6= 200.13
##$BF7= 200.13
##$BF8= 200.13
##$BYTORDA= 1
##$CFDGTYP= 0
##$CFRGTYP= 5
##$CHEMSTR= <none>
##$CNST= (0..31)
1 1 145 1 1 1 1 1 1 1 1 1 1 1 1 1 1 1 1 1 1 1 1 1 1 1 1 1 1 1 1 1 
##$CPDPRG= <waltz16>
##$CPDPRG1= <>
##$CPDPRG2= <waltz16>
##$CPDPRG3= <>
##$CPDPRG4= <mlev>
##$CPDPRG5= <mlev>
$$ [...]
##$SUBNAM3= <"">
##$SUBNAM4= <"">
##$SUBNAM5= <"">
##$SUBNAM6= <"">
##$SUBNAM7= <"">
##$SUBNAM8= <"">
##$SUBNAM9= <"">
##$SW= 369.568048894756
##$SWIBOX= (0..15)
0 1 3 0 0 0 0 0 0 0 0 0 0 0 0 0 
##$SW_h= 29940.119760479
##$TD= 32768
##$TD0= 1
##$TE= 0
##$TE2= 300
##$TE3= 300
##$TEG= 300
##$TL= (0..7)
0 120 53 12 22 120 120 120 
##$TP= (0..7)
150 150 150 150 150 150 150 150 
##$TP07= 0
##$TPNAME0= <>
##$TPNAME1= <>
##$TPNAME2= <>
##$TPNAME3= <>
##$TPNAME4= <>
##$TPNAME5= <>
##$TPNAME6= <>
##$TPNAME7= <>
##$TPOAL= (0..7)
0.5 0.5 0.5 0.5 0.5 0.5 0.5 0.5 
##$TPOFFS= (0..7)
0 0 0 0 0 0 0 0 
##$TUNHIN= 0
##$TUNHOUT= 0
##$TUNXOUT= 0
##$USERA1= <user>
##$USERA2= <user>
##$USERA3= <user>
##$USERA4= <user>
##$USERA5= <user>
##$V9= 5
##$VALIST= <valist>
##$VCLIST= <CCCCCCCCCCCCCCC>
##$VD= 0
##$VDLIST= <DDDDDDDDDDDDDDD>
##$VPLIST= <PPPPPPPPPPPPPPP>
##$VTLIST= <TTTTTTTTTTTTTTT>
##$WBST= 1024
##$WBSW= 4
##$XGAIN= (0..3)
0 0 0 0 
##$XL= 0
##$YL= 0
##$YMAX_a= 17928
##$YMIN_a= -22215
##$ZGOPTNS= <>
##$ZL1= 120
##$ZL2= 120
##$ZL3= 120
##$ZL4= 120
##$ABSF1= 182.463
##$ABSF2= -187.1042
##$ABSG= 5
##$ABSL= 3
##$ALPHA= 0
##$AQORDER= 0
##$ASSFAC= 0
##$ASSFACI= 0
##$ASSFACX= 0
##$ASSWID= 0
##$AUNMP= <proc_1d>
##$AZFE= 0.1
##$AZFW= 0.5
##$BCFW= 0
##$BC_mod= 2
##$BYTORDP= 0
##$COROFFS= 0
##$CY= -3
##$DATMOD= 1
##$DC= 0
##$DFILT= <>
##$DTYPP= 0
##$F1P= 0
##$F2P= 0
##$FCOR= 1
##$FTSIZE= 65536
##$FT_mod= 6
##$GAMMA= 0
##$GB= 0
##$INTBC= 1
##$INTSCL= 5.30512e-09
##$ISEN= 30
##$LB= 1
##$LEV0= 0
##$LPBIN= 0
##$MAXI= 10000
##$MC2= 0
##$MEAN= 0
##$ME_mod= 0
##$MI= 50
##$NCOEF= 0
##$NC_proc= -8
##$NLEV= 6
##$NOISF1= 182.463
##$NOISF2= 159.3651
##$NSP= 0
##$NTH_PI= 0
##$NZP= 0
##$OFFSET= 182.463
##$PC= 4
##$PHC0= -1270.127
##$PHC1= -37.99901
##$PH_mod= 1
##$PKNL= yes
##$PPARMOD= 0
##$PSCAL= 0
##$PSIGN= 0
##$REVERSE= no
##$SF= 81.0140089999434
##$SI= 65536
##$SIGF1= 159.3651
##$SIGF2= -187.1042
##$SINO= 113.3802
##$SIOLD= 16384
##$SREGLST= <1H.CDCl3>
##$SSB= 0
##$STSI= 65536
##$STSR= 0
##$SW_p= 29940.119760479
##$SYMM= 0
##$S_DEV= 0
##$TDeff= 32768
##$TDoff= 0
##$TI= <>
##$TILT= no
##$TM1= 0
##$TM2= 0
##$TOPLEV= 0
##$USERP1= <user>
##$USERP2= <user>
##$USERP3= <user>
##$USERP4= <user>
##$USERP5= <user>
##$WDW= 1
##$XDIM= 65536
##$YMAX_p= 386988711
##$YMIN_p= -37973273
$$ End of Bruker specific parameters
$$ ---------------------------------
##NTUPLES= NMR SPECTRUM
##VAR_NAME=  FREQUENCY,     SPECTRUM/REAL,   SPECTRUM/IMAG
##SYMBOL=    X,             R,               I
##VAR_TYPE=  INDEPENDENT,   DEPENDENT,       DEPENDENT
##VAR_FORM=  AFFN,          ASDF,            ASDF
##VAR_DIM=   65536,         65536,           65536
##UNITS=     HZ,            ARBITRARY UNITS, ARBITRARY UNITS
##FACTOR=    0.456856943014862, 1,           1
##FIRST=     14782.0589164792, 0,            0
##LAST=      -15158.0608439998, 0,           0
##MIN=       -15158.0608439998, -37973273,   0
##MAX=       14782.0589164792, 386988711,    0
$$ Real data points
##PAGE= N=1
##DATA TABLE= (X++(R..R)), XYDATA
$$ [...]
43784H381652k071513o237753l44861P123351N389489l184800p513812m046779
43776b505026M65112R85859o0298K08652L92408n00588L2107L082708N005190
43767G106124K565375j786408l347315j827841r24809j934386j643376J948257
43759A55621M850644J828790m788151o073620J333590Q649425N660456m872938
43751F743817j0297594m853960L858921O468696K907515r21142j404367J534203
43743D036089O207000Q411452L933818m247013o556681N74145P994890N815385
43735B6169085k489343n388945J94396N685037L555253l799076q892140p764054
43727G270213k512978J509244N75250l296622m142891K34576N035992N490131
$$ plain form
43784 8381652 6310139 72386 -272475 6850876 12240365 9055565 1541753 -2505026
43776 -2505026 -2039914 -1054055 -1114353 -905701 -513293 -1013881 -981774 2100934 7106124
43767 7106124 9671499 7885091 4537776 2709935 1785126 -149260 -1792636 155621
43759 155621 5006265 6835055 2046904 -4026716 -2693126 5956299 11616755 6743817
43751 6743817 -3553777 -8407737 -4548816 1919880 4827395 3906253 2501886 4036089
43743 4036089 10243089 18654541 22588359 18341346 11784665 12358810 20353700 26169085
43735 26169085 23679742 18290797 18485193 24170230 27725483 23926407 15034267 7270213
43727 7270213 4757235 6266479 6841729 3545107 -597784 -363208 4672784 10162915
43719A0162915L281816K010307N18051l490928o804439m796921q840O78609l642586
43710b092016p385334p404895n292079j376143N517160J1723010J0508251K500236
43702F698190l132194j108074L033947K210904k111746l927580k051267j01758
43694d89578K0637k50035K47114R13880J134144J158028J328498J442347O79870
43685F184905j614953m338678m980879l092226j552720k006264j515370K563068
43677a0353117O922735O504367K337347n19074j202202k670306m287251k288409
43669e555910K429892M679614L650109L280809L308252q97474p610870p930126
43661d645704K09029O813129M300527j684278k725913n41710j069333k767214
$$ plain form
43719 10162915 13444731 15455038 15973089 12482161 5677722 880801 871961 1550570 -2092016
43710 -2092016 -9477350 -16882245 -22174324 -23550467 -18033307 -6310297 4197954 6698190
43702 6698190 3565996 2457922 5491869 7702773 5591027 1663447 -387820 -489578
43694 -489578 -468941 -718976 -471862 442018 1576162 2734190 4062688 5505035 6184905
43685 6184905 4569952 231274 -4749605 -7841831 -9394551 -11400815 -12916185 -10353117
43677 -10353117 -3430382 3073985 5411332 4892258 3690056 1019750 -3267501 -5555910
43669 -5555910 -3126018 1553596 5203705 8484514 11792766 10895292 3284422 -4645704
43661 -4645704 -4436675 2376454 6676981 4992703 2266790 1725080 655747 -2111467
43653b111467m93826L952351M873554K745205J988790J527146k869915q475034
43645A136804p600779J76792O664307P072406N333451N370846M436324j230249
43637B1359902r231753j3305403j0260129k691135L484284L980760N72712l89958
43629f480720L802575P778292N482665q11982m200864l452333k957946l851169
43621d691482k968080p38656j776283n668887n301028J930939Q463622P177395
43613c572460J578892p19796K46689r68299m159263l140264L176376P113444K969693
43604B525012m053860m695827J496175N973814L667520l00220Q10583M948480
43596A0371677M955110J08906l106843j994282j805344n864298q613488m280087
$$ plain form
43653 -2111467 -2605293 1347058 6220612 8965817 10954607 12481753 9611838 1136804
43645 1136804 -6463975 -6287183 377124 7449530 12782981 18153827 22590151 21359902
43637 21359902 12128149 -1177254 -11437383 -14128518 -10644234 -6663474 -6090762 -6480720
43629 -6480720 -2678145 5100147 10582812 9770830 5569966 2117633 -840313 -4691482
43621 -4691482 -7659562 -8398218 -10174501 -15843388 -21144416 -19213477 -10749855 -3572460
43613 -3572460 -1993568 -2713364 -2466675 -3434974 -7594237 -10734501 -7558125 -444681 2525012
43604 2525012 -1528848 -6224675 -4728500 1245314 4912834 4612614 5423197 10371677
43596 10371677 15326787 15435693 12328850 10334568 8529224 2664926 -5948562 -10228649
43588a0228649K859459M313974K94760j359639J846286L441213j252565p750406
43580g835567q806522l324803L951254Q037844O806612J678574k856559l025331
43572e374498j88194J201399K62971M57327L111461M920239L710188K052390K293717
43563A2447000K076405j472643o125665p297182m780733k848925l911917n125125
43555a7038785k258415M287996Q497384M830532m278880r127639l493204O892094
43547a1688917J0452978L678061n603868q982018o280200k098939J232155M013921
43539a5276827O165230P224481P128543N034351J53989m764062m756007K33481
43531A143179L801413J750928k110110k830721k334505m781013p566058m426435
$$ plain form
43588 -10228649 -7369190 -3055216 -2760456 -4120095 -2273809 1167404 -85161 -7835567
43580 -7835567 -16642089 -19966892 -16015638 -7977794 -1171182 507392 -2349167 -5374498
43572 -5374498 -5562692 -4361293 -4098322 -3640995 -529534 4390705 8100893 10153283 12447000
43563 12447000 14523405 13050762 6925097 -372085 -5152818 -8001743 -11913660 -17038785
43555 -17038785 -19297200 -15009204 -6511820 -1681288 -5960168 -15087807 -18581011 -11688917
43547 -11688917 -1235939 2442122 -3161746 -12143764 -18423964 -20522903 -19290748 -15276827
43539 -15276827 -9111597 -1887116 5241427 10275778 10429767 5665705 909698 1143179
43531 1143179 4944592 6695520 4585410 1754689 -579816 -5360829 -12926887 -17353322
43523a7353322L709153Q507331N832679J065950N36559L053036L380971K25069
43515H957426l274898m797817m723035l498150m19712M300041Q118417P914140
43507A2576412K978254l730951p336903m991982J070639N107507L721900j51622
43499I243254o37337L568867P061418M348858l140207q930495r260491o007746
43491c753879k323655Q14745K826948K364480K25445k756K867275M866329K625480
43482A0510412j200916k334574j663277k505641l674169j600939K045614J904980
43474A481490j895888l111541Q80085N329189O080154N001070M761217M027621
43466B2553397J304607j345074j921775j769553k371292k879806l175993m834687
$$ plain form
43523 -17353322 -13644169 -5136838 695841 1761791 2298350 5351386 8732357 8957426
43515 8957426 5682528 884711 -3838324 -7336474 -7756186 -3456145 4662272 12576412
43507 12576412 15554666 11823715 4486812 -505170 565469 5672976 9394876 9243254
43499 9243254 8605917 12174784 19236202 23585060 20444853 11514358 2253867 -3753879
43491 -3753879 -6077534 -5262789 -2435841 -71361 154084 151328 3018603 7884932 10510412
43482 10510412 9309496 6974922 5311645 2806004 -868165 -2469104 -423490 1481490
43474 1481490 -414398 -3525939 -2645854 2683335 8763489 13764559 18525776 22553397
43466 22553397 23858004 22512930 20591155 18821602 16450310 13570504 10394511 5559824
43458E559824o743512m966209L24277L433349J803882r4362P46977O23628k332092
43449a644238j921979N881934J2718505P802953n441838j2899634q640010p41871
43441d886178K106339R01166Q63747K800809L668138J749807j614654l673178
43433A915996k796899n29218p7617j513403j209276J870884L321762J37148m025550
43424b906173m848447l885743l789144k341063J965685L971743R9960k718725
43416a4451907K933685J0273809O563537n900195j1242673l520751N271185M385459
43408e687851j572711l555745j625570k68530N62109K117919J977135o06081j066904
43399i726229K554059M670811J289056k603478j368923K011532K058515J54733
$$ plain form
43458 5559824 -1183688 -6149897 -5825620 -2392271 -588389 -682751 64226 687854 -1644238
43449 -1644238 -3566217 2315717 15034222 22837175 17395337 4495703 -4144307 -4886178
43441 -4886178 -2779839 -1878673 -1014926 1785883 5454021 7203828 5589174 1915996
43433 1915996 -880903 -1410121 -1487738 -3001141 -4210417 -2339533 982229 1119377 -2906173
43424 -2906173 -7754620 -11640363 -15429507 -17770570 -15804885 -11833142 -11733182 -14451907
43416 -14451907 -11518222 -1244413 5319124 -581071 -11823744 -15344495 -10073310 -5687851
43408 -5687851 -7260562 -10816307 -12441877 -12710407 -12148298 -10030379 -8053244 -8659325 -9726229
43399 -9726229 -7172170 -2501359 -1212303 -3815781 -5184704 -3173172 -1114657 -959924
43391i59924K88395Q91126j233169l535575k120655O48591O02194l05387J536678
43382d187726L087417l13497m870369k906268M279799P708758M399038N57336
43374G754488M04660N00289k589872o166059n979164j972193K836971N590497
43366C79617M744802J279339j251326r47542n35903k491889l732595m70687M100036
43357A073852L770012n12425j960730R65809K712197O50597r84897O89003K406934
43348H810352J350031J85763J721937L689242K769565j41335k141748k642790
43340A3601017k786453l240660m305659n495524m388366M51927N254055M746171
43332C836508O66942L48859M982215O242116j512923j1926211j4887225r380027
$$ plain form
43391 -959924 -671529 219597 -1013572 -4549147 -6669802 -6021211 -5419017 -5724404 -4187726
43382 -4187726 -1100309 -1413806 -6284175 -9190443 -4910644 2798114 7197152 7754488
43374 7754488 8159148 8659437 6069565 -96494 -6075658 -8047851 -5210880 379617
43366 379617 5124419 6403758 5152432 4204890 3668987 1177098 -2555497 -3026184 1073852
43357 1073852 4843864 4331439 2370709 3336518 6048715 6699312 5714415 6403418 8810352
43348 8810352 10160383 10346146 12068083 15757325 18526890 18385555 16243807 13601017
43340 13601017 10814564 7573904 3268245 -2227279 -6615645 -6163718 -909663 3836508
43332 3836508 4503450 4852309 9834524 16076640 14563717 2637506 -12249719 -21629746
43324b1629746k370953J501167L018691L503085L017112K825141M525564O542734
43316I32795N545300J769455n49808J050363L739000L064776j192251m324136
43308A0035494k186914L238452N503036J886840k493461j798161J595591O07741
43300A6388618m829532o545148o18878N701947M031991l372230p443860m612155
43292a299247L52321K006281k75574l688919m899937k132222K625072M556363
43284b755862J804674j463350p01906K600172L903689K800346K449828L142207
43276A1779798J705443k498106n746479n345884l187292k373803k931695k485624
43268a1083642K51831L758394N084683L116791M91490O64959K667207J695616
$$ plain form
43324 -21629746 -24000699 -22499532 -19480841 -15977756 -12960644 -10135503 -5609939 932795
43316 932795 6478095 8247550 7697742 8748105 12487105 15551881 14359630 10035494
43308 10035494 7848580 11087032 16590068 18476908 15983447 14185286 15780877 16388618
43300 16388618 11559086 5013938 4395060 10097007 14128998 10756768 3312908 -1299247
43292 -1299247 -946926 1059355 783781 -2905138 -7805075 -9937297 -7312225 -2755862
43284 -2755862 -951188 -2414538 -3116444 -516272 3387417 6187763 8637591 11779798
43276 11779798 13485241 10987135 5240656 -105228 -3292520 -5666323 -8598018 -11083642
43268 -11083642 -10831811 -7073417 -1988734 1128057 1619547 2284506 4951713 6647329
43260F647329l501262p416367n024132J012675M289417K931110n05123m421871
43252e988224p891702p453019j011849O187306O620009J354218j462744N25882
43244i120123P97190l959878p121044k372987O024501R215170N304206o57397
43236a890362m292549m006016Q16635P579487R273079K055523p539716r250416
43228g254335k145416M909484N441708J912133m18581j88697J084098J700733
43220E041127k91150n429945r637506p421567p6980M388720K074345j328409N11084
43211a2170281N310672O990006N359442M506206M334463J027895m793969p358249
43203C206185m114246Q25949K805294J266309k451169o565838p220583j663417
$$ plain form
43260 6647329 3146067 -4270300 -9294432 -8281757 -3992340 -1061230 -1566353 -5988224
43252 -5988224 -13879926 -21332945 -22344794 -16157488 -9537479 -8183261 -9646005 -9120123
43244 -9120123 -8322933 -12282811 -19403855 -21776842 -15752341 -6537171 -1232965 -1890362
43236 -1890362 -6182911 -10188927 -9372292 -1792805 7480274 9535797 1996081 -7254335
43228 -7254335 -9399751 -4490267 951441 2863574 2444993 2256296 3340394 5041127
43220 5041127 4749977 -679968 -10317474 -17739041 -17816021 -13427301 -11352956 -12681365 -12170281
43211 -12170281 -6859609 130397 5489839 9996045 14330508 15358403 10564434 3206185
43203 3206185 -908061 -82112 2723182 3989491 1538322 -5027516 -12248099 -13911516
43195a3911516N143248M151693m220790p760567O80957J1122867R500525k437830
43187B268587j0205576o832791N13341L881801L920610L619133K233836k41622
43179h42681k35966K858345L654552p23213m817644k871260K446855N125136N018861
43170I612985N486542N498786J343544n629373r622337q171889m074909l54213
43162e910864J881727J620596j058815k943216j240216J742024J922259L6786
43154c949719j25253J326026R28940j439190k395885j367338j204985k422515
43146a0649919k553968j283007l25507J515144O360343J0360324O903591j939476
43138H387525n852484j123540L507606L61682n892434o548325j660111K474480
$$ plain form
43195 -13911516 -8768268 -4616575 -8837365 -16597932 -15916975 -4794108 4706417 2268587
43187 2268587 -7936989 -14769780 -14256439 -10374638 -6454028 -2834895 -601059 -842681
43179 -842681 -1078647 1779698 5434250 4711037 -106607 -2977867 -531012 4594124 9612985
43170 9612985 15099527 20598313 21941857 16312484 6690147 -1481742 -5556651 -5910864
43162 -5910864 -4029137 -2408541 -3467356 -6410572 -7650788 -5908764 -3986505 -3949719
43154 -3949719 -4074972 -2748946 -1820006 -3259196 -5655081 -7022419 -8227404 -10649919
43146 -10649919 -13203887 -14486894 -14812401 -13297257 -6936914 3423410 10327001 8387525
43138 8387525 2535041 1411501 4919107 5280789 -611645 -7159970 -8820081 -6345601
43130f345601L370793K801033J258497j226828k018972K50403K070709J026956
43122A186990J007164M601080N270231l460833j4414491j3720385r63623R039739
43114a1454128O817525j23286p13468M231880O879961N429248L896375L099095
43106A8063202L61094l275232l251209M29311J751121k381422o713189m838508
43098A45168J197483L214125j654870o567165m311904K451299M790348J11968
43090f23548m431989k621032K196040L112985J74062q76776J682985L394795J301492
43081C309014j878355k715773j519512K31425K875099O281331P651764M726851
43073A8961844m87353l789878l726910k615842l110211n010856n559537k816050
$$ plain form
43130 -6345601 -2974808 -173775 1084722 -142106 -2161078 -1910675 160034 1186990
43122 1186990 2194154 6795234 12065465 8604632 -5809859 -19530244 -20493867 -11454128
43114 -11454128 -4636603 -4759889 -5473357 -1241477 5638484 11067732 14964107 18063202
43106 18063202 18424296 15149064 11897855 12327166 14078287 11696865 4983676 145168
43098 145168 1342651 4556776 2901906 -3665259 -7977163 -5525864 -735516 -623548
43090 -623548 -5055537 -7676569 -5480529 -2367544 -2193482 -3070258 -1387273 2007522 3309014
43081 3309014 1430659 -1285114 -2804626 -2573201 301898 6583229 14234993 18961844
43073 18961844 18474491 14684613 10957703 8341861 5231650 220794 -5338743 -8154793
43065h154793J209359K035615j552097n063061l965095P0575K155765J826006
43057a1437726K701748M995411M398292j34297l410056j846805Q29512j49664
43049d053585k816593k021763J973346L915046J610721j271541q37182K183404
43041a318147M201752L257947Q85242J99067J964624K735259j122094p183863
43033C619787q194045j662045N227201M111987l420523p722771l298850N099851
43025f239408Q908878M965707k452865o515222m166581J118238L189071N71901
43017f20281j984363r48420K25672l286733q823836q720820j188871P013843R731191
43008h602618P933434N260973K177905k079988n533116n527833k865597n85854
$$ plain form
43065 -8154793 -6945434 -4909819 -6461916 -11524977 -15490072 -15419497 -13263732 -11437726
43057 -11437726 -8735978 -3740567 657725 523428 -2886628 -4733433 -3903921 -4053585
43049 -4053585 -6870178 -8891941 -6918595 -3003549 -1392828 -2664369 -3501551 -1318147
43041 -1318147 2883605 6141552 7026794 7225861 9190485 11925744 10803650 3619787
43033 3619787 -4574258 -6236303 -1009102 3102885 -317638 -8040409 -11339259 -6239408
43025 -6239408 2669470 7635177 5182312 -1332910 -5499491 -4381253 -1192182 -620281
43017 -620281 -2604644 -3553064 -3327392 -6614125 -15437961 -24158781 -25347652 -18333809 -8602618
43008 -8602618 -669184 4591789 6769694 4689706 -843410 -6371243 -9236840 -9822694
43000i822694J78255O00460J470924K258458K104652L89369k528411m236146k046827
42991a1631960K820856N515607L988082K007334K728748K818927j870832p370672
42983i93910n599015K570598O102088j004136j0023770q940557R37291P312502
42975i638909M110584j749590k095651J499524K681601P69814J64768K036592
42967b221267K978750J616600Q62921K318429L141817P94238k705091l972900
42959B813497k979258j760908o28345J285692L245079L729504L013722K179366
42951A0898349O62834k179628m131136k481109J044188J843434n81879j512587
42943C562466J592942M757193L294619j399068m369593l980477k377958p29238
$$ plain form
43000 -9822694 -9644439 -9043979 -7573055 -5314597 -3209945 -2820576 -5348987 -9585133 -11631960
42991 -11631960 -8811104 -3295497 692585 2699919 5428667 8247594 6376762 -993910
42983 -993910 -6592925 -4022327 2079761 1075625 -8948145 -17888702 -16951411 -9638909
42975 -9638909 -5528325 -7277915 -9373566 -7874042 -5192441 -4422627 -4257859 -2221267
42967 -2221267 757483 2374083 3237004 5555433 8697250 9491488 6786397 2813497
42959 2813497 -165761 -1926669 -2555014 -1269322 1975757 5705261 8718983 10898349
42951 10898349 11561183 9381555 5250419 2769310 3813498 5656932 5075053 3562466
42943 3562466 5155408 9912601 13207220 11808152 7438559 3458082 1080124 350886
42935C50886J601104L494699K102880k476272n933217m805022m32613L488267
42927b609288N062430M432436K063581j259964m256083o487920q186727p597900
42919a8839435j655710P959647J2939134P647153j680893l525113L220203P397599
42911A3462585J632044p206465q590588l157819L75487r36126k220493j169837
42903g811212j365289l854109l660768J671210O473522M548861j982736n732451
42895a1712972k760514N069324J3003463J5413243Q860771k636291q882106m761190
42887A1593728K666228L158630l425480q436798o906724k398107K4226j86502
42879c910799o88663M31377L292491N083002J766045n391551q024630j290130
$$ plain form
42935 350886 1951990 5446689 7549569 5073297 -859920 -5664942 -6097555 -2609288
42927 -2609288 2453142 6885578 8949159 7689195 3433112 -3054808 -11241535 -18839435
42919 -18839435 -20495145 -12535498 403636 8050789 6369896 2844783 6064986 13462585
42911 13462585 15094629 7888164 -702424 -3860243 -3484756 -4420882 -6641375 -7811212
42903 -7811212 -9176501 -13030610 -16691378 -15020168 -8546646 -3997785 -5980521 -11712972
42895 -11712972 -14473486 -9404162 3599301 19012544 27873315 25237024 16354918 11593728
42887 11593728 14259956 17418586 13993106 5556308 -1350416 -3748523 -3724297 -3910799
42879 -3910799 -4599462 -4168085 -875594 4207408 5973453 581902 -7442728 -8732858
42871h732858O754637M714949m830455p826925O03332R156296P836799J593450
42863I269225l87894M17024k666359p597527o181242K072864Q551668P796245
42855A1274004L234378J35845n57775m01036o84458k266427m198125l125122J750887
42846E162171M813647P23910o510721p955271k642699J616103R44089M66878L953407
42837E71514O630329L425877k123861l444743q49387M39549r54219k030142j708206
42828d3289j661020j705063K2087K142851M70309n262928r075218n318982M405548
42819a6025705J2372626J1927620L534653n316813o877671j137516M026653K277478
42811D781325l471809n487693j471893L662436N278016L457664j77760m821642
$$ plain form
42871 -8732858 -1978221 2736728 -2093727 -9920652 -9317320 -161024 7675775 9269225
42863 9269225 8881331 9298355 6631996 -965531 -7146773 -5073909 3477759 11274004
42855 11274004 14508382 14644227 14086452 13685416 13000958 10734531 6536406 3411284 5162171
42846 5162171 9975818 10699728 4189007 -3766264 -6408963 -4792860 -3848771 -3381893 571514
42837 571514 7201843 10627720 8503859 5059116 4209729 4649278 3695059 1664917 -43289
42828 -43289 -1704309 -3409372 -3387285 -1244434 -774125 -6037053 -15112271 -20431253 -16025705
42819 -16025705 -3653079 8274541 11809194 6492381 -385290 -1522806 2503847 4781325
42811 4781325 1309516 -4178177 -5650070 -1987634 3290382 6748046 6570286 1748644
42803A748644q051805o185700j65343L223769J20122l828102o62438Q202398J3079741
42794G481286Q416953j102373p643472q666645o416282k969997J130425N295819
42786d474286Q311134Q506765M133096m099521j0510193q510120O38012P135005
42778A129892M404160j938509j893674M791962Q945999N740542O38031m20501
42770B1397902L54703j598430m380719l409017r44106l805083j1269703j3078633
42762a6733086l368441R090951J0804023J138935p003625m564921K666409M097295
42754c872460o02131l427563j795007j258148l926127l720378K385497O789825
42746i426492K439546m701529l956936L204735N667657O98774k532846Q54941
$$ plain form
42803 1748644 -6303161 -12488861 -12654204 -9430435 -9310313 -13138415 -13800853 -5598455 7481286
42794 7481286 15898239 14795866 7152394 -1514251 -7930533 -10900530 -9770105 -4474286
42786 -4474286 3836848 12343613 16476709 12377188 1866995 -6643125 -6005113 1129892
42778 1129892 5534052 3595543 1701869 6493831 15439830 21180372 21818403 21397902
42770 21397902 21752605 20154175 15773456 12364439 11420333 7615250 -3654453 -16733086
42762 -16733086 -20101527 -11010576 -206553 932382 -6071243 -10636164 -7969755 -3872460
42754 -3872460 -4474591 -7902154 -9697161 -10955309 -14881436 -18601814 -16216317 -9426492
42746 -9426492 -6986946 -11688475 -15645411 -12440676 -6773019 -6074245 -8607091 -7752150
42738g752150L854626R41098k115702P30209M430622J903420k975524k112872
42730c096273K506700K778046q00521o16850L194813K124965n101206q536870
42722g547196k690711M470828M039723j088081k893420p44441M16656l50835J69829
42713f217648K507295L982308L713175L110608K481274J221958J52110N1487p15586
42704A0286981l682449o742130o336223k015752L696537Q214234R246036M939296
42696A7606530k868032p895107n937859m98123J872557J33065j469355o70565
42688B73111N22255L96355o0652K51987J035618K031610L127108L094663R52813
42679A1624868j765189k802155k586022l020043l812194l233920j584771l86507
$$ plain form
42738 -7752150 -3897524 -2956426 -5072128 -4341919 88703 1992123 -983401 -3096273
42730 -3096273 -589573 2188473 1387952 771102 3965915 6090880 989674 -7547196
42722 -7547196 -10237907 -5767079 -1727356 -2815437 -5708857 -6453298 -6036642 -6387477 -6217648
42713 -6217648 -3710353 271955 3985130 7095738 9577012 10798970 10951080 11002567 10286981
42704 10286981 6604532 -137598 -6473821 -8489573 -4793036 3421198 12667234 17606530
42696 17606530 14738498 6843391 905532 407409 2279966 2413031 943676 273111
42688 273111 795366 1191721 1131069 1383056 2418674 4450284 7577392 10672055 11624868
42679 11624868 9859679 7057524 4471502 1451459 -2360735 -5594655 -7179426 -7565933
42671g565933Q86535L399310N321759M035977J115240J85295O50986o19880j972089
42662E437200J212735O525864N150525m013056r619458l651913N610326N252978
42654A1905201l031887o203431j23051N224950K332214l097668l134569l45791
42646C525968j706586n691681m729774J748066N793392L160738q85173p53188
42638D61762J173376P9527k377637q85869M158234O458985L020056j846267l070008
42629G172159j104941L70518k54840j793542k430021p75826K995501N591327L064984
42620A2835319l141138n886245j183136N549815O100775J42692n270958n476291
42612C670833k447254L10117J948081K567349J857851Q11994J003559J071621
$$ plain form
42671 -7565933 -6679398 -3280088 2041671 6077648 7192888 7378183 8029169 7409289 5437200
42662 5437200 6649935 13175799 18326324 14313268 4693810 1041897 6652223 11905201
42654 11905201 8873314 2669883 2546832 7771782 10103996 7006328 3871759 3525968
42646 3525968 1819382 -3872299 -8602073 -6854007 -1060615 2100123 1214950 461762
42638 461762 1635138 1714665 -662972 -1548841 2609393 9068378 12088434 10242167 7172159
42629 7172159 6067218 6437736 6182896 4389354 1959333 1183507 4179008 9770335 12835319
42620 12835319 9694181 3807936 2624800 8174615 14275390 14418082 9147124 3670833
42612 3670833 1223579 1533696 3481777 6049126 7906977 8718971 9722530 10794151
42604A0794151k030642o941497p610143j634718N190389N993323J300080l079258
42596A981685l908950k478402p57858M47795O57586L75069J520462M200275M585143
42587F622805l00874o856210q214999l021022L154845N303848L830501J386155
42579A905049p91908j805710l47455K518250K980903l16141l227140j355124L451522
42570C012246N161624J304322m271498o179478k728704L472893Q040317P899457
42562A5711179L678258p89944k532670k476236k994670l646505k080044J362963
42554F232331L352436K358557L79363j127277l333141o074314n756288q87957
42546d856290L519328K194638j669316k26901O456816Q687688R54223q678386
$$ plain form
42604 10794151 8763509 1822012 -5788131 -7422849 -2232460 3760863 5060943 1981685
42596 1981685 -1927265 -4405667 -5163525 -4715730 -4058144 -3683075 -2162613 2037662 6622805
42587 6622805 6321931 -534279 -8749278 -11770300 -8615455 -3311607 518894 1905049
42579 1905049 1113141 -692569 -1040024 1478226 4459129 4142988 915848 -439276 3012246
42570 3012246 8173870 9478192 5206694 -972784 -3701488 -228595 7811722 15711179
42562 15711179 19389437 18599493 16066823 13590587 10595917 6949412 4869368 6232331
42554 6232331 9584767 11943324 12322687 11195410 7862269 1787955 -3968333 -4856290
42546 -4856290 -1336962 857676 -811640 -1038541 5418275 14105963 15060186 6381800
42538F381800q642345L13819O281366K383199n085520o715180k400472P81832
42530f701501k38301j238970J525499N410349N590595J907823j776048l248155
42522A231291l237788j849262J778586N488611M740360n2221j608256L982583
42514A0473904R178102M345401o951424j1182153m240854K390039o59968o363471
42506c010424l220845N642178P038495j356526p287692k980864L546505J927547
42498B98374m583347m933001K771439Q986352O393167j528782o780170o152751
42490e528719j968531K452032M877131L949263K38076k961891k501976O23680
42482h20935K223571M94637j531973o30816J667689J514415j169737k502951k42423
$$ plain form
42538 6381800 -2260545 -1946726 4334640 6717839 1632319 -5082861 -7483333 -6701501
42530 -6701501 -6939802 -8178772 -6653273 -1242924 4347671 6255494 4479446 1231291
42522 1231291 -2006497 -3855759 -2077173 3411438 8151798 8099577 6491321 10473904
42514 10473904 19652006 23997407 17045983 5863830 1622976 4013015 3353047 -3010424
42506 -3010424 -6231269 -589091 6449404 5092878 -2194814 -5175678 -1629173 298374
42498 298374 -4284973 -9217974 -6446535 2539817 8932984 7404202 624032 -5528719
42490 -5528719 -7497250 -5045218 -168087 3781176 4019252 1057361 -1444615 -820935
42482 -820935 1402636 1897273 365300 -265516 1402173 2916588 1746851 -756100 -998523
42473i98523L884536P358729Q499341N118582l086195j0036144p942425R04540
42465C702441M481958k157914q262378k821019Q683126J2869863P987012K834787
42457B7317876J24209n088954j1438453j0693360l308961j03286m161248n143548
42449a2495725K214305P970654M031351j846222k19428L607015N61913m718781
42441h94918k648425K593037r6627p659272o228139N402400J2706175P959955
42433A1134186K98124j107387N8888k355491n276218l009634K577013N604538
42425G924019M240077K06996m450633o501595l123632K627384L934466J37960
42417D995042k312601q49262l17861k546876j991535L270726N819686R50187m451735
$$ plain form
42473 -998523 2886013 10244742 18744083 23862665 20776470 10740326 2797901 3702441
42465 3702441 8184399 6026485 -2235893 -5056912 3626214 16496077 24483089 27317876
42457 27317876 27442085 22353131 10914678 221318 -3087643 -3190929 -7352177 -12495725
42449 -12495725 -10281420 -2310766 1720585 -125637 -345065 3261950 3823863 -894918
42441 -894918 -3543343 -950306 -1046933 -8706205 -14934344 -9531944 3174231 11134186
42433 11134186 11432310 10324923 10383811 8028320 2752102 -257532 2319481 7924019
42425 7924019 12164096 12371092 7920459 1418864 -1704768 922616 4857082 4995042
42417 4995042 2682441 1833179 1515318 -1031558 -3023093 247633 6067319 7017506 2565771
42408B565771l277657l45933l410058q638543o307783K968886Q815687O170801
42400a458829j54057n197556q637989r381808m280809N285570J2066585J0925043
42392h33850M181060k121956l925740j248170K044533J327598k814213l843982
42384g234720J608644P046692M259201m426036q969697n291494J069048M425196
42376g513166M775653L744963J712575K64831J359265K833655N08618m396893
42368C289501o017796k869364L71103J248523K594574N232299N065779P74720
42360I689339k484903j192036R78633K36601o64568J774267M596065L152356q82250
42351A5203504k444752j111381l15788q53335q80737o88170j938638l294692k108198
$$ plain form
42408 2565771 -711886 -1057819 -4467877 -13106420 -19414203 -16445317 -7629630 -1458829
42400 -1458829 -1612886 -6810442 -15448431 -24830239 -29111048 -23825478 -11758893 -833850
42392 -833850 3347210 1225254 -2700486 -3948656 -1904123 -576525 -3390738 -7234720
42384 -7234720 -5626076 1420616 5679817 1253781 -7715916 -13007410 -11938362 -7513166
42376 -7513166 -2737513 1007450 2720025 2984856 4344121 7177776 7686394 3289501
42368 3289501 -2728295 -5597659 -5226556 -3978033 -1383459 3848840 8914619 9689339
42360 9689339 7204436 6012400 6991033 7227634 6563066 8337333 12933398 16085754 15203504
42351 15203504 12758752 11647371 11331583 10478248 9597511 8909341 6970703 3676011 1567813
42342A567813K05117l27187l393499m063842j58755M404767N286113L371809K510182
42333I402518L572492L259848j098421o969367q468986l540353K456073K932712
42325A546516j257668l363385p60186J900779J079873r059K263907N157316M087092
42316A0645185N3442k645648k904631j897399R78838N446118O786743J674787
42308A8137435m827047n297314j129565Q3205l029167m568563k508534j310192
42300d449742k030228K25985N655823O311207j309931q787472p613507j246260
42292a3244125K102606K210158L633954M982372J579795l824526l310373L465152
42284b404987P994521N595078J149404k0523M09342j094065l340994l246378j248240
$$ plain form
42342 1567813 1772930 1445743 -1947756 -6011598 -6170353 -1765586 3520527 6892336 9402518
42333 9402518 12975010 16234858 15136437 8167070 -301916 -3842269 -1386196 1546516
42325 1546516 288848 -3074537 -3834723 -1933944 -854071 -863130 1400777 6558093 10645185
42316 10645185 10698627 8052979 5148348 3250949 4229787 9675905 16462648 18137435
42308 18137435 13310388 8013074 6883509 6966714 3937547 -631016 -3139550 -4449742
42300 -4449742 -6479970 -6253985 -598162 5713045 4403114 -4384358 -11997865 -13244125
42292 -13244125 -11141519 -8931361 -5297407 -315035 1264760 -2559766 -5870139 -2404987
42284 -2404987 5589534 11184612 12334016 12313493 12722835 11628770 8287776 5041398 3793158
42275C793158m2760m21906j170133j218405j79403J400067J566351q40068l305639
42266d18738k273929J120853K122873j94691j506185K53371J465934l52053j863827
42257a646392j01569J706497l45299l712158l695126j499390j479771k815662
42249a3588870j119413K861878L651341L67888j637058R9747J323796r72941k976906
42240a1990538l31987M723567O609267L486393k183174p026689p917139l331132
42232a7961432L311046N345641J394390j699985J417592O223847N267231j67939
42224C130391k557377k34654J010125j656843m006457k744010m80126J55679J091854
42215f291418L835431N370746L287842L78459l40352q56408l449408m936753j741647
$$ plain form
42275 3793158 3750398 3328492 2158359 939954 760551 2160618 3726969 2886901 -418738
42266 -418738 -2692667 -1571814 551059 356368 -1149817 -896446 569488 217435 -1646392
42257 -1646392 -1747961 -41464 -386763 -4098921 -7794047 -9293437 -10773208 -13588870
42249 -13588870 -14708283 -11846405 -8195064 -7827176 -9464234 -9364487 -8040691 -9013632 -11990538
42240 -11990538 -12322525 -7598958 -989691 2496702 313528 -6713161 -14630300 -17961432
42232 -17961432 -14650386 -9304745 -7910355 -9610340 -8192748 -1968901 3298330 3130391
42224 3130391 573014 338360 1348485 -308358 -4314815 -7058825 -7538951 -7383272 -6291418
42215 -6291418 -2455987 2914759 6202601 6581060 6240708 5384300 1934892 -3001861 -4743508
42206d743508K670455K565759j01748J346670O072520N570718k283163p967085
42198C130618l861641M243210N805673M13565l694490k773975q29317n30437P37361
42189B640567L963165M844759P00638m230712m715578j957230n75128r18293N52082
42180C04270M336706O196531K958038l305316p682720o831425r78347O026349
42172A024086Q649176M456861k438641n158763j903281K441853L198364J391902
42164A1661557O73680J468863J045137j799510m825951n214323k807939k18113
42156a6599j49719k402809l673253j288303L198666N834329N282104L323505M79270
42147A0587191m672237j0303320j0298957k327377O651484Q056152K712797j202669
$$ plain form
42206 -4743508 -2073053 492706 390958 1737628 7810148 13380866 11097703 3130618
42198 3130618 -731023 3512187 9317860 9731425 6036935 3262960 2433643 1903206 2640567
42189 2640567 6603732 11448491 12149129 7918417 3202839 1245609 670481 -247812 304270
42180 304270 4640976 10837507 13795545 10490229 2807509 -4023916 -5002263 1024086
42172 1024086 9673262 14130123 11691482 6532719 4629438 7071291 10269655 11661557
42164 11661557 12335237 13804100 14849237 13049727 8223776 3009453 201514 -16599
42156 -16599 -166318 -2569127 -6242380 -7530683 -4332017 1502312 6784416 10107921 10587191
42147 10587191 5914954 -4388366 -14687323 -17014700 -10363216 -2307064 405733 -796936
42139g96936L7490K095132R80332j205918j139748K82961O36272L39129Q34047
42130B062761J037319q61678l510065l333124R50747O315242P666335K245701
42122A2573238o445381r746443k567403Q541989J0822991Q04997j0555342j1536744
42114h108098l551726L428354M856316M234635M354142L576476Q87726j772042
42106G905783l174084l706021k354497J782835M831674J502535n694386p651101
42098f557262j623973M203897L121375l87114O26206L576362J469741m160887
42090B68345n044427M54694N058907M392568K387343K536748J919162j726225
42082A0247115l839049r891N556429N184902j193877o435477o557257m657835
$$ plain form
42139 -796936 -759446 1335686 2316018 1110100 -29648 253313 889585 1228714 2062761
42130 2062761 3100080 2238402 -1271663 -4604787 -3654040 2661202 10327537 12573238
42122 12573238 6127857 -3618586 -6185989 2356000 13178991 13983988 3428646 -8108098
42114 -8108098 -11659824 -8231470 -3375154 859481 5213623 8790099 9677825 7905783
42106 7905783 4731699 1025678 -1328819 454016 5285690 6788225 1093839 -6557262
42098 -6557262 -8181235 -3977338 -855963 -1243077 -616871 2959491 4429232 268345
42090 268345 -4776082 -4321388 737519 5130087 7517430 10054178 11973340 10247115
42082 10247115 6408066 6398175 11954604 17139506 15945629 9510152 2952895 -1704940
42074a704940m122646l560248o42403L116608M393462K645239J71283j093997
42066g97642q52841N37998K427985L594086L049584J124031j076276k929650m163473
42057I13802m020780j969203P71110J917333R70894J10753J148668K624384J688559
42048D155520j503812l496851k194886M30178J736410K286419L671194M189086
42040I273258Q26043m515660n484683j8850N464526M258390j157595k637939J880388
42031G887878N560048K529841m184172p254713m365744L97935K744722K349400
42023E665195J149877M02109L25226R25676J924624K494370J989542Q68440K87360
42014A6032419N59308M68722j253720l899508n132686l711748j061081K81359
$$ plain form
42074 -1704940 -5827586 -9387834 -10030237 -6913629 -2520167 125072 296355 -797642
42066 -797642 -1650483 -1112485 1315500 4909586 7959170 9083201 8006925 5077275 913802
42057 913802 -3106978 -5076181 -4305071 -2387738 -1416844 -1306091 -157423 2466961 4155520
42048 4155520 2651708 -845143 -3040029 -2609851 -873441 1412978 5084172 9273258
42040 9273258 10099301 5583641 98958 80108 5544634 9803024 8645429 6007490 7887878
42031 7887878 13447926 15977767 11793595 4538882 173138 571073 3315795 5665195
42023 5665195 6815072 7217181 7542407 8468083 10392707 12887077 14876619 15745059 16032419
42014 16032419 16591727 17060449 15806729 11907221 6774535 3062787 2001706 2283065
42006B283065r88216m121684o254328l256194O056651J5183338J3845626P48451
41998B3496709j1346078r689778J566265O682163K05093o388043l069074M029495
41990E486752L777931k245715l911254J73991J621629k201834l607584J429405
41982E23321N230523M82052p335843p398025Q72950P435500N440463j194012m567610
41973e10681k203702K038523L500559J332560j367734j209611J501196L004214
41965F085324R38939k227335k155659J651870M915563L599828j350476n020545
41957F437509l990425j00679J938204M98238j029520P82938M368250N437544K980177
41948A7322236j79509k315547m541038o925973o521505j301469O099860J0394750
$$ plain form
42006 2283065 1294849 -2826835 -9081163 -12337357 -6280706 8902632 22748258 23496709
41998 23496709 12150631 2460853 4027118 10709281 10914374 4526331 1457257 5486752
41990 5486752 9264683 7018968 3107714 3281705 4903334 2701500 -906084 523321
41982 523321 5753844 6235896 -1099947 -8497972 -7625022 -189522 5250941 4056929 -510681
41973 -510681 -2714383 -675860 2824699 4157259 2789525 1579914 3081110 6085324
41965 6085324 7024263 4796928 2641269 4293139 9208702 12808530 11458054 6437509
41957 6437509 2447084 2346405 4284609 4782847 3753327 4536265 8904515 14342059 17322236
41948 17322236 17142727 14827180 10286142 3360169 -3161336 -4462805 1637055 12031805
41940A2031805Q335198J103853o247255q011459l221298K156163J570384l602097
41932D115294n867817k141849K683892M039060L668289M223948L518266q88518
41924A3350565n525359n072615j65281L852076M250530K716249J503054J713011
41916A6622230L706543N705665M201146p38181l530061o06754L540357K985287
41908C1886232m85428j223325M34339r4767k061395j94391N288702Q110925O231427
41899D7892319M392685M770207L473155q19491k808926P22389N082826N031818
41891F7736982J891911j093684m457546q514711r352132m753056L75332M79344
41883D2312440k409041k649003J64804K172849K075552R34672k257485q201892
$$ plain form
41940 12031805 20367003 21470856 15223601 7212142 3990844 6147007 7717391 4115294
41932 4115294 -1752523 -3894372 -1210480 2828580 6496869 10720817 14239083 13350565
41924 13350565 7825206 2752591 2587310 6439386 10689916 13406165 14909219 16622230
41916 16622230 20328773 26034438 30235584 29497403 25967342 25360588 28900945 31886232
41908 31886232 31400804 30177479 30611818 30517051 28455656 28261265 33549967 41660892 47892319
41899 47892319 52285004 57055211 60528366 59708875 56899949 57622338 62705164 67736982
41891 67736982 69628893 68535209 64077663 55562952 46210820 41457764 41833096 42312440
41883 42312440 39903399 37254396 37419200 39592049 41667601 42602273 40344788 32142896
41875C2142896j2069507p615734L217844J0646519Q259517k42256o524374o565667
41867B1249238l197169j820608m068259n297985k95941P917991R410853M54391
41859B4352511r592572r824569k073609L210763K228534N30874J614398K016427
41851A2462757o96683l285001l291960l302208n009663m932944m04179M954407
41843c505474O265417M035908J411199j519419n600217p624041l396066M930211
41835e002482R704259O646814p00479o019378o643311m018493m36250K822604
41827c646716N136998N876457M484226J343938j527247j675302R58438L091108
41819A4041900J412953l093964n470777k267622L883694O479431K464239l715159
$$ plain form
41875 32142896 20073389 12457655 15675499 26322018 34581535 34339279 27814905 21249238
41867 21249238 18052069 16231461 12163202 6865217 6569276 14487267 23898120 24352511
41859 24352511 14759939 4935370 2861761 6072524 8301058 8831932 10446330 12462757
41851 12462757 11766074 8481073 5189113 1886905 -3122758 -8055702 -8459881 -3505474
41843 -3505474 2759943 6795851 8207050 6687631 1087414 -6536627 -9932693 -5002482
41835 -5002482 4701777 11348591 10648112 4628734 -2014577 -6033070 -6469320 -3646716
41827 -3646716 1490282 7366739 11850965 13194903 11667656 9992354 10950792 14041900
41819 14041900 15454853 12360889 6890112 4622490 8506184 14985615 17449854 13734695
41811A3734695m951330r3743M530163L074052k723995o448373n082517j203102
41803H35850J733028K632937J321240k275228o064162o025553q60102N397541
41795c304449P578502N061179J374674q62528k240346l829340m567307k900062
41787c689677Q8513J369163K01925l99466J829854M128073K151686k746544l881092
41778i47565J627572P974410P885822J780958l853985n111353l713502k639169
41770C003188k629594k816632j862237J151972M676821M804188N6213n560317
41762H23602p173470m667127n76790M503599R832691J1137799N636034j828981
41754A7687357m495428l513453m467217o332248l719140R11281p10594o842757
$$ plain form
41811 13734695 8783365 8689622 13219785 16293837 13569842 7121469 2038952 835850
41803 835850 2568878 5201815 6523055 4247827 -1816335 -7841888 -8701990 -3304449
41795 -3304449 4274053 9335232 10709906 9847378 7607032 3777692 -789615 -3689677
41787 -3689677 -3601164 -2232001 -2030076 -2429542 -599688 3528385 5680071 2933527 -947565
41778 -947565 680007 8654417 16540239 18321197 14467212 9355859 5642357 3003188
41770 3003188 373594 -2443038 -4305275 -3153303 1523518 6327706 6383919 823602
41762 823602 -6349868 -11016995 -11593785 -7090186 2742505 13880304 19516338 17687357
41754 17687357 13191929 9678476 5211259 -1120989 -4840129 -3928848 -4639442 -11482199
41746a1482199n160981P034744J5106394Q060447m155740n556131K622208O662319
41738A3131061K449870j257984O93234L425101K659539O07926n14350j642362
41730A9552035j923773J052016M777935L753138q72362k054052J213000J950604
41722B7448541k097754l629750J396921N262022J52552q585759r467747j127513
41714I351513O660009O491113Q63448l512269l325813K8426K840552K037017j982323
41705A9451673n587668o401894n983091o132568m940977L5150O135490P263573
41697C839688J490315o036849q624696m569139K348025P177374P746059N359980
41689H730757K755334J554617J343508O24771j587125m559747n932109l933602
$$ plain form
41746 -11482199 -16643180 -9608436 5497958 13558405 9402665 3846534 6468742 13131061
41738 13131061 15580931 14322947 15016181 18441282 21100821 21708747 21194397 19552035
41730 19552035 17628262 18680278 23458213 27211351 26338989 24284937 25497937 27448541
41722 27448541 25350787 21721037 23117958 28379980 28532532 19946773 10479026 9351513
41714 9351513 16011522 22502635 23366083 19853814 16528001 16556427 19396979 21433996 19451673
41705 19451673 13864005 7462111 1479020 -4653548 -9594525 -9559375 -3423885 3839688
41697 3839688 5330003 -706846 -9331542 -13900681 -11552656 -4375282 3370777 8730757
41689 8730757 11486091 13040708 14384216 15008987 13421862 8862115 2930006 -1003596
41681a003596Q3312K800675L249081L701728N081852M746699J396495j466326
41673A8589920j040926n66116l523866n815955j376867O281782P234983J07777
41665A9890732n490810l467100J095501K089075R42913K61910k041865n903053
41657G377303m878255L309108R414733M960183m246774o613122j654868K003067
41649I671375J328377L41812k48253l064252n151238j081731N240705M172664
41641A1209459l323170n768516j17656K936307k395739o646650j592547N143194
41633e55318L198043k468236r3744Q336285R556978L07752p407688m294873M113903
41624A0693102P474369M408890R28377M68843R72149m09429l616819o119822n334143
$$ plain form
41681 -1003596 -920284 1880391 5129472 8831200 13913052 18659751 20056246 18589920
41673 18589920 17548994 16982878 13459012 7643057 6266190 12547972 19782955 19890732
41665 19890732 14399922 10932822 12028323 14117398 15060311 15322221 13280356 7377303
41657 7377303 2499048 5808156 15222889 20183072 15936298 9323176 7668308 9671375
41649 9671375 10999752 11341564 11093311 8029059 2877821 1796090 7036795 11209459
41641 11209459 7886289 2117773 2000117 4936424 2540685 -4105965 -5698512 -555318
41633 -555318 2642725 174489 80745 8417030 17974008 18281760 10874072 6579199 10693102
41624 10693102 18167471 22576361 23504738 23973581 24945730 24536301 20919482 14799660 9465517
41615I465517j201250L131564M150663J534805k027443l927492l334883q90895
41607F900586J608406K193438R51665P7651M06895L1328j832818k532564m80582
41598G324005J130378o68862k661242k1665M850577M611010j854238p037230n311648
41589C61085j28536K134097R14358M08925K765804N951249P105788N564978L059924
41580B8137672J910967K394632K202735o6265k070846j150183O51307r57340n588417
41571B5464262q408218p324501m834740k362512J324568M952841M611786Q99561
41563A4323047p12811O23588p38354n256188m174372N393895J0789803P78043
41555B1026651j4597591j5559698j152542R276798M392417m725549l973445L628291
$$ plain form
41615 9465517 8264267 11395831 15546494 17081299 15053856 11126364 7791481 6900586
41607 6900586 8508992 10702430 11654095 11731746 12138641 12169969 10337151 7804587 7324005
41598 7324005 8454383 7785521 5124279 5102614 9953191 14564201 12709963 5672733 361085
41589 361085 232549 2366646 3281004 3689929 6455733 12406982 19512770 25077748 28137672
41580 28137672 30048639 32443271 34646006 34579741 32508895 31358712 32010019 31052679 25464262
41571 25464262 17056044 9731543 4896803 2534291 3858859 8811700 13423486 14323047
41563 14323047 13610236 14233824 13495470 8239282 4064910 9458805 20248608 21026651
41555 21026651 6429060 -9130638 -10283180 -1006382 3386035 -1339514 -5312959 -1684668
41547a684668O453967K912804M60959J877524L289765L079827L326441L365602
41539B3082221M2878n370236p274508l752799P85643J969492K13161j697638k130513
41530E867701r50955Q62958J625526R74948O90329J417735N91201l233765o263858
41521A581820m008148J773654N406356N201427L874540K251830j436904o151960
41513H492615p997561o155948l234553N07050O678275J1821868Q938798j239347
41505A7811197q231348n521298O29321J576905r83071P2721M561491N672823J190793
41496A6779534l814201n135657l800587k009236r3401J831627L284723M621414
41488A1664216N562089L735367j397132m972138k231247L646160M955787J49541
$$ plain form
41547 -1684668 4769299 7682103 8143062 10020586 13310351 16390178 19716619 23082221
41539 23082221 23125099 17754863 10480355 6727556 7513199 9482691 9695852 7998214 5867701
41530 5867701 4916746 5779704 7405230 8380178 9070507 10488242 11079443 7845678 1581820
41521 1581820 -2426328 -652674 4753682 9955109 13829649 16081479 14644575 8492615
41513 8492615 495054 -5660894 -8895447 -8388397 -1710122 10111746 19050544 17811197
41505 17811197 9579849 4058551 4687872 6264777 5281706 5354427 9915918 15588741 16779534
41496 16779534 12965333 7829676 4029089 2019853 1926452 3758079 7042802 11664216
41488 11664216 17226305 20961672 19564540 14592402 12361155 16007315 20963102 21112643
41480B1112643m876882o060193n244151m267627j881582J365152J728808j097340
41472G78828j842446K048122N333609K745906k732511m509112j731634J396868
41464A487630K952683M240477M917476K853407j107433k920187p75332K494572
41456A4143293L242206R81864j755973j855726J681301N853246N617002j28583
41448B7778630n901939n815108j233997J183457j487260n360334o177832m735167
41440a749550l802753k800982Q84061O114319P176835P44008p855289q687371
41432i976722R33282J1289272J0689557j1951q409311o819298j357192j125019
41424d787382m454869l161452L037129N738692J861451p75808M154820J0796156
$$ plain form
41480 21112643 16235761 10175568 4931417 663790 -1217792 147360 1876168 778828
41472 778828 -1063618 984504 6318113 9064019 6331508 1822396 90762 1487630
41464 1487630 4440313 8680790 13598266 16451673 15344240 12424053 11648721 14143293
41456 14143293 17385499 18367363 16611390 14755664 16436965 22290211 27907213 27778630
41448 27778630 21876691 16061583 14827586 16011043 14523783 9163449 2985617 -1749550
41440 -1749550 -5552303 -8353285 -7469224 -1354905 5821930 6565938 -1289351 -9976722
41432 -9976722 -9043440 2245832 12935389 12923438 4514127 -2305171 -3662363 -4787382
41424 -4787382 -9242251 -12403703 -9366574 -3627882 -1766431 -2542239 1612581 12408737
41416A2408737R273153L03742n717050l117418K465833L438638N73956N1166L204390
41407B2885147M382455m68922p153848q094305k139059M074905M809421J792237
41399B0088031J98745R56761N81130k494108n350102m964246k095686N86897K087415
41390I594837L147981M109814M349861L353210J357330p93556k003006j591734
41382B1524737L1594J644712K154311J073298j307898l557129l741534j562175
41374A6259916R12487J920499K376295L726899M559469K223539k370996m795883
41366B4812225k907732P7150k7764k747021l623306J52786O153265Q925131N741472
41357C6556206J05436j619086K141096N775030L754398j865423m745587l337954
$$ plain form
41416 12408737 21681890 21985632 16268582 13151164 15616997 19055635 19629591 19680757 22885147
41407 22885147 27267602 26798680 19644832 11550527 9411468 13486373 18295794 20088031
41399 20088031 20286776 21243537 21824667 19330559 13980457 9016211 6920525 7507422 9594837
41390 9594837 12742818 16852632 21202493 24555703 25913033 25119477 23116471 21524737
41382 21524737 21556331 23201043 25355354 26428652 25120754 21563625 17822091 16259916
41374 16259916 17172403 19092902 21469197 25196096 29755565 31979104 29608108 24812225
41366 24812225 21904493 21981643 21953879 19206858 15583552 15736338 21889603 30814734 36556206
41357 36556206 36661642 35042556 37183652 42958682 46713080 44847657 40102070 36764116
41349C6764116j633019j449351k50499K079621J090091m040197o419531j165510
41341B4975721N794501N806549Q57885J35778M494581M458822l779293j0025713
41333C2718831m327687P185871R782535P59982o907164k758638P700037J2185862
41325E6339629Q228791L873575M489682O174773L291323l007709o761386m704471
41317F7924207R38491N551242O094282L193469O03400J518725M890922P026839
41309I7741577O800810O492925P359223Q377065J0133009J4802398K0459489K1622914
41301A93789410J8741882J9887003K7526092L1601254K4460699J5131614J6295854
41294C47433808K2482431J7072472m63149j1992152q586758l361257q739887j7083035
$$ plain form
41349 36764116 35131097 33681746 33431247 35510868 36600959 32560762 26141231 24975721
41341 24975721 30770222 36576771 37434656 37570434 42065015 46523837 42744544 32718831
41333 32718831 28391144 35577015 45359550 46119532 39212368 36453730 44153767 56339629
41325 56339629 64568420 68441995 72931677 79106450 82397773 79390064 72628678 67924207
41317 67924207 68862698 74413940 80508222 83701691 84305091 85823816 90714738 97741577
41309 97741577 104542387 111035312 118394535 126771600 136904609 151707007 172166496 193789410
41301 193789410 212531292 232418295 259944387 291545641 316006340 331137954 347433808
41294 347433808 369916239 386988711 386525562 374533410 365946652 362585395 353845508 336762473
41286C36762473j5888195r112205q529674j3096733j2798429p468287o120347
41279B63748603j0185381j2132655j0193788j0778923j5307117j7254016j4305300
41272A73591423j1767491j1218065p058811J815905P548689N648819K551745M988741
41264A66100955R667998J0041945P278609P906283J4291869K2499422K7017047
41257B64804128K4662530J6675462Q480260M014357M19468o638624j3676086j3506269
41249B85235226q496731r320003j8107471k4021752k0463997j5495825j7653930
41242A71675517k1581611j7653905q035202k367260l020857n020294o237046p472381
41234A00286961o039609L99539O257700M481111j352396j528632M664628Q874334
$$ plain form
41286 336762473 320874278 311762073 303232399 290135666 277337237 269868950 263748603
41279 263748603 253563222 241430567 231236779 220457856 205150739 187896723 173591423
41272 173591423 161823932 150605867 143547056 145362961 152911650 158560469 161112214 166100955
41264 166100955 175768953 185810898 193089507 200995790 215287659 237787081 264804128
41257 264804128 289466658 306142120 314622380 318636737 319056205 312417581 298741495 285235226
41249 285235226 276738495 267418492 249311021 225289269 204825272 189329447 171675517
41242 171675517 150093906 132440001 124404799 122037539 119016682 113996388 107759342 100286961
41234 100286961 94247352 94646891 100904591 105385702 104033306 102504674 107169302 116043636
41226A16043636Q134929P950473R619803O193076m590039j3286235j1151569k681632
41218A16232442R23862l522001r134103r378567n439818l276747o223808j1441303
41210F8739957j3507182j0995799p533291n794790m187216j740038j360452l700344
41202A9920845l001902M038632R902791N832310l497522n650156P28821M784453
41194C3058272J834734j19966M068010P376966L606812j227048P15079N825227
41186E5138086N779768J245861q17825Q86075K007187J495409J974312L186244
41178G0895117K686432J388469J545214J276062j849009m087020m30428N337441
41170G6762278M411640l224924p779212m088598J379861J042597l822242p787329
$$ plain form
41226 116043636 124178565 132129038 141748841 147941917 143351878 130065643 118914074 116232442
41218 116232442 117156304 113634303 104500200 95121633 89681815 86405068 80181260 68739957
41210 68739957 55232775 44236976 36703685 30908895 26721679 24981641 23621189 19920845
41202 19920845 16918943 20957575 30860366 36692676 33195154 27544998 28273819 33058272
41194 33058272 34893006 34773040 38841050 46218016 49824828 48597780 49312859 55138086
41186 55138086 60917854 62163715 61345890 62231965 64239152 65734561 67708873 70895117
41178 70895117 73581549 74970018 76515232 77791294 75942285 71855265 71424837 76762278
41170 76762278 81173918 77948994 70169782 66081184 67461045 68503642 64681400 56894071
41162E6894071r501220j0017340p965420k384925K662420K089886k939941o538864
41154B2298667o184325m770734m435524k878614K073402P309278P301125J691882
41146B2405157l015439j015695N122927P130109J611447n115854m998749J121950
41138B3245853M577345K40125p114112r344764m766816J298954M039497L837783
41130A6013865L452802L567662K791288N18770k164746m000817m397968k911330
41122A2869526L91605L644143L959156N79207l786338n635982l801805L72717
41114H592229M214798M568029J58645n406566o080110j181480K693018J062347
41106H620910j134998K703720R193829R118881J966055k956561j173236O91236
$$ plain form
41162 56894071 47392851 37375511 29410091 27025166 29687586 31777472 28837531 22298667
41154 22298667 16114342 11343608 6908084 4029470 6102872 13412150 20713275 22405157
41146 22405157 19389718 18374023 23496950 30627059 32238506 27122652 22123903 23245853
41138 23245853 27823198 28063323 20949211 11604447 6837631 8136585 12176082 16013865
41130 16013865 19466667 23034329 25825617 26344387 24179641 20178824 15780856 12869526
41122 12869526 13261131 16905274 20864430 21443637 17657299 12021317 8219512 8592229
41114 8592229 12807027 17375056 17533701 12127135 6047025 4865545 7558563 8620910
41106 8620910 7485912 10189632 19383461 28502342 30468397 27511836 26338600 27029836
41098B7029836k949403p133441n150498K65787K010752k48971j718788j543643
41090A0561631k401466l412245j116111L519958N883281M937365L579457K510176
41082B4062046o5646l079053l287370j416545j387558k918712j195470M808249
41074A5519941R585881Q611124L649798j082516l366843k229099K146242N838611
41066C8673139L502436m233569r976596q641441l327445K43357J113224J988898
41058A9342003M083588O078449O097103K981940k110865m778617j558887M242052
41050C4376766N351600M22735l896975k715466Q40313K129319K082275L393369
41042D1983936M673870L791227K970852M703668N897572K590143j874691o12009
$$ plain form
41098 27029836 24080433 16946992 11796494 12062281 14073033 13824062 12105274 10561631
41090 10561631 8160165 4747920 3631809 7151767 13035048 17972413 21551870 24062046
41082 24062046 23996400 20917347 17629977 16213432 14825874 11907162 10711692 15519941
41074 15519941 25105822 33716946 37366744 36284228 32917385 30688286 32834528 38673139
41066 38673139 42175575 37942006 27965410 19323969 15996524 16239881 17353105 19342003
41058 19342003 23425591 29504040 35601143 38583083 36472218 31693601 30134714 34376766
41050 34376766 39728366 40151101 36254126 33538660 34378973 36508292 38590567 41983936
41042 41983936 46657806 50449033 53419885 58123553 64021125 66611268 64736577 64124568
41034F4124568N440820P153049j19712r275137j0111544j810658O581012O921594
41026F8903992P03463l525247n52915N401304O562249K111244j236945M17047
41018G8784192K610601M01355l237191k294834K398514M706213L060620J999326
41010H8428796L641999M260506J392100j220995O82591M928153N489778L51627
41002A07954555o227216q729446n723775m29471K778105K227189k00130j494368
40994I0155443r8586L447578O484844M846062l040181j1135021r417317L290749
40986H4533571J4028430R734278n415808j4378843q940238J428001M881850K661306
40978H8532547L161511P189712P886820K703501l141289n528448o557471q705346
$$ plain form
41034 64124568 69565388 76718437 76598725 67323588 57212044 55401386 61982398 68903992
41026 68903992 69607455 66082208 65529293 70930597 77492846 79604090 78367145 78784192
41018 78784192 81394793 81796148 78558957 76264123 78662637 83368850 86429470 88428796
41010 88428796 92070795 96331301 97723401 96502406 97184997 102113150 107602928 107954555
41002 107954555 101727339 92997893 87274118 86844647 89622752 91849941 91649811 90155443
40994 90155443 90056857 93504435 99989279 104835341 101795160 90660139 81242822 84533571
40986 84533571 98562001 108296279 102880471 88501628 79561390 80989391 85871241 88532547
40978 88532547 91694058 98883770 106770590 109474091 106332802 100804354 94246883 85541537
40970H5541537r703515o740476j867915O21764l0158j216530j315294p31217K32123
40961F4790319J276031O10339k873952o074668m413170R83717L305205k86019
40953E7317802l421463N86116P902387Q431174q1744q727824r252960l309584
40945D9443904K193005L445462M31911n351282r646758o768963K491285Q412540
40937D4651104L959785m655462o212935m19843L125014N65741j804630p8914Q88147
40928D0018007k051286l130250K197763P662862N177960k210281n500646l772651
40920C8391478l149191m250089j611223M410519O218136J933072n70397L008837
40912D4381142N694887J317624m277596k711834K919167L671734j19524n50596
$$ plain form
40970 85541537 75838022 69097546 67229631 67851395 67821237 66604707 65289413 64558196 64790319
40961 64790319 66066350 66676689 63802737 57728069 53314899 54298616 57603821 57317802
40953 57317802 53896339 54482455 62384842 70816016 70734272 62006448 52753488 49443904
40945 49443904 51636909 55082371 55514282 50163000 40516242 33747279 36238564 44651104
40937 44651104 48610889 43955427 37742492 37322649 40447663 41013404 39208774 39129860 40018007
40928 40018007 37966721 34836471 37034234 44697096 49875056 47664775 42164129 38391478
40920 38391478 35242287 30992198 29380975 33791494 40009630 41942702 41372305 44381142
40912 44381142 50076029 51393653 47116057 44404223 47323390 50995124 50875600 50325004
40904E0325004L209411L877140j580j115597K735466L700927j644366m173501
40896E6912904K887967J0739278Q216643R45006L165640J3977165J7410730P489360
40888A21744693j934076J854332J2409256J5997314J1763170R035874J0753090
40881A81623653J1654719J0591965J2785690J8406915J8906526R083266l911038
40874B59141696q815630l805139K672236K598427l803630j0236496j1400123p484513
40866B18866828l080733k253191m488539n493830j873044N273702J1197395J1632940
40858B29781528O468267k96579m481563n597983o262994q253776j0655793j1885096
40850A88816011j1666981j0628041r776670j0660708j3754947j6302303j4625034
$$ plain form
40904 50325004 53534415 57411555 57409975 56294378 59029844 62730771 61086405 56912904
40896 56912904 59800871 70540149 78756792 79701798 82867438 96844603 114255333 121744693
40888 121744693 119810617 121664949 134074205 150071519 161834689 170870563 181623653
40881 181623653 193278372 203870337 216656027 235062942 253969468 263052734 259141696
40874 259141696 250326066 246520927 249193163 251791590 247987960 237751464 226351341 218866828
40866 218866828 215786095 213532904 209044365 203550535 201677491 206951193 218148588 229781528
40858 229781528 236249795 235953216 231471653 225873670 219610676 211356900 200701107 188816011
40850 188816011 177149030 166520989 156744319 146083611 132328664 116026361 101401327
40843A01401327r512971o198069p453133r782721q439005l443860J404673K967154
40835F0943395N63044l809002n777387k704571J452040K09704n243219o618149
40827C9015855j940409J23700n111000q521832j333846Q461840O383427o095830
40819C0981905j3125919p622349P03163K315994J32212L70361J987426J472314
40811A7215107J55732O11082J565934J153982K13572r80962l819659o529895m533614
40802E051279J535783M930676L053493J452037L884858N964384L439709l85824
40794B8926395r78724N5498o68298k384998l405458m375299m316259m49579M186027
40785A6589305J815193o415976q323028O59742P977874L003476n464754l588568
$$ plain form
40843 101401327 91888356 85690287 78237154 68454433 60015428 56571568 57976241 60943395
40835 60943395 61506439 57697437 51920050 49215479 50667519 50877223 45634004 39015855
40827 39015855 37075446 37199146 32088146 23566314 22232468 30694308 37077735 30981905
40819 30981905 17855986 10233637 10936800 13252794 13385006 13755367 15742793 17215107
40811 17215107 17370839 17981921 19547855 20701837 20915409 19934447 16114788 9584893 5051279
40802 5051279 6587062 11517738 14571231 16023268 19908126 25872510 29312219 28926395
40794 28926395 27947671 28003169 27334871 24949873 21544415 17169116 12852857 12403278 16589305
40785 16589305 18404498 11988522 3665494 4325236 12303110 15306586 9841832 6253264
40777F253264N241811P777629L120770P12393J175370k829599q944363o767575
40769E739700K340836N067602j568139n109610N58886N273252J447104k911603
40761A0838028N31323N728789L780894j745648k378848R41012K013055Q64796
40753B0573401P83270r7198m163083o391049j048086P474477R791356M566726
40745C1489814j746071n143259o066436m206469L40133K929591m70628n403085
40737A1723590l819956L983144R308370O570825j083230p178744p804590l105526
40729H593883K511552L308788n53589j767741L627893R140655P573198K757300
40721C5191939K825217O128200M866487M09613K395598J1687637J6599276R947147
$$ plain form
40777 6253264 11495075 19272704 22393474 23105867 24281237 21451638 12507275 5739700
40769 5739700 8080536 13148138 11579999 6470389 7029275 12302527 13749631 10838028
40761 10838028 11369351 17098140 20879034 19133386 16754538 17695550 19708605 20573401
40753 20573401 21356671 21259473 17096390 10705341 9657255 17131732 26923088 31489814
40745 31489814 29743743 24600484 18534048 14327579 14667712 17597303 17126675 11723590
40737 11723590 7903634 11886778 21195148 27765973 26682743 19503999 11699409 8593883
40729 8593883 11105435 14414223 13860634 12092893 15720786 24861441 32434639 35191939
40721 35191939 38017156 44145356 49011843 49421456 51817054 63504691 80103967 90051114
40713I0051114p64746n553924n282117o154232q148842o752126k038763J075919
40705E6432283j16504l772038o951765p980292o572585l959385j710837L76162
40697B5745039L015310M222565J417099k968823l308527M44365J804687j916707
40689B8455008m805825j997809K115489J243060k335934j872997K606379M865523
40681B8272894K802899P70169J405754J956225K41942j484074j118224o80320
40673C2167265k737129n915057o870660m832106j777035O12536K087502K752260
40665A5487576K739491K730880L306849L657734K236250p08173k374679o14932
40657B6460996K593877L050361K57280j241041J531157M761295L110389j588864
$$ plain form
40713 90051114 89286368 83732444 78450327 72296095 64147253 57395127 55356364 56432283
40705 56432283 56315779 52543741 45591976 37611684 31039099 27079714 25368877 25745039
40697 25745039 28760349 32982914 34400013 31431190 28122663 28567028 30371715 28455008
40689 28455008 23649183 21651374 23766863 25009923 22673989 20800992 23407371 28272894
40681 28272894 31075793 31845962 33251716 35207941 35449883 33965809 32847585 32167265
40673 32167265 29430136 23515079 16644419 11812313 10035278 10647814 12735316 15487576
40665 15487576 18227067 20957947 24264796 27922530 30158780 29450607 27075928 26460996
40657 26460996 29054873 32105234 32362514 31121473 32652630 37413925 40524314 38935450
40649C8935450k381709J932872M215272j08141n216176k913822N170981R424167
40641D9058894N150312j953993m156927j231404Q07406j554055m702966k793487
40633C8623780M027626Q841431O680994J262574o40514O81007n72985m590314
40625E4313599m359813K417772Q053635O487117K612972L049013M477615M22410
40617G7474320n682302n374714k98969n23502p984009j3294695j0842937n979715
40609B7493477l850516j509331L939430Q453769P960926M587918J044302l597551
40601D4522424p862654o366091j01492J152354n966792j0570046m284070L959540
40593A4483173K197062m171275j613661P911426J0121397K784074j534546J615995
$$ plain form
40649 38935450 36553741 38486613 42701885 42593744 37377568 34463746 39634727 49058894
40641 49058894 54209206 52255213 48098286 46866882 47674288 46120233 41417267 38623780
40633 38623780 42651406 51492837 58173831 59436405 58795891 59476898 58903913 54313599
40625 54313599 49953786 52371558 60425193 66912310 69525282 72574295 77051910 77474320
40617 77474320 71792018 66417304 66118335 65594833 57610824 44316129 33473192 27493477
40609 27493477 23642961 22133630 26073060 34526829 42487755 47075673 48119975 44522424
40601 44522424 36659770 30293679 30192187 31344541 25377749 14807703 10523633 14483173
40593 14483173 16680235 12508960 10895299 18806725 28928122 31712196 30177650 31793645
40585C1793645J401951p308561j2986789o335505M199696O548198L007924K465922
40577B2786481M073153J232652m823465p572937o520179n026949j525478N816394
40569H439672J0020649L546446p029302p878160J202877O252455P42219n939260
40561I357596n421783k659010m480889o950236l255012L785259O787952N933819
40553C097696O449116P521774L574165m350917p717661k799902L403305L017864
40545A2195440j960406l326248J291058M988712J236373o462732q276874j059173
40537a373850O838178O480974J84850k884655n19495O90290k374838l871955M15677
40528C585176M701913K116263l424375k612063M544447Q053932K318643o276122
$$ plain form
40585 31793645 33195596 25887035 12900246 6564741 10764437 17312635 20320559 22786481
40577 22786481 26859634 28092286 23268821 15695884 9175705 4148756 2623278 8439672
40569 8439672 18460321 22006767 14977465 7099305 8302182 14554637 15296856 9357596
40561 9357596 3935813 1276803 -3204086 -10154322 -13409334 -9624075 -2836123 3097696
40553 3097696 9546812 17068586 20642751 16291834 8574173 5774271 9177576 12195440
40545 12195440 10235034 6908786 8199844 13188556 14424929 7962197 -314677 -1373850
40537 -1373850 5464328 11945302 12130152 9245497 8726002 9416292 7041454 3169499 3585176
40528 3585176 8287089 10403352 6978977 4366914 8911361 16965293 19283936 13007814
40520A3007814q402297k884788M055613O617005L643375k034434n827360m830096
40512C344832q75666J427613N72804m54437K43454O8546l109420n790269l239074
40503g811617K387936L660076j636028o652440m783880J314842M311226L010718
40495f199167K768963N632677O575953J900703m156451n494609k848646j231228
40487c051805j442235j89159K569313K901973P185k016912j053094n3583j031103
40478c359420j353140P94889K182401r5269l004600j940311K228157M960100M607269
40469E020076K987533J468550N18016J084243K356640N43904n373045r104373
40461d98456m284332N132029Q451547K391924n003847o038138k559296o38094
$$ plain form
40520 13007814 4605517 1720729 5776342 12393347 16036722 14002288 8174928 3344832
40512 3344832 2469166 3896779 4469583 4015146 4258600 4327146 1217726 -4572543 -7811617
40503 -7811617 -5423681 -1763605 -3399633 -10052073 -14835953 -13521111 -9209885 -6199167
40495 -6199167 -3430204 2202473 8778426 10679129 6522678 1028069 -1820577 -3051805
40487 -3051805 -4494040 -4683199 -2113886 788087 795272 -1221640 -2274734 -2328317 -3359420
40478 -3359420 -4712560 -3917671 -1735270 -1830539 -4835139 -6775450 -4547293 412807 5020076
40469 5020076 8007609 9476159 9994175 11078418 13435058 13978962 8605917 -498456
40461 -498456 -4782788 349241 8800788 11192712 6188865 150727 -2408569 -3046663
40453c046663j597808k527332j881478j70657K485143N452272N928386K111380
40445F753243k840986l685430J86175M155995M771626L351207K075602N4940l756843
40436A1065529o345301l937420J191982K590307n14947j251233L442402N806351
40428A2047670j184789j0332292q820527J653098O041277q97648o294146k74177
40420h061534P885166N573959k084722j548345N921830O999142o66184n200247
40412H819065j205387K609843L87753j501928J564430K948955k197688o435439
40404D989604k837501J954091q76953o226112l418628N156674P583892J726450
40396H051517k540491j63627K638468P56869k151520k112657j576262k921093
$$ plain form
40453 -3046663 -4644471 -7171803 -9053281 -9223938 -6738795 -1286523 4641863 6753243
40445 6753243 3912257 226827 413002 4568997 9340623 12691830 14767432 14822372 11065529
40436 11065529 4720228 782808 1974790 4565097 4050150 2798917 6241319 12047670
40428 12047670 10862881 530589 -8289938 -6636840 -595563 -1493211 -7787357 -8061534
40420 -8061534 -176368 5397591 3312869 1764524 7686354 14685496 14019312 8819065
40412 8819065 7613678 10223521 10611274 9109346 10673776 13622731 11425043 4989604
40404 4989604 2152103 4106194 3229241 -2996871 -6415499 -1258825 6325067 8051517
40396 8051517 5511026 5347399 7985867 8742736 6591216 4478559 2902297 -18796
40388a8796k745013J915320P114703P013511J772259l641157n528250l181891
40380B700686K163193O741685N730696q83094o281565m539607J340741L090414
40372A0063149k060068q301528r089213m383551J147737M096463M246774K566621
40364a713616K83580n89482J101292K874531N71107n158653p455815j790929O440590
40355e437395P804070J397293m332593m012742j918931l139336m743870j577988
40347a5961492L840418M705378J108522R2707M190563P019042K867980m662972
40339C200146p376002k798707L739394O052606L370402k82282j332501l43603
40331D229453k20074j555033j886110j68588R35003n43249j980711k37644K548496
$$ plain form
40388 -18796 -2763809 -848489 6266214 13279725 15051984 11410827 5882577 2700686
40380 2700686 4863879 11605564 17336260 16453166 10171601 5631994 6972735 10063149
40372 10063149 8003081 -298447 -9387660 -13771211 -12623474 -8527011 -4280237 -1713616
40364 -1713616 -1430036 -2019518 -918226 1956305 2527412 -2631241 -10087056 -11877985 -5437395
40355 -5437395 2366675 3763968 -568625 -4581367 -6500298 -9639634 -14383504 -15961492
40347 -15961492 -12121074 -7415696 -6307174 -6214467 -2023904 4995138 7863118 3200146
40339 3200146 -4175856 -6974563 -3235169 2817437 6187839 5905557 4573056 4229453
40331 4229453 4009379 2454346 568236 399648 1334651 791402 -1189309 -1426953 1121543
40322A121543J857587j729164l253695j530680p37354k386190j750684L949036
40314d459601Q741645N146135m119377q200109k493279M826576L880675l385458
40306f2793o078615L91744Q082578P831682J637881j369285J605333M268987J805715
40297A8113227k521517l572507j591550Q7666K73907o39573k731962m679048l526356
40288g87713L02517J873591p02566k354930P12676M191787L167993J043822K981378
40279A0428555N219761J017478n843176n148089K690613N699454j435999r463855
40271C164742q905974k321509K942282N384120O555264N114359M00662l792935
40263H541011m913903n695292p249935m572933M403743J1485438Q362737l78745
$$ plain form
40322 1121543 2979130 1249966 -2003729 -3534409 -4271763 -6657953 -8408637 -4459601
40314 -4459601 4282044 9428179 5308802 -2891307 -5384586 -558010 3322665 -62793
40306 -62793 -6141408 -5749664 2332914 10164596 11802477 10433192 12038525 16307512 18113227
40297 18113227 15591710 12019203 10427653 10515319 10789226 10149653 7417691 2738643 -787713
40288 -787713 -485196 1388395 685829 -1669101 -956425 3235362 6403355 7447177 10428555
40279 10428555 15648316 16665794 10822618 5674529 8365142 14064596 12628597 3164742
40271 3164742 -5741232 -8062741 -5120459 263661 6818925 11933284 12333946 8541011
40263 8541011 3627108 -2068184 -9318119 -13891052 -9487309 1998129 10360866 9982121
40255I982121l324225J539430N679656L862212K78593N0901K137739K859903J084163
40246B4150493k161468n357071o472194m415835j073978Q12779J413443K402286
40238I298455K818869M43435l115298l295425P23639M195062K991208j530029
40230A2529916n190115n890226m333953j801090J051186L727599N214674M266753
40222I574744R91217k231840l075879k386088k470687k375467J028873O169041
40214E223914O310901p50801p603853o763746j049158J673944N31942P49151K690141
40205A012435Q53361n093407o866839O96778J0564430J1635344K743848o579225
40197H966725q111722l128583J996542M410884N759254O068336J828701p000048
$$ plain form
40255 9982121 6657896 8197326 13876982 17739194 18017787 18068688 20206427 23066330 24150493
40246 24150493 21989025 16631954 10159760 5743925 4669947 5482726 6896169 9298455
40238 9298455 12117324 12560759 9445461 6150036 6873675 11068737 14059945 12529916
40230 12529916 7339801 1449575 -2884378 -4685468 -3634282 93317 5307991 9574744
40222 9574744 10565961 8334121 5258242 2872154 401467 -1974000 -945127 5223914
40214 5223914 11534815 10784014 3180161 -3583585 -4632743 -2958799 -2426857 -1677706 1012435
40205 1012435 1865796 -3227611 -10094450 -9397672 1166758 12802102 15545950 8966725
40197 8966725 855003 -2273580 -277038 4133846 9893100 15961436 17790137 10790089
40189A0790089j2325510o738238M328128P311166j053428q667260n633101K028454
40181i959700L623050P03430K003966O795703O014873j744533p897263q089334
40173h549808o723063n245595J600590J3052958J7623541Q878235l273553n965046
40165A1398259r21787J024797k380772l551193O38103L930336J382907l415833
40157H104817m858425l042844j338554l27347J699889M125818L873957K31685
40149H468996l049023k408047J59993n57726n000949o987831k382090L927617
40141g829060M311825o59732l455877q95134K442887K865525K664785L964861
40133C410080L906488K17426l486321k989017m34772q33021l976770m952460j790489
$$ plain form
40189 10790089 -1535421 -8273659 -3945531 3365635 2312207 -6355053 -11988154 -9959700
40181 -9959700 -6336650 -5633220 -3629254 3166449 9181322 7436789 -460474 -8549808
40173 -8549808 -15272871 -20518466 -18917876 -5864918 11758623 20636858 17363305 11398259
40165 11398259 10476472 11501269 9120497 5569304 6207407 10137743 11520650 8104817
40157 8104817 3246392 203548 -1135006 -1462353 237536 4363354 8237311 8468996
40149 8468996 5419973 3011926 3171919 2614193 -2386756 -9374587 -11756677 -7829060
40141 -7829060 -3517235 -4176967 -7632844 -8527978 -6085091 -3219566 -554781 3410080
40133 3410080 7316568 7533994 4047673 1058656 623884 -209137 -4185907 -9138367 -10928856
40124a0928856J842355K062471q4947j85795L694564P832112O924026J602403
40116A2758333j329512J277897L048384k313117r296259p374090J987564O015930
40108D775130j92102o634499m704654Q04855K622119L150797O560059Q055825
40100A4437530K258296m845140m417120J44811o60307n253128l826457L371850
40092A210335N262178j189243n361985n62459N161579K546202m242235m740064
40084a915692K193359P888867O120045l42309m690400l918904j302391j557851
40076B474724l641022j330286O450224J0699257M098703o484555q575237k610942
40068A080866l31532m939746o295405P75915O995940M456877k04816J741992N490755
$$ plain form
40124 -10928856 -9086501 -7024030 -7108977 -7294772 -3600208 4231904 11155930 12758333
40116 12758333 11428821 12706718 15755102 13441985 4145726 -3228364 -1240800 4775130
40108 4775130 4583028 -2051471 -6756125 -5951270 -3329151 -178354 6381705 14437530
40100 14437530 16695826 11850686 7433566 7578377 6918070 1664942 -2161515 1210335
40092 1210335 6472513 5283270 -78715 -641174 4520405 7066607 2824372 -1915692
40084 -1915692 277667 8166534 14286579 13944270 9253870 5334966 4032575 2474724
40076 2474724 -1166298 -2496584 3953640 14652897 18751600 12267045 3691808 1080866
40068 1080866 749334 -4190412 -10485817 -9709902 -2713962 1742915 1538099 3280091 8770846
40059H770846J596859o449617o979092O54251M657281j007262q150521o953104
40051a3860359J333889Q123947Q272191L469444j588478l463086k139966m86244
40043c38662q88982k736074l974772l501743p30762M548140R695074R738456L589302
40034A5399977l115243m948888l539184l443856m417624l058794K88139K159265
40026d676208K038632K019618J459802j951303o078141n518314J58534M753550
40018g793830L562676j142163m081162k765286J579025N557846N614941J592480
40010B124527j954175j288482Q20635o18117m131079l317881L029853Q735873
40002C401154R187121O266838K796725j437681n416141m962811P57019N711038
$$ plain form
40059 8770846 10367705 3918088 -3061004 -2406753 2250528 1243266 -6907255 -13860359
40051 -13860359 -12526470 -4402523 3869668 7339112 5750634 2287548 147582 -338662
40043 -338662 -1227644 -3963718 -7938490 -11440233 -12170995 -7622855 2072219 11810675 15399977
40034 15399977 12284734 7335846 3796662 352806 -4064818 -7123612 -6835473 -4676208
40026 -4676208 -2637576 -617958 841844 -1109459 -7187600 -12705914 -12547380 -7793830
40018 -7793830 -4231154 -5373317 -9454479 -12219765 -10640740 -5082894 532047 2124527
40010 2124527 170352 -1118130 -297495 -915612 -5046691 -8364572 -5334719 3401154
40002 3401154 12588275 18855113 21651838 20214157 14798016 9835205 10592224 16303262
39994A6303262M337647j244442n082651n011660k952507r78409o23198l019937
39986A728105o343984o102262j148381L725467M312362K621300K595857L918778
39978E307242L998027K568814K89919l400807o706466m427077L716501Q422908
39970I769061K161881q415022j0472859l269162J814782n69085k727599J768213
39962i939790P189475N441555q92849l089964O30129L995830K506800j895728
39954C945458n205424n548115l219118n6559J539333J408749K233522M976801
39946G4647N892168J566401m916830p225361m354065j389954j560604k130634
39938a4044232K33282L905354M887526K675591N83374R80588K599596K739154
$$ plain form
39994 16303262 20640909 19396467 14313816 9302156 6349649 5371240 4748042 1728105
39986 1728105 -4615879 -10718141 -11866522 -8141055 -3828693 -1207393 1388464 5307242
39978 5307242 9305269 11874083 12164002 8763195 2056729 -2370348 1346153 9769061
39970 9769061 11930942 3515920 -6956939 -10226101 -8411319 -8980404 -11708003 -9939790
39962 -9939790 -2750315 2691240 1798391 -1291573 -661444 3334386 5841186 3945458
39954 3945458 -1259966 -6808081 -10027199 -10083758 -8544425 -7135676 -4902154 74647
39946 74647 5966815 7533216 2616386 -4608975 -8963040 -10352994 -11913598 -14044232
39938 -14044232 -13810950 -9905596 -5018070 -2342479 -1759105 -778517 1821079 4560233
39930D560233M85737k820176n114075m688597q08322M906354P975359M656652
39922I153165k660273o358923k568498L076278K564140l342307o431250l036762
39914i604430J733546L060409K746213L180768J872744k435305m073855J683372
39906a836538R088759Q607226R52943m107620k264620P11054l14769k977211l697818
39897D161406l194749k242830J275610O722015P866323Q31515r121631j3301932
39889g004273r128832p51695O311472Q006658L193920l981967o479408k289794
39881a2123919L404537O129760O980941O792169K435854n799600j0017104n240972
39873g438334J628946J763346j857163l98867N320115O617394J998371j565752
$$ plain form
39930 4560233 5045970 2225794 -2888281 -7576878 -8385200 -3478846 4496513 9153165
39922 9153165 6492892 133969 -2434529 641749 3205889 -136418 -6567668 -9604430
39914 -9604430 -7870884 -4810475 -2064262 1116506 2989250 553945 -3519910 -1836538
39906 -1836538 7252221 15859447 16812390 12704770 10440150 11151204 10836435 7859224 4161406
39897 4161406 966657 -1276173 -563 6721452 14587775 15419290 6297659 -7004273
39889 -7004273 -16133105 -16884800 -10573328 -2566670 627250 -3354717 -9834125 -12123919
39881 -12123919 -8719382 -2589622 4391319 11183488 13619342 7819742 -2197362 -7438334
39873 -7438334 -5809388 -4046042 -5903205 -6302072 -981957 5635437 7633808 6068056
39865F068056j990702m362649q434146o403960K936645R432384O529354Q28485
39857D603467L27336K524706J609520r63829j345754j408384l352084k884704
39849h89726K854084O653601J118478p659795q042209j296333O12019n093646
39841a1743527p534097p4046R350755J0964141O432523K816934Q70607k789587
39833H293703o604438n307945J104872O028834M600383n63376l349898j873791
39825B328344m32539l282720p607332n845245L433686J1006401P976733j667812
39817E909516o136194k099101K320423J595041N16066L770634O415702K071308
39809A4363395n331814o690096j494988K179964M03310k252841j826194n29871
$$ plain form
39865 6068056 4077354 -285295 -8719441 -15123401 -12186756 -2754372 3774982 4603467
39857 4603467 4930803 7455509 9065029 8101200 6755446 5347062 1994978 -889726
39849 -889726 1964358 8617959 9736437 2076642 -5965567 -7261900 -6649881 -11743527
39841 -11743527 -19277624 -19351670 -10000915 963226 7395749 10212683 11083290 8293703
39833 8293703 1689265 -3618680 -2513808 3515026 8115409 7552033 4202135 2328344
39825 2328344 1895805 -1386915 -8994247 -14839492 -11405806 -399405 7577328 5909516
39817 5909516 -226678 -2325779 -5356 1589685 2105751 5876385 12292087 14363395
39809 14363395 9031581 2341485 846497 3026461 3429771 1176930 -649264 -1179135
39801a179135n74115N52318M161165N303336k75848p470495p032868J309399P648240
39792B441997N203474j190592l232715p36538L02647j854446k871527o24134J098949
39783a462885j003331m754693o460138n586751k825300K191326P827700R300327
39775b773745M921759n6435m13420J792709K098183J776616M183031O185178J965611
39766A9679487n797151p788704j966891L110583J000368m642450p589783o797411
39758a0791952l235366L285117R659615R213991J397244m598620j668547N536843
39750H798325Q459796O070381K036187l165637r206363j0509889l459459M758863
39742C782204M326046k744893o151406l299699r64473j621447L803M749327N022273
$$ plain form
39801 -1179135 -1753250 -1200932 2960233 8263569 7987721 517226 -6515642 -5206243 2441997
39792 2441997 7645471 6454879 3222164 2485626 2788273 933827 -1937700 -2561834 -1462885
39783 -1462885 -2466216 -7220909 -13681047 -19267798 -22093098 -19901772 -12074072 -2773745
39775 -2773745 2148014 2091579 1678159 3470868 5569051 7345667 11528698 17713876 19679487
39766 19679487 13882336 6093632 4126741 7237324 8237692 3595242 -3994541 -10791952
39758 -10791952 -14027318 -10742201 -1082586 8131405 9528649 4930029 3261482 8798325
39750 8798325 17258121 23328502 25364689 22199052 12992689 2482800 -976659 3782204
39742 3782204 8108250 5363357 -788049 -4087748 -5052221 -6673668 -6669865 -1920538 3101735
39733C101735k204960q268000n192210K493946N489117L269780K138616L796754
39725D624778L990959J004370j746033j913553j283323j393495p16768J613247
39717D180182K680414l62602m856260m860425L64406L687980p08907p841502p371199
39708a5087913J418404P448581L898712j387936J414092P702421N485198m603845
39700F287714r159064k601572M787533L618727j376120j814726M68204o28634
39692d17938k850400K63952O494070O962717J15689n862730n590061l185123l879931
39683g949755n741931l980776P51755L131004R22584j754114J32736N612985Q410541
39674d64971N041192j93906j038224J692887J678363k534942m805196j174946
$$ plain form
39733 3101735 896775 -7371225 -12563435 -10069489 -4580372 -1310592 828024 4624778
39725 4624778 8615737 9620107 7874074 5960521 4677198 3283703 2566935 4180182
39717 4180182 6860596 6497994 1641734 -3218691 -2854285 833695 124788 -7716714 -15087913
39708 -15087913 -13669509 -6220928 -2322216 -3710152 -2296060 5406361 10891559 6287714
39700 6287714 -2871350 -5472922 -685389 2933338 1557218 -257508 210696 -417938
39692 -417938 -3268338 -3004386 3489684 10452401 10568090 4705360 -884701 -4069824 -7949755
39683 -7949755 -13691686 -17672462 -16920707 -13789703 -12867119 -14621233 -14488497 -8875512 -464971
39674 -464971 4576221 4382315 3344091 5036978 6715341 4180399 -624797 -1799743
39666a799743L524449K874321k074804n739203o225211n533734m522663k778697
39658b2275285j252624l89514K076641P011636J0210699P630370J628353k944769
39650A695507n748031q348281q089311j957027N629643O889131J831554k008036
39642a0104851n58403L175444N905872O915775M509235k233309q006243o177297
39634f573777K21601J526814l408476n273388Q4005N073036L715357N62389J64570
39625c907869j356590n864434m910584O698248J7348738J2337285l623447j1743405
39617D977942n346886L160451K841653j467845m15537M777802O110919J663393
39609A6301892k838836l073730j047388p99012k475945k307383J758499N864860
$$ plain form
39666 -1799743 1724706 4599027 2524223 -3214980 -9440191 -14973925 -19496588 -22275285
39658 -22275285 -23527909 -23917423 -21840782 -14829146 -4618447 3011923 4640276 1695507
39650 1695507 -4052524 -12400805 -20490116 -22447143 -16817500 -9928369 -8096815 -10104851
39642 -10104851 -10663254 -7487810 -1581938 5333837 9843072 7609763 -396480 -6573777
39634 -6573777 -6352176 -4825362 -8233838 -13507226 -13423221 -8350185 -4634828 -4072439 -3907869
39625 -3907869 -5264459 -11128893 -16039477 -9341229 8007509 20344794 16721347 4977942
39617 4977942 -368944 2791507 5633160 4165315 3749778 8527580 14638499 16301892
39609 16301892 13463056 10389326 9341938 8542926 6066981 3759598 5518097 11382957
39601A1382957M216131k618928p312457n520571j427355l27043r81828m53856
39593c042950q61137l793469l190661N945445J5074942J0805963m233549j2407066
39585D297518n752046L360671K009321n011865n666661L86356M496325M159046
39577B278665L732500L557015k32488n890525o245965J71575O378678O970534
39569A0719989M092314J707790J84664j071963q56906J141526K533565J322903
39561A9773882j668899m311812m757332k051731J717244J365058m677266r241047
39553c851903m546233N232556P727924k6961o870891m118029K294368K876286
39545a282883k62802J225665O750687P851025K441941k534029l108529l287097
$$ plain form
39601 11382957 15599088 12980160 5667703 147132 -1280223 -1607266 -2589094 -3042950
39593 -3042950 -3904087 -7697556 -10888217 -4942772 10132170 20938133 16704584 4297518
39585 4297518 -1454528 1906143 3915464 -1096401 -6763062 -6376706 -1880381 2278665
39577 2278665 6011165 9568180 9335692 3445167 -2800798 -2629223 3749455 10719989
39569 10719989 14812303 16520093 16704757 15632794 14775888 15917414 18450979 19773882
39561 19773882 18104983 13793171 9035839 6984108 8701352 10066410 5389144 -3851903
39553 -3851903 -8398136 -3165580 4562344 4535383 -2335508 -6453537 -4159169 -1282883
39545 -1282883 -1545685 -320020 6430667 14281692 16723633 14189604 11081075 7793978
39537G793978n891325p061883l602470J259301L575324M116872M058933J283649
39529E532379m048692n965628r46763M913771L957260j443923k939466O89760
39521b51302K818028M50634k068788j540046j15522O98745K606667M501186J474451
39512H574053o266171j0570890o477553J12036J642181j48652N15188K536659
39504a0083149J031386k146236p10166M372429N252189J44475l355762n79061
39496f073895L063751J572352k194275k278824N55381J193381r71106j751716
39488f884951Q35254M500921O818803P063433M479095j098757o696299p868293
39480A149206l828841J418076L656975K390133k0163j399654j459398j443505
$$ plain form
39537 7793978 1902653 -5159230 -8761700 -7502399 -3927075 189797 4248730 5532379
39529 5532379 1483687 -4481941 -5428704 -514933 3442327 1998404 -941062 -251302
39521 -251302 2566726 3017360 948572 -591474 -706996 -8251 2598416 7099602 8574053
39512 8574053 2307882 -8263008 -14740561 -14628525 -12986344 -13134996 -12619808 -10083149
39504 -10083149 -9051763 -11197999 -11908165 -7535736 -2283547 -2139072 -5494834 -6073895
39496 -6073895 -3010144 -1437792 -3632067 -5910891 -5355510 -4162129 -5133235 -6884951
39488 -6884951 -6049697 -1548776 5270027 12333460 16812555 15713798 9017499 1149206
39480 1149206 -2679635 -1261559 2395416 4785549 4765386 3365732 1906334 462829
39472D62829k295700k959460j406336K148404M674012M170069K350225J693023
39464H837066J503015n48789m051556n966916m944768k850248j557493n32625
39456a0112314J416100L669196M430028L132659J138330M5055n2430j85496o77550
39447B803578p17885k29326p28507k766029l771614j003633L922055O374384M496932
39438H379955O42272k793077n161286n097240j179893L726092M206979O74261
39430C398063J54262N099294P693249J173785q563530j0404921l568816K679571
39422b339043L083508J533647K144519L378631K760525Q58559j250445l058562
39414G111339k336412K434227O882861M758491j948174m376973j5645L617066
$$ plain form
39472 462829 -1832871 -4792331 -6198667 -4050263 623749 4793818 7144043 8837066
39464 8837066 10340081 9791292 5739736 -227180 -5171948 -8022196 -9579689 -10112314
39456 -10112314 -8696214 -5027018 -596990 2535669 3673999 3719054 3666624 3481128 2803578
39447 2803578 2085693 1856367 1127860 -1638169 -5409783 -6413416 -2491361 3883023 8379955
39438 8379955 9022227 6229150 1067864 -4029376 -5209269 -1483177 2723802 3398063
39430 3398063 3552325 8651619 16344868 17518653 8955123 -1449798 -5018614 -2339043
39422 -2339043 744465 2278112 4422631 7801262 10561787 11420346 10169901 7111339
39414 7111339 4774927 7209154 14092015 18850506 16902332 12525359 12509714 16126780
39406A6126780J412047j895729j428003p94764m336712q008587o002487q55936
39398e783391J344505J214652K860327M332353Q79665m639606m524511J251251
39390c064755M760087K773444N18041J365441J769389p14363k590782j426937
39382C389565n40672k475394m162832k985301j619077k084590j008475L429142
39374h057634N525096K79707o752634o094824J604997O529450L911386q52701
39366c907157j985393m72896P19479J682690K603111J648157m53842R30254O632530
39357G396933R585315M190853m099050n541118k27420K264344k757635q818781
39349A993441q495749l140431J311745K811143K867065J885951j31627j145460
$$ plain form
39406 16126780 17538827 15643098 14215095 13420331 9083619 1075032 -4927455 -5783391
39398 -5783391 -4438886 -3224234 -363907 3968446 4848111 208505 -4316006 -3064755
39390 -3064755 1695332 4468776 4986817 6352258 8121647 7407284 4816502 3389565
39382 3389565 2848893 373499 -3789333 -6774634 -8393711 -10478301 -11486776 -8057634
39374 -8057634 -2532538 -2252831 -9005465 -15100289 -13495292 -6965842 -3054456 -3907157
39366 -3907157 -5892550 -6365446 -5645967 -3963277 -1360166 287991 -165851 764403 7396933
39357 7396933 16982248 21173101 17074051 11532933 11305513 13569857 10812222 1993441
39349 1993441 -6502308 -9642739 -8330994 -5519851 -2652786 -766835 -898462 -2043922
39341b043922j56586k37256l554426n846652j720720O270096J0351595Q467256
39333A1529385N448582L346862j218070q154474j0799778o113018p95702j433746
39325h189959m299350j685299N866848J0800384R369352M630201M37039j489316
39317A5439900j22298L290212L775329j118414n334019j670293O015468O422703
39309B6698588k597043r834879o285255K804668O409727K321980k739291l898811
39301A2879684k773503k482521l038859k601109p71557N73597m29752k735186
39293a379206l028651m01041J657107M86070r83166J043802M013520K574262j979245
39284B003452l243493p66776j047915n487403o453684O3584O283069L885422l215582
$$ plain form
39341 -2043922 -2200508 -2437764 -5992190 -11838842 -13559562 -7289466 3062129 11529385
39333 11529385 16977967 20324829 19106759 10952285 152507 -5960511 -6756213 -8189959
39325 -8189959 -12489309 -14174608 -8307760 2492624 11861976 16492177 16929216 15439900
39317 15439900 15317602 18607814 22383143 21264729 15930710 14260417 20275885 26698588
39309 26698588 24101545 14266666 7981411 10786079 17195806 19517786 16778495 12879684
39301 12879684 10106181 7623660 4584801 1983692 1212135 1785732 1355980 -1379206
39293 -1379206 -4407857 -4808898 -3151791 -2665721 -3648887 -2605085 1408435 3982697 2003452
39284 2003452 -1240041 -2006817 -3054732 -8542135 -14995819 -14932235 -8649166 -4763744 -7979326
39275g979326n308871j340188J527239j844k036635j419930K73598J093899J487701
39266a3704357K077895K780950M092638N827302N510154J592908k982377m078460
39258A116653j813732P41887K299904K968932J598183j944192m097595k058432
39250a188392J221914J337082p63741j473703j004817j005019R75686O956308
39242E055318J1275900P003710j974143n198660j523709j9200m042818o070193
39234D506205j777385K192196K70230k491850l63638K281443j169280p646227
39226d198306r474382o451234l902319k408728J453187O383299P286909M382647
39218f928927L429602O225745P717234M143559j393895l635714j727939Q66375
$$ plain form
39275 -7979326 -13288197 -14628385 -13101146 -13102990 -15139625 -16559555 -16285957 -15192058 -13704357
39266 -13704357 -11626462 -8845512 -4752874 1074428 6584582 8177490 5195113 1116653
39258 1116653 -697079 44808 2344712 5313644 6911827 4967635 870040 -1188392
39250 -1188392 33522 1370604 606863 -866840 -1871657 -2876676 -1900990 5055318
39242 5055318 16331218 23334928 21360785 16162125 14638416 14619216 10576398 4506205
39234 4506205 2728820 4921016 5191246 2699396 2335758 4617201 3447921 -4198306
39226 -4198306 -13672688 -20123922 -24026241 -26434969 -24981782 -18598483 -11311574 -6928927
39218 -6928927 -3499325 2726420 10443654 14587213 13193318 9557604 7829665 8696040
39210H696040R68438r17515j161129K535409P136043P111833J930297k902182
39202B3397234l643419k536348j990359k83593K974749L151036j786081n415378
39194A3867841j929383L515184J916307n514241r512418o749556k237192Q42769
39186e800689L670799M469038n86773p621248o883261K444559R135818N841159
39178D669402j280779l943350l302073l282249j184655N799718J1286004P444083
39170A6206101j648066m706494K20829L686457k49152o050144o289964k036046
39162h66479N27379p01721k376427j532370Q31235J989956J275613M98841Q22697
39153D68724P56377j094851k566847o43677K679830K054548k481878m089084L89639
$$ plain form
39210 8696040 9664478 8746963 7585834 10121243 17257286 24369119 26299416 23397234
39202 23397234 19753815 17217467 15227108 14943515 17918264 21069300 19283219 13867841
39194 13867841 11938458 15453642 17369949 11855708 2343290 -4406266 -6643458 -5800689
39186 -5800689 -2129890 2339148 1752375 -5868873 -12752134 -10307575 -1171757 4669402
39178 4669402 3388623 -554727 -3856800 -7139049 -8323704 -2523986 8762018 16206101
39170 16206101 14558035 9851541 10072370 13758827 13509675 7459531 1169567 -866479
39162 -866479 -339100 -1040821 -3417248 -4949618 -4118383 -2128427 -852814 -353973 468724
39153 468724 1225101 130250 -2436597 -3080274 -400444 1654104 -827774 -4916858 -4527219
39144d527219M349267J176323m927825n132963L43843L202122N04645j650952
39136f662759R61049M226888L171846o09518k815508k699887j667339J98930K348834
39127c547464K043739j548113m258301j933767L307157N538102K660648j542967
39119G19034k469874N06672M085338M640764K137889L34464J620597K794683l79040
39110A3990527n248630m890471M63760K214082k855051n875469J47506P145870
39102E092124L132071q246768j1868311l664012M163114K723307j442704O23434
39094i487745O208259P833286N599160L581238O82434n106079q461532l302733
39086b453712N557134P832912L076140R7169J831877J836434k961223o888739
$$ plain form
39144 -4527219 -177952 998371 -3929454 -9062417 -8718574 -5516452 -5011807 -6662759
39136 -6662759 -5701710 -1474822 1697024 1087506 -1728002 -4427889 -6095228 -5896298 -3547464
39127 -3547464 -1503725 -3051838 -7310139 -9243906 -5936749 -398647 2262001 719034
39119 719034 -1750840 -1244168 2841170 7481934 9619823 9954287 11574884 14369567 13990527
39110 13990527 8741897 3851426 4315186 6529268 3674217 -2201252 -2053746 5092124
39102 5092124 8224195 -22573 -11890884 -15554896 -11391782 -8668475 -10111179 -9487745
39094 -9487745 -3279486 4553800 10152960 13734198 14416632 9310553 849021 -2453712
39086 -2453712 3103422 10936334 14012474 14109643 15941520 17777954 14816731 7927992
39078G927992n899266l436506k127348Q85161N599688N620673q05936n077318
39070B687140j152111L907706J294260m823904m608409Q85321K470386r09144
39062b48755j226048L698908O325319K431628k505971l280027k260074k739979
39054A95001k749264j8738L130994M085089L932881L802560K298395m34073j381594
39045A2861251l48367j479069n953691q759184o254080j510596J410029K858551
39037g175156L597543J593051k663293l773138L65039L852021J960888r70316
39029c213361O87130M098751L613417Q56335O01701R93217k735810p967254p774714
39020a0840588k334878K021310L666945O194863Q995087P007595J88729n654473
$$ plain form
39078 7927992 2028726 -1407780 -3535128 -2649967 2949721 8570394 7764458 2687140
39070 2687140 1535029 5442735 6736995 1913091 -2695318 -1809997 660389 -248755
39062 -248755 -1474803 2224105 8549424 10981052 8475081 5195054 2934980 195001
39054 195001 -2554263 -2573001 557993 4643082 8575963 12378523 14676918 14242845 12861251
39045 12861251 12512884 11033815 5080124 -3679060 -9933140 -11443736 -10033707 -7175156
39037 -7175156 -3577613 -1984562 -4647855 -8420993 -8055954 -4203933 -2243045 -3213361
39029 -3213361 -2526231 1572520 5185937 6042272 6643973 7637190 4901380 -3065874 -10840588
39020 -10840588 -13175466 -11154156 -7487211 -1292348 7702739 14710334 14899063 9244590
39012I244590p857680q295339o255843L74371O774109M986671k414171l737485
39004g180777L892474R471173N293416k119989m097106k059385o56176J161317
38996C704947L947825K096393o151592j1368251n917289L031286M323628q7412
38988f420465q77466J731074M98270l301680j749666L559885K319646o025046
38980a0265448r153833j413421O652705M792617j923422k613158L130256O994063
38972c799641M613269j071060n623042o279404k095362M295623P538571N681542
38964C260496K564231J526189Q73446j404991l217403k554637j496714j800925
38956b250308j058132K115249L728370O69766l034458k195875J268476K439882
$$ plain form
39012 9244590 1386910 -6908429 -13164272 -12789901 -6015792 -1029121 -3443292 -7180777
39004 -7180777 -3288303 6182870 11476286 9356297 5259191 3199806 2543630 3704947
38996 3704947 7652772 9749165 3597573 -7770678 -13687967 -10656681 -6333053 -6420465
38988 -6420465 -7297931 -5566857 -5068587 -8370267 -10119933 -6560048 -4240402 -10265448
38980 -10265448 -19419281 -20832702 -14179997 -9387380 -11310802 -13923960 -10793704 -3799641
38972 -3799641 813628 -257432 -5880474 -12159878 -14255240 -9959617 -2421046 3260496
38964 3260496 5824727 7350916 8224362 6819371 3601968 1047331 -449383 -2250308
38956 -2250308 -3308440 -1193191 2535179 3204945 170487 -2025388 -756912 1682970
38948A682970J890505K820634L275434k71000m097377j553988M758356N109397
38940A3614931k384533q794640q279305m946978k651535J511974P868194Q403025
38932D341133j086458j0824811r010115J332475P545758N462189J544784o20858
38924a315903l902293p259467l936195O239794J3031695R757066K650539J61544
38916A5426780O65557j479544m246795k036429K576808J876680l261161l277439
38908F244457M533782J0058364M695567n755604r141328l362197K387256J072245
38900A0732542m103423n832646j916417L770999O387125L900734k205962p584080
38892C148872p495705j287413N635025O701205J716695k807863k134146O60390
$$ plain form
38948 1682970 3573475 6394109 9669543 9398543 5301166 3747178 8505534 13614931
38940 13614931 11230398 2435758 -5843547 -10790525 -13442060 -11930086 -4061892 4341133
38932 4341133 3254675 -7570136 -16580251 -15247776 -7702018 -2239829 -695045 -1315903
38924 -1315903 -5218196 -12477663 -16413858 -10174064 2857631 12614697 15265236 15426780
38916 15426780 16092337 14612793 10365998 8329569 10906377 12783057 9521896 6244457
38908 6244457 10778239 20836603 25532170 19776566 10635238 7273041 9660297 10732542
38900 10732542 6629119 796473 -1119944 2651055 9038180 12938914 10732952 3148872
38892 3148872 -4346833 -5634246 779 6701984 8418679 5610816 3476670 4137060
38884D137060n8155l712471m902011k593535j589283l422089k633282L677198
38876a1096568Q658763M730329m285106p944892m022239p4529m39564o63882K824694
38867a2312994N823539L733611m74251j141734J508603K923713J428811p25692
38859G63606j494552n12228J780645L641208K721840m69325k468690k149983k401056
38850e88535m194418l750164P94469M837875M212863J977138K692486M372096
38842A0353810K801982m5886L51059K056053j82641m719491n038667j334168o95621
38833C546430m963222p587307m648862l53914J397939K722168N247346N585570
$$ plain form
38884 4137060 4078905 366434 -4535577 -7129112 -8718395 -12140484 -14773766 -11096568
38876 -11096568 -2437805 2292524 -1992582 -9937474 -13959713 -14034242 -14473806 -15137688 -12312994
38867 -12312994 -6489455 -2755844 -3230095 -4371829 -2863226 60487 1489298 763606
38859 763606 -730946 -1243174 537471 4178679 6900519 6431194 3962504 1812521 -588535
38850 -588535 -4782953 -8533117 -7738648 -2900773 1312090 3289228 5981714 10353810
38842 10353810 13155792 13109906 13460965 15517018 15334377 10614886 5576219 4242051 3546430
38833 3546430 -1416792 -9004099 -13652961 -14006875 -12608936 -9886768 -4639422 946148
$$ [...]
##END NTUPLES=NMR SPECTRUM
##END=
