##TITLE=31Pdec_PhPA1809PM
 , 8 sc
 20.9.2019
##JCAMPDX= 6.0         $$ Bruker NMR JCAMP-DX V2.0
##DATA TYPE= NMR SPECTRUM
##DATA CLASS= NTUPLES
##ORIGIN= UXNMR, Bruker Analytische Messtechnik GmbH
##OWNER= root
$$ XWIN-NMR		Version 3.5
$$ Fri Sep 20 13:53:53 2019 Russian Standard Time (UT+4h)  she@DPX200
##.OBSERVE FREQUENCY= 81.013821
##.OBSERVE NUCLEUS= ^31P
##.ACQUISITION MODE= SIMULTANEOUS
##.ACQUISITION SCHEME= undefined
##.AVERAGES= 24
##.DIGITISER RES= 17
##SPECTROMETER/DATA SYSTEM= spect
##.PULSE SEQUENCE= zgpg30
##.SOLVENT NAME= CDCl3
##.SHIFT REFERENCE= (INTERNAL, CDCl3, 0, 182.463)
##AUDIT TRAIL= $$ (NUMBER, WHEN, WHO, WHERE, WHAT)
$$ ##TITLE= Audit trail, XWIN-NMR		Version 3.5
$$ ##JCAMPDX= 5.01
$$ ##ORIGIN= Bruker BioSpin GmbH
$$ ##OWNER= she
$$ F:/spectra/data/she/nmr/P31/1/pdata/1/auditp.txt
$$ ##AUDIT TRAIL=  $$ (NUMBER, WHEN, WHO, WHERE, WHAT)
(   1,<2019-09-20 13:53:01.67 +0400>,<she>,<DPX200>,
      <created by zg, POWCHK disabled, PULCHK disabled
       configuration hash MD5:
       00 E9 B6 7A A2 85 ED C7 34 08 36 98 17 FE 4E 26
       data hash MD5: 32K
       94 82 27 ED CE CC 4D 1B E4 6B 27 A9 2E 3F F2 92>)
(   2,<2019-09-20 13:53:06.73 +0400>,<she>,<DPX200>,
      <Start of raw data processing
       efp BC_mod = 2 LB = 1 FT_mod = 6 PKNL = 1 PHC0 = -407.9035 PHC1 = 108.6003 SI = 64K 
       data hash MD5: 64K
       B8 A0 B2 2E 4D AD D3 E3 CB 72 07 64 0C C0 C0 97>)
(   3,<2019-09-20 13:53:20.39 +0400>,<she>,<DPX200>,
      <pk PHC0 = 1.143273 PHC1 = 0 
       data hash MD5: 64K
       5C CD 73 F5 C7 86 ED 34 0B 44 C9 30 F0 ED DF ED>)
(   4,<2019-09-20 13:53:29.31 +0400>,<she>,<DPX200>,
      <abs ABSG = 5 
       data hash MD5: 64K
       70 05 0A 7E 5B 5E 86 41 36 39 A1 FF DF 77 0D 79>)
$$ ##END=
$$ 
$$ hash MD5
$$ 8A 96 DB 93 A0 08 4E 0B 9D E2 E5 16 B6 DF 1C 5B
##$RELAX= 
##$RELAX= 
##$RELAX= 
##$RELAX= 
##$RELAX= 
##$RELAX= 
##$RELAX= 
##$RELAX= 
$$ Bruker specific parameters
$$ --------------------------
##$DU= <F:/spectra>
##$EXPNO= 1
##$NAME= <P31>
##$PROCNO= 1
##$TYPE= <nmr>
##$USER= <she>
##$AMP= (0..31)
100 100 100 100 100 100 100 100 100 100 100 100 100 100 100 100 100 100 
100 100 100 100 100 100 100 100 100 100 100 100 100 100 
##$AQSEQ= 0
##$AQ_mod= 1
##$AUNM= <au_zg>
##$AUTOPOS= <>
##$BF1= 81.014009
##$BF2= 200.13
##$BF3= 200.13
##$BF4= 200.13
##$BF5= 200.13
##$BF6= 200.13
##$BF7= 200.13
##$BF8= 200.13
##$BYTORDA= 1
##$CFDGTYP= 0
##$CFRGTYP= 5
##$CHEMSTR= <none>
##$CNST= (0..31)
1 1 145 1 1 1 1 1 1 1 1 1 1 1 1 1 1 1 1 1 1 1 1 1 1 1 1 1 1 1 1 1 
##$CPDPRG= <waltz16>
##$CPDPRG1= <>
##$CPDPRG2= <waltz16>
##$CPDPRG3= <>
##$CPDPRG4= <mlev>
##$CPDPRG5= <mlev>
##$CPDPRG6= <mlev>
##$CPDPRG7= <mlev>
##$CPDPRG8= <mlev>
##$CPDPRGB= <>
##$CPDPRGT= <>
##$D= (0..31)
0 1 0 0 0 0 0 0 0 0 0 0.03 2e-05 3e-06 0 0 0 0 0 0 0 0 0 0 0 0 0 0 0 0 
0 0 
##$DATE= 1568973181
##$DBL= (0..7)
120 120 120 11 120 120 24 19 
##$DBP= (0..7)
150 150 150 150 150 150 150 150 
##$DBP07= 0
##$DBPNAM0= <>
##$DBPNAM1= <>
##$DBPNAM2= <>
$$ [...]
##$SUBNAM3= <"">
##$SUBNAM4= <"">
##$SUBNAM5= <"">
##$SUBNAM6= <"">
##$SUBNAM7= <"">
##$SUBNAM8= <"">
##$SUBNAM9= <"">
##$SW= 369.568048894756
##$SWIBOX= (0..15)
0 1 3 0 0 0 0 0 0 0 0 0 0 0 0 0 
##$SW_h= 29940.119760479
##$TD= 32768
##$TD0= 1
##$TE= 0
##$TE2= 300
##$TE3= 300
##$TEG= 300
##$TL= (0..7)
0 120 53 12 22 120 120 120 
##$TP= (0..7)
150 150 150 150 150 150 150 150 
##$TP07= 0
##$TPNAME0= <>
##$TPNAME1= <>
##$TPNAME2= <>
##$TPNAME3= <>
##$TPNAME4= <>
##$TPNAME5= <>
##$TPNAME6= <>
##$TPNAME7= <>
##$TPOAL= (0..7)
0.5 0.5 0.5 0.5 0.5 0.5 0.5 0.5 
##$TPOFFS= (0..7)
0 0 0 0 0 0 0 0 
##$TUNHIN= 0
##$TUNHOUT= 0
##$TUNXOUT= 0
##$USERA1= <user>
##$USERA2= <user>
##$USERA3= <user>
##$USERA4= <user>
##$USERA5= <user>
##$V9= 5
##$VALIST= <valist>
##$VCLIST= <CCCCCCCCCCCCCCC>
##$VD= 0
##$VDLIST= <DDDDDDDDDDDDDDD>
##$VPLIST= <PPPPPPPPPPPPPPP>
##$VTLIST= <TTTTTTTTTTTTTTT>
##$WBST= 1024
##$WBSW= 4
##$XGAIN= (0..3)
0 0 0 0 
##$XL= 0
##$YL= 0
##$YMAX_a= 25527
##$YMIN_a= -34651
##$ZGOPTNS= <>
##$ZL1= 120
##$ZL2= 120
##$ZL3= 120
##$ZL4= 120
##$ABSF1= 182.463
##$ABSF2= -187.1042
##$ABSG= 5
##$ABSL= 3
##$ALPHA= 0
##$AQORDER= 0
##$ASSFAC= 0
##$ASSFACI= 0
##$ASSFACX= 0
##$ASSWID= 0
##$AUNMP= <proc_1d>
##$AZFE= 0.1
##$AZFW= 0.5
##$BCFW= 0
##$BC_mod= 2
##$BYTORDP= 0
##$COROFFS= 0
##$CY= -3
##$DATMOD= 1
##$DC= 0
##$DFILT= <>
##$DTYPP= 0
##$F1P= 0
##$F2P= 0
##$FCOR= 1
##$FTSIZE= 65536
##$FT_mod= 6
##$GAMMA= 0
##$GB= 0
##$INTBC= 1
##$INTSCL= 5.30512e-09
##$ISEN= 30
##$LB= 1
##$LEV0= 0
##$LPBIN= 0
##$MAXI= 10000
##$MC2= 0
##$MEAN= 0
##$ME_mod= 0
##$MI= 50
##$NCOEF= 0
##$NC_proc= -7
##$NLEV= 6
##$NOISF1= 182.463
##$NOISF2= 159.3651
##$NSP= 0
##$NTH_PI= 0
##$NZP= 0
##$OFFSET= 182.463
##$PC= 4
##$PHC0= -406.7602
##$PHC1= 108.6003
##$PH_mod= 1
##$PKNL= yes
##$PPARMOD= 0
##$PSCAL= 0
##$PSIGN= 0
##$REVERSE= no
##$SF= 81.0140089999434
##$SI= 65536
##$SIGF1= 159.3651
##$SIGF2= -187.1042
##$SINO= 113.3802
##$SIOLD= 16384
##$SREGLST= <1H.CDCl3>
##$SSB= 0
##$STSI= 65536
##$STSR= 0
##$SW_p= 29940.119760479
##$SYMM= 0
##$S_DEV= 0
##$TDeff= 32768
##$TDoff= 0
##$TI= <>
##$TILT= no
##$TM1= 0
##$TM2= 0
##$TOPLEV= 0
##$USERP1= <user>
##$USERP2= <user>
##$USERP3= <user>
##$USERP4= <user>
##$USERP5= <user>
##$WDW= 1
##$XDIM= 65536
##$YMAX_p= 484719704
##$YMIN_p= -98995958
$$ End of Bruker specific parameters
$$ ---------------------------------
##NTUPLES= NMR SPECTRUM
##VAR_NAME=  FREQUENCY,     SPECTRUM/REAL,   SPECTRUM/IMAG
##SYMBOL=    X,             R,               I
##VAR_TYPE=  INDEPENDENT,   DEPENDENT,       DEPENDENT
##VAR_FORM=  AFFN,          ASDF,            ASDF
##VAR_DIM=   65536,         65536,           65536
##UNITS=     HZ,            ARBITRARY UNITS, ARBITRARY UNITS
##FACTOR=    0.456856943014862, 1,           1
##FIRST=     14782.0589164792, 0,            0
##LAST=      -15158.0608439998, 0,           0
##MIN=       -15158.0608439998, -98995958,   0
##MAX=       14782.0589164792, 484719704,    0
$$ Real data points
##PAGE= N=1
##DATA TABLE= (X++(R..R)), XYDATA
$$ [...]
$$ plain form
43793 9744442 10267498 6059887 1541037 165258 452367 -772188 -2655824 -1531089
43785 -1531089 2686872 5573017 4542452 2291776 2091442 2903391 1798672 -1163257
43777 -1163257 -3610262 -5055563 -7077207 -9462361 -9305529 -5083291 495320 3371402
43769 3371402 2752152 1174149 508131 -78667 -1612349 -2606607 -763278 3158991 5355585
43760 5355585 3609539 310963 -497262 1923891 4587880 4748333 2510055 -465004
43752 -465004 -2985011 -4436561 -4449298 -3600767 -3466842 -4733309 -5808710 -4525961 -1027491
43743 -1027491 2163256 3043574 2093678 949240 33471 -1522651 -3860407 -5421485 -4626123
43734 -4626123 -1999945 280369 1024133 1365067 2999195 5764180 7778417 7650750 5678511
$$ packed form
43793I744442N23056m207611m518850j375779K87109j224555j883636J124735
43785a531089M217961K886145j030565k250676k00334Q11949j104719k961929
43777a163257k447005j445301k021644k385154J56832M222238N578611K876082
43769C371402o19250j578003o66018n86798j533682r94258J843329L922269K196594
43760E355585j746046l298576q08225K421153K663989J60453k238278k975059
43752d65004k520007j451550j2737Q48531J33925j266467j075401J282749L498470
43743a027491L190747Q80318r49896j144438r15769j556122k337756j561078P95362
43734d626123K626178K280314P43764L40934J634128K764985K014237j27667j972239
$$ plain form
43725 5678511 3024793 775434 -39673 1266531 3913683 5642015 4908641 2751632
43717 2751632 1465783 1646050 1746637 687337 -507490 -444095 450212 807178 671149
43708 671149 1218446 2167400 1436029 -1707332 -4713724 -4510626 -1346497 1712411 2666436
43699 2666436 2268794 1923654 1769299 1458449 1301484 1589636 1780865 1430999 1313674
43690 1313674 2597817 5115415 7080435 6466520 2643458 -2707426 -6201194 -5362047
43682 -5362047 -1289982 2108269 2229250 349256 -511221 712694 2551924 3306937 2724702
43673 2724702 1715432 1258406 1356978 747283 -1657974 -4859944 -6632263 -6670872 -6932443
43664 -6932443 -7905183 -7089368 -3236199 418608 370863 -1557524 -800448 2829437 5096278
$$ packed form
43725E678511k653718k249359q15107J306204K647152J728332p33374k157009
43717B751632j285849J80267J00587j059300j194827O3395Q94307L56966j36029
43708F71149N47297R48954p31371l143361l006392K03098L164129L058908R54025
43699B666436l97642l45140j54355l10850j56965K88152J91229l49866j17325
43690A313674J284143K517598J965020o13915l823062n350884l493768Q39147
43682e362047M072065L398251J20981j879994q60477J223915J839230P55013n82235
43673B724702j009270m57026R8572o09695k405257l201970j772319l8609k61571
43664f932443r72740Q15815L853169L654807m7745j928387P57076L629885K266841
$$ plain form
43655 5096278 4311553 3511159 4598801 5092104 3044736 1085085 2287174 5101337 5927511
43646 5927511 4508085 3300013 3186846 3215095 3290821 3818773 3702939 2019388 814090
43637 814090 2740538 6420099 7795018 6088507 4807702 6377103 9289686 11460288
43629 11460288 13040541 14612078 15728377 16932790 20379036 26359054 31436992 32000641
43621 32000641 27787372 20447047 11298733 2798211 -582517 3291471 10172133 13172955
43613 13172955 10211318 5098038 1999145 1945351 4397983 8522666 12080053 12279499
43605 12279499 9269534 6444758 5937144 6018649 4448108 2171199 1720697 3687677 6819274
43596 6819274 10054787 12273674 11597804 7750120 4016593 3660632 4930403 3219536
$$ packed form
43655E096278p84725q00394J087642M93303k047368j959651J202089K814163Q26174
43646E927511j419426j208072j13167K8249P5726N27952j15834j683551j205298
43637H14090J926448L679561J374919j706511j280805J569401K912583K170602
43629A1460288J580253J571537J116299J204413L446246N980018N077938N63649
43621C2000641m213269p340325r148314q500522l380728L873988O880662L000822
43613A3172955k961637n113280l098893n3794K452632M124683L557387J99446
43605A2279499l009965k824776n07614Q1505j570541k276909m50502J966980L131597
43596F819274L235513K218887o75870l847684l733527l55961J269771j710867
$$ plain form
43588 3219536 -1669321 -4486927 -2144407 1585249 1670208 -1099862 -2326044 -1088122
43580 -1088122 -426219 -1548442 -1989969 -75197 2545095 3933929 4285729 4037583 2522940
43571 2522940 63702 -1270279 -576089 879273 3040010 7940581 14683965 17317021
43563 17317021 11940718 3279344 -748571 652663 1506010 -1216547 -4119311 -4095428
43555 -4095428 -2674806 -1875941 -908444 476744 24472 -2598958 -3685365 -1288797 863380
43546 863380 -603707 -2506915 -8029 5210257 7476700 5956525 4712828 4745017 2594991
43537 2594991 -2317719 -5259080 -3287484 403007 1945254 2074380 2853108 3245550 1799781
43528 1799781 562495 2167151 5244044 6728444 6951906 8261640 9827820 8426538
$$ packed form
43588C219536m888857k817606K342520L729656Q4959k770070j226182J237922
43580a088122O61903j122223m41527J914772K620292J388834L51800k48146j514643
43571B522940k459238j333981O94190J455362K160737M900571O743384K633056
43563A7317021n376303q661374m027915J401234Q53347k722557k902764K3883
43555d095428J420622P98865R67497J385188m52272k623430j086407K396568K152177
43546H63380j467087j903208K498886N218286K266443j520175j243697L2189k150026
43537B594991m912710k941361J971596L690491J542247J29126P78728L92442j445769
43528A799781j237286J604656L076893J484400K23462J309734J566180j401282
$$ plain form
43520 8426538 4331099 2078132 4274879 8024914 9000423 6509337 3013259 690933
43512 690933 113991 872844 1976978 2445145 2429754 2927985 3808884 3347518 594319
43503 594319 -2912655 -4873045 -4802528 -3806164 -2503854 -469831 2498717 5689772 8234316
43494 8234316 9867160 10682567 10526805 9024260 6372343 3952152 3458057 4855470 5842332
43485 5842332 4515084 2271234 2370362 5195204 6809451 3660315 -2523235 -6460097
43477 -6460097 -5546397 -2431047 -1085384 -2095778 -2964901 -1952823 -46492 741903 -283830
43468 -283830 -2292970 -4096752 -4737820 -3542538 -776619 1761750 2054037 353757 -653042
43459 -653042 876828 3332941 3636175 1331070 -969475 -1268870 -552755 -822277 -2324500
$$ packed form
43520H426538m095439k252967K196747L750035R75509k491086l496078k322326
43512F90933n76942P58853J104134M68167j5391M98231Q80899m61366k753199
43503E94319l506974j960390P0517R96364J302310K034023K968548L191055K544544
43494H234316J632844Q15407j55762j502545k651917k420191m94095J397413R86862
43485E842332j327248k243850R9128K824842J614247l149136o183550l936862
43477f460097R13700L115350J345663j010394q69123J012078J906331P88395j025733
43468b83830k009140j803782o41068J195282K765919K538369K92287j700280j006799
43459f53042J529870K456113L03234k305105k300545k99395P16115k69522j502223
$$ plain form
43450 -2324500 -3902954 -5005451 -5934124 -6632085 -6553456 -5718730 -5003642 -5234198 -6345161
43441 -6345161 -7302557 -6784748 -4481745 -1741519 18860 1533493 4646698 8577643
43433 8577643 9579887 6008750 1563759 832051 3175286 4301796 2904938 1777451
43425 1777451 2311203 2218259 178216 -1046330 1364426 5777693 8118264 6499902 1940054
43416 1940054 -3299342 -5972342 -3130881 3721177 7909469 4740409 -2037918 -4735429
43408 -4735429 -1607244 1985958 1824138 -502648 -1918207 -2343822 -2958408 -3527964 -3733564
43399 -3733564 -4471395 -5709443 -5323075 -2060804 2301261 5480307 7318646 8256380 7506015
43390 7506015 4880235 2407439 1838346 2218654 1971860 1508307 1583110 1146604 -514649
$$ packed form
43450b324500j578454j102497r28673o97961P8629Q34726P15088k30556j110963
43441f345161r57396N17809K303003K740226J760379J514633L113205L930945
43433H577643J002244l571137m444991p31708K343235J126510j396858j127487
43425A777451N33752r2944k040043j224546K410756M413267K340571j618362m559848
43416A940054n239396k673000K841461O852058M188292l169060o778327k697511
43408d735429L128185L593202j61820k326786j415559m25615o14586n69556k05600
43399c733564p37831j238048L86368L262271M362065L179046J838339R37734p50365
43390G506015k625780k472796n69093L80308k46794m63553P4803m36506j661253
$$ plain form
43381 -514649 -1434470 183744 2359356 1793673 -1303679 -3978248 -4840196 -4303740 -1939501
43372 -1939501 2439003 6026400 5712479 3045910 2045138 2392983 37031 -4917879
43364 -4917879 -6723974 -2502464 2918807 3689854 151210 -3902919 -7183158 -10223731
43356 -10223731 -12004392 -11518805 -10411950 -10164631 -8837048 -4585032 -199633 510504
43348 510504 -780390 764614 5037019 6706491 3620169 210731 650903 3003865
43340 3003865 2941922 83628 -2464696 -2895772 -2079753 -1078856 289038 2467800 5197968
43331 5197968 7652703 8956298 8792819 7735926 6532522 5160199 3467040 2570143
43323 2570143 4154947 7933633 11070461 10927375 7662967 3619963 808269 -594976
$$ packed form
43381e14649r19821J618214K175612n65683l097352k674569q61948N36456K364239
43372a939501M378504L587397l13921k666569j000772L47845k355952m954910
43364d917879j806095M221510N421271P71047l538644m054129l280239l040573
43356a0223731j780661M85587J106855K47319J327583M252016M385399P10137
43348E10504j290894J545004M272405J669472l086322l409438M40172K352962
43340C003865o1943k858294k548324m31076Q16019J000897J367894K178762K730168
43331E197968K454735J303595j63479j056893j203404j372323j693159q96897
43323B570143J584804L778686L136828j43086l264408m043004k811694j403245
$$ plain form
43315 -594976 -1787490 -3699409 -5579617 -5520101 -2930402 75972 762165 -1143425 -3438644
43306 -3438644 -4018759 -2268147 1439708 5863915 8728223 8318872 5614672 3457605
43298 3457605 3379055 4422527 5015441 4560063 3154421 1254440 -154554 -304698 279996
43289 279996 383054 -543717 -2493631 -5342658 -7774607 -7288762 -3574933 -390924 -1016968
43280 -1016968 -3211526 -2672912 -520626 -2092975 -7905955 -11539521 -8682031 -3190520
43272 -3190520 -962781 -2108568 -3081160 -3015297 -3444640 -4115411 -3535656 -2301232 -2065299
43263 -2065299 -2350266 -1826358 -1545155 -3309466 -5670182 -5075036 -701313 4703363 8271536
43254 8271536 8785588 6104179 1799008 -617011 772823 3342138 3481237 1872710
$$ packed form
43315e94976j192514j911919j880208N9516K589699L006374O86193j905590k295219
43306c438644n80115J750612L707855M424207K864308m09351k704200k157067
43298C457605p8550J043472N92914m55378j405642j899981j408994j50144N84694
43289B79996J03058r26771j949914k849027k431949M85845L713829L184009o26044
43280a016968k194558N38614K152286j572349n812980l633566K857490N491511
43272c190520K227739j145787r72592O5863m29343o70771N79755J234424K35933
43263b065299k84967N23908K81203j764311k360716N95146M373723N404676L568173
43254H271536N14052k681409m305171k416019J389834K569315J39099j608527
$$ plain form
43246 1872710 1710750 2922465 2497031 49722 -1467900 -762394 406525 1176229 2532829
43237 2532829 3655592 1914780 -2163570 -4361987 -3007354 -1600155 -3094750 -5505726
43229 -5505726 -5709453 -3963974 -1902282 505030 2927983 2911575 -323144 -3103179 -2123022
43220 -2123022 319511 -39296 -2506646 -2742991 -49517 1384837 -1046114 -4612029
43212 -4612029 -5288846 -2786757 2294 937462 656108 1181522 3031827 3964538 1560779
43203 1560779 -2788708 -4510457 -1721239 1713089 1225324 -2182713 -3619722 -1038464
43195 -1038464 2894720 5046620 4690107 2256958 -1464507 -4306972 -3912651 -1100222
43187 -1100222 310228 -1762221 -5044046 -6128393 -4416034 -1523475 1493669 4456241
$$ packed form
43246A872710j61960J211715m25434k447309j517622P05506J168919P69704J356600
43237B532829J122763j740812m078350k198417J354633J407199j494595k410976
43229e505726k03727J745479K061692K407312K422953j6408l234719k780035R80157
43220b123022K442533l58807k467350k36345K693474J434354k430951l565915
43212d612029o76817K502089K789051R35168k81354N25414J850305R32711k403759
43203A560779m349487j721749K789218L434328m87765l408037j437009K581258
43195a038464L933184K151900l56513k433149l721465k842465L94321K812429
43187a100222J410450k072449l281825j084347J712359K892559L017144K962572
$$ plain form
43179 4456241 6520635 6246187 3418019 -155002 -2090471 -1560508 117928 1106057 1088190
43170 1088190 1099053 1387613 799111 -1029955 -2343622 -1502531 674340 2434472 3739411
43161 3739411 5309001 6139588 4741149 2404685 2256649 4777716 6984797 6655816 4820077
43152 4820077 3337737 2611788 2699397 4020841 5512620 4659292 1327208 -722076 1439916
43143 1439916 5471967 6717250 4245288 1062793 -806569 -2159395 -3485498 -3296221
43135 -3296221 -858969 1773909 2243960 981503 158279 515312 984690 989078 1253385
43126 1253385 2144515 2894057 3144702 3753917 4973763 5338389 4197443 4125261 7986990
43117 7986990 13881688 16395316 13872389 11057513 12396151 15873010 16810550 15241769
$$ packed form
43179D456241K064394k74448k828168l573021j935469N29963J678436R88129j7867
43170A088190J0863K88560n88502j829066j313667Q41091K176871J760132J304939
43161C739411J569590Q30587j398439k336464j48036K521067K207081l28981j835739
43152D820077j482340p25949Q7609J321444J491779q53328l332084k049284K161992
43143A439916M032051J245283k471962l182495j869362j352826j326103J89277
43135c296221K437252K632878M70051j262457q23224L57033M69378M388K64307
43126A253385Q91130P49542K50645O09215J219846L64626j140946p2182L861729
43117G986990N894698K513628k522927k814876J338638L476859R37540j568781
$$ plain form
43109 15241769 15015063 16804565 17056240 14230978 11366831 10957207 11383518 10618269 9984413
43100 9984413 11425461 13564066 13374682 10229475 6047504 2811758 1674097 2838122
43092 2838122 4601423 4315010 1924376 411990 1065109 1192201 -1006179 -2565852 -516656
43083 -516656 2232250 537163 -5081275 -9191639 -9336664 -8177507 -7938065 -7779120 -7225866
43074 -7225866 -7244641 -6860203 -3604825 1144425 2273708 -1403801 -4531163 -3278076 -1253326
43065 -1253326 -3299794 -7583483 -8929350 -6944187 -5270956 -4744591 -3028218 -181087
43057 -181087 1017554 361492 602496 1886663 867075 -3219612 -6339806 -5698400 -3812738
43048 -3812738 -3881081 -4796445 -4087130 -2822865 -3734573 -6367425 -7918103 -7792856 -7758310
$$ packed form
43109A5241769k26706J789502K51675k825262k864147m09624M26311p65249o33856
43100I984413J441048K138605j89384l145207m181971l235746j137661J164025
43092B838122J763301k86413k390634j512386O53119J27092k198380j559673K049196
43083e16656K748906j695087n618438m110364j45025J159157K39442J58945N53254
43074g225866j8775L84438L255378M749250J129283l677509l127362J253087K024750
43065a253326k046468m283689j345867J985163J673231N26365J716373K847131
43057a81087J198641o56062K41004J284167j019588m086687l120194O41406J885662
43048c812738o8343r15364P09315J264265r11708k632852j550678J25247L4546
$$ plain form
43039 -7758310 -8162106 -7526933 -5925420 -5391504 -6249460 -5972354 -2961341 881496 2856134
43030 2856134 2856084 2357830 1543887 -410744 -2875498 -3835380 -2708948 -1291617 -969000
43021 -969000 -370699 2479526 6104913 5939066 -2515 -7357089 -9609892 -5715255 -1029369
43012 -1029369 -139249 -1574603 -1431842 342022 563543 -1582438 -3408221 -3375429 -3258636
43003 -3258636 -4438608 -5232782 -4007542 -2386862 -2610142 -3456215 -2021295 1183037 2255108
42994 2255108 -547733 -4146741 -4764317 -2531292 -247568 929641 2272635 4318261
42986 4318261 5127640 2616593 -2522524 -7296789 -9306192 -8237311 -4939172 -499217
42978 -499217 3450447 5069671 4183669 2892707 2912846 3018057 850287 -3188936 -6056196
$$ packed form
43039g758310m03796O35173J601513N33916q57956K77106L011013L842837J974638
43030B856134n0m98254q13943j954631k464754r59882J126432J417331L22617
43021i69000N98301K850225L625387j65847n941581p354574k252803L894637M685886
43012a029369Q90120j435354J42761J773864K21521k145981j825783L2792J16793
43003c258636j179972p94174J225240J620680k23280q46073J434920L204332J072071
42994B255108k802841l599008o17576K233025K283724J177209J342994K045626
42986D318261Q09379k511047n139117m774265k009403J068881L298139M439955
42978d99217L949664J619224q86002j290962K0139J05211k167770m039223k867260
$$ plain form
42969 -6056196 -6225809 -5360315 -5019579 -4069724 -951964 3364066 6651824 8265698 8751758
42960 8751758 7907227 5522395 3147154 2590903 3024696 1983125 -831955 -3091867 -3299805
42951 -3299805 -2310687 -924285 1630679 5710409 9605296 11150599 9849499 6703927
42943 6703927 3256619 1382543 2380017 5220929 7016937 6273609 4597972 4346426 5820437
42934 5820437 7730407 9126647 9647990 8943304 7186526 5412933 4198713 2720440
42926 2720440 201001 -2434657 -3502707 -2643943 -994787 187945 191776 -1190248 -3267475
42917 -3267475 -4454179 -3728079 -1939124 -940636 -1602872 -3172343 -4241879 -3916832 -2435666
42908 -2435666 -1018670 -750055 -1518062 -2503158 -3320609 -3676335 -2513774 624762 3661865
$$ packed form
42969f056196j69613Q65494L40736R49855L117760M316030L287758J613874M86060
42960H751758q44531k384832k375241n56251M33793j041571k815080k259912k07938
42951c299805R89118J386402K554964M079730L894887J545303j301100l145572
42943F703927l447308j874076R97474K840912J796008p43328j675637k51546J474011
42934E820437J909970J396240N21343p04686j756778j773593j214220j478273
42926B720440k519439k635658j068050Q58764J649156J182732L831j382024k077227
42917c267475j186704P26100J788955R98488o62236j569471j069536L25047J481166
42908b435666J416996K68615p68007r85096q17451l55726J162561L138536L037103
$$ plain form
42899 3661865 3897612 2137504 2018443 4330824 5321753 2509338 -1169204 -1962898 -1106989
42890 -1106989 -2029862 -3811555 -2228460 3145397 7409659 6641965 2204529 -2131621
42882 -2131621 -4298144 -4190892 -2644229 -1406416 -1932379 -3242970 -3041199 -1545233 -1716433
42873 -1716433 -4763842 -7984111 -8391077 -6244015 -3692184 -2218967 -2826671 -6219735
42865 -6219735 -10794335 -12691727 -10270091 -6766867 -6044618 -7278237 -6663240 -3161670
42857 -3161670 664648 3005468 4585676 5711440 4743933 983593 -3209718 -5038536
42849 -5038536 -4624578 -3970948 -3547078 -1999456 854863 2843563 2186553 -1562 -1420042
42840 -1420042 -1931597 -3225672 -5232147 -5294690 -2122609 1404145 1394551 -2296691 -6599844
$$ packed form
42899C661865K35747j760108j19061K312381R90929k812415l678542p93694Q55909
42890a106989r22873j781693J583095N373857M264262p67694m437436m336150
42882b131621k166523J07252J546663J237813n25963j310591K01771J495966j71200
42873a716433l047409l220269m06966K147062K551831J473217o07704l393064
42865f219735m574600j897392K421636L503224P22249j233619O14997L501570
42857c161670L826318K340820J580208J125764r67507l760340m193311j828818
42849e038536M13958O53630M23870J547622K854319J988700o57010k188115j418480
42840a420042n11555j294075k006475o2543L172081L526754r594l691242m303153
$$ plain form
42831 -6599844 -9477127 -10982421 -10718971 -7668427 -3195497 -1038909 -2736343 -5441866
42823 -5441866 -5880683 -4237909 -2336417 -276573 2540847 4731814 4246722 1644508
42815 1644508 -557463 -1398666 -1901654 -2232709 -1089744 1587674 3591358 3166910 1213424
42806 1213424 -226736 -506342 -406776 -443990 -188633 910152 2660455 4220798 4961710
42797 4961710 5130729 5373840 5589019 4913609 3209669 1787765 1894200 3037811 3691976
42788 3691976 3277319 2574937 2432728 2913015 3614004 4135860 4269030 4159141 4078121 3742808
42778 3742808 2389868 -19045 -2270321 -3120435 -2448549 -748337 1623151 3992671
42770 3992671 5182172 4819843 4052731 3920117 3820082 2698371 898435 -458222 -1089677
$$ packed form
42831f599844k877283j505294K63450L050544M472930K156588j697434k705523
42823e441866m38817J642774J901492K059844K817420K190967m85092k602214
42815A644508k201971q41203n02988l31055J142965K677418K003684m24448j953486
42806A213424j440160k79606R9566l7214K55357J098785J750303J560343P40912
42797D961710J69019K43111K15179o75410j703940j421904J06435J143611O54165
42788C691976m14657p02382j42209M80287P00989N21856J33170j09889q1020l35313
42778C742808j352940k408913k251276q50114O71886J700212K371488K369520
42770C992671J189501l62329p67112j32614j00035j121711j799936j356657o31455
$$ plain form
42761 -1089677 -1087477 319210 3687993 7511091 9323518 8533300 6479763 3925580 473588
42752 473588 -3448657 -6197589 -7229473 -7988985 -9389518 -9772379 -6784838 -761453 4870306
42743 4870306 6660759 4303977 764162 -744909 99247 927977 -102428 -2374200
42735 -2374200 -4469868 -6211910 -7764241 -8080082 -6202702 -3321953 -1510784 -943458
42727 -943458 -430927 -203688 -1652474 -4292325 -5562357 -4221786 -1753441 188108 1531696
42718 1531696 2312113 1769939 44145 -1328997 -1897210 -3303162 -6302930 -8632241 -7821153
42709 -7821153 -4854769 -2953408 -3319457 -3885716 -2219528 1463930 4248626 3186641
42701 3186641 -1451799 -5612901 -5394885 -1720983 694428 -435212 -2128432 -906076
$$ packed form
42761a089677K200J406687L368783L823098J812427p90218k053537k554183l451992
42752D73588l922245k748932j031884p59512j400533l82861K987541O023385N631759
42743D870306J790453k356782l539815j509071Q44156Q28730j030405k271772
42735b374200k095668j742042j552331l15841J877380K880749J811169N67326
42727i43458N12531K27239j448786k639851j270032J340571K468345J941549J343588
42718A531696P80417n42174j725794j373142n68213j405952k999768k329311Q11088
42709g821153K966384J901361l66049n66259J666188L683458K784696j061985
42701C186641m638440m161102K18016L673902K415411j129640j693220J222356
$$ plain form
42693 -906076 2052030 3121039 1966573 1756333 3940674 5980701 5194004 2570442 1214385
42684 1214385 2140744 3120472 1573679 -2258745 -5369112 -5083461 -1841749 1374327 2161701
42675 2161701 644820 -1539162 -3137236 -3791669 -3666902 -3343169 -3561521 -4529830 -5825099
42666 -5825099 -7077207 -8115428 -8531205 -8086384 -7411340 -6959758 -5536652 -1952564 1734749
42657 1734749 1443876 -3266529 -7449458 -6681274 -2487471 482114 655440 -23720 -334758
42648 -334758 -976631 -1984826 -2160598 -1350623 -807841 -1049938 -1540732 -2521525 -4816719
42639 -4816719 -7625740 -8856328 -8051657 -6779173 -5749784 -3957615 -1340833 199824
42631 199824 -350075 -1347306 -980693 153895 357207 -739531 -2417458 -4285273 -6029329
$$ packed form
42693i06076K958106J069009j154466k10240K184341K040027p86697k623562j356057
42684A214385R26359R79728j546793l832424l110367K85651L241712L216076P87374
42675B161701j516881k183982j598074o54433J24767L23733k18352r68309j295269
42666e825099j252108j038221m15777M44821O75044M51582J423106L584088L687313
42657A734749k90873m710405m182929P68184M193803K969585J73326o79160l11038
42648c34758o41873j008195j75772Q09975N42782k42097m90794r80793k295194
42639d816719k809021j230588Q04671J272484J029389J792169K616782J540657
42631A99824n49899r97231L66613J134588K03312j096738j677927j867815j744056
$$ plain form
42622 -6029329 -6721176 -5749285 -3833911 -2069381 -486559 1629442 4474886 7279584
42614 7279584 8590173 6999845 2762422 -1216830 -1685271 1067656 3356605 2968931
42606 2968931 1927896 3037080 5678424 7195235 6948957 6373505 5840793 4381920 2515382
42597 2515382 2442105 4442576 5453254 2964416 -1137708 -2655468 -486260 2037233
42589 2037233 1609805 -906644 -2135090 -1080453 -307962 -1778330 -3553205 -2487024
42581 -2487024 1003715 3478200 3625344 3915144 6048218 7591689 5479447 945848
42573 945848 -1943571 -1759764 -772878 -854814 -1367327 -1581140 -2210777 -3266542 -2972888
42564 -2972888 -742887 812337 -768303 -3793222 -4358484 -1584447 1732201 3491922
$$ packed form
42622f029329o91847R71891J915374J764530J582822K116001K845444K804698
42614G279584J310589j590328m237423l979252m68441K752927K288949l87674
42606B968931j041035J109184K641344J516811k46278n75452n32712j458873j866538
42597B515382p3277K000471J010678k488838m102124j517760K169208K523493
42589B037233m27428k516449j228446J054637P72491j470368j774875J066181
42581b487024L490739K474485J47144K89800K133074J543471k112242m533599
42573I45848k889419J83807R86886q1936n12513k13813o29637j055765K93654
42564b972888K230001J555224j580640l024919n65262K774037L316648J759721
$$ plain form
42556 3491922 4446429 5344465 4737558 1409088 -2860068 -5017413 -4213301 -1775608 1343025
42547 1343025 4986655 8102700 8876806 6901564 3574590 124510 -3119510 -5353697
42539 -5353697 -5303881 -3393246 -1966762 -2174614 -2329516 -731779 1532249 2386225 1953116
42530 1953116 1823915 2118429 1600943 261542 -504610 -243311 126224 372331 1436135
42521 1436135 3430214 4925804 4819299 3484505 1725727 131576 -189956 1923076
42513 1923076 5605022 7854951 6630409 3116310 128487 -900233 -762636 -1144283
42505 -1144283 -2899600 -4933623 -4760336 -1213048 3489924 5779357 4824545 2964535
42497 2964535 2024910 1246369 -625790 -3204058 -5206075 -5660927 -3904544 -304681 2705274
$$ packed form
42556C491922R54507Q98036o06907l328470m269156k157345Q04112K437693L118633
42547A343025L643630L116045P74106j975242l326974l450080l244020k234187
42539e353697M9816J910635J426484k07852j54902J597737K264028Q53976m33109
42530A953116j29201K94514n17486j339401p66152K61299L69535K46107J063804
42521A436135J994079J495590j06505j334794j758778j594151l21532K113032
42513A923076L681946K249929j224542l514099k987823j028720J37597l81647
42505a144283j755317k034023J73287L547288M702972K289433r54812j860010
42497B964535r39625p78541j872159k578268k002017m54852J756383L599863L009955
$$ plain form
42488 2705274 2818232 1625481 3208474 7985754 11420572 10533450 7924794 6724616
42480 6724616 5453077 1777230 -2023657 -2369561 -877811 -2036334 -5538172 -6577670
42472 -6577670 -3666695 -666761 -314272 -898893 -705562 -810451 -1523371 -706253 1853982
42463 1853982 2698726 347698 -1243841 1502076 5917799 7178455 5470277 4372275
42455 4372275 4065336 1555035 -2766034 -4160457 -531668 3825576 3845874 350708 -1568027
42446 -1568027 553292 3844199 4347887 2129632 877389 2744134 5212089 4544768
42438 4544768 1535928 1106833 5376789 9977588 9653077 5502061 3272256 5208222
42430 5208222 7301060 5336052 456803 -3100490 -3623645 -2916644 -2654427 -2156899 -241829
$$ packed form
42488B705274J12958j192751J582993M777280L434818q87122k608656j200178
42480F724616j271539l675847l800887l45904J491750j158523l501838j039498
42472f577670K910975K999934L52489n84621J93331j04889p12920Q17118K560235
42463A853982Q44744k351028j591539K745917M415723J260656j708178j098002
42455D372275l06939k510301m321069j394423L628789M357244K0298l495166j918735
42446a568027K121319L290907N03688k218255j252243J866745K467955o67321
42438D544768l008840m29095M269956M600799l24511m151016k229805J935966
42430E208222K092838j965008m879249l557293n23155P07001K62217M97528J915070
$$ plain form
42421 -241829 2225923 2861156 667016 -2479455 -3756589 -2385368 -28680 1451549
42413 1451549 1641522 1150365 884398 1893915 4387595 6461953 5564296 1980251 -1016973
42404 -1016973 -1467620 -959131 -1194262 -1059383 487269 1297676 -692235 -3148248 -2486597
42395 -2486597 90264 425995 -1536709 -1897268 -47352 219052 -1787196 -1377177 3146882
42386 3146882 5799942 1523260 -5190781 -6359576 -2063498 743646 -579458 -1391941
42378 -1391941 1575213 5026724 4754978 1650038 -622746 -440174 1741524 5226942
42370 5226942 8512142 9271529 7242595 5165930 4900180 4778529 3028299 1517934 3073251
42361 3073251 6591149 8105905 6082061 2683359 63263 -1645703 -2386321 -1126772
$$ packed form
42421b41829K467752O35233k194140l146471j277134J371221K356688J480229
42413A451549J89973m91157k65967J009517K493680K074358q97657l584045k997224
42404a016973m50647N08489k35131J34879J546652Q10407j989911k456013O61651
42395b486597K576861L35731j962704l60559J849916K66404k006248M10019M524059
42386C146882K653060m276682o714041j168795M296078K807144j323104q12483
42378a391941K967154L451511k71746l104940k272784J82572K181698L485418
42370E226942L285200P59387k028934k076665k65750j21651j750230j510365J555317
42361C073251L517898J514756k023844l398702k620096j708966p40618J259549
$$ plain form
42353 -1126772 2074982 4968808 5374589 3321897 181439 -2914507 -4917827 -4742551
42345 -4742551 -2843711 -1848682 -3759547 -6901207 -7461518 -4238674 -161101 1610508
42337 1610508 1519867 2124442 3847950 4430260 2733871 847964 1034162 2120066 1064379
42328 1064379 -2363907 -4722209 -3261187 605712 3313348 3483641 2901029 3601493 5228330
42319 5228330 5549283 3089420 -1051370 -4107014 -4422216 -2932827 -1514268 -678901 -104600
42310 -104600 -643939 -3487767 -7123300 -7783434 -4282421 -193726 665157 -980037 -1864665
42301 -1864665 -1234119 -865154 -1111360 -440490 1167404 1781635 1059258 969837 1914059
42292 1914059 1361621 -1801845 -4487405 -3523058 -313242 1543387 1615151 2323364 4233467
$$ packed form
42353a126772L201754K893826M05781k052692l140458l095946k003320J75276
42345d742551J898840R95029j910865l141660n60311L222844M077573J771609
42337A610508r0641O04575J723508N82310j696389j885907J86198J085904j055687
42328A064379l428286k358302J461022L866899K707636J70293n82612P00464J626837
42319E228330L20953k459863m140790l055644l15202J489389J418559Q35367N74301
42310a04600n39339k843828l635533o60134L501013M088695Q58883j645194q84628
42301a864665O30546L68965k46206O70870J607894O14231p22377q9421R44222
42292A914059n52438l163466k685560R64347L209816J856629P1764P08213J910103
$$ plain form
42283 4233467 5236345 4469227 3684227 3883243 3599578 1996398 1066438 2591960 4812081
42274 4812081 4704138 2493711 1090486 1322812 765911 -1741804 -3105135 210329 6653615
42265 6653615 10476450 8235132 2437400 -1847839 -2379774 -875712 -244261 -2125008
42257 -2125008 -6281988 -10825931 -13290018 -12736448 -10623492 -8656408 -6521937 -3302550
42249 -3302550 -337106 -101309 -2063289 -2467726 531897 4011591 4471771 2838536 2673122
42240 2673122 4720936 6324924 5975737 5375105 6189625 7239452 6416998 3838005 1447534
42231 1447534 257058 -573692 -2058061 -3901037 -5082497 -5481121 -6329145 -8614954 -11201053
42222 -11201053 -11507744 -8633879 -4794891 -2511071 -1275873 1142460 4542386 5954257
$$ packed form
42283D233467J002878p67118p85000J99016k83665j603180r29960J525522K220121
42274D812081j07943k210427j403225K32326n56901k507715j363331L315464O443286
42265F653615L822835k241318n797732m285239n31935J504062O31451j880747
42257b125008m156980m543943k464087N53570K112956J967084K134471L219387
42249c302550K965444K35797j961980m04437K999623L479694M60180j633235j65414
42240B673122K047814J603988l49187o00632Q14520J049827q22454k578993k390471
42231A447534j190476q30750j484369j842976j181460l98624q48024k285809k586099
42222a1201053l06691K873865L838988K283820J235198K418333L399926J411871
$$ plain form
42214 5954257 4166173 2258384 3892648 8487287 12023638 11930245 9278947 6407322
42206 6407322 4344452 3085698 2782473 3427569 3971973 2834443 -574830 -5158454 -8859888
42197 -8859888 -9904502 -7735629 -3451379 541646 1989263 619332 -1548949 -2249586
42189 -2249586 -1295684 -252488 136528 1009031 3236017 5440788 5645039 4280729 3719816
42180 3719816 4715999 5184855 3299937 235772 -1447824 -1128546 -410282 -633469 -1468326
42171 -1468326 -1876163 -1355871 -127013 1150149 1805598 1928918 2540398 4244239 5906765
42162 5906765 5681301 3456459 1316491 1219559 2989859 4954989 5781674 5212588 3791776
42153 3791776 2574754 2449274 2880412 1922551 -1334496 -4638700 -4418273 -133733 4534663
$$ packed form
42214E954257j788084j907789J634264M594639L536351r3393k651298k871625
42206F407322k062870j258754l03225O45096N44404j137530l409273m583624l701434
42197h859888j044614K168873M284250L993025J447617j369931k168281p00637
42189b249586R53902J043196L89016Q72503K226986K204771K04251j364310n60913
42180C719816R96183M68856j884918l064165j683596L19278P18264k23187q34857
42171a468326m07837N20292J228858J277162O55449J23320O11480J703841J662526
42162E906765k25464k224842k139968r6932J770300J965130Q26685n69086j420812
42153C791776j217022j25480M31138r57861l257047l304204K20427M284540M668396
$$ plain form
42144 4534663 5637449 3053534 -283558 -2161379 -2597144 -2292677 -1561859 -889411 -762833
42135 -762833 -486434 1201012 3737655 4735667 3271391 1271319 272310 -1033723 -3723017
42126 -3723017 -5089996 -1773024 4235514 6693718 3024683 -2336321 -4056405 -2280240
42118 -2280240 -586723 -175024 605138 2172441 2657788 1196246 -337195 141093 2168773
42109 2168773 3402482 2234762 -761856 -3464768 -4001541 -2276154 186779 1923510
42101 1923510 2631876 2577264 1913350 1105179 922581 1190516 690032 -676251 -1007568
42092 -1007568 736415 2358895 1171489 -1761533 -2825782 -1107523 375749 -795162
42084 -795162 -3296690 -4491790 -3764006 -2085781 -132876 1668363 2712244 3243498 4390550
$$ packed form
42144D534663J102786k583915l337092j877821m35765L04467P30818O72448J26578
42135g62833K76399J687446K536643R98012j464276k000072r99009j306033k689294
42126c723017j366979L316972O008538K458204l669035n361004j720084J776165
42118b280240J693517M11699P80162J567303M85347j461542j533441M78288K027680
42109B168773J233709j167720k996618k702912n36773J725387K462933J736731
42101A923510P08366n4612o63914q08171j82598K67935n00484j366283l31317
42092a007568J743983J622480j187406k933022j064249J718259J483272j170911
42084g95162k501528j195100P27784J678225J952905J801239J043881N31254J147052
$$ plain form
42075 4390550 5797122 4931643 768511 -3292528 -2881414 1487776 4673925 3209451
42067 3209451 -1049971 -4232973 -5125645 -5041325 -4603539 -2841320 575973 3789852 4287519
42058 4287519 1609232 -2140493 -4729231 -6315919 -8715197 -12037009 -13313401 -9707621
42050 -9707621 -2490021 3774678 6028455 5132716 3191038 513914 -3238090 -6382071
42042 -6382071 -6188773 -2563924 1303311 2699584 2221124 1819046 1464599 -385938 -3541511
42033 -3541511 -5376861 -3966168 -508570 2256592 3118213 2965809 3051661 3766578 4689644
42024 4689644 4751994 2672402 -1492605 -5289935 -5821604 -3199338 -688798 -543784 -931289
42015 -931289 1475872 6409186 9393457 6868253 753301 -3263049 -1753198 3170753
$$ packed form
42075D390550J406572q65479m163132m061039M11114M369190L186149j464474
42067C209451m259422l183002q92672Q4320M37786J762219L417293L213879M97667
42058D287519k678287l749725k588738j586688k399278l321812j276392L605780
42050i707621P217600O264699K253777q95739j941678k677124l752004l143981
42042f382071J93298L624849L867235J396273m78460m02078l54447j850537l155573
42033c541511j835350J410693L457598K765162Q61621j52404Q5852P14917R23066
42024D689644O2350k079592m165007l797330n31669K622266K510540J45014l87505
42015i31289K407161M933314K984271k525204o114952m016350J509851M923951
$$ plain form
42007 3170753 6945584 7923201 8284759 9719988 10292408 7357187 2390437 24184 1847419
41998 1847419 3999875 2623018 -674088 -1567287 279306 906827 -1570062 -3929944
41990 -3929944 -2520363 1922872 6086293 8427547 9384902 9095896 7756726 7119005 8537302
41981 8537302 9930888 7761637 2182658 -2796338 -4801017 -5555109 -6695717 -6508351
41973 -6508351 -3218880 1101774 2949948 2016000 497074 -695313 -1729991 -1046734
41965 -1046734 3161579 8642741 10276571 6609498 1810335 -179595 -117674 -289402 -188397
41956 -188397 1777488 4613677 5934828 5506808 4928514 4921939 5386863 6860060 9155410
41947 9155410 9721617 6615495 2532609 2445727 7080227 11842944 12643178 9819207 5747818
$$ packed form
42007C170753L774831R77617L61558J435229N72420k935221m966750k366253J823235
41998A847419K152456j376857l297106q93199J846593O27521k476889k359882
41990c929944J409581M443235M163421K341254R57355k89006j339170o37721J418297
41981H537302J393586k169251n578979m978996k004679p54092j140608J87366
41973f508351L289471M320654J848174r33948j518926j192387j034678O83257
41965a046734M208313N481162J633830l667073m799163j989930O1921j71728J01005
41956a88397J965885K836189J321151m28020n78294o575M64924J473197K295350
41947I155410N66207l106122m082886q6882M634500M762717Q00234k823971m071389
$$ plain form
41938 5747818 1728337 -1548768 -3264951 -3850127 -4926676 -6492008 -6268831 -3182600
41930 -3182600 757833 3513434 5546387 7524341 8093763 6479877 5055548 6191777
41922 6191777 8178671 7665890 5041248 3684372 4296469 3904261 1128351 -1176443 -107095
41913 -107095 3237382 5825464 6796960 7401804 8098537 7802439 5696290 2379791 -744852
41904 -744852 -2442864 -2179730 -296647 2358327 5050154 7123767 7651121 6076952 3311007
41895 3311007 1146006 291078 -31672 -259428 461017 2645804 4988845 5612446 4266049
41886 4266049 2396362 1409355 1571616 2255644 2558020 1877143 392417 -1188656 -2537315
41877 -2537315 -3834738 -4780638 -4384411 -2472861 -628463 -537167 -1772013 -2313245 -1159269
$$ packed form
41938E747818m019481l277105j716183n85176j076549j565332K23177L086231
41930c182600L940433K755601K032953J977954N69422j613886j424329J136229
41922F191777J986894n12781k624642j356876O12097l92208k775910k304794J069348
41913a07095L344477K588082R71496O04844O96733k96098k106149l316499l124643
41904g44852j698012K63134J883083K654974K691827K073613N27354j574169k765945
41895C311007k165001q54928l22750k27756P20445K184787K343041O23601j346397
41886D266049j869687r87007J62261O84028L02376o80877j484726j581073j348659
41877b537315j297423r45900L96227J911550J844398R1296j234846n41232J153976
$$ plain form
41868 -1159269 667902 1875512 2599458 3779592 5546633 7023498 7491120 7024597 5912546
41859 5912546 4135945 1875923 88491 -173087 1038507 2751729 4473337 6349304
41851 6349304 7552951 5977810 1005319 -4286260 -5661957 -2466753 1931137 4552890
41843 4552890 5594369 6162890 5642567 3204730 324144 -658295 112459 358940 -665352
41834 -665352 -984666 1082425 4378897 6224866 5222548 2163610 -880115 -1835974 4537
41825 4537 3202110 5445395 6032276 6254158 7057331 7694761 7478060 7364340 8336309 9393841
41815 9393841 9123709 8547964 9983977 12969362 13839718 10434807 5202289 1981766 1159300
41806 1159300 39020 -2777594 -5642791 -6543050 -5545009 -3875951 -2012866 304122
$$ packed form
41868a159269J827171J207610P23946J180134J767041J476865M67622m66523j112051
41859E912546j776601k260022j787432k61578J211594J713222J721608J875967
41851F349304J203647j575141m972491n291579j375697L195204M397890K621753
41843D552890J041479N68521n20323k437837k880586r82439P70754K46481j024292
41834f65352l19314K067091L296472J845969j002318l058938l043725r55859J840511
41825D537L197573K243285N86881K21882Q03173O37430k16701j13720R71969J057532
41815I393841k70132n75745J436013K985385Q70356l404911n232518l220523q22466
41806A159300j120280k816614k865197r00259R98041J669058J863085K316988
$$ plain form
41798 304122 2948319 5195475 6351596 6217319 5291804 4611657 4771759 5090259 4667797
41789 4667797 4319176 6005688 9733724 12592075 12194921 9877044 8783501 9605835 10130673
41780 10130673 8584673 5334997 1303604 -2985399 -6124463 -5856864 -1926563 2592312
41772 2592312 4519567 4210332 4352864 5849852 6862292 5969972 4447120 4648645 7293903
41763 7293903 11146785 14514713 16156409 15421587 12836742 10512094 10614103 12799108
41755 12799108 14166180 12744647 10272160 10128523 12958764 16222527 18229294 20327787
41747 20327787 23956524 27703254 29357348 29253039 29022539 28288388 25801621 23248974
41739 23248974 24070171 27911367 30039554 27769489 23973559 22066702 20943435 18098333
$$ packed form
41798C04122K644197K247156J156121j34277r25515o80147J60102L18500m22462
41789D667797l48621J686512L728036K858351l97154k317877j093543Q22334N24838
41780A0130673j546000l249676m031393m289003l139064K67599L930301M518875
41772B592312J927255l09235J42532J496988J012440q92320j522852K01525K645258
41763G293903L852882L367928J641696p34822k584845k324648J02009K185005
41755A2799108J367072j421533k472487j43637K830241L263763K006767K098493
41747B0327787L628737L746730J654094j04309k30500p34151k486767k552647
41739B3248974Q21197L841196K128187k270065l795930j906857j123267k845102
$$ plain form
41731 18098333 14927850 14701090 16780563 17249228 14943889 12895664 13490722 15777214
41723 15777214 18159461 20280793 21180923 18921497 13765827 9110651 7544868 8203508
41715 8203508 9414544 11314006 13891693 15081320 13510153 11173338 10478710 10241138
41707 10241138 7851414 4310434 3373157 5687721 7329327 5202389 1145316 -841225
41699 -841225 511834 3217014 5055880 5511598 5350971 5685239 7378224 10440700 13669740
41690 13669740 15164264 13587810 9347448 4626918 1756895 1243929 1805771 2314142
41682 2314142 2660982 2559952 1301064 -254090 653984 5085641 10005872 11870722 11324691
41673 11324691 11406060 12092698 10445186 6218359 3254745 4032025 6387359 7499710 7912500
$$ packed form
41731A8098333l170483k26760K079473M68665k305339k048225N95058K286492
41723A5777214K382247K121332R00130k259426n155670m655176j565783O58640
41715H203508J211036J899462K577687J189627j571167k336815o94628k37572
41707A0241138k389724l540980r37277K314564J641606k126938m057073j986541
41699h41225J353059K705180J838866M55718j60627L34268J692985L062476L229040
41690A3669740J494524j576454m240362m720530k870023n12966N61842N08371
41682B314142L46840j01030j258888j555154R08074M431657M920231J864850n46031
41673A1324691Q1369O86638j647512m226827k963614P77280K355334J112351M12790
$$ plain form
41664 7912500 9204544 10435928 9850493 8145236 7092755 6291998 4061116 583961
41656 583961 -2233465 -3095523 -1480085 2995759 8867333 12146186 10568017 7308960
41648 7308960 7004079 9044734 8747968 4640996 179296 -2046190 -3300474 -4838590
41640 -4838590 -5384786 -4268083 -3201344 -2797745 -908305 3146708 6160988 5723812 4104431
41631 4104431 4188931 4526764 2280642 -1372261 -3095664 -2828991 -2876756 -2858505 -348802
41622 -348802 3970957 6622271 7009729 8178428 11170498 13169596 12619535 11782547 12127094
41613 12127094 11262818 7344511 3141184 2293335 3928785 4427692 2805595 984436
41605 984436 -82253 -1213254 -2485060 -2918926 -2568903 -2402757 -2230989 -1221647 -428091
$$ packed form
41664G912500J292044J231384n85435j705257j052481q00757k230882l477155
41656E83961k817426q62058J615438M475844N871574L278853j578169l259057
41648G308960l04881K040655k96766m106972m461700k225486j254284j538116
41640d838590n46196J116703J066739M03599J889440M055013L014280m37176j619381
41631D104431Q4500L37833k246122l652903j723403K66673m7765J8251K509703
41622c48802M319759K651314L87458J168699K992070J999098n50061q36988L44547
41613A2127094q64276l918307m203327q47849J635450M98907j622097j821159
41605I84436j066689j131001j271806m33866L50023J66146J71768J009342P93556
$$ plain form
41596 -428091 -2075781 -5733541 -7739083 -5727415 -1857709 38 -965520 -2136357
41588 -2136357 -1166482 1527336 3973611 5078222 5233116 5086930 4564888 3323581 1634742
41579 1634742 218087 -621791 -1017196 -772690 502395 2274069 3129195 2567604 1898637
41570 1898637 2530846 3998824 4549691 3243765 714925 -1699516 -2799294 -1936789 460795
41561 460795 2861856 3775829 3008108 1692604 1395323 2996357 5561222 6486271 4287573
41552 4287573 1366433 1850649 5930604 8937217 7700301 5029966 5064968 6727994 5979809
41543 5979809 3050229 2306999 4877162 6622163 4950066 2804356 3227209 4256927
41535 4256927 3027937 1565821 3717175 8220097 9912858 7418216 4861343 5281095
$$ packed form
41596d28091j647690l657760k005542K011668L869706J857747r65558j170837
41588b136357R69875K693818K446275J104611J54894j46186n22042j241307j688839
41579A634742j416655q39878l95405K44506J275085J771674Q55126n61591o68967
41570A898637O32209J467978N50867j305926k528840k414441j099778Q62505K397584
41561D60795K401061R13973p67721j315504k97281J601034K564865R25049k198698
41552D287573k921140M84216M079955L006613j236916k670335L5002J663026p48185
41543E979809k929580p43230K570163J745001j672097k145710M22853J029718
41535D256927j228990j462116K151354M502922J692761k494642k556873M19752
$$ plain form
41527 5281095 6692423 6368318 5275264 5603096 6600099 6064457 4484333 4463844 6440298
41518 6440298 7867606 7037924 5266708 4325563 3724428 2096579 -39741 -791879 304717
41509 304717 1721432 2229740 2243810 2512393 2941079 3520549 5134496 8166291 11135251
41500 11135251 12142280 11192885 9678620 8016408 5639185 3271864 2946184 4853874
41492 4853874 6182963 4690801 1988725 1255713 2573951 2972059 1142204 -333988
41484 -333988 1404202 5411491 8221718 8407704 7920499 8729838 9878968 9017252 5948435
41475 5948435 3131532 2581620 3483168 3473245 1547827 -1020058 -2271299 -1505978 84429
41466 84429 405949 -1416643 -3616341 -3346823 -206728 2996970 4043149 4428664 6822062
$$ packed form
41527E281095J411328l24105j093054L27832R97003n35642j580124k0489J976454
41518F440298J427308q29682j771216r41145o01135j627849k136320p52138J096596
41509C04717J416715N08308J4070K68583M28686N79470J613947L031795K968960
41500A1135251J007029r49395j514265j662212k377223k367321l25680J907690
41492D853874J329089j492162k702076p33012J318238L98108j829855j476192
41484c33988J738190M007289K810227J85986m87205Q09339J149130q61716l068817
41475E948435k816903n49912R01548r923j925418k567885j251241P65321J590407
41466H4429L21520j822592k199698K69518L140095L203698J046179L85515K393398
$$ plain form
41457 6822062 10535747 12253767 10975653 9280278 9205235 9795853 9814184 10008314 10930640
41448 10930640 11003802 8963184 6209054 4487272 3200722 1571648 1485964 4878238 9636215
41439 9636215 11716364 10600707 9025927 7835651 5336795 2074937 1690900 5415719
41431 5415719 9681886 11460522 12422456 14921834 17052913 15643249 12193268 11473403
41423 11473403 14627196 17495048 16375484 12449794 9409477 8877365 9429065 8778607
41415 8778607 5941721 2121369 23500 1496094 5500313 9176939 10997484 11850271
41407 11850271 12902655 13720784 13155954 11079306 8400256 6004083 4432135 4114974
41399 4114974 5039212 6276926 6561409 5537589 4074018 3163752 2847075 2555478 2251810
$$ packed form
41457F822062L713685J718020j278114j695375p5043N90618J8331J94130R22326
41448A0930640P3162k040618k754130j721782j286550j629074q5684L392274M757977
41439I636215K080149j115657j574780j190276k498856l261858l84037L724819
41431E415719M266167J778636R61934K499378K131079j409664l449981p19865
41423A1473403L153793K867852j119564l925690l040317n32112N51700o50458
41415H778607k836886l820352k097869J472594M004219L676626J820545Q52787
41407A1850271J052384Q18129n64830k076648k679050k396173j571948l17161
41399D114974R24238J237714K84483j023820j463571r10266l16677k91597l03668
$$ plain form
41390 2251810 2528987 3459037 4252434 4703866 5998047 8709205 10679231 8988234 4197027
41381 4197027 361696 -79295 785518 111852 -1136398 42532 3599815 6106104 5384206
41372 5384206 2903843 1232795 1385565 3323233 6907620 11117297 13799600 13585347
41364 13585347 11425984 9485112 9026609 9696100 10176966 9367157 7639191 6909240 8608468
41355 8608468 11818158 14422636 15547563 15395638 13495716 9537470 5655351 4949059
41347 4949059 7276196 9406903 10021891 11209868 13741352 14753690 12767048 11447931
41339 11447931 14516288 19415771 20469946 16926228 13412590 13000426 14190220 14890507
41331 14890507 15191146 15429966 15279624 15770269 18642188 22454254 22934943 18930521 14602686
$$ packed form
41390B251810K77177R30050P93397M51432J294181K711158J970026j690997m791207
41381D197027l835331m40991Q64813o73666j248250J178930L557283K506289p21898
41372E384206k480363j671048J52770J937668L584387M209677K682303k14253
41364A3585347k159363j940872m58503O69491M80866q09809j727966p29951J699228
41355H608468L209690K604478J124927j51925j899922l958246l882119p06292
41347D949059K327137K130707O14988J187977K531484J012338j986642j319117
41339A1447931L068357M899483J054175l543718l513638m12164J189794P00287
41331A4890507L00639K38820j50342M90645K871919L812066M80689m004422m327835
$$ plain form
41322 14602686 13602108 14362234 13851404 12829951 13709389 15421390 14639348 11239930 8670193
41313 8670193 8810028 9675402 8746035 6029344 3228552 1981532 3448547 7677879 12687949
41304 12687949 15784281 16421324 16470777 17403310 18774894 19866330 21008907 22374493 22937203
41295 22937203 21844469 19889762 18546556 18128866 17753526 16701435 15187207 14118016
41287 14118016 14474133 16507764 19249224 21225613 21837673 21563518 20868986 19744978 18388395
41278 18388395 17293792 16348193 14918343 13324775 13011695 14373168 15564785 14840066
41270 14840066 13318807 13794339 16963677 20402774 21524526 20222879 18248064 17380693
41262 17380693 18837730 22845412 27428148 28987679 26135051 22189876 21501833 23668732
$$ packed form
41322A4602686j000578P60126n10830j021453Q79438J712001p82042l399418k569737
41313H670193J39835Q65374r29367k716691k800792j247020J467015M229332N010070
41304A2687949L096332O37043M9453R32533J371584J091436J142577J365586N62710
41295B2937203j092734j954707j343206m17690l75340j052091j514228j069191
41287A4118016L56117K033631K741460J976389O12060k74155o94532j124008j356583
41278A8388395j094603r45599j429850j593568l13080J361473J191617p24719
41270A4840066j521259M75532L169338L439097J121752j301647j974815q67371
41262A7380693J457037M007682M582736J559531k852628l945175o88043K166899
$$ plain form
41254 23668732 24442308 22776569 23116087 28472076 34837090 36531738 34787438 35881134
41246 35881134 41453152 46289787 46785084 46266691 49314318 55206413 60467511 64496481
41238 64496481 68942455 74285278 80856843 90714568 104360888 117979945 128675662 140440438
41230 140440438 159448736 184790504 210091554 233981908 262192938 298230294 338680500
41223 338680500 379783519 421400830 460106771 484606362 484719704 462195464 427559202
41216 427559202 388819031 348306088 308117958 272088927 241998957 216480186 194408119
41209 194408119 176157224 161572438 149927311 141754494 137663698 135791974 133764411
41202 133764411 132718609 135613437 141742195 147244332 151709207 159843625 174863296 194105550
$$ packed form
41254B3668732P73576j665739L39518N355989O365014J694648j744300J093696
41246C5881134N572018M836635M95297n18393L047627N892095N261098M028970
41238F4496481M445974N342823O571565R857725J3646320J3619057J0695717J1764776
41230A40440438J9008298K5341768K5301050K3890354K8211030L6037356M0450206
41223C38680500M1103019M1617311L8705941K4499591J13342k2524240l4636262
41216D27559202l8740171m0512943m0188130l6029031l0089970k5518771k2072067
41209A94408119j8250895j4584786j1645127q172817m090796j871724k027563
41202A33764411j045802K894828O128758N502137M464875Q134418J5019671J9242254
$$ plain form
41194 194105550 213654231 234225875 259506319 290559627 324510223 357374053 385586713
41187 385586713 405263918 412212042 403481557 379013389 342658153 301715099 263722566
41180 263722566 232263996 206200168 183044176 161936133 143291189 127394035 114202261
41173 114202261 103264212 93303637 83274883 74209297 68318238 65756282 64145874 61900225
41165 61900225 59778395 58164922 55371724 50510863 45865460 43882180 43212321 40445728
41157 40445728 35184840 30839625 30141127 31774443 32188048 29737008 26282461 24755732
41149 24755732 25476241 25678662 23349843 20411416 20233029 22860975 25723166 28919367
41141 28919367 35685214 46127398 54801568 57792271 58845509 64234916 73914524 82703971
$$ packed form
41194A94105550J9548681K0571644K5280444L1053308L3950596L2863830K8212660
41187C85586713J9677205O948124q730485k4468168l6355236m0943054l7992533
41180B63722566l1458570k6063828k3155992k1108043j8644944j5897154j3191774
41173A14202261j0938049r960575j0028754r065586n891059k561956j610408k245649
41165F1900225k121830j613473k793198m860861m645403j983280o69859k766593
41157D0445728n260888m345215o98498J633316M13605k451040l454547j526729
41149B4755732P20509K02421k328819k938427j78387K627946K862191L196201
41141B8919367O765847J0442184Q674170K990703J053238N389407R679608Q789447
$$ plain form
41133 82703971 89002904 96782644 108331272 119940920 126661771 127645113 124720885 118865534
41125 118865534 110668083 101976552 94223400 86288624 76378702 65395048 56531774 51789708
41117 51789708 50236102 49439261 47519887 44043001 39934730 36664780 35094882 35102634 36141933
41108 36141933 37486623 37955573 36461765 33272884 29978589 27968427 27765783 29868120
41100 29868120 34817919 41837282 48690747 53900354 58305569 63672604 70538164 78113959
41092 78113959 85473807 92035277 97569401 102386692 106680955 109039537 106760167 98862580
41084 98862580 88008110 78108964 70501947 63745491 56791072 50743771 47109347 45441012
41076 45441012 43543772 39816449 35047266 31737455 31430175 32772548 32742133 29851097
$$ packed form
41133H2703971O298933P779740J1548628J1609648O720851R83342k924228n855351
41125A18865534q197451q691531p753152p934776r909922j0983654q863274m742066
41117E1789708j553606p96841j919374l476886m108271l269950j569898P752J039299
41108C6141933J344690M68950j493808l188881l294295k010162k02644K102337
41100B9868120M949799P019363O853465N209607M405215N367035O865560P575795
41092G8113959P359848O561470N534124M817291M294263K358582k279370p897587
41084I8862580j0854470r899146p607017o756456o954419o047301l634424j668335
41076D5441012j897240l727323m769183l309811l07280J342373l0415k891036
$$ plain form
41068 29851097 25388731 21325618 18121855 15293137 12974366 11578164 10497897 8607200
41060 8607200 6055124 4509141 5446501 8782837 13022562 16202605 17115503 16369490 15793674
41051 15793674 15980025 15116703 11514437 6649987 3923212 4528224 6432679 7625672
41043 7625672 8238503 8646314 7710486 4798402 2158485 2916708 6929602 10623227 11399436
41034 11399436 10682117 11633126 14677786 16574217 14239253 8841763 5133839 6276228
41026 6276228 10023335 11160155 7568648 2449871 133622 1273171 3279003 4065951
41018 4065951 3579688 2513324 1697616 2542161 5812817 9542775 10262035 7240484 3717207
41009 3717207 2735873 3502749 3576728 3100431 4225932 6827661 7709474 5050391 1527360
$$ packed form
41068B9851097m462366m063113l203763k828718k318771j396202j080267j890697
41060H607200k552076j545983R37360L336336M239725L180043R12898p46013n75816
41051A5793674J86351q63322l602266m864450k726775O05012J904455J192993
41043G625672O12831M07811r35828k912084k639917P58223M012894L693625P76209
41034A1399436p17319R51009L044660J896431k334964n397490l707924J142389
41026F276228L747107J136820l591507n118777k316249J139549K005832P86948
41018D065951m86263j066364q15708Q44545L270656L729958P19260l021551l523277
41009C717207r81334P66876P3979m76297J125501K601729Q81813k659083l523031
$$ plain form
41000 1527360 1281654 4785887 8491518 9376145 8213475 7763379 8947659 10119994 9815899
40991 9815899 8775415 8590243 9369989 9989674 10278071 11513626 14404642 17721074 19578403
40982 19578403 19304435 17524231 15288235 13792872 13996269 15452288 16213208 15036300
40974 15036300 13184722 12853239 14210530 15333672 14923383 13734736 13199778 13859518 15450581
40965 15450581 17474278 19249150 20191121 20420952 20590263 21091625 22034307 23732285 26231499
40956 26231499 28509907 29385987 29377352 30444941 33497915 37181941 39612420 40481285 41044058
40947 41044058 42728206 46064765 50415871 54627027 58358399 62328999 66423694 68310664
40939 68310664 65558997 58935382 52015787 47595420 45960961 46253759 47351624 47480186
$$ packed form
41000A527360k45706L504233L705631Q84627j162670m50096J184280J172335l04095
40991I815899j040484j85172P79746O19685K88397J235555K891016L316432J857329
40982A9578403k73968j780204k235996j495363K03397J456019P60920j176908
40974A5036300j851578l31483J357291J123142m10289j188647n34958O59740J591063
40965A5450581K023697J774872R41971K29831J69311N01362R42682J697978K499214
40956B6231499K278408Q76080q635J067589L052974L684026K430479Q68865N62773
40947D1044058J684148L336559M351106M211156L731372L970600M094695J886970
40939F8310664k751667o623615o919595m420367j634459K92798J097865J28562
$$ plain form
40931 47480186 45505999 43142139 43522298 46992353 50700062 52853574 54468477 56031099
40923 56031099 55949705 54272875 54694564 60082761 68417634 75799711 81188236 85497981
40915 85497981 88580316 90465723 93296865 98066009 101198901 98765293 93056947 90494162
40907 90494162 93289208 97411635 98833652 97528751 94780591 90823083 86534256 83930447
40899 83930447 83346202 82821979 81407684 80434381 80693139 81262286 82035759 84315690 87742686
40890 87742686 89803954 89838883 90370448 92656384 94005970 91837550 87818044 85503373
40882 85503373 85916361 87634845 89156492 88838361 84503832 75918410 66553518 60627223
40874 60627223 59147415 60237780 61833307 62416989 60856144 57645417 55071480 54410001
$$ packed form
40931D7480186j974187k363860L80159L470055L707709K153512J614903J562622
40923E6031099q1394j676830M21689N388197Q334873P382077N388525M309745
40915H5497981L082335J885407K831142M769144L132892k433608n708346k562785
40907I0494162K795046M122427J422017j304901k748160l957508m288827k603809
40899H3930447n84245n24223j414295r73303K58758N69147P73473K279931L426996
40890H7742686K061268L4929N31565K285936J349586k168420m019506k314671
40882H5503373M12988J718484J521647l18131m334529q585422r364892n926295
40874F0627223j479808J090365J595527N83682j560845l210727k573937o61479
$$ plain form
40866 54410001 54377456 53888571 54261145 56443248 58114071 56577186 53228725 51980989 53844985
40857 53844985 55961300 55752624 53361676 49936619 46069802 42568016 40777606 41071090
40849 41071090 41914114 41186631 38387505 35557653 35702726 39525525 44205634 46921020
40841 46921020 48851813 52938453 58075525 59847305 58166324 59206333 66627262 75287035
40833 75287035 78109729 75627831 73312484 72121827 68185727 60954699 55068118 53176646
40825 53176646 52362389 49324221 44622953 39976656 35278645 30358288 26510039 24370093
40817 24370093 22937433 22129688 23513556 27022668 29754371 29741968 28429850 27756729 27232056
40808 27232056 25734926 24005634 23351873 23542724 23659062 23574806 23277514 22239656 20629339
$$ packed form
40866E4410001l2545m88885L72574K182103J670823j536885l348461j247736J863996
40857E3844985K116315k08676k390948l425057l866817l501786j790410K93484
40849D1071090Q43024p27483k799126k829852J45073L822799M680109K715386
40841D6921020J930793M086640N137072J771780j680981J040009P420929Q659773
40833G5287035K822694k481898k315347j190657l936100p231028n886581j891472
40825E3176646q14257l038168m701268m646297m698011m920357l848249k139946
40817B4370093j432660q07745J383868L509112K731703j2403j312118o73121n24673
40808B7232056j497130j729292o53761J90851J16338q4256k97292j037858j610317
$$ plain form
40799 20629339 19631351 19621392 19613714 19145920 18682656 17557605 14206669 9700580 8262011
40790 8262011 12214948 18492668 22146830 21564932 18507009 15070045 12882717 13568262
40782 13568262 17279403 21436493 22945770 21314327 18379745 15807433 14004903 12568572
40774 12568572 10781890 8602005 7667172 9744344 13586146 15487418 14049386 12088381
40766 12088381 12340057 13694352 13766452 13027282 13749785 16218699 18419663 18704325 17035969
40757 17035969 14519606 12996359 13818135 15931701 16841677 16279077 16376652 17184230 15665222
40748 15665222 11385571 9248487 12940332 19011714 21802700 21351133 21450572 22366933 21423447
40739 21423447 19439033 20271145 24087400 27065301 28225083 30602414 34553725 36037331
$$ packed form
40799B0629339r97988r959p678m67794m63264j125051l350936m506089j438569
40790H262011L952937O277720L654162n81898l057923l436964k187328O85545
40782A3568262L711141M157090J509277j631443k934582k572312j802530j436331
40774A2568572j786682k179885r34833K077172L841802J901272j438032j961005
40766A2088381K51676J354295P2100p39170P22503K468914K200964K84662j668356
40757A7035969k516363j523247Q21776K113566R09976n62600R7575Q07578j519008
40748A5665222m279651k137084L691845O071382K790986m51567R9439R16361r43486
40739B1423447j984414Q32112L816255K977901J159782K377331L951311J483606
$$ plain form
40731 36037331 33833812 32902323 37400010 44960255 51128817 55224937 58316169 59547074
40723 59547074 58865426 60143897 66855624 76846682 85794607 93910356 104600977 117986847
40715 117986847 130833927 142523395 156170200 173223186 191296718 208532896 226255672
40708 226255672 245505437 263985024 278392721 287444390 290913116 288096165 279501264
40701 279501264 268339924 257975522 248857682 239912346 231914504 227102901 225779757 225657047
40693 225657047 225137335 225582870 229504041 237500867 247618908 256838188 262445409 262620872
40685 262620872 256801822 245798153 231330352 215266633 198998623 183113480 167636106
40678 167636106 152847513 139594332 128262000 117947258 107843705 99163865 93792388
$$ packed form
40731C6037331k203519r31489M497687P560245O168562M096120L091232J230905
40723E9547074o81648J278471O711727R991058Q947925Q115749J0690621J3385870
40715A17986847J2847080J1689468J3646805J7052986J8073532J7236178J7722776
40708B26255672J9249765J8479587J4407697R051669L468726k816951q594901
40701B79501264j1161340j0364402r117840q945336p997842m811603j323144j22710
40693B25657047n19712M45535L921171P996826J0118041R219280N607221J75463
40685B62620872n819050j1003669j4467801j6063719j6268010j5885143j5477374
40678A67636106j4788593j3253181j1332332j0314742j0103553q679840n371477
$$ plain form
40671 93792388 90647259 85819868 77893928 70705305 67923015 66688154 60863760 50310235
40663 50310235 42088743 40829902 42392954 40391424 35516925 33651692 36397931 38722808
40655 38722808 36489180 31880238 29437919 29825418 30059494 28247424 25613457 24234814
40647 24234814 24519225 25182297 24825106 23077257 20335430 16880155 13045121 10305428
40639 10305428 10726251 14182997 17371698 17406896 15629587 15735761 18587170 21322067 21640502
40630 21640502 20380240 19308010 18943915 19550996 21684060 24197074 24110003 20614399 17248681
40621 17248681 17475612 19526842 18720185 14327235 10875032 12084599 16360590 19655695
40613 19655695 20570253 20571235 20549826 19735335 17971737 16792967 17223086 17949301 17067630 14875708
$$ packed form
40671I3792388l145129m827391p925940p188623k782290j234861n824394j0553525
40663E0310235q221492j258841J563052k001530m874499j865233K746239K324877
40655C8722808k233628m608942k442319L87499K34076j812070k633967j378643
40647B4234814K84411O63072l57191j747849k741827l455275l835034k739693
40639A0305428M20823L456746L188701L5198j777309J06174K851409K734897L18435
40630B1640502j260262j072230l64095O07081K133064K513014q7071l495604l365718
40621A7248681K26931K051230q06657m392950l452203J209567M275991L295105
40613A9655695R14558R82k1409q14491j763598j178770M30119P26215q81671k191922
$$ plain form
40603 14875708 13440245 13665580 14294300 13922044 12564651 10932183 9651484 9663069 11651330
40594 11651330 14284627 14975036 13656408 13660432 16863219 20111138 19374534 15782982 13896535
40585 13896535 14964002 16163725 16529812 18873763 24215964 28511710 27773893 23580094
40577 23580094 20495624 20088077 20524982 20676971 21413165 23139169 24646844 24854045 24232233
40568 24232233 24161899 25428936 27136185 27077464 24291761 21276066 21638848 24894167 26119268
40559 26119268 22402072 17220527 16026809 19398329 23369656 25129864 25268050 25123780
40551 25123780 25048607 25255196 25740583 25250061 22675990 19605922 19200347 22292878 26674635
40542 26674635 30333936 33154386 35243882 36187311 36720304 38703372 42186789 44499069
$$ packed form
40603A4875708j435463K25335O28720l72256j357393j632468j280699J1585J988261
40594A1651330K633297O90409j318628M024L202787L247919p36604l591552j886447
40585A3896535J067467J199723L66087K343951N342201M295746p37817m193799
40577B3580094l084470m07547M36905J51989P36194J726004J507675K07201o21812
40568B4232233p0334J267037J707249n8721k785703l015695L62782L255319J225101
40559B6119268l717196n181545j193718L371520L971327J760208J38186j44270
40551B5123780p5173K06589M85387m90522k574071l070068m05575L092531M381757
40542B6674635L659301K820450K089496R43429N32993J983068L483417K312280
$$ plain form
40534 44499069 43674770 41182762 39779243 39960373 40124575 39403277 38836568 40046270 43618266
40525 43618266 48350940 51538272 50945728 47560658 45601682 48360990 54254127 58371229
40517 58371229 58118600 55947956 55709059 57450504 57512649 53656201 48151896 44660328 43568917
40508 43568917 42519084 40836655 40613539 42775031 44749564 43757817 40535451 37832885
40500 37832885 36702793 36430205 36868614 38201839 38989303 37151793 32976812 28884876
40492 28884876 26093903 23731782 21465434 20591335 21750867 23624986 24820236 25293904
40484 25293904 25103459 23630337 21140908 19334907 18957862 18411664 16322311 14147417
40476 14147417 14267609 16262490 17215815 15771291 14087958 15036615 18518656 21549981
$$ packed form
40534D4499069q24299k492008j403519J81130J64202p21298n66709J209702L571996
40525D3618266M732674L187332n92544l385070j958976K759308N893137M117102
40517E8371229k52629k170644k38897J741445O2145l856448n504305l491568j091411
40508D3568917j049833j682429k23116K161492J974533r91747l222366k702566
40500C7832885j130092k72588M38409J333225P87464j837510m174981m091936
40492B8884876k790973k362121k266348q74099J159532J874119J195250M73668
40484B5293904j90445j473122k489429j806001l77045n46198k089353k174894
40476A4147417J20192J994881R53325j444524j683333R48657L482041L031325
$$ plain form
40468 21549981 21732205 19797713 18329242 18450249 18716740 17467519 15194753 13690190
40460 13690190 13578586 13878172 13569342 12341406 10111222 7269709 5341746 5821264 8050490
40451 8050490 9691536 9778211 9976635 12172967 15980542 19506157 21841041 23992820 27624372
40442 27624372 33204816 39323287 44163765 47967442 53021566 60084806 65972375 66777106
40434 66777106 62904645 58371773 55097757 50739158 43040886 33660405 26083069 21762621
40426 21762621 20023724 20073914 21154775 21843398 21106603 19517863 18138139 16812468 14656823
40417 14656823 11560148 8279051 5755978 5002430 6574579 9338058 10885832 10033110
40409 10033110 7743669 5016270 1736362 -1261348 -1299316 2688153 7367701 8350711
$$ packed form
40468B1549981J82224j934492j468471J21007K66491j249221k272766j504563
40460A3690190j11604K99586l08830j227936k230184k841513j927963M79518K229226
40451H050490J641046Q6675J98424K196332L807575L525615K334884K151779L631552
40442B7624372N580444O118471M840478L803677N054124P063240N887569Q04731
40434F6777106l872461m532872l274016m358599p698272r380481p577336m320448
40426B1762621j738897N0190J080861O88623p36795j588740j379724j325671k155645
40417A4656823l096675l281097k523073p53548J572149K763479J547774q52722
40409A0033110k289441k727399l279908k997710l7968L987469M679548R83010
$$ plain form
40401 8350711 5625033 3230015 3856087 6082814 7081244 5987670 3997820 2483355
40393 2483355 1649205 511317 -1761675 -4172638 -4390316 -1679254 1735646 3369759
40385 3369759 3411104 3535062 4019986 3952819 3333287 2795050 1902304 -6454 -1771477
40376 -1771477 -1649896 -382030 -461419 -2195096 -3032140 -1330571 1547495 3534102 3978506
40367 3978506 2787490 -71044 -3041167 -3359616 -667216 1731624 1147840 -600104
40359 -600104 233593 4043651 7552408 8166730 6357773 3840555 1668880 661034 1729878
40350 1729878 4537762 6918425 6945322 5207931 4023247 4450612 5043122 4014794 2004474
40341 2004474 1710088 4604516 8845116 11171356 10434700 8248297 6228703 3983809
$$ packed form
40401H350711k725678k395018O26072K226727R98430j093574j989850j514465
40393B483355q34150j137888k272992k410963k17678K711062L414900J634113
40385C369759M1345J23958M84924o7167o19532n38237q92746j908758j765023
40376a771477J21581J267866p9389j733677q37044J701569K878066J986607M44404
40367C978506j191016k858534k970123l18449K692400K398840n83784j747944
40359f00104Q33697L810058L508757O14322j808957k517218k171675j007846J068844
40350A729878K807884K380663K6897j737391j184684M27365N92510j028328k010320
40341B004474k94386K894428M240600K326240p36656k186403k019594k244894
$$ plain form
40333 3983809 698226 -2301044 -2290044 1271259 5309019 6372544 4587345 3003389
40325 3003389 3207199 3322378 1041073 -2984167 -6187542 -7311711 -6746668 -4584914 -798585
40316 -798585 2875079 3965021 2766051 2307781 3949600 5566445 5378311 4812809 5549255
40307 5549255 6340112 5503910 4358107 4874825 5644440 3955786 802468 -315538 822696
40298 822696 1001321 -347648 467844 5157203 9691998 9666613 6424716 4514249 4977635
40289 4977635 4748909 2070222 -760429 -669463 2260498 5156913 5695658 4231275 2751104
40280 2751104 2246865 1810246 663813 91272 1894546 5290321 7160630 5727207 2465614
40271 2465614 1221 -404716 1045503 3316915 4570816 3210565 -170391 -3134441
$$ packed form
40333C983809l285583k999270J1000L561303M037760J063525j785199j583956
40325C003389K03810J15179k281305m025240l203375j124169N65043K161754L786329
40316g98585L673664J089942j198970m58270J641819J616845j88134n65502P36446
40307E549255P90857q36202j145803N16718P69615j688654l153318j118006J138234
40298H22696J78625j348969Q15492M689359M534795k5385l241897j910467M63386
40289D977635k28726k678687k830651R0966K929961K896415N38745j464383j480171
40280B751104n04239m36619j146433n72541J803274L395775J870309j433423l261593
40271B465614k464393m05937J450219K271412J253901j360251l380956k964050
$$ plain form
40263 -3134441 -4266912 -4303177 -4062387 -3220327 -1881295 -1227950 -1348077 -360343 2734022
40254 2734022 5942912 6636775 4713818 2033466 -6024 -1048339 -1309444 -1734471 -3175425
40245 -3175425 -4400643 -2826517 1553625 5230624 5738084 4624930 3872677 2289231
40237 2289231 -1433982 -4678858 -3959165 -409558 1915620 2164281 2847135 4482125 4642995
40228 4642995 2651223 907616 627183 128317 -1445816 -2390335 -1966208 -2257051 -4587465
40219 -4587465 -7007139 -7354344 -6319902 -5585032 -5307836 -5297047 -6198195 -7407396 -6223740
40210 -6223740 -1599549 3247468 4573342 2848089 1280141 1206232 1700470 2458088 4007049
40201 4007049 5647703 5933159 4961402 3947427 3011550 1699178 1056452 2425985 4444247
$$ packed form
40263c134441j132471l6265K40790Q42060J339032O53345j20127R87734L094365
40254B734022L208890O93863j922957k680352k039490j042315k61105m25027j440954
40245c175425j225218J574126M380142L676999N07460j113154p52253j583446
40237B289231l723213l244876P19693L549607K325178K48661O82854J634990J60870
40228D642995j991772j743607k80433m98866j574133r44519M24127k90843k330414
40219d587465k419674l47205J034442P34870K77196J0789r01148j209201J183656
40210f223740M624191M847017J325874j725253j567948p3909M94238P57618J548961
40201D007049J640654K85456r71757j013975r35877j312372o42726J369533K018262
$$ plain form
40192 4444247 4255905 2039302 1304296 3712828 6384660 6002324 3397283 1938755 2718710
40183 2718710 3561305 2423033 -26062 -1533600 -1011881 307694 326069 -1417742 -3031429
40174 -3031429 -2536253 -411987 1185242 1539102 2138910 3910906 5335438 4492165 1847874
40165 1847874 -388173 -1023135 -661112 -215831 -115545 -839083 -2666306 -4501886 -4329982
40156 -4329982 -1723455 1017753 1352572 -269371 -813939 1551880 5052277 6325957
40148 6325957 4345965 1433856 311932 1005174 1326414 -17944 -1829902 -2133697 -581730
40139 -581730 1568207 3296825 4550201 5177112 4393376 2015232 -572041 -1688029 -1312465
40130 -1312465 -873549 -1264648 -2075699 -2772347 -3379573 -3546290 -2158258 1180465 5110874
$$ packed form
40192D444247j88342k216603p35006K408532K671832l82336k605041j458528P79955
40183B718710Q42595j138272k449095j507538N21719J319575J8375j743811j613687
40174c031429M95176K124266J597229L53860N99808J771996J424532q43273k644291
40165A847874k236047o34962L62023M45281J00286p23538j827223j835580J71904
40156d329982K606527K741208L34819j621943n44568K365819L500397J273680
40148F325957j979992k912109j121924O93242L21240j344358j811958l03795J551967
40139e81730K149937J728618J253376O26911p83736k378144k587273j115988L75564
40130a312465M38916l91099q11051o96648o07226j66717J388032L338723L930409
$$ plain form
40121 5110874 7919056 9246046 9428608 8076271 4852781 1094865 -1160268 -1624009
40113 -1624009 -1556340 -1403052 -807328 -908837 -3688023 -8087477 -9843859 -7083675 -3259142
40104 -3259142 -1857466 -936819 3140994 8520524 9602998 5767984 2895017 4609764
40096 4609764 6956388 4845010 -113632 -2311831 -234918 2456613 2766958 1309976
40088 1309976 -204186 -849699 234047 3194077 5715952 4946162 1775486 348494
40080 348494 2507251 5503087 6203242 4727486 2616786 337554 -1477195 -973062 2296570
40071 2296570 5696411 6766176 6253021 5619978 3759244 -741538 -5813294 -7850004
40063 -7850004 -6303143 -3063016 1360953 6982691 10684900 8548866 2372353 -1026710
$$ packed form
40121E110874K808182J326990J82562j352337l223490l757916k255133m63741
40113a624009O7669J53288N95724j01509k779186m399454j756382K760184L824533
40104c259142J401676R20647M077813N379530J082474l835014k872967J714747
40096D609764K346624k111378m958642k198199K076913K691531L10345j456982
40088A309976j514162o45513J083746K960030K521875p69790l170676j426992
40080C48494K158757K995836P00155j475756k110700k279232j814749N04133L269632
40071B296570L399841J069765n13155o33043j860734m500782n071756k036710
40063g850004J546861L240127M423969N621738L702209k136034o176513l399063
$$ plain form
40055 -1026710 1469610 5638201 6826024 5898405 5402075 4242334 592998 -3061402
40047 -3061402 -2935069 -353708 -135548 -3139168 -5240521 -4087180 -2303844 -2599088 -3645169
40038 -3645169 -3098427 -1746946 -1864234 -3172392 -3144219 -689636 2494684 4090513 3265648
40029 3265648 759461 -1927855 -3351087 -3062966 -2016138 -1472783 -1379497 -487817 1466530
40020 1466530 2412924 70809 -4451923 -6888333 -4970262 -1945781 -2596611 -6504430
40012 -6504430 -8481177 -5988844 -2498435 -1976597 -3631475 -4717026 -5203165 -5943123 -4903443
40003 -4903443 19887 5822639 6955247 2778684 -1998887 -4274770 -5343250 -6392365
39995 -6392365 -6146007 -4321587 -2921633 -2371852 -630572 2052538 2059951 -1437071 -3804501
$$ packed form
40055a026710K496320M168591J187823r27619m96330j159741l649336l654400
40047c061402J26333K581361K18160l003620k101353J153341J783336k95244j046081
40038c645169N46742J351481j17288j308158K8173K454583L184320J595829q24865
40029C265648k506187k687316j423232K88121J046828N43355R3286Q91680J954347
40020A466530R46394k342115m522732k436410J918071L024481o50830l907819
40012f504430j976747K492333L490409N21838j654878j085551m86139p39958J039680
40003d903443M923330N802752J132608m176563m777571k275883j068480j049115
39995f392365K46358J824420J399954N49781J741280K683110P413l497022k367430
$$ plain form
39986 -3804501 -1680338 1852711 2621011 1796367 2346949 2740376 -57161 -3736248 -3033667
39977 -3033667 1932667 5457885 4372723 1314916 -400790 -430342 697351 2881759
39969 2881759 4725481 4450901 3312630 4238349 6504018 6076905 2203662 -926659 -619559
39960 -619559 829517 1134329 1828699 4120338 5231177 2707672 -928014 -1775364 -174945
39951 -174945 1012525 1250438 1496293 826047 -1682059 -3397213 -1197860 2820955 3356515
39942 3356515 -602667 -4619840 -5292882 -3747373 -2190688 -1014046 -225772 -92148 615367
39933 615367 3421242 6241555 4615742 -1666383 -7106043 -7579214 -4875257 -1860579
39925 -1860579 2219367 7667671 9854799 4686409 -3697264 -6898631 -3397658 116276
$$ packed form
39986c804501K124163L533049P68300q24644N50582L93427k797537l679087P02581
39977c033667M966334L525218j085162l057807j715706k9552J127693K184408
39969B881759J843722k74580j138271R25719K265669m27113l873243l130321L07100
39960f19559J449076L04812O94370K291639J110839k523505l635686q47350J600419
39951a74945J187470K37913K45855o70246k508106j715154K199353M018815N35560
39942C356515l959182m017173o73042J545509J556685J176642P88274J33624P07515
39933F15367K805875K820313j625813o282125n439660m73171K703957L014678
39925a860579M079946N448304K187128n168390q383673l201367L500973L513934
$$ plain form
39917 116276 -1002654 -3563899 -2847061 530831 3269686 4935110 6912371 8332463
39909 8332463 7071646 3715136 1182509 790319 1215115 1058966 350943 -214181 134712
39900 134712 1878237 4015346 4302972 2336931 965843 2485799 5016344 5470811 4587347
39891 4587347 5350290 7477453 7881367 6390582 6185158 7796047 7639327 4253858 1115735
39882 1115735 535007 -640667 -5497903 -11183832 -13072639 -11760135 -10982578 -10810906 -8249789
39873 -8249789 -3460640 -130991 246740 -59254 740488 2236480 4256081 6830393 7806138
39864 7806138 5038449 1177777 1340692 5304527 7320624 5103944 3315345 5483411
39856 5483411 8041594 6422766 2434281 728548 1507263 1936945 2158320 4342120 7288652
$$ packed form
39917A16276j118930k561245P16838L377892K738855J665424J977261J420092
39909H332463j260817l356510k532627l92190M24796j56149p08023n65124L48893
39900A34712J743525K137109K87626j966041j371088J519956K530545M54467q83464
39891D587347P62943K127163M03914j490785k05424J610889j56720l385469l138123
39882A115735n80728j175674m857236n685929j888807J312504P77557J71672K561117
39873h249789M789149L329649L77731l05994P99742J495992K019601K574312R75745
39864G806138k767689l860672J62915L963835K016097k216680j788599K168066
39856E483411K558183j618828l988485j705733P78715M29682K21375K183800K946532
$$ plain form
39847 7288652 7476952 5127711 4251009 6271445 7984346 6803473 4353076 3538646 4904657
39838 4904657 7101849 8661908 8347563 5780414 2562542 1047473 1438675 1738359 872269
39829 872269 69081 708482 2429225 3816563 3693783 1709337 -1052953 -2407148 -1595507
39820 -1595507 -923557 -2889271 -6258441 -7434171 -5423091 -2720190 -1196773 30726
39812 30726 2099694 4434137 6061336 6617500 5541674 2734533 475396 1790857 5976039
39803 5976039 8569231 6973550 3363207 793887 -472093 -1005751 188523 3390434
39795 3390434 5907548 5054050 1795972 -1024815 -2508506 -3385906 -3610309 -2919816 -2401209
39786 -2401209 -2867767 -2953031 -1382383 278530 9194 -923277 70918 2265887 2684673
$$ packed form
39847G288652J88300k349241q76702K020436J712901j180873k450397q14430J366011
39838D904657K197192J560059l14345k567149l217872j515069L91202K99684q66090
39829H72269q03188O39401J720743J387338j22780j984446k762290j354195Q11641
39820a595507O71950j965714l369170j175730K011080K702901J523417J227499
39812C0726K068968K334443J627199N56164j075826k807141k259137J315461M185182
39803E976039K593192j595681l610343k569320j265980n33658J194274L201911
39795C390434K517114q53498l258078k820787j483691q77400k24403O90493N18607
39786b401209m66558q5264J570648J660913k69336r32471R94195K194969M18786
$$ plain form
39777 2684673 1298276 1153311 3004576 3745926 1351044 -1976098 -3176748 -2166779
39769 -2166779 -673733 461529 1186389 1353235 1428591 2383287 3603364 2753320 -831662
39760 -831662 -4370086 -4835080 -2416550 614212 2750127 3364612 2002012 -180642 -58090
39751 -58090 3480993 6463649 4168668 -1858729 -4732387 -813498 5893722 9325139
39743 9325139 8448642 6598017 5953678 5687895 4788331 3836050 3524834 3358310 2599594
39734 2599594 1330689 -53212 -1480134 -2725933 -2997099 -1603016 1287746 4783407
39726 4783407 7664384 8559811 6652847 2831357 -500321 -1523947 -643665 468441
39718 468441 986157 1353626 1923428 2177363 1663022 1211927 2560515 6249952 9899312
$$ packed form
39777B684673j386397j44965J851265P41350k394882l327142j200650J009969
39769b166779J493046J135262P24860J66846P5356R54696J220077q50044l584982
39760h31662l538424m64994K418530L030762K135915O14485j362600k182654J22552
39751e8090L539083K982656k294981o027397k873658L918889O707220L431417
39743I325139q76497j850625o44339k65783q99564r52281l11216j66524p58716
39734B599594j268905j383901j426922j245799k71166J394083K890762L495661
39726D783407K880977Q95427j906964l821490l331678j023626Q80282J112106
39718D68441N17716L67469N69802K53935n14341m51095J348588L689437L649360
$$ plain form
39709 9899312 9608723 4292578 -1982958 -3928002 -1319854 1054018 334305 -788478
39701 -788478 570162 2000379 -248320 -4133550 -4009546 600273 4040278 3179543 1398563
39692 1398563 1747913 1651970 -1673202 -5022075 -3512646 1761859 5506905 5749793 4557314
39683 4557314 2650705 -1166537 -5391535 -5990715 -2231761 1904834 3205860 2338797
39675 2338797 694222 -1738882 -3961761 -3454570 -103166 2682712 2649992 1354306 525050
39666 525050 -554825 -1942706 -1289129 1781587 3248129 427109 -3092839 -2637314 146353
39657 146353 173206 -2657556 -3673430 -1501430 -16409 -1268948 -1922611 896587 4562897
39648 4562897 4990127 2726545 1526924 2475122 2845273 508622 -3013774 -4419583 -2322616
$$ packed form
39709I899312k90589n316145o275536j945044K608148K373872p19713j122783
39701g88478J358640J430217k248699l885230J24004M609819L440005q60735j780980
39692A398563L49350r5943l325172l348873J509429N274505L745046K42888j192479
39683D557314j906609l817242m224998n99180L758954M136595J301026q67063
39675B338797j644575k433104k222879N07191L351404K785878l2720j295686q29256
39666E25050j079875j387881O53577L070716J466542k821020l519948M55525K783667
39657A46353K6853k830762j015874K172000J485021j252539o53663K819198L666310
39648D562897M27230k263582j199621R48198L70151k336651l522396j405809K096967
$$ plain form
39639 -2322616 1337566 3191646 1742303 -1220463 -2811193 -2248757 -900594 439233
39631 439233 2473894 5155309 6409422 4519236 733981 -1976830 -2340692 -1701222 -1644005
39622 -1644005 -1918806 -1265593 343563 1261101 308442 -1315839 -1353739 324219 1303925
39613 1303925 138209 -1220131 -103563 2725265 3731189 1267871 -2374798 -3925638
39605 -3925638 -2543602 146686 1995944 1794026 51867 -1143768 -94826 2375797
39597 2375797 3862060 3598933 3306170 4388100 5833926 5789954 4071066 2127444 1138588
39588 1138588 731167 -767349 -4641136 -9592053 -11883904 -9268720 -4251269 -1270141
39580 -1270141 -977925 -239776 2027725 2817126 363035 -2200576 -1350953 1529153 2748405
$$ packed form
39639b322616L660182J854080j449343k962766j590730N62436J348163J339827
39631D39233K034661K681415J254113j890186l785255k710811l63862O39470N7217
39622a644005k74801O53213J609156R17538r52659j624281l7900J677958R79706
39613A303925j165716j358340J116568K828828J005924k463318l642669j550840
39605c925638J382036K690288J849258k01918j742159j195635J048942K470623
39597B375797J486263k63127k92763J081930J445826m3972j718888j943622r88856
39588A138588m07421j498516l873787m950917k291851K615184N017451K981128
39580a270141K92216P38149K267501P89401k454091k563611Q49623K880106J219252
$$ plain form
39571 2748405 1981794 1554085 1670502 683740 -554192 777651 3999593 4296605 -644086
39562 -644086 -6641890 -7967548 -4057388 877452 3245236 2838464 1274861 -74334
39554 -74334 -657101 -655586 -617271 -815219 -1238067 -2159928 -3699689 -4604034 -2930699 1198861
39544 1198861 4761461 4892125 1935917 -1536578 -3780485 -4674817 -4359899 -2869999 -1064224
39535 -1064224 -439960 -1615635 -3822311 -5979991 -7391916 -7334501 -5151605 -1355397 2244475
39526 2244475 4342174 5508412 6850241 7778024 6582422 3492111 1442777 2372593
39518 2372593 3872220 1801746 -3762704 -7663039 -5886453 -670990 2440923 1232566
39510 1232566 -1749755 -3536410 -3869346 -3861577 -3834188 -3322551 -1849331 784960 3896842
$$ packed form
39571B748405p66611m27709J16417r86762j237932J331843L221942K97012m940691
39562f44086n997804j325658L910160M934840K367784m06772j563603j349195
39554g4334n82767J515L8315j97948m22848r21861j539761r04345J673335M129560
39544A198861L562600J30664k956208l472495k243907q94332L14918J489900J805775
39535a064224O24264j175675k206676k157680j411925N7415K182896L796208L599872
39526B244475K097699J166238J341829R27783j195602l090311k049334R29816
39518B372593J499627k070474n564450l900335J776586N215463L111913j208357
39510A232566k982321j786655l32936P769K7389N11637J473220K634291L111882
$$ plain form
39501 3896842 5760358 5560257 5059345 6038273 6386581 2141528 -5697639 -10168977 -6670513
39492 -6670513 638679 4047458 1834541 -1186267 -1483420 -899283 -2575451 -6449906
39484 -6449906 -10137747 -11712237 -10231450 -5538956 923179 6342391 8666834 7731313
39476 7731313 4198976 -897766 -5206151 -5911690 -2840968 984774 3155419 4519006
39468 4519006 6552218 7975627 6369780 2133274 -1645125 -2974924 -2563592 -1816292
39460 -1816292 -1309329 -1390039 -2286509 -3072758 -2196811 284795 2392716 2743826 2008710
39451 2008710 1245740 352936 -821803 -1343512 -641358 17246 -802426 -2250189 -2169083
39442 -2169083 -232614 1586695 1692529 453122 -997835 -1886509 -1299301 1679857 6235657
$$ packed form
39501C896842J863516k00101n00912R78928L48308m245053p839167m471338L498464
39492f670513P309192L408779k212917l020808k97153N84137j676168l874455
39484f449906l687841j574490J480787M692494O462135N419212K324443r35521
39476G731313l532337n096742m308385p05539L070722L825742K170645J363587
39468D519006K033212J423409j605847m236506l778399j329799M11332P47300
39460a816292N06963q0710q96470p86249Q75947K481606K107921L51110p35116
39451B008710p62970q92804j174739n21709P02154O58604q19672j447763Q1106
39442b169083J936469J819309J05834j239407j450957q88674N87208K979158M555800
$$ plain form
39433 6235657 9485619 9229355 6377133 3546050 1859684 389536 -1559562 -3006347
39425 -3006347 -2517347 -162632 2149862 2226481 -334059 -3509263 -4789956 -3887277 -2668271
39416 -2668271 -2170073 -1182754 1155480 2933511 1599991 -2426840 -6456711 -9153861
39408 -9153861 -10951463 -11297979 -8762953 -4470951 -2088427 -2803636 -3217030 -343784 3891169
39399 3891169 5808313 5316124 4745835 4039789 1176934 -3058228 -4800999 -2345703 1567058
39390 1567058 3647882 3383621 1516592 -1701508 -5050711 -5896333 -3484873 -660327
39382 -660327 -62629 -481584 515790 2083502 1443935 -1162182 -2336023 -470141 2251284
39373 2251284 3510149 3702790 3879091 3367726 1475775 -170330 635495 3315930 4982359
$$ packed form
39433F235657L249962k56264k852222k831083j686366j470148j949098j446785
39425c006347M89000K354715K312494P6619k560540l175204j280693R02679J219006
39416b668271M98198R87319K338234J778031j333520m026831m029871k697150
39408i153861j797602l46516K535026M292002K382524p15209m13394K873246M234953
39399C891169J917144m92189n70289p06046k862855m235162j742771K455296L912761
39390A567058K080824k64261j867029l218100l349203q45622K411460K824546
39382f60327N97698m18955R97374J567712o39567k606117j173841J865882K721425
39373B251284J258865J92641J76301n11365j891951j646105Q05825K680435J666429
$$ plain form
39364 4982359 4115607 2036608 621343 161605 -83760 -606236 -1591189 -3008719 -4008821
39355 -4008821 -3326904 -1319663 -568553 -2939819 -6638101 -7966768 -5902188 -2986365
39347 -2986365 -1325368 124213 3060443 6532598 8140173 7425891 5906479 4295436
39339 4295436 1972118 -823356 -2541569 -2616547 -2296262 -2464963 -2393641 -1521641 -714424
39330 -714424 -525903 186143 2318061 4432231 4416970 2501054 923118 1022989 2106114
39321 2106114 2761111 1904698 -936013 -4712975 -6610550 -4621072 -389997 2345521
39313 2345521 2322429 1805183 2709366 3990774 4050628 3546347 3826075 4184296 3223628 2087161
39303 2087161 3401638 6854259 8730536 7002270 4351742 4201029 5788539 5922321
$$ packed form
39364D982359q66752k078999j415265m59738k45365n22476r84953j417530j000102
39355d008821O81917K007241P51110k371266l698282j328667K064580K915823
39347b986365J660997J449581K936230L472155J607575p14282j519412j611043
39339D295436k323318k795474j718213p4978L20285j68701P1322Q72000Q07217
39330g14424J88521P12046K131918K114170j5261j915916j577936R9871J083125
39321B106114O54997q56413k840711l776962j897575J989478M231075K735518
39313B345521k3092n17246R04183J281408N9854n04281K79728L58221r60668j136467
39303B087161J314477L452621J876277j728266k650528j50713J587510J33782
$$ plain form
39295 5922321 4283103 3483613 4036603 3122247 -446672 -3687161 -4218508 -4325775 -6764996
39286 -6764996 -9095813 -6958401 -1835982 -145512 -4045662 -8344886 -8347533 -5874120 -4499047
39277 -4499047 -3289699 246805 4154779 4271036 1060023 -801586 644424 2635188
39269 2635188 2879978 2477751 2658283 2407867 929229 -529971 -895169 -804111 -563049
39260 -563049 911077 3523078 4737311 2806653 -536652 -2397021 -2195154 -1232531 -263225
39251 -263225 802817 1922086 3150093 4910274 6882989 7687821 6696592 5048870 4034187
39242 4034187 3766768 4098163 5045546 5488350 3668294 328360 -967219 1479006 4592838
39233 4592838 4472051 1355376 -1635715 -2880395 -2828433 -1945445 -1040356 -2213424 -6262582
$$ packed form
39295E922321j639218p99490N52990r14356l568919l240489n31347j07267k439221
39286f764996k330817K137412N122419J690470l900150m299224k647K473413J375073
39277d499047J209348L536504L907974J16257l211013j861609J446010J990764
39269B635188K44790m02227J80532k50416j478638j459200l65198R1058K41062
39260e63049J474126K612001J214233j930658l343305j860369K01867R62623R69306
39251b63225J066042J119269J228007J760181J972715Q04832r91229j647722j014683
39242D034187k67419L31395R47383M42804j820056l339934j295579K446225L113832
39233D592838j20787l116675k991091j244680N1962Q82988R05089j173068m049158
$$ plain form
39224 -6262582 -10130030 -10124917 -6911673 -4117020 -2866862 -1456018 57849 -646778 -3395527
39215 -3395527 -4417893 -1623837 2318836 3917896 3041388 1485438 106804 -646976
39207 -646976 146495 1948467 2026277 -892685 -3913943 -3498895 -465165 1185040 -282874
39198 -282874 -2709991 -3767139 -3776225 -4086283 -4522798 -3794929 -1664034 511226 1478247
39189 1478247 1615247 2208886 3459152 4088866 3283513 2078874 1951938 2777594 3273423
39180 3273423 2821466 1636927 -143887 -2078483 -2900815 -2155665 -1566224 -2713538 -4267342
39171 -4267342 -4151235 -3523134 -5037924 -7536299 -6852834 -2623517 353708 -645602 -2232372
39162 -2232372 -930233 1037775 19931 -2405810 -1957903 1206451 2935316 1836265
$$ packed form
39224f262582l867448N113L213244K794653J250158J410844J513867p04627k748749
39215c395527j022366K794056L942673J599060q76508j555950j378634p53780
39207f46976P93471J801972P7810k918962l021258M15048L033730J650205j467914
39198b82874k427117j057148r086l10058m36515P27869K130895K175260R67021
39189A478247J37000N93639J250266O29714q05353j204639j26936Q25656M95829
39180C273423m51957j184539j780814j934596q22332P45150N89441j147314j553804
39171d267342J16107O28101j514790k498375O83465M229317K977225r99310j586770
39162b232372J302139J968008j017844k425741M47907L164354J728865j099051
$$ plain form
39154 1836265 805752 1701728 2846688 2821665 3077743 5005106 6842530 5437023 140992
39145 140992 -6008109 -8678166 -6036343 -773827 2364555 1761312 342524 975233 2656292
39136 2656292 3077553 2502439 2280622 1753679 162197 -337269 2209945 4931395 3484630
39127 3484630 -774191 -2260360 280771 2300223 1308622 367495 1812838 3138349
39119 3138349 2173040 1373623 3134213 4977017 3715853 1166439 1298736 4140697 6692798
39110 6692798 7808576 7999817 6258083 1601906 -3304812 -4485382 -2169063 -41460
39102 -41460 725063 2719698 7284166 11901650 13488250 11595918 7771042 4118560 2755716
39093 2755716 4224575 6133392 5634084 3312362 2267775 3475529 4802793 4641031
$$ packed form
39154A836265j030513Q95976J144960k5023K56078J927363J837424j405507n296031
39145A40992o149101k670057K641823N262516L138382o03243j418788O32709J681059
39136B656292M21261n75114k21817n26943j591482m99466K547214K721450j446765
39127C484630m258821j486169K541131K019452r91601r41127J445343J325511
39119C138349r65309p99417J760590J842804j261164k549414J32297K841961K552101
39110F692798J115778J91241j741734m656177m906718j180570K316319K127603
39102d1460P66523J994635M564468M617484J586600j892332l824876l652482j362844
39093B755716J468859J908817m99308k321722j044587J207754J327264j61762
$$ plain form
39085 4641031 3459090 1400527 -2348218 -6800025 -8886814 -7422498 -4798988 -3371188
39077 -3371188 -2669770 -1632962 -929021 -1128342 -956747 411992 1356107 402362 -1010578
39068 -1010578 -846235 53965 -476015 -2149375 -2885801 -2387479 -2046937 -1729299 162486
39059 162486 3191340 4574327 3321259 2022517 3083135 5259568 5515510 2685666
39051 2685666 -2180249 -7429220 -10880844 -9869224 -3940537 2980749 5817356 4074191
39043 4074191 2069553 2880474 4577984 3942331 1576395 687752 2037237 3170900 2572748
39034 2572748 1598061 1469803 1066306 -671709 -2324023 -2209639 -1469430 -2285823 -3871146
39025 -3871146 -3215795 47896 2487876 1741446 134969 1449576 5491597 8174045
$$ packed form
39085D641031j181941k058563l748745m451807k086789J464316K623510J427800
39077c371188P01418J036808P03941j99321J71595J368739R44115r53745j412940
39068a010578J64343R00200n29980j673360p36426M98322L40542L17638J891785
39059A62486L028854J382987j253068j298742J060618K176433K55942k829844
39051B685666m865915n248971l451624J011620N928687O921286K836607j743165
39043D074191k004638Q10921J697510o35653k365936q88643J349485J133663n98152
39034B572748r74687j28258m03497j738015j652314J14384P40209q16393j585323
39025c871146O55351L263691K439980p46430j606477J314607M042021K682448
$$ plain form
39017 8174045 6702326 2755005 103103 420483 2200068 3001659 1823279 -567379
39009 -567379 -2785710 -3870075 -3524600 -1995316 -42518 1196236 825391 -988228 -2861690
39000 -2861690 -3234886 -1919456 -449608 -292973 -690807 711678 4480275 7799529 7677789
38991 7677789 4927807 2944360 2812946 2119999 -895765 -4644448 -6902075 -7761376 -8002493
38982 -8002493 -6841375 -3965872 -2031064 -3782403 -7436913 -8225405 -4584276 55479
38974 55479 1993508 1191415 20949 541750 3646189 8522985 12085659 11147714 6337992
38965 6337992 2120460 1932341 4838258 7669762 8640706 7945161 6558788 5577974 5429306
38956 5429306 5038916 3130771 534697 -710975 -633744 -1052326 -1631396 348118 4830735
$$ packed form
39017H174045j471719l947321k651902L17380J779585Q01591j178380k390658
39009e67379k218331j084365L45475J529284J952798J238754l70845j813619j873462
39000b861690l73196J315430J469848J56635l97834J402485L768597L319254j21740
38991G677789k749982j983447j31414o92947l015764l748683k257627q59301k41117
38982h002493J161118K875503J934808j751339l654510p88492L641129M639755
38974E5479J938029q02093j170466N20801L104439M876796L562674r37945m809722
38965F337992m217532j88119K905917K831504R70944o95545j386373r80814j48668
38956E429306l90390j908145k596074j245672P7231m18582n79070J979514M482617
$$ plain form
38947 4830735 7141111 3919241 -1869056 -4850918 -3988061 -2253629 -1372594 -366817
38939 -366817 1609300 4120550 6610605 8190263 7140781 3257242 -263245 -158236
38931 -158236 2450559 3897064 3450140 3537780 4893648 5253130 3365820 919941 -403368
38922 -403368 -883898 -981844 -469011 -194750 -1769833 -4348944 -4671577 -1806948 1002578
38913 1002578 1135301 480470 1997899 4641341 4888533 2131261 -671991 -1524240 -1683606
38904 -1683606 -2700061 -3389912 -1421075 2887245 6013157 5070006 1437989 -526815
38896 -526815 1606160 5965178 9277288 10480605 10267884 8840634 6343260 4292767
38888 4292767 3912752 3833447 2277861 739371 1926447 4424587 3811199 -204712 -2451397
$$ packed form
38947D830735K310376l221870n788297k981862Q62857J734432Q81035J005777
38939c66817J976117K511250K490055J579658j049482l883539l520487J05009
38931a58236K608795J446505m46924Q7640J355868L59482j887310k445879j323309
38922d03368m80530r7946N12833K74261j575083k579111l22633K864629K809526
38913A002578J32723o54831J517429K643442K47192k757272k803252q52249j59366
38904a683606j016455o89851J968837M308320L125912r43151l632017j964804
38896e26815K132975M359018L312110J203317k12721j427250k497374k050493
38888D292767l80015p9305j555586j538490J187076K498140o13388m015911k246685
$$ plain form
38879 -2451397 29728 3519477 3747383 2276886 2725325 4033765 2560403 -1152779
38871 -1152779 -3016452 -2063399 -1451947 -2616047 -3152620 -1641706 -301356 -818884 -912437
38862 -912437 2329427 7788349 11437077 10941926 7324958 3014215 -55738 -986230 -173342
38853 -173342 813467 401163 -1685994 -4331101 -6089754 -6551050 -6913746 -8594071 -10621405
38844 -10621405 -9503626 -3347159 4520866 8307262 6327243 2637450 1475216 2423156
38836 2423156 2649300 1978003 3124905 7317356 11974422 13454633 10926562 6776433
38828 6776433 3813934 2831805 2766367 2481883 1852232 1361787 1444332 2448373 4501685
38819 4501685 6871424 8096653 7449955 5733545 3969565 2095530 -15755 -1110787
$$ packed form
38879b451397K481125L489749K27906j470497M48439J308440j473362l713182
38871a152779j863673R53053O11452j164100n36573J510914J340350n17528r3553
38862i12437L241864N458922L648728m95151l616968m310743l069953r30492Q12888
38853a73342R86809m12304k087157k645107j758653m61296l62696j680325k027334
38844a0621405J117779O156467P868025L786396j980019l689793j162234R47940
38836B423156K26144o71297J146902M192451M657066J480211k528071m150129
38828F776433k962499r82129o5438k84484o29651m90445Q2545J004041K053312
38819D501685K369739J225229o46698j716410j763980j874035k111285j095032
$$ plain form
38811 -1110787 210198 3121121 5136917 5118234 4144241 3279444 2263825 955275 310441
38802 310441 910050 1859280 2255650 2620555 3679177 4670691 4277515 2724533 1616030
38793 1616030 1814994 2587564 2933971 2840730 2838682 2887210 2302625 871019 -371530 -50071
38783 -50071 1806324 3735137 5005216 6725729 9599390 11586007 9958048 5547565
38775 5547565 2536183 3254579 5352693 5489506 3968733 3708787 5707794 7753454 7559177
38766 7559177 5597031 4507705 6408588 10628728 13648582 12040780 6348225 1280089
38758 1280089 958483 4641796 8273861 9338504 8503888 7168466 5662334 4099844
38750 4099844 3002464 2289620 1023833 -1160892 -3486804 -5306005 -6659580 -7119849
$$ packed form
38811a110787J320985K910923K015796j8683r73993q64797j015619j308550o44834
38802C10441N99609R49230L96370L64905J058622R91514l93176j552982j108503
38793A616030J98964P72570L46407r3241k048M8528n84585j431606j242549L21459
38783e0071J856395J928813J270079J720513K873661J986617j627959m410483
38775E547565l011382P18396K098114J36813j520773k59946J999007K045660j94277
38766G559177j962146j089326J900883M220140L019854j607802n692555n068136
38758A280089l21606L683313L632065J064643q34616j335422j506132j562490
38750D099844j097380p12844j265787k184725k325912j819201j353575m60269
$$ plain form
38742 -7119849 -5703520 -2919864 -1331722 -2468943 -4227231 -3206084 828536 4644001
38734 4644001 5605940 4204034 2226117 364773 -1302150 -2028216 -1280719 -122321 -16713
38725 -16713 -552878 -12554 1772438 2879838 2106354 612673 -197315 -823137 -2166952
38716 -2166952 -3227009 -2451508 -753324 -744291 -2813919 -4271867 -3120063 -617437 1057225
38707 1057225 1872504 3092569 4750122 5793256 5864630 5165054 3249205 -79284 -2990465
38698 -2990465 -2863148 297702 3311903 3322897 695954 -2028293 -2966883 -2166477 -1010705
38689 -1010705 -915566 -1934140 -2439501 -1031125 1252246 2014181 1133909 1506100 4911391
38680 4911391 8671318 8456422 3837034 -1056181 -2550140 -1220273 -657 -222741
$$ packed form
38742g119849J416329K783656J588142j137221j758288J021147M034620L815465
38734D644001R61939j401906j977917j861344j666923p26066P47497J158398J05608
38725a6713n36165N40324J784992J107400p73484j493681q09988o25822j343815
38716b166952j060057P75501J698184R033k069628j457948J151804K502626J674662
38707A057225Q15279J220065J657553J043134P1374o99576j915849l328489k911181
38698b990465J27317L160850L014201J0994k626943k724247r38590Q00406J155772
38689a010705R5139j018574n05361J408376K283371P61935q80272L72191L405291
38680D911391L759927k14896m619388m893215j493959J329867J219616k22084
$$ plain form
38672 -222741 -948237 -1182871 -879595 111796 2197811 4389275 4042602 -148247 -5528801
38663 -5528801 -7608243 -4968213 -620106 1834551 1767878 522403 -1213775 -3160574
38655 -3160574 -3864394 -1940979 1227821 2365742 332391 -2639900 -4202424 -4253735 -3236116
$$ packed form
38672b22741p25496k34634L03276R91391K086015K191464l46673m190849n380554
38663e528801k079442K640030M348107K454657o6673j245475j736178j946799
38655c160574p03820J923415L168800J137921k033351k972291j562524n1311J017619
$$ [...]
##END NTUPLES=NMR SPECTRUM
##END=
