##TITLE=31Pdec_PhPA1609
 CDCl3, 24 sc
 17.9.2019
##JCAMPDX= 6.0         $$ Bruker NMR JCAMP-DX V2.0
##DATA TYPE= NMR SPECTRUM
##DATA CLASS= NTUPLES
##ORIGIN= UXNMR, Bruker Analytische Messtechnik GmbH
##OWNER= root
$$ XWIN-NMR		Version 3.5
$$ Tue Sep 17 14:27:06 2019 Russian Standard Time (UT+4h)  she@DPX200
##.OBSERVE FREQUENCY= 81.013821
##.OBSERVE NUCLEUS= ^31P
##.ACQUISITION MODE= SIMULTANEOUS
##.ACQUISITION SCHEME= undefined
##.AVERAGES= 24
##.DIGITISER RES= 17
##SPECTROMETER/DATA SYSTEM= spect
##.PULSE SEQUENCE= zgpg30
##.SOLVENT NAME= CDCl3
##.SHIFT REFERENCE= (INTERNAL, CDCl3, 0, 182.463)
##AUDIT TRAIL= $$ (NUMBER, WHEN, WHO, WHERE, WHAT)
$$ ##TITLE= Audit trail, XWIN-NMR		Version 3.5
$$ ##JCAMPDX= 5.01
$$ ##ORIGIN= Bruker BioSpin GmbH
$$ ##OWNER= she
$$ F:/spectra/data/she/nmr/P31/1/pdata/1/auditp.txt
$$ ##AUDIT TRAIL=  $$ (NUMBER, WHEN, WHO, WHERE, WHAT)
(   1,<2019-09-17 14:26:24.32 +0400>,<she>,<DPX200>,
      <created by zg, POWCHK disabled, PULCHK disabled
       configuration hash MD5:
       00 E9 B6 7A A2 85 ED C7 34 08 36 98 17 FE 4E 26
       data hash MD5: 32K
       18 B3 1A 7B A8 90 4A EF 99 D4 82 70 32 04 F0 D3>)
(   2,<2019-09-17 14:26:27.25 +0400>,<she>,<DPX200>,
      <Start of raw data processing
       efp BC_mod = 2 LB = 1 FT_mod = 6 PKNL = 1 PHC0 = -399.1301 PHC1 = 107.2003 SI = 64K 
       data hash MD5: 64K
       86 F1 AE 8C 76 35 95 87 AE E7 40 C9 21 9E E6 05>)
(   3,<2019-09-17 14:26:41.40 +0400>,<she>,<DPX200>,
      <pk PHC0 = 2.706969 PHC1 = 0 
       data hash MD5: 64K
       05 4F 41 82 6F 22 C1 D3 36 47 E8 7F 9F 5D 26 C0>)
(   4,<2019-09-17 14:26:44.64 +0400>,<she>,<DPX200>,
      <abs ABSG = 5 
       data hash MD5: 64K
       F2 1D 36 1A AF 1D 6A 6B 6C 01 AA F4 E1 49 07 87>)
$$ ##END=
$$ 
$$ hash MD5
$$ 5D 90 7B C8 F0 51 BF 2A 5B C1 5A 4E 70 67 D4 E3
##$RELAX= 
##$RELAX= 
##$RELAX= 
##$RELAX= 
##$RELAX= 
##$RELAX= 
##$RELAX= 
##$RELAX= 
$$ Bruker specific parameters
$$ --------------------------
##$DU= <F:/spectra>
##$EXPNO= 1
##$NAME= <P31>
##$PROCNO= 1
##$TYPE= <nmr>
##$USER= <she>
##$AMP= (0..31)
100 100 100 100 100 100 100 100 100 100 100 100 100 100 100 100 100 100 
100 100 100 100 100 100 100 100 100 100 100 100 100 100 
##$AQSEQ= 0
##$AQ_mod= 1
##$AUNM= <au_zg>
##$AUTOPOS= <>
##$BF1= 81.014009
##$BF2= 200.13
##$BF3= 200.13
##$BF4= 200.13
##$BF5= 200.13
##$BF6= 200.13
##$BF7= 200.13
##$BF8= 200.13
##$BYTORDA= 1
##$CFDGTYP= 0
##$CFRGTYP= 5
##$CHEMSTR= <none>
##$CNST= (0..31)
1 1 145 1 1 1 1 1 1 1 1 1 1 1 1 1 1 1 1 1 1 1 1 1 1 1 1 1 1 1 1 1 
##$CPDPRG= <waltz16>
##$CPDPRG1= <>
##$CPDPRG2= <waltz16>
##$CPDPRG3= <>
##$CPDPRG4= <mlev>
##$CPDPRG5= <mlev>
##$CPDPRG6= <mlev>
##$CPDPRG7= <mlev>
##$CPDPRG8= <mlev>
##$CPDPRGB= <>
##$CPDPRGT= <>
##$D= (0..31)
0 1 0 0 0 0 0 0 0 0 0 0.03 2e-05 3e-06 0 0 0 0 0 0 0 0 0 0 0 0 0 0 0 0 
0 0 
##$DATE= 1568715983
##$DBL= (0..7)
120 120 120 11 120 120 24 19 
##$DBP= (0..7)
150 150 150 150 150 150 150 150 
##$DBP07= 0
##$DBPNAM0= <>
##$DBPNAM1= <>
##$DBPNAM2= <>
$$ [...]
##$SUBNAM3= <"">
##$SUBNAM4= <"">
##$SUBNAM5= <"">
##$SUBNAM6= <"">
##$SUBNAM7= <"">
##$SUBNAM8= <"">
##$SUBNAM9= <"">
##$SW= 369.568048894756
##$SWIBOX= (0..15)
0 1 3 0 0 0 0 0 0 0 0 0 0 0 0 0 
##$SW_h= 29940.119760479
##$TD= 32768
##$TD0= 1
##$TE= 0
##$TE2= 300
##$TE3= 300
##$TEG= 300
##$TL= (0..7)
0 120 53 12 22 120 120 120 
##$TP= (0..7)
150 150 150 150 150 150 150 150 
##$TP07= 0
##$TPNAME0= <>
##$TPNAME1= <>
##$TPNAME2= <>
##$TPNAME3= <>
##$TPNAME4= <>
##$TPNAME5= <>
##$TPNAME6= <>
##$TPNAME7= <>
##$TPOAL= (0..7)
0.5 0.5 0.5 0.5 0.5 0.5 0.5 0.5 
##$TPOFFS= (0..7)
0 0 0 0 0 0 0 0 
##$TUNHIN= 0
##$TUNHOUT= 0
##$TUNXOUT= 0
##$USERA1= <user>
##$USERA2= <user>
##$USERA3= <user>
##$USERA4= <user>
##$USERA5= <user>
##$V9= 5
##$VALIST= <valist>
##$VCLIST= <CCCCCCCCCCCCCCC>
##$VD= 0
##$VDLIST= <DDDDDDDDDDDDDDD>
##$VPLIST= <PPPPPPPPPPPPPPP>
##$VTLIST= <TTTTTTTTTTTTTTT>
##$WBST= 1024
##$WBSW= 4
##$XGAIN= (0..3)
0 0 0 0 
##$XL= 0
##$YL= 0
##$YMAX_a= 15294
##$YMIN_a= -16834
##$ZGOPTNS= <>
##$ZL1= 120
##$ZL2= 120
##$ZL3= 120
##$ZL4= 120
##$ABSF1= 182.463
##$ABSF2= -187.1042
##$ABSG= 5
##$ABSL= 3
##$ALPHA= 0
##$AQORDER= 0
##$ASSFAC= 0
##$ASSFACI= 0
##$ASSFACX= 0
##$ASSWID= 0
##$AUNMP= <proc_1d>
##$AZFE= 0.1
##$AZFW= 0.5
##$BCFW= 0
##$BC_mod= 2
##$BYTORDP= 0
##$COROFFS= 0
##$CY= -3
##$DATMOD= 1
##$DC= 0
##$DFILT= <>
##$DTYPP= 0
##$F1P= 0
##$F2P= 0
##$FCOR= 1
##$FTSIZE= 65536
##$FT_mod= 6
##$GAMMA= 0
##$GB= 0
##$INTBC= 1
##$INTSCL= 5.30512e-09
##$ISEN= 30
##$LB= 1
##$LEV0= 0
##$LPBIN= 0
##$MAXI= 10000
##$MC2= 0
##$MEAN= 0
##$ME_mod= 0
##$MI= 50
##$NCOEF= 0
##$NC_proc= -8
##$NLEV= 6
##$NOISF1= 182.463
##$NOISF2= 159.3651
##$NSP= 0
##$NTH_PI= 0
##$NZP= 0
##$OFFSET= 182.463
##$PC= 4
##$PHC0= -396.4231
##$PHC1= 107.2003
##$PH_mod= 1
##$PKNL= yes
##$PPARMOD= 0
##$PSCAL= 0
##$PSIGN= 0
##$REVERSE= no
##$SF= 81.0140089999434
##$SI= 65536
##$SIGF1= 159.3651
##$SIGF2= -187.1042
##$SINO= 113.3802
##$SIOLD= 16384
##$SREGLST= <1H.CDCl3>
##$SSB= 0
##$STSI= 65536
##$STSR= 0
##$SW_p= 29940.119760479
##$SYMM= 0
##$S_DEV= 0
##$TDeff= 32768
##$TDoff= 0
##$TI= <>
##$TILT= no
##$TM1= 0
##$TM2= 0
##$TOPLEV= 0
##$USERP1= <user>
##$USERP2= <user>
##$USERP3= <user>
##$USERP4= <user>
##$USERP5= <user>
##$WDW= 1
##$XDIM= 65536
##$YMAX_p= 309022325
##$YMIN_p= -37517385
$$ End of Bruker specific parameters
$$ ---------------------------------
##NTUPLES= NMR SPECTRUM
##VAR_NAME=  FREQUENCY,     SPECTRUM/REAL,   SPECTRUM/IMAG
##SYMBOL=    X,             R,               I
##VAR_TYPE=  INDEPENDENT,   DEPENDENT,       DEPENDENT
##VAR_FORM=  AFFN,          ASDF,            ASDF
##VAR_DIM=   65536,         65536,           65536
##UNITS=     HZ,            ARBITRARY UNITS, ARBITRARY UNITS
##FACTOR=    0.456856943014862, 1,           1
##FIRST=     14782.0589164792, 0,            0
##LAST=      -15158.0608439998, 0,           0
##MIN=       -15158.0608439998, -37517385,   0
##MAX=       14782.0589164792, 309022325,    0
$$ Real data points
##PAGE= N=1
##DATA TABLE= (X++(R..R)), XYDATA
$$ [...]
44102F428125j790723l235482K272296O065517K664777l902399p922665q685308
44094h105862p403621l634014K092946O205581N795802K173519j035704j413744
44086e325097J401224N796368Q116890N254392j225535n854783n538066k753734
44078a28341j158245q44422j84946M26489K0943J41903K366646L989160J127601
44069E756788l806855l420150L709271Q753826L707786p125996j2402127q375048
44061a3202505j997217J42224p07051o06425O11895J357387J964165K449717N13677
44052i474133l845044n031725J563413J1571512J5469984R806240K54436n996588
44044A4318095o638129l383216O87864K242821j9225l267922l600326j233652
$$ plain form
44102 6428125 4637402 1401920 3674216 9739733 12404510 8502111 579446 -8105862
44094 -8105862 -15509483 -19143497 -17050551 -10844970 -5049168 -2875649 -3911353 -5325097
44086 -5325097 -3923873 1872495 9989385 15243777 14018242 8163459 2625393 -128341
44078 -128341 -1286586 -2131008 -2315954 -1889465 -1868522 -1726619 640027 4629187 5756788
44069 5756788 1949933 -1470217 2239054 10992880 14700666 7574670 -4827457 -13202505
44061 -13202505 -15199722 -15057498 -15764549 -16370974 -15759079 -14401692 -12437527 -9987810 -9474133
44052 -9474133 -13319177 -18350902 -16787489 -5215977 10254007 20060247 20314683 14318095
44044 14318095 7679966 4296750 4984614 7227435 7208210 3940288 339962 -893690
44036h93690N45556J056345K447403M239080K999832j091361k760253M38281L493418
44027A0474611J200916l727528m597702l97096L452581L024844p0488k678566
44019F681572l956959m065764k374252Q52318K949877J545600j725538k396071
44011b489217J170192M875719L561908j952163n317104l170349n238j396240m860303
44002i582795k742737N935981J2317307Q845308r19220p287107o158763j680436
43994a272462Q54094M24302q60386o56245K088817N805564O473919J631490n751747
43985H737346r791274q094584l325012J289436M767348O293225M228436n46873
43977C558048l195894j79313N166779N518221j527782r599099r946441j152553
$$ plain form
44036 -893690 -348134 708211 3155614 7394694 10394526 9303165 6542912 6981193 10474611
44027 10474611 11675527 7947999 3350297 2953201 6405782 9430626 9360138 6681572
44019 6681572 2724613 -1341151 -3715403 -2863085 86792 1632392 -93146 -2489217
44011 -2489217 -1319025 3556694 7118602 5166439 -150665 -3321014 -3326252 -4722492 -9582795
44002 -9582795 -12325532 -6389551 5927756 14773064 13853844 6566737 407974 -1272462
43994 -1272462 -418368 5934 -854452 -1510697 578120 6383684 12857603 14489093 8737346
43985 8737346 -1053928 -9148512 -12473524 -11184088 -6416740 -123515 4104921 3558048
43977 3558048 362154 182841 5349620 10867841 9340059 -259040 -10205481 -11358034
43969a1358034Q676607J0259771L475952k526715r44901L501497J299307p097437
43961E286047j0226493j971136Q261161Q253635M44490k812719J175136K325000
43953A0735121m239562r248408m434413L643028M275869l56501k07784M909909
43945E077259N186525k103648p346799l326416M384401O271566J132254n000736
43937D274406p040247m184187R53809L905414K396411k11366N54152L003364K451800
43928F103556M25917K081302M658489k50109j0525509j2292735p69312R924315
43920f44086O714395l479325n819277M47426M816040L637909J833209P58344k328612
43911E936023n107150k920937J030762J03326k878167L67894P565393P309819
$$ plain form
43969 -11358034 -2681427 7578344 11054296 8527581 7582680 11084177 12383484 5286047
43961 5286047 -4940446 -6911582 1349579 9603214 10047704 7234985 8410121 10735121
43953 10735121 6495559 -2752849 -7187262 -3544234 731635 375134 167350 5077259
43945 5077259 10263784 8160136 813337 -2513079 1871322 8142888 9275142 4274406
43937 4274406 -2765841 -6950028 -5996219 -2090805 305606 94240 648392 3651756 6103556
43928 6103556 6529473 8610775 13269264 13019155 2493646 -9799089 -10568401 -644086
43920 -644086 6070309 2590984 -3228293 -2780867 2035173 5673082 7506291 8264635 5936023
43911 5936023 828873 -2092064 -1061302 -957976 -3836143 -3468249 4097144 11406963
43903A1406963k410818j0183320q380407k386278R30004K616160M897254N155013
43895A644571J989298p99029o42413N42880K164549N852920Q445451L787753n370519
43886A7615461p795658o74784M418370j326719j0568901j1177015k890472N406193
43878f993525Q610806P786651M548997J48628l136810m592742n840989o521330
43870e990314m183576j49358J360025J521720N540708J0795398P408809m775692
43862A1527720j1614511m395085O681113P707716J67964n184998n223237m289140
43854d622458l425968n35251K709774K891306N72779j992733m165359l624077
43846a2191987K754264J0247702Q523348j725434o368985L56256N492596p69553
$$ plain form
43903 11406963 8996145 -1187175 -9567582 -11953860 -11023856 -8407696 -3510442 1644571
43895 1644571 3633869 2834840 2192427 2735307 4899856 10752776 19198227 22985980 17615461
43886 17615461 9819803 9145019 13563389 12236670 1667769 -9509246 -12399718 -6993525
43878 -6993525 1617281 9403932 13952929 14101557 10964747 6372005 531016 -5990314
43870 -5990314 -10173890 -10323248 -8963223 -7441503 -1900795 8894603 16303412 11527720
43862 11527720 -86791 -4481876 2199237 9906953 10074917 4889919 -333318 -4622458
43854 -4622458 -8048426 -8583677 -5873903 -2982597 -2409818 -4402551 -8567910 -12191987
43846 -12191987 -9437723 809979 9333327 7607893 1238908 1595164 7087760 6318207
43838F318207p883302l892082K967690l07565p076005l064389P089315Q086222
43830B238091J559381J478742O716934L353289p317271q746996J337781O497244
43822G117195Q02140k036197M605205Q195830J155452n077186j705506J705447
43814A4762380l688332r129235m806029K250150J641672k290103m79801M200853
43806B461555M432570K468082L226619K860452k629416o400157j733214M268836
43798H955327J446345o209956p510657j981654K205814K791760L353613L446330
43790F496922P88962j009331J920288M850019J911201k807515k644845r47784
43782H557917l921704o717907r49670Q087768P196845l427503r951112o286884
$$ plain form
43838 6318207 -1565095 -5457177 -2489487 -2797052 -9873057 -12937446 -5848131 2238091
43830 2238091 3797472 5276214 11993148 15346437 8029166 -717830 619951 7117195
43822 7117195 7919335 5883138 10488343 18684173 19839625 14762439 13056933 14762380
43814 14762380 11074048 1944813 -2861216 -611066 1030606 -1259497 -1739298 2461555
43806 2461555 6894125 9362207 12588826 15449278 12819862 6419705 4686491 8955327
43798 8955327 10401672 4191716 -3318941 -5300595 -3094781 -303021 3050592 6496922
43790 6496922 7285884 6276553 8196841 13046860 14958061 12150546 9505701 8557917
43782 8557917 4636213 -2081694 -3031364 5056404 12253249 8825746 -1125366 -7412250
43774g412250j134864j503793k883268r2969L646610L830573J881311K81595k198922
43765e585977n926717p070035l011678L207638O780123O203663L149617M42559
43757a810807M87232K697087L273382N37125j777540l91612J646036J87040k374461
43748B473482j207640K254154L160999K365605M448823Q001461O543380o51099
43740B7389165o571249o430691k901716k73993O19485M23584o74851j727771j599434
43731H252529r13782o84040n54067r94305l770640o909576m476082L597960P714772
43722A262769J753406o244993n468958J374371L672767j46474l058291k919535
43714i774938k858675j143897N831605J2287886Q978632l26464k998944J583783
$$ plain form
43774 -7412250 -8547114 -10050907 -12934175 -13027144 -9380534 -5549961 -3668650 -3387055 -5585977
43765 -5585977 -11512694 -18582729 -21594407 -18386769 -11606646 -5402983 -2253366 -1810807
43757 -1810807 -1323575 1373512 4646894 5184019 3406479 3014867 4660903 4847943 2473482
43748 2473482 1265842 3519996 6680995 9046600 13495423 21496884 28040264 27389165
43740 27389165 20817916 14387225 11485509 11211516 11831001 12254585 11579734 9851963 8252529
43731 8252529 7338747 6654707 6100640 5106335 1335695 -5573881 -10049963 -6452003 1262769
43722 1262769 3016175 -3228818 -8697776 -7323405 -3650638 -3797112 -6855403 -9774938
43714 -9774938 -12633613 -13777510 -7945905 4341981 13320613 12994149 9995205 11578988
43706A1578988J167085p343207j1669415m991434K832995K206291k021862j724148
43698i964707J382357K541716L046016L978290J036170n988063q504402k491252
43690a4963875L275758J278380k519831m00791L239002J317884j805307J245596
43682i333184N855047K992556l731180l220624M218350P544655L197189j024603
43674F498206n73784R8604j877807k934725j465624j079824k559555j670650J963267
43665c601892K563679j543355l665806N33959N359511L822132j751877m129197
43657b412846k040777j54743n41699n49631J131204J814433l54974k945199k982130
43648i036362j523446j541013k689178j764848J687881M173682L952276L809722
$$ plain form
43706 11578988 12746073 5402866 -6266549 -11257983 -8424988 -6218697 -8240559 -9964707
43698 -9964707 -8582350 -6040634 -2994618 983672 2019842 -3968221 -12472623 -14963875
43690 -14963875 -11688117 -10409737 -12929568 -13330359 -10091357 -8773473 -10578780 -9333184
43682 -9333184 -3478137 -485581 -4216761 -7437385 -3219035 4325620 7522809 6498206
43674 6498206 5924422 6023026 4145219 1210494 -255130 -1334954 -3894509 -5565159 -3601892
43665 -3601892 -1038213 -2581568 -6247374 -5713415 -353904 3468228 1716351 -2412846
43657 -2412846 -4453623 -4608366 -5150065 -5699696 -4568492 -2754059 -3109033 -6054232 -9036362
43648 -9036362 -10559808 -12100821 -14789999 -16554847 -14866966 -10693284 -6741008 -2931286
43640b931286N395936N101334J70881m904448m415097r08065q78732k988482j87318
43631f545277O423142O832008j737754q513699m574335M497994Q144958N216562
43623I743599J311357j473598l860481l912803o78271R40653l025441p728439
43615h683424o203217l28574K874773K489782K816453M055001K675979o87911
43607i91138k167084k164671l845822n410288k286108L657461N580391K419013
43599e208246J7467J024899J671510j90631j441057o6570J335617N57364j011776
43590c311423j656141j290608K30075K287266J731951k903928o799115m522126
43582a6234049J224673L504749K192594K906962N871867N202276j18706l858726
$$ plain form
43640 -2931286 2464650 7565984 7736865 2832417 -1582680 -2490745 -3369477 -6357959 -6545277
43631 -6545277 -122135 6709873 4972119 -3541580 -8115915 -3617921 4527037 9743599
43623 9743599 11054956 9581358 5720877 1808074 1129803 2070456 -954985 -8683424
43615 -8683424 -14886641 -15215215 -12340442 -9850660 -7034207 -2979206 -303227 -991138
43607 -991138 -3158222 -5322893 -9168715 -14579003 -16865111 -13207650 -7627259 -5208246
43599 -5208246 -5190779 -4165880 -2494370 -2685001 -4126058 -4192628 -2857011 -2299647 -3311423
43590 -3311423 -4967564 -6258172 -6028097 -3740831 -2008880 -4912808 -11711923 -16234049
43582 -16234049 -15009376 -11504627 -9312033 -6405071 -533204 4669072 4550366 691640
43574F91640k775065n85643k5390M08351J96455l315323o706841k439069P753379
43565f797506J2189038O580536J064748L654887P663180M108596l325184o172563
43557A8965732n760622q072834j0226544m987229M540908P479129J804757k950188
43549G93109o37860L820164L849911o2130l880416n554498m468212r51053J666062
43540e424923k01630l896831k272848N877954J2452236R987790N65038q064804
43532I021982j1117641q616616k832144K202804K023024k960333n877189j637820
43524a9793933N242702O323593J541881p57685K962338N524927O46446n861421
43516d171152m129691L934519O428889o54580p268500m837736J345137K346864
$$ plain form
43574 691640 -2083425 -2669068 -2694458 -2286107 -2089652 -5404975 -12111816 -14550885 -6797506
43565 -6797506 5391532 11972068 13036816 16691703 24354883 28463479 25138295 18965732
43557 18965732 13205110 5132276 -5094268 -10081497 -5540589 1938540 3743297 793109
43549 793109 155249 3975413 7825324 7763194 3882778 -1671720 -6139932 -7090985 -5424923
43540 -5424923 -5626553 -9523384 -11796232 -5918278 6533958 16521748 17086786 9021982
43532 9021982 -2095659 -10712275 -13544419 -11341615 -9318591 -12278924 -18156113 -19793933
43524 -19793933 -14551231 -8227638 -6685757 -7443442 -4481104 1043823 1690269 -4171152
43516 -4171152 -8300843 -4366324 2062565 1407985 -5860515 -10698251 -9353114 -7006250
43508g006250M59442L574712R478075Q127224j035011o320407j237832N963270
43500A2003223N194231j843423o952499o977022l444497K845375R388322R436770
43492A9650480K08696r933213j0678696l608552J234149N45676M70419M381925
43484B270884P387363N426647J805471O23139O520l158032o397090n227548j025367
43475A711987L83298k315275l372099J724009Q696203Q780190O2379r029984r491233
43466b850525k496843L077040K579705R9795M04550J992152J475129K59834J733387
43457F274224M492269L929746m16374m177982m756805m024104l813306k904669
43449e397001m9916L059073L722500J601015q79468p94565K288528M790381K164381
$$ plain form
43508 -7006250 -6546808 -2972096 6505979 14633203 13598192 7277785 6039953 12003223
43500 12003223 17197454 15354031 8401532 1424510 -2019987 825388 10213710 19650480
43492 19650480 19859176 9925963 -752733 -4361285 -3127136 -2581460 -2111041 2270884
43484 2270884 9658247 15084894 16890365 17513504 17520024 14361992 7964902 2737354 1711987
43475 1711987 2095285 -219990 -3592089 -1868080 6828123 15608313 15670692 6640708 -2850525
43466 -2850525 -5347368 -2270328 309377 409172 813722 2805874 4281003 4540837 6274224
43457 6274224 10766493 14696239 14279865 10101883 5345078 1320974 -2492332 -5397001
43449 -5397001 -5446917 -2387844 1334656 2935671 2056203 1261638 3550166 8340547 10504928
43440A0504928m770284q708762m259164M218260P235704J854344n531597p921378
43432g377949m786425R8553L418731L460293M15132k490970j327975L256774N941164
43423F07328L499257j374625m629763n578580m568542m8473P533542J1822844
43415G262988O710878l881767q451272k223388O055611N589183j944333n294805
43407C823095O1256N664165K818070m535150n829831L58076M342902k21790p125836
43398f45043o596480J352183P594280N745173j082301m977052j886820M445320
43390C949260O165719j76748q825541j1026892n833082l11385J453416K987248
43382a1618005O492690P138580K002436k615055r90493J305517l070307q216855
$$ plain form
43440 10504928 5734644 -2974118 -7233282 -3015022 4220682 6075026 543429 -7377949
43432 -7377949 -12164374 -12065821 -8647090 -5186797 -4771665 -7262635 -8590610 -5333836 607328
43423 607328 4106585 2731960 -1897803 -7476383 -12044925 -12093398 -4559856 7262988
43415 7262988 13973866 10092099 1640827 -582561 5473050 11062233 9117900 3823095
43407 3823095 3884351 9548516 12366586 7831436 2001605 2359681 6702583 6480793 -645043
43398 -645043 -7241523 -5889340 1704940 7450113 6367812 1390760 -496060 3949260
43390 3949260 10114979 9938231 1112690 -9914202 -15747284 -16058669 -14605253 -11618005
43382 -11618005 -5125315 2013265 4015701 1400646 410153 1715670 -1354637 -9571492
43374i571492k830697R260167J1746253Q51812p750475k835453N906934M755320
43366I532369k753346m009369J486769L164322k370633p374261o470084k847138
43358a1641371k84119J456353K131357M64610o77574L230256R260857Q847293
43350A2787662J035988m619008k073827K531618J419473l015251l759671q32553
43342C474431L96356j089793j709689q75339j550992l747241l936038j257295
43334a0295600J322536K466645L598677L928880K65998o350780r434046n460515
43326a9958205J146528M718862N581287O510636O109679J369067n457802q411326
43318h391274n727290j357416J125791J600896O31801j391698j958573J518289
$$ plain form
43374 -9571492 -12402189 -3142022 8604231 9456043 1705568 -1129885 4777049 9532369
43366 9532369 6779023 2769654 4256423 7420745 5050112 -2324149 -8794233 -11641371
43358 -11641371 -11925490 -10469137 -8337780 -7873170 -8550744 -5320488 3940369 12787662
43350 12787662 13823650 9204642 7130815 9662433 11081906 8066655 4306984 3474431
43342 3474431 3870787 2780994 1071305 195966 -1355026 -5102267 -9038305 -10295600
43334 -10295600 -8973064 -6506419 -2907742 1021138 1287136 -5063644 -14497690 -19958205
43326 -19958205 -18811677 -14092815 -8511528 -2000892 4108787 5477854 20052 -8391274
43318 -8391274 -14118564 -15475980 -14350189 -12749293 -12117492 -13509190 -15467763 -13949474
43310a3949474O231793N911145J69200l651180j073805K697710J279434k649490
43302e034667k159660K321503L992837J104916n38727K398831N451115L935395
43294A1471543R2626j331286m04740m33271j717287j357095J695761M901292N287248
43285A8204791K074734l411808q449253r935949o696795j012346L201716L742096
43277b282814J291032j838467l324867k242135p9631K68782k284243n126446m238644
43268a9857433J522404Q682205J1631938P366106j291050p541639p097958k628481
43260i213908o2421q48323p50933K954393O577656N091821n0510k098690J904858
43251C503943O664502N296066j386026n404973j937639M007257M153148j646721
$$ plain form
43310 -13949474 -7717681 -1806536 -1637336 -5288516 -6362321 -3664611 -2385177 -5034667
43302 -5034667 -7194327 -4872824 -879987 224929 -313798 2085033 7536148 11471543
43294 11471543 11564169 10232883 9828143 9394872 7677585 6320490 8016251 12917543 18204791
43285 18204791 20279525 16867717 8418464 -1517485 -8214280 -9226626 -6024910 -2282814
43277 -2282814 -991782 -2830249 -6155116 -8397251 -8476882 -8208100 -10492343 -15618789 -19857433
43268 -19857433 -18335029 -9652824 1979114 9345220 8054170 512531 -6585427 -9213908
43260 -9213908 -9276329 -10124652 -10875585 -7921192 -1343536 3748285 3697775 1599085 3503943
43251 3503943 10168445 15464511 14078485 8673512 6735873 10743130 14896278 13249557
43243A3249557n480729l223588k32650j854171m204661r64875M842868M626602
43235F758353j811412n604594k816243O24794O32289J620443O301738Q202541
43227A3907909K071589n694786n936897l27321L184367L568466M959188N492366
43219B1224881j80096q549560r623882k679797J868010j168809m683391k578690
43211f371334O90995r2405j200066K288724O694206N944507J603434j293564l054382
43202E210115n696797n524037J193063Q715902Q083612Q49726l421665k243178
43194G166741k073835m750589l723324K807192O060362L09486o647326m864864
43186e716157K465212M514663l10592l102767O41533M538927K425337j805110
$$ plain form
43243 13249557 7768828 4545240 4312590 2458419 -1746242 -2711117 2131751 6758353
43235 6758353 4946941 -657653 -3473896 -2849102 -2216813 -596370 5705368 13907909
43227 13907909 15979498 10284712 4347815 4020494 7204861 10773327 15732515 21224881
43219 21224881 21044785 12495225 2871343 191546 2059556 890747 -3792644 -6371334
43211 -6371334 -5680339 -5772744 -6972810 -4684086 2010120 7954627 9558061 8264497 5210115
43202 5210115 -486682 -6010719 -4817656 3898246 11981858 12831584 9409919 7166741
43194 7166741 5092906 342317 -3381007 -573815 5486547 5796033 -851293 -5716157
43186 -5716157 -3250945 1263718 953126 -2149641 -1508108 3030819 5456156 3651046
43178C651046p55449M695323O579404J666159l863780l411458Q31679J735907
43170A1128831k000798m465589k282552L10535n75925j080028L497872Q229332
43162A2761678L979315p225163j2103363m482580N262944M973518k585864n775082
43154e194597j436469L320050L942558L090672K637587M93239k676600k019123
43146B157317K860622N094918O03519n346052o411010m276655l762174l803183
43138a2882698l86971M724757N808556K491206J28381Q50743R76615j441016k852368
43129b582795o19015K135957J692190l02658j71242J346068N82259k460313l622952
43120d002501j085146J501561J78972l466360m208867k38916M211236M206406
$$ plain form
43178 3651046 2895597 7590920 14170324 15836483 11972703 8561245 9392924 11128831
43170 11128831 9128033 4662444 2379892 2690427 2114502 1034474 4532346 12761678
43162 12761678 16740993 9515830 -2587533 -7070113 -1807169 3166349 580485 -5194597
43154 -5194597 -6631066 -3311016 631542 3722214 6359801 6853040 4176440 2157317
43146 2157317 5017939 10112857 10716376 5370324 -1040686 -5317341 -9079515 -12882698
43138 -12882698 -13269669 -8544912 -2736356 -245150 -116769 733974 1710589 269573 -2582795
43129 -2582795 -3201810 -1065853 626337 323679 152437 1498505 2080764 -379549 -4002501
43120 -4002501 -5087647 -3586086 -3407114 -6873474 -11082341 -11321257 -7110021 -2903615
43112b903615L63856k231809q35838J821913K118549P41904Q94910K810658L376890
43103F157418J266602p76854j94062J183642n46635n690955r748891q388977k580852
43094a9319564K272734K448515J13186Q1274K917626M048721R16018k195154R4901
43085h621743N712006P213556K381661k420411j383653K826467L831976Q93942
43077A0433801j287943p41146r84113m579720q075189o314173M1688M452478K217945
43068d836372l824959o537685k493067M616510Q377986O088911N14908l398480
43060a492248k840317O60342K557180J5798m163740m452421m05513J734150j948393
43051a0335162n858040j865997Q363185J4320849J0180231J304008m202471m532554
$$ plain form
43112 -2903615 -2539759 -4771568 -5607406 -3785493 -1666944 -925040 -30130 2780528 6157418
43103 6157418 7424020 6647166 6453104 7636746 7090111 1399156 -8349735 -16738712 -19319564
43094 -19319564 -17046830 -14598315 -14485129 -14403855 -11486229 -7437508 -6521490 -8716644 -8621743
43085 -8621743 -2909737 4303819 6685480 4265069 2881416 5707883 9539859 10433801
43077 10433801 9145858 8404712 7420599 2840879 -5234310 -11548483 -11506795 -7054317 -4836372
43068 -4836372 -8661331 -15199016 -17692083 -13075573 -4697587 1391324 1906232 -1492248
43060 -1492248 -4332565 -3672223 -1115043 -1099245 -5262985 -9715406 -10120919 -8386769 -10335162
43051 -10335162 -16193202 -18059199 -9696014 4624835 14805066 16109074 11906603 7374049
43043G374049k291394O39823K480426O64519l858759n412104j335243K854663
43035A115980J260121l115623l256734N60788J882123p64482j849285J286455
43027b880657M086871K668632l41526j045298p0153L82956Q06680J928902J758456
43018G294863r16615l097164j665682J474096K297712P13077l70723n17968j865960
43009C345636m230262m448486j344204K138146L130106K653163L590849O334052
43001A1169000Q014316N757765Q3823m964125n487967j970655R80326M3638k736444
42992A0889677k944829K2896K318725J253478j301693k455284k714041m194656
42984H74273n787621l738317K280398O958606N582198M13475k322302p92993R56005
$$ plain form
43043 7374049 5082655 5722478 8202904 8867423 5008664 -403440 -1738683 1115980
43035 1115980 2376101 -739522 -3996256 -3435468 -1553345 -2317827 -4167112 -2880657
43027 -2880657 1206214 3874846 3533320 2488022 2417869 2800825 3607505 5536407 7294863
43018 7294863 6378248 3281084 1615402 3089498 5387210 6100287 5729564 5211596 3345636
43009 3345636 -884626 -5333112 -6677316 -4539170 -1409064 1244099 4834948 11169000
43001 11169000 19183316 24941081 25024904 20060779 14572812 12602157 13582483 13626121 10889677
42992 10889677 7944848 7967744 10286469 11539947 10238254 7782970 5068929 874273
42984 874273 -4913348 -8651665 -6371267 587339 6169537 6583012 4260710 3467717 4423722
42975D423722J2346j448863j176403j332157m061408o110016l303450J676779
42967a1319450K365449j175126k104757J969967M866425K142049j540998p34317
42959e530758J235531j580623o420488n552685O38751L828183J353454K3815L535961
42950h468859N326532l32721p507517o591876J508549P321911O423208K974926
42942F54153N14483k417084n905074n522268N45922O547220N948814P5748m074543
42933c632629k707711J482883L684038J920729j578083k344997J776387P109892
42925E710509P485226K223561k564290k575920r50050j880831l250721j237812
42917B959672J521343k00051m335599m005003M95251J424221l022064m742736
$$ plain form
42975 4423722 4436068 2987205 1810802 478645 -3582763 -9692779 -12996229 -11319450
42967 -11319450 -8954001 -10129127 -12233884 -10263917 -5397492 -3255443 -4796441 -5530758
42959 -5530758 -4295227 -5875850 -12296338 -17849023 -17210272 -13382089 -12028635 -12004820 -8468859
42950 -8468859 -3142327 -3475048 -10982565 -17574441 -16065892 -8743981 -2320773 654153
42942 654153 1168636 -1248448 -7153522 -12675790 -12129868 -5582648 366166 441914 -3632629
42933 -3632629 -6340340 -4857457 -1173419 747310 -830773 -3175770 -1399383 5710509
42925 5710509 13195735 15419296 12855006 10279086 9329036 7448205 4197484 2959672
42917 2959672 4481015 4280964 -54635 -4059638 -3564387 -2140166 -5162230 -9904966
42909i904966O81788N789569L481544o65264K191811Q236258O045758m585651
42901A1270847j0813675n361008L517037M997765L09941j657436K270299P132237
42893A1666007P797953L663132l052595q853060r548235l667348M314512P376386
42885I696752L382047k901593n523922l233453O60630K438872J100706j453428
42877D166611k345142l11412K911326M063024J850749j204947j348260J668529
42869I450478L654350J111818l693330n232317k260065K36507j957059o237740
42861d927358o809830k402558K746245M644715L413513J851605K490550N573103
42853F579985Q004735N436115k250545q858653q196337j460782M601092N700377
$$ plain form
42909 -9904966 -9223178 -3433609 47935 -617329 1574482 9810740 15856498 11270847
42901 11270847 457172 -4903836 -1386799 3610966 3920907 2263471 4533770 11666007
42893 11666007 19463960 23127092 20074497 11221437 1673202 -1994146 2320366 9696752
42885 9696752 13078799 10177206 4653284 1419831 2080461 4519333 5620039 4166611
42877 4166611 1821469 1510057 4421383 8484407 10335156 9130209 7781949 9450478
42869 9450478 13104828 14216646 10523316 5290999 3030934 3267441 1310382 -4927358
42861 -4927358 -11737188 -14139746 -11393501 -6748786 -3335273 -1483668 1006882 6579985
42853 6579985 14584720 20020835 17770290 8911637 715300 -745482 3855610 9555987
42845I555987K941736q34075l615267l918202j926492m29324j171853j738482
42837a135972m3764O96154k655966n473343j205308O480855P268459N09292k908425
42828A531982K087459O819942L737815j697079j992459p35810m462146r201244
42820c911540o937527j30546K452309Q71775K366108O348052M285062m464290
42812H79403r287843m329128K836767L400295o21503k094466L52810K866259K980158
42803c017248J037449j468296k040049P13010L586436K119184j588519p15121
42795a373154M927557O899087P88814o751621q270755n425407k872354L86155
42787a1691678N904144Q383281K896918m488661l459425M756578Q091111O39282
$$ plain form
42845 9555987 12497723 11663648 8048381 4130179 2203687 1774363 602510 -1135972
42837 -1135972 -1179736 -483582 -3139548 -8612891 -9818199 -3337344 3931115 4440407 1531982
42828 1531982 3619441 10439383 14177198 12480119 10487660 9751850 5289704 -3911540
42820 -3911540 -10849067 -10979613 -8527304 -7655529 -5289421 1058631 5343693 879403
42812 879403 -8408440 -12737568 -9900801 -6500506 -7122009 -9216475 -8863665 -5997406 -3017248
42803 -3017248 -1979799 -3448095 -5488144 -4775134 -1188698 930486 -658033 -1373154
42795 -1373154 3554403 10453490 11242304 4490683 -3780072 -9205479 -12077833 -11691678
42787 -11691678 -5787534 2595747 5492665 1004004 -2455421 2301157 10392268 11031550
42779A1031550r690015j2575770p223081m8012L936803M018894J830202l54517
42771i073946j082655q58806p50540n56886k51831j310078l385764k253888L994475
42762a5529919R137552N989095j987689m451829K76362K935780r70227l426326
42754h027201K354277R650528Q393269P89919l419303k767656l746470o724709
42746c497346m470177L808635Q490812M039564k190489j741552K390229K505855
42738I335531q05476j289507J282715J343712k053619l799965j938893m23863
42730A650635j402122j955901n36699J52146o93849L01960L325111K578652l986488
42721e66555q409536l163969O722003R891215M162654k389199m347020m203026
$$ plain form
42779 11031550 1341535 -11234235 -18457316 -18505328 -14568525 -10549631 -8719429 -9073946
42771 -9073946 -10156601 -11015407 -11765947 -12322833 -12574664 -13884742 -17270506 -19524394 -15529919
42762 -15529919 -6392367 -403272 -2390961 -6842790 -6566428 -3630648 -4600875 -8027201
42754 -8027201 -5672924 3977604 12370873 13160792 9741489 6973833 3227363 -3497346
42746 -3497346 -7967523 -4158888 4331924 8371488 6180999 4439447 6829676 9335531
42738 9335531 8530055 7240548 8523263 9866975 7813356 4013391 2074498 1650635
42730 1650635 248513 -1707388 -2244087 -2091941 -2785790 -2483830 841281 3419933 -566555
42721 -566555 -8976091 -12140060 -5418057 4473158 8635812 6246613 1899593 -2303433
42713b303433m411372l114744l99998p85664n061786o305284K58900Q479949Q971331
42704d672101K383742j993193L81017M277787L910625Q81751j70149N57610q43628
42695D713461m575855n535334m78287O201239O824725p6170p551872q411951l105343
42686a1995387K347110L930991K260713m88864k294975q46772M046761P618044
42678D577621M661818k360467n292232k077646p6488l853037o604360p47218Q292588
42669c479421Q521401n11084o594884l035684K468488J613956j238443K265219
42661I548Q875697P454078l455869j2251062j0595311m145558k029596k872262
42653a9010335P98717Q252224J0387752M285406j227022J263061O231336L863862
$$ plain form
42713 -2303433 -6714805 -9829549 -10229547 -11015211 -16076997 -22382281 -22123381 -13643432 -4672101
42704 -4672101 -2288359 -4281552 -3900535 377252 4287877 5169628 4999479 5557089 4713461
42695 4713461 137606 -5397728 -5876015 325224 7149949 7073779 -478093 -8890044 -11995387
42686 -11995387 -9648277 -5717286 -3456573 -3945437 -6240412 -7087184 -3040423 4577621
42678 4577621 9239439 6878972 1586740 -490906 -567394 -4420431 -11024791 -11772009 -3479421
42669 -3479421 5041980 4530896 -2063988 -5099672 -2631184 -1017228 -2255671 9548
42661 9548 8885245 16339323 12883454 632392 -9962919 -14108477 -16138073 -19010335
42653 -19010335 -18211618 -9959394 428358 4713764 3486742 4749803 10981139 14845001
42645A4845001m159518o486985P32225P481795M227147m366900o425209K04678
42637F052234N602693K384633m281489m796523J157988M702926P39790n050013
42629F512239m946729n13320L77750l892806o160713j995636L356842L884033
42621c378340K309145L914530O012303K723158k837473k078832L865278M386399
42613A4916168k844395o692587n07217O550729M388358k364335m251713l413000
42605E782008o848692j0156911l753562P827993R570423l03441o403679n3013
42597d338874P970540N758571j766481l077533J784473M366911K359812R3560
42589A3150979j183282l426010m896461k368042J349301M64980m073054n605998
$$ plain form
42645 14845001 10685483 4198498 4930723 12412518 16639665 12272765 5847556 6052234
42637 6052234 11654927 14039560 9758071 4961548 6119536 10822462 11562252 6512239
42629 6512239 1565510 1052190 1429940 -2462866 -8623579 -10619215 -7262373 -3378340
42621 -3378340 -1069195 2845335 8857638 11580796 8743323 6664491 10529769 14916168
42613 14916168 12071773 5379186 4871969 11422698 15811056 13446721 9195008 5782008
42605 5782008 -1066684 -11223595 -14977157 -7149164 2421259 2117818 -4285861 -4338874
42597 -4338874 3631666 9390237 7623756 4546223 6330696 10697607 13057419 13150979
42589 13150979 11967697 8541687 3645226 1277184 2626485 3091465 -981589 -6587587
42581f587587k104954J774984K976481L314028L888110L073795J415645K125780
42573I876282M749794M313513o09987m532473l263027p60393l182969r091003
42565b500263j0608850l824421N751986R225659M211496k670723l593830J041916
42557b967030L383447p80465n402490k604495N025791P016102p3475p235338n413711
42548i051664K371073O102667K315812l092440m273811k176893q30709q70712
42540i506677M84531M310029P412723N917010M83274l884417l799553j342503
42532G4417l38642q24335k09106J584200K333624K310599L885816N788000L372709
42523A7977282l243401o968628l436897K069564K394697j052042j880506L82731
$$ plain form
42581 -6587587 -8692541 -6917557 -3941076 -627048 3261062 6334857 7750502 9876282
42573 9876282 14626076 18939589 18329602 13797129 10534102 9773709 6590740 -2500263
42565 -2500263 -13109113 -16933534 -11181548 -1955889 2255607 -415116 -4008946 -2967030
42557 -2967030 416417 -364048 -5766538 -8371033 -3345242 3670860 3597385 -3637953 -9051664
42548 -9051664 -6680591 -577924 1737888 -1354552 -5628363 -7805256 -8635965 -9506677
42540 -9506677 -9022146 -4712117 2700606 8617616 9100890 5216473 1416920 74417
42532 74417 -264225 -1088560 -1297666 286534 2620158 4930757 8816573 14604573 17977282
42523 17977282 14733881 7765253 4328356 6397920 8792617 7740575 5860069 6242800
42515F242800M57946k784516m382458k183071n01600k320021l950796j236172
42507a0657888L570293N271321K880383l77649j688276j52800L683181O679297
42499I207862M371686k873227p712948m293920L340788O301652K644984j549368
42491I437509k022499p99736k21464P61465J985632K9431n337184p885629l073964
42482g126439M460262O854011L387242o71927k833002m339687m107057M17551
42474c959046N990004N243139j929917o176735j975257L726563K040925m353489
42466a393813n822800k84361N280933O308341N096862L399677r01222p052805
42458D630812q857781l322239L690131N289681K655305J319174K176420J965292
$$ plain form
42515 6242800 6700746 3916230 -466228 -2649299 -3150899 -5470920 -9421716 -10657888
42507 -10657888 -7087595 -1816274 1064109 686460 -1001816 -1154616 2528565 9207862
42499 9207862 13579548 10706321 2993373 -1300547 2040241 8341893 10986877 9437509
42491 9437509 7415010 6615274 6393810 7155275 9140907 9170338 3833154 -4052475 -7126439
42482 -7126439 -2666177 4187834 7575076 6903149 4070147 -269540 -4376597 -3959046
42474 -3959046 2030958 7274097 5344180 -832555 -2807812 918751 2959676 -1393813
42466 -1393813 -7216613 -7500974 -2220041 4088300 9185162 12584839 11683617 4630812
42458 4630812 -4226969 -7549208 -3859077 1430604 4085909 5405083 7581503 9546795
42450I546795J90565m65354M03130M78188o20310j034401p80612j421881j762651
42441D533469R97088N298813N742226R65013m022810n225021m312644l474493
42433E01641j079014L540602N824999J979068l995559n036863q80639K442020
42425C296255J805363j05510r14552j714952k956123k464011K19864J819682K95736
42416g18248j610104o01076K194226L353317K089655K79156o52101k89026J550282
42407E596081L473762K295867k548778o073405l439539K297873L219105k106767
42399B714199n788023j779549N017515N530198p76472n801025m341539K97103
42391d927593K960545L082327K057770n62777m262610n030203n90238M667545
$$ plain form
42450 9546795 9737360 9272006 9675136 10153324 9533014 8498613 7718001 6296120 4533469
42441 4533469 5530557 10829370 16571596 17536609 13513799 8288778 3976134 501641
42433 501641 -577373 2963229 8788228 10767296 6771737 1734874 854235 3296255
42425 3296255 5101618 4996108 4081556 2366604 -589519 -3053530 -2833666 -1013984 -718248
42416 -718248 -2328352 -2929428 -735202 2618115 4707770 4986926 4334825 4045799 5596081
42407 5596081 9069843 11365710 8816932 2743527 -696012 1601861 4820966 2714199
42399 2714199 -3073824 -4853373 164142 5694340 4917868 -883157 -5224696 -4927593
42391 -4927593 -1967048 1115279 3173049 2610272 -1652338 -6682541 -7272779 -2605234
42383b605234N182790K339555J306961J840637l99854m093046k658609L884836
42375D798036O681511J900864k028386K117899P447770L091113p914993j1987805
42367D106009m423125N285261Q071072N313093K002868r73268l664425l592376
42359A2125109m32216J290017j200702m073027k881903N60945J609999j48626
42351F849596j408486l88559J880201L702899L756602J911753L86385J342508
42343A8032899K610919j2172n153938o062211p56657L907144J987244l242016
42335A1311212n163148k955751n7148J817641K131530l93612m016146l117904
42327d43326L323247P514644L455601l411380m380886j81217K717468L418167
$$ plain form
42383 -2605234 2577556 4917111 6224072 8064709 7664855 3571809 913200 4798036
42375 4798036 11479547 13380411 11352025 13469924 20917694 24008807 16093814 4106009
42367 4106009 -317116 4968145 13039217 18352310 20355178 19381910 15717485 12125109
42359 12125109 11692893 12982910 11782208 7709181 4827278 5388223 6998222 6849596
42351 6849596 5441110 5052551 6932752 10635651 14392253 16304006 16690391 18032899
42343 18032899 20643818 20631646 15477708 9415497 8658840 12565984 14553228 11311212
42335 11311212 6148064 3192313 3135165 4952806 7084336 6690724 2674578 -443326
42327 -443326 2879921 10394565 13850166 10438786 6057900 5876683 8594151 12012318
42319A2012318M625958L924430j820043o707697k879338M486642K682106p888639
42311H435737j2596973m658442N414611P140920L919845K870527K533917o20551
42303A2439591k783181O24764N616100N399754L69962m579346p492802p932638
42295A662204m044207K436319M294065j122096n990179l337949K118508K538805
42287a444530k21485L5688J636021o89959l879284j085625M572882L432185m329187
42278a973294q034897l040212L706464O287465O545752N547720M6390p876409
42270A208979q745205l1534O946922K638336o053261o194846J714468N436058
42262c080083j64005o485421m716547K451066O404013M472888J433100J434333
$$ plain form
42319 12012318 16638276 20562706 18742663 12034966 9155628 13642270 16324376 8435737
42311 8435737 -4161236 -8819678 -3405067 3735853 7655698 10526225 13060142 12439591
42303 12439591 9656410 10281174 15897274 21297028 21666990 17087644 9594842 1662204
42295 1662204 -2382003 54316 4348381 3226285 -2763894 -6101843 -3983335 -1444530
42287 -1444530 -1666015 -1630327 5694 -684265 -4563549 -5649174 -1076292 2355893 -1973294
42278 -1973294 -10008191 -13048403 -9341939 -3054474 3491278 9038998 9085388 1208979
42270 1208979 -7536226 -7567760 -620838 2017498 -4035763 -10230609 -8516141 -3080083
42262 -3080083 -3244088 -9729509 -14446056 -11994990 -5590977 -1118089 315011 1749344
42254A749344K921194K146209j146932l724210l647188k497131k161964j817367
42246h178045N5375K496886L332530K334599P13147j277340l569363m460374k705627
42237a1258212l74499k81672j501881r62567J462377L372060M417795N917831
42229G91232O459220L116451k539542m963779k515926L9259j223599m026584m043774
42220h907042p86885K860894M064535J536316l325035n874817k523823L426772
42212i529085M675614J56080k679546J399052P313921O760962o3285n006326l038930
42203a1543J667102J535163m828629j0336060p279629K716048R177008N477017
42195a883523j997965k245878M989431R251289M536945l512090p512068p500594
$$ plain form
42254 1749344 4670538 6816747 5669815 1945605 -1701583 -4198714 -6360678 -8178045
42246 -8178045 -8122670 -5625784 -2293254 41345 754492 -522848 -4092211 -8552585 -11258212
42237 -11258212 -11632711 -11914383 -13416264 -14378831 -12916454 -9544394 -5126599 791232
42229 791232 7250452 10366903 7827361 2863582 347656 386915 -836684 -4863268 -8907042
42220 -8907042 -9693927 -6833033 -2768498 -1232182 -4557217 -10432034 -12955857 -9529085
42212 -9529085 -4853471 -4697391 -7376937 -5977885 1336036 8096998 8033713 3027387 -11543
42203 -11543 1655559 3190722 -1637907 -11973967 -19253596 -16537548 -7360540 -1883523
42195 -1883523 -3881488 -6127366 -1137935 8113354 12650299 9138209 1626141 -5874453
42187e874453o316358l065832L043424P668377O338195J192162k263741k146809
42179a425035J20047L461216O149049M897031m16539m641979m361707k914614
42171H67469l698275l471648J189956N415140K361444m782969o115084L19123
42163g914844N658463L163809l107090m851896K89432P233229R062308L462680
42155A2996091m284162o008035p31255L153165m11580n753474m072446K745986
42147b365710N423245J763620j723668j598265q99388o29923J798178M182261
42139E950350L21622p844256r656561j920937M769757K132916l366577k340943
42131a1954629K219185J812200k075999j005675N471852R241883O868293L289188
$$ plain form
42187 -5874453 -12190811 -15256643 -12213219 -4544842 1793353 2985515 721774 -1425035
42179 -1425035 -1304988 2156228 8305277 13202308 12785769 8143790 3782083 867469
42171 867469 -2830806 -6302454 -5112498 302642 2664086 -2118883 -8233967 -7914844
42163 -7914844 -2256381 907428 -2199662 -7051558 -6762126 471103 9533411 12996091
42155 12996091 8711929 2703894 1972639 5125804 4714224 -1039250 -5111696 -2365710
42147 -2365710 3057535 4821155 3097487 1499222 599834 -30089 1768089 5950350
42139 5950350 6271972 -1572284 -11228845 -13149782 -8380025 -6247109 -9613686 -11954629
42131 -11954629 -9735444 -7923244 -9999243 -11004918 -5533066 3708817 10577110 13866298
42123A3866298K091632J283190j4048Q92365L666836L246377k074292o879001
42115A6079357o325146k525664J23137J268678K261282J483108l055486q648827
42107F60439j0108133o316023q95398L229562O331311Q608696Q022592L355483
42099A2888529k709462n971378n350208l028615m08098L339534P821815R326108
42091A5908225M893309k691113o914258m569135J407696N887721N892424J393210
42083B1208079m779369p384687l021060M587429P296457K572960l105212l646746
42075A3727851j651599k665428n131904l037249L093148N692689J739565k404773
42067I362300j014159K184212L32004n473168p688112l531682J421132J892388
$$ plain form
42123 13866298 15957930 17241120 17227072 18119437 21786273 25032650 22958358 16079357
42115 16079357 9754211 7228547 7351684 8620362 10881644 12364752 9309266 660439
42107 660439 -9447694 -15763717 -16659115 -13429553 -7098242 1510454 9533046 12888529
42099 12888529 10179067 4207689 -1142519 -4171134 -4579232 -1239698 6582117 15908225
42091 15908225 20801534 18110421 11196163 6627028 8034724 13922445 19814869 21208079
42083 21208079 16428710 9044023 6022963 10610392 17906849 20479809 17374597 13727851
42075 13727851 12076252 9410824 4278920 1241671 4334819 10027508 11767073 9362300
42067 9362300 8348141 10532353 10864357 5391189 -2296923 -5828605 -4407473 -2515085
42059b515085J69147J659466O032762O926324O33266q029920j0612442m675245
42051a0411727L840045Q108159P602566N853768L535853j653147q132576q973012
42043b30071r94851Q282412Q354734p08134q272177p349895k554277r93440j418237
42034e883936J565513O557775O640712P97126l772924k400397P58901J91926l031250
42025A423446m779576m493628l704700j785357K063603N671899P099229P707654
42017I202570P780549L490188n869285j2124350p763154J760798M335219j705998
42009h93463o335868l459011K172259M846550M780688K853431j725410n449109
42001c209933k244610N038284N504521k483711o474703N26539P763800M061696
$$ plain form
42059 -2515085 -2345938 -686472 5346290 12272614 12905880 4875960 -5736482 -10411727
42051 -10411727 -6571682 1536477 9139043 14992811 18528664 16875517 8742941 -230071
42043 -230071 -1224922 7057490 15412224 14704090 6431913 -917982 -3472259 -4465699 -5883936
42034 -5883936 -4318423 2239352 8880064 9677190 5904266 3503869 4262770 4454696 1423446
42025 1423446 -3356130 -7849758 -11554458 -13339815 -11276212 -5604313 1494916 9202570
42017 9202570 16983119 20473307 14604022 2479672 -5283482 -3522684 812535 -893463
42009 -893463 -7229331 -10688342 -8516083 -3669533 1111155 3964586 2239176 -3209933
42001 -3209933 -5454543 -416259 5088262 2604551 -3870152 -3343613 4420187 8481883
41993H481883l914124l851683J279252K26501n382119m456942K290429K841285
41985b485518m030452n159793M571387J2635809Q571859n65133l002039O14121
41977A1150241K111601m93785l011516l015409q14488K724384M608415J559085
41969A4818528l183069k225965L460618L765926m099800r189343m040637K753466
41961B059724R86147m479278l662443P69794N5954l010799R59439R054345Q932690
41952A1665573K07120l483927L447710R456296M328074n979248j0130317p114658
41944B396623l403664j652785J71608K737796M275678L177400r68221n959074
41936G75361o315449P07575Q432971P309677r98187m601737J350517P806114O309694
$$ plain form
41993 8481883 4567759 716076 1995328 2221829 -3160290 -7617232 -5326803 -2485518
41985 -2485518 -6515970 -11675763 -7104376 5531433 14103292 13538159 10536120 11150241
41977 11150241 13261842 12768057 9756541 6741132 5926644 8651028 13259443 14818528
41969 14818528 11635459 9409494 12870112 16636038 12536238 3346895 -693742 2059724
41961 2059724 3045871 -1433407 -5095850 -4326056 -4270102 -7280901 -6321462 2732883 11665573
41952 11665573 11872693 8388766 11836476 21292772 25620846 19641598 9511281 2396623
41944 2396623 -1007041 -2659826 -2488218 249578 4525256 7702656 6734435 775361
41936 775361 -5540088 -4832513 3600458 10910135 9911948 5310211 6660728 14466842 20776536
41927B0776536R34826n80368O56905r15858m457007m668312r79458K353073K829955
41918A5950292R38849k406322n078818l748169J155996M400666L579335K619978
41910A7411807L658350K211627l684169o811594j381053O041727N807934K71204
41902B3525833r57009L051233M829913K545614J800411L645136K405924k932402
41894C7914653n726904k779807P43854M91095j192226j431512j186296o95924
41886B6136933J939984M957815L313784k273928m491723r82188J275121k670771
41878B7205027p824873p862784m509594k480859j418633Q02397K149558M16596
41870F476835j137099J522760O127826P304409M079516m83929m166928n816749
$$ plain form
41927 20776536 21711362 21130994 21787899 20872041 16415034 11746722 10767264 13120337 15950292
41918 15950292 16889141 14482819 9404001 5655832 6811828 11212494 14791829 17411807
41910 17411807 21070157 23281784 19597615 12786021 11404968 17446695 23254629 23525833
41902 23525833 22568824 25620057 30449970 32995584 34795995 38441131 40847055 37914653
41894 37914653 32187749 29407942 30151796 30642891 29450665 28019153 26832857 26136933
41886 26136933 28076917 33034732 36348516 34074588 29582865 28600677 29875798 27205027
41878 27205027 19380154 11517370 7007776 4526917 3108284 3910681 6060239 6476835
41870 6476835 5339736 6862496 12990322 20294731 24374247 23890318 19723390 13906641
41862A3906641l960955M44878K913580J001080k095594k820853k330665k931010
41854D127102l768685l627728l467870k855057P25962N619087N829271J306505
41846C888587K34278N182963O344017k631268j1248196o691190N508706R621092
41838A0208989L876006P12170M422666N099476k484228r049066n904201J880311
41830H762123M537962J222780k225343k801503j688909m21513J09274j51644K64594
41821G607821J409506n39729p034511j0742068m213357O514472Q198547N29152
41813A729833k910372L590436R061376M435657l574071n472232l683665m159184
41805i82222l979933J062701N357658K312108k785941j195996M013924L874768
$$ plain form
41862 13906641 9945686 10390564 13304144 14305224 12209630 9388777 7058112 4127102
41854 4127102 358417 -3269311 -6737181 -9592238 -8866276 -3247189 2582082 3888587
41846 3888587 4122865 9305828 15649845 13018577 1770381 -4920809 587897 10208989
41838 10208989 14084995 14797165 19219831 24319307 21835079 12786013 6881812 8762123
41830 8762123 13300085 14522865 12297522 9496019 7807110 7385597 7494871 7343227 7607821
41821 7607821 9017327 8477598 1443087 -9298981 -13512338 -6997866 1200681 1729833
41813 1729833 -1180539 2409897 11471273 15906930 12332859 6860627 3176962 -982222
41805 -982222 -4962155 -3899454 1458204 3770312 984371 -211625 3802299 7677067
41797G677067n72231j721007m07427k896239n763555K42399J1457580J2870090
41789B0886677J451299p601127l642028M457595M167127j978583l729390j03232
41781A3908338K232318J766523K324175L413943M72484n783320q594211m760177
41773D980073J245051M086050L567788K324914J565356J214592J646240L043079
41765B3673143M139031L176188m49l496329n231237n051231m417806l847291j914121
41756G029898K082981N874497O771893N408544M153969K654434j151317n456801
41748B7368098m933274J056727M986480K83503q552689j0321202j617870Q196655
41740A6466428Q995301K899104M50517N085092P776642J89225j1789464j4137771
$$ plain form
41797 7677067 7104836 5383829 4976402 2080163 -3683392 -3440993 8016587 20886677
41789 20886677 22337976 14736849 11094821 15552416 19719543 17740960 14011570 13908338
41781 13908338 16140656 17907179 20231354 23645297 24117781 18334461 9740250 4980073
41773 4980073 6225124 10311174 13878962 16203876 17769232 18983824 20630064 23673143
41765 23673143 27812174 30988362 30987913 27491584 22260347 17209116 12791310 8944019 7029898
41756 7029898 9112879 14987376 21759269 27167813 31321782 33976216 32824899 27368098
41748 27368098 22434824 23491551 28478031 28761534 20208845 9887643 8269773 16466428
41740 16466428 25461729 28360833 28811350 33896442 41673084 41862309 30072845 15935074
41732A5935074l076759R668997J1813521M514885k380162l875257k805489k360671
41724B7434139k258548k063744k914576m768502n309865k601792K931621Q735656
41716A9184389J0915181O852933n68569m124268j145283J782627k127524q982740
41708B1786746q945950m69610P452180P665717K723761j097133j552872o538J655178
41699B9211479J411465j429420l690104j508542L032299L538436j201331n050423
41691B4313859l924069j488538k240529m156351k438138L140503Q463809J0011312
41683C1681858O935177Q78024m403733o037061n546180n860583n105180P72288
41675A3314610Q726367R799565K312719m117478k229739K831946K963165n92797
$$ plain form
41732 15935074 12858315 22527312 34340833 38855718 36475556 32600299 29794810 27434139
41724 27434139 25175591 23111847 20197271 15428769 10118904 7517112 10448733 19184389
41716 19184389 30099570 36952503 36383934 32259666 31114383 32897010 30769486 21786746
41708 21786746 12840796 12371186 19823366 27489083 30212844 29115711 27562839 27556301 29211479
41699 29211479 30622944 29193524 25503420 23994878 27027177 30565613 29364282 24313859
41691 24313859 20389790 18901252 16660723 12504372 10066234 13206737 21670546 31681858
41683 31681858 38617035 39495059 35091326 29054265 23508085 17647502 12542322 13314610
41675 13314610 22040977 31840542 34153261 30035783 27806044 30637990 33601155 33008358
41667C3008358j806160p00354j009136j316151K400217P851235Q704724M659709
41659E1792442J545517J837239K108328J0817k461676l147221k083401L22339
41651D9924384L229097M338949K967762K245181L954131M291332L44919k892192
41643F8403563N99824P140549Q399435M984789M771918Q431531Q161548K614233
41635A13507390J347238R653417J9161679K0187910J5370070J3643351J6863640
41628B09734695K0048757K0509507J9395408J6914880J2371495P185683K861900
41621C09022325k238181r852094j7785210k3006986k6180317k8704687k8026784
41614A73228066k1331570j2221198q100696j1135081j6213467j7696577j4353499
$$ plain form
41667 33008358 31202198 30501844 29492708 28176557 30576774 38428009 47132733 51792442
41659 51792442 53337959 55175198 57283526 57294343 54832667 51685446 49602045 49924384
41651 49924384 53153481 57492430 60460192 62705373 66659504 70950836 71295755 68403563
41643 68403563 69003387 76143936 84543371 89528160 94300078 102731609 110893157 113507390
41635 113507390 114854628 124508045 143669724 163857634 179227704 192871055 209734695
41628 209734695 229783452 250292959 269688367 286603247 298974742 306160425 309022325
41621 309022325 306784144 296932050 279146840 256139854 229959537 201254850 173228066
41614 173228066 151896496 139675298 131574602 120439521 104226054 86529477 72175978
41607G2175978q094240j854169J215706N9606k513424l230175l043417n108988
41599D9606877q675649r254512n467934j630228j851659m785382o256350m656165
41591G028998j529536J479117L948563N622759N781496L810098j9310l966684
41583B2155501n264863k624979J370585K315825m01884j973408J605466P023619
41575B4205862O713959j281383r836722j0966249n008388J090669K906979K403115
41567A0227842L095916M998633N347832J990137m417773r431735o917234L713996
41559H607614J2780128R245601l775649r863727m19856J2344048J1547998r45909
41551C9520248q224280k915385M456641L398974k289093l740768r89967L7446
$$ plain form
41607 72175978 64081738 62227569 63443275 63502881 60989457 57759282 54715865 49606877
41599 49606877 40931228 31676716 26208782 24578554 22726895 17941513 11685163 7028998
41591 7028998 5499462 6978579 10927142 16549901 22331397 26141495 26122185 22155501
41583 22155501 16890638 14265659 15636244 17952069 17550185 15576777 17182243 24205862
41575 24205862 30919821 29638438 19801716 8835467 3827079 4917748 7824727 10227842
41567 10227842 13323758 18322391 23670223 25660360 21242587 11810852 4893618 8607614
41559 8607614 21387742 30633343 26857694 16993967 16574111 28918159 40466157 39520248
41551 39520248 31295968 28380583 32837224 36236198 33947105 30206337 29216370 29253816
41543B9253816j816995l279225l716815m524245l992927L22155N560419O279751
41535B4085934K737175O11943K129033K848395j136275o973903q488095l763081
41527A2051126K612021M371557M1362n538220o777199l947604j973953k598062
41519a758972j734004L331961Q277403P421039K309998l43557J773608L871463
41511B3148939J267432m513755q058682o258946j276744J728145K1790l091423
41503B966756j636748N102926J0467023Q207528R2743o661795p416480l195436
41495G926517J808216L210815m02026m569729k520053N163537Q752818K060869
41487B1430964p535760q519240j149791M313199L254460J136351K169771L178719
$$ plain form
41543 29253816 27436821 24157596 20440781 15916536 11923609 12245764 17806183 24085934
41535 24085934 26823109 27435052 29564085 32412480 31276205 24302302 15814207 12051126
41527 12051126 14663147 19034704 19076066 13537846 6760647 2813043 839090 -1758972
41519 -1758972 -3492976 -161015 8116388 15537427 17847425 17503868 19277476 23148939
41511 23148939 24416371 19902616 11843934 5584988 4308244 6036389 6058179 2966756
41503 2966756 1330008 6432934 16899957 25107485 25200228 18538433 11121953 7926517
41495 7926517 9734733 12945548 12543522 7973793 5453740 10617277 19370095 21430964
41487 21430964 13895204 5375964 4226173 8539372 11793832 12930183 15099954 18278673
41479A8278673J294412o97079n89508j280580m610997o551791l259150K647728
41471E231708N978077N050186O40958o190913j1437915q769310J818556J0393390
41463B714737Q117257j227141o403206k802468M232109P952298O316191R70429
41455A9870206m465317n920445l202271j497689m301154p298255m810640M07063
41447a1218502J324855j050927J159308Q427468J0783494L140843n412360m440572
41439B713607K684467M953627M10997l061338j818856r92056l391690l499612
41431b000854K559156Q471279O294962j024505l809873l20323J416394k758881
41423H827355o341700l087011K478710K228352k540634l513150J007713L643107
$$ plain form
41479 18278673 19573085 18876006 18286498 17005918 12394921 5843130 2583980 5231708
41471 5231708 11209785 16259971 16900929 10710016 -727899 -9497209 -7678653 2714737
41463 2714737 10831994 9604853 3201647 399179 4631288 12583586 18899777 19870206
41455 19870206 15404889 9484444 6282173 4784484 483330 -6814925 -11625565 -11218502
41447 -11218502 -9893647 -10944574 -9785266 -1357798 9425696 12566539 7154179 2713607
41439 2713607 5398074 10351701 10762698 7701360 5882504 4890448 1498758 -2000854
41431 -2000854 558302 9029581 15324543 14300038 10490165 10169842 11586236 8827355
41423 8827355 2485655 -601356 1877354 4105706 1565072 -1948078 -940365 2702742
41415B702742L07868l158187p03704M030208L471598k027686m700094p28266M705477
41406C899956M941236M27668k563670j38307M541555N303674P84564l742699l477583
41397I976394o51078n38031k617543j392364L624657N543428P08025m668661l487408
41388F497419J736228L432148J17334l620228n263759n495827l426501J870061
41380d153125O309756M740765o27803k931326j088896K78959O58554L923541Q158931
41371A5269356N852923k794303p375422k958724J969481k16051m051612j884595
41363C811053J925447r04673o673851m743177M561056R672337N042685k573304
41355A0117573o038010n655312l058617K837835R991784J1552224M783010m156294
$$ plain form
41415 2702742 3010610 -147577 -851281 3178927 6650525 4622839 -77255 -805521 3899956
41406 3899956 8841192 9268860 6705190 6566883 11108438 16412112 17196676 13453977 9976394
41397 9976394 9325316 8787285 6169742 4777378 8402035 13945463 14653488 9984827 6497419
41388 6497419 8233647 11665795 11783129 8162901 2899142 -2596685 -6023186 -4153125
41380 -4153125 2156631 6897396 6269593 3338267 2249371 2528330 3186884 7110425 15269356
41371 15269356 21122279 18327976 10952554 7993830 9963311 9747260 5695648 3811053
41363 3811053 5736500 4831827 -1842024 -6585201 -2024145 7648192 12690877 10117573
41355 10117573 4079563 -1575749 -4634366 -1796531 8195253 19747477 24530487 20374193
41347B0374193q114182o608098k855431J247864L928781K632287j893275m815527
41339C896612l593188j033483L39208J868580L877278K951971j712219m604849
41331A989910j684736K682057K304419j044068p41278M183030P948285O433361
41323B2070980J363662l425904n439522l725522K78908K472761K78416l376156
41315A0497623l640462o36057Q50799j577895m543114l162060L337077J0533318
41307A1659229J2397243O801403j849042p068149p541054p014964p023402m923285
41299d562021o17513J316971k82854K21759N383230Q415991L982635j602531l61669
41290A1893998L142564n63457q128802p240882K720721Q535229L961069j384374
$$ plain form
41347 20374193 12260011 5651913 2796482 4044346 7973127 10605414 8712139 3896612
41339 3896612 303424 -730059 -390851 1477729 5355007 8306978 6594759 1989910
41331 1989910 305174 2987231 5291650 4247582 3506304 7689334 15637619 22070980
41323 22070980 23434642 20008738 14569216 10843694 11122602 13595363 13873779 10497623
41315 10497623 6857161 6221104 7071903 5494008 950894 -2211166 1125911 11659229
41307 11659229 24056472 30857875 29008833 21940684 14399630 7384666 361264 -4562021
41299 -4562021 -5179534 -3862563 -4145417 -3923658 1459572 9875563 13858198 12255667 11893998
41290 11893998 15036562 14473105 6344303 -896579 1824142 10359371 14320440 12936066
41282A2936066R42270N151173K731515l598002o227109m679207k585198M00147
41274E071655M912778O192269J167915l786438j421545M263988M142285j039523
41266A9503384k295447K230721M246615r72661p261066p339051k742868K42321
41258E611948l57773j541230r93340K87910L68393p00870q56230J139781L418258
41249F376847L112316N96887j014270q51109j049114j708429K5631L808782M476103
41240A3773644l6240m402713l634842N164K082406K332374J214292l160486q636688
41231d63089p134367K873658R949918N933396L55494N170347J2596466O101324
41223C5383147j0416136j5395816l092034P050104J259684q192883m888513O259496
$$ plain form
41282 12936066 13878336 19029509 21761024 18163022 11935913 7256706 4671508 5071655
41274 5071655 9984433 16176702 17344617 13558179 12136634 16400622 20542907 19503384
41266 19503384 17207937 19438658 23685273 22712612 15451546 8112495 5369627 5611948
41258 5611948 5254175 3712945 2719605 3007515 3375908 2675038 1818808 2958589 6376847
41249 6376847 9489163 10086050 9071780 8220671 7171557 5463128 5488759 9297541 13773644
41240 13773644 13737404 9334691 5699849 5705013 7787419 10119793 11334085 8173599 -463089
41231 -463089 -7597456 -4723798 5226120 11159516 11515010 16685357 29281823 35383147
41223 35383147 24967011 9571195 6479161 13529265 14788949 6596066 1707553 7967049
41215G967049J0138062N521162K078720J908476j85663l497058l296772k315310
41207A8318666o422780j1227716o859757M401653Q746093Q31738q640606q430724
41199i283433N8491Q464750J1713821R014343K080957l954304l901281M11183
41191A4604527J896002j407249m099735l009637j416592j159114J321480O805980
41183A3535662Q914374L736629k643044k851638R66010K190314R06530J778098
41175B6532935L893775J953868l122639l852399J802910N944848J913467o007391
41167B9059374q747953m440413O25999J080135j876887l513345j107433L841607
41159A4921084P127064N637240Q26006k388035j423776P57951L36349j240368
$$ plain form
41215 7967049 18105111 23626273 25704993 27613469 27427806 23930748 20633976 18318666
41207 18318666 11895886 668170 -6191587 -1789934 6956159 7787897 -852709 -9283433
41199 -9283433 -9224942 -760192 10953629 19967972 22048929 18094625 14193344 14604527
41191 14604527 16500529 15093280 10993545 7983908 6567316 5408202 6729682 13535662
41183 13535662 22450036 26186665 23543621 20691983 21657993 23848307 24754837 26532935
41175 26532935 30426710 32380578 29257939 25405540 27208450 33153298 35066765 29059374
41167 29059374 20311421 15871008 16497007 17577142 15700255 12186910 11079477 14921084
41159 14921084 22048148 27685388 28511394 26123359 24699583 25457534 25793883 24553515
41151B4553515M79992N091959O437153J318858m771869l894002M530881J3373216
41143D7119703J6188767J3181532R301287Q592770J0198994Q915981J092113r137526
41135A05453621j2715418p322222k226614o457198j5274543j5691615m614452
41128D1151559O566677P169397k87983n970291m879924Q11428O290073O762686
41120E7613622L00036p813069q307684O7028O944300M126416k535143k259202
41112D8136304M573057Q743325P565022P158041R598949Q799323K056310l960375
41104I2669956l722050j565663l845548q467512r254124o584917o129847q801325
41096D4298970r128013l941415L143349P279037P752051N902056J779898m025326
$$ plain form
41151 24553515 25033507 30125466 36562619 37881477 33109608 29215606 33746487 47119703
41143 47119703 63308470 76490002 85791289 94384059 104583053 113499034 114591147 105453621
41135 105453621 92738203 85415981 83189367 76732169 61457626 45766011 41151559
41128 41151559 47718236 54887633 54599650 48629359 43749435 44560863 50850936 57613622
41120 57613622 57913658 50100589 41792905 41859933 48804233 52930649 50395506 48136304
41112 48136304 52709361 61452686 69017708 76175749 85774698 94574021 96630331 92669956
41104 92669956 88947906 87382243 83536695 75069183 65815059 59230142 53100295 44298970
41096 44298970 35170957 31229542 34372891 41651928 49403979 55306035 57085933 53060607
41088E3060607p928362o479833j124504L247658M249454L613937K961621J638051
41080E3238629q4044L70212L365841M806450K321232M17523M071524R766537R956161
41071H8230065N329541M330647R536368J3241643R573610K574095k209741n950566
41063A24655662j0414721j1482884o475279j287252j745767l827608j660449P67944
41055H8529646k990323p832214l787107N987705Q210895M11327n476610k612748
41047H0440571J655839M15330k429584k491433l340028o936723o675559R72024
41039F1610437P365614M241391k518960k142309M489555Q501118Q157546Q745202
41031I8449594J0345362P433108L43658l105501J110800Q219847J2396631J3067974
$$ plain form
41088 53060607 45132245 38652412 37527908 40775566 45025020 48638957 51600578 53238629
41080 53238629 53154585 53524797 56890638 61697088 64018320 64435843 68507367 78273904 88230065
41071 88230065 93559606 97890253 107426621 120668264 130241874 132815969 130606228 124655662
41063 124655662 114240941 102758057 96282778 94995526 93249759 89422151 87761702 88529646
41055 88529646 85539323 77707109 73920002 79907707 88118602 88529929 83053319 80440571
41047 80440571 82096410 82511740 80082156 77590723 74250695 67313972 60638413 61610437
41039 61610437 68976051 73217442 70698482 68556173 73045728 81546846 89704392 98449594
41031 98449594 108794956 116228064 116571722 113466221 114577021 122796868 135193499 148261473
41023A48261473J2226878J0976501J0056441R755860Q962418P396359P215472
41016B14851402Q542115O232072l090653j3094867j4075268o522017r99513l799608
41008A88043663r657548j0587582n826746k11548K526290J757361j417880m874118
41000A59751892o754681p382177q234288r034655q246762o157894m610014l875338
40992A05456083k697339j097209j39389O17946K267040L680634K843892O56688
40984A11588346J95424K658252O912014J1767090J5349451J4264492Q171725L612011
40976A74518805P432137J6734949K1237016J6181192P443668K910020M066645
40969B50524432P385653Q904252N764731k046774r686617j1510888q677762q198665
$$ plain form
41023 148261473 160488351 171464852 181521293 191277153 200239571 207635930 214851402
41016 214851402 223393517 229625589 226534936 213440069 199364801 192842784 191843271 188043663
41008 188043663 178386115 167798533 161971787 161760239 164286529 166043890 164626010 159751892
41000 159751892 152997211 145615034 137380746 128346091 120099329 113941435 109331421 105456083
40992 105456083 102758744 101661535 101522146 102140092 104407132 108087766 110931658 111588346
40984 111588346 111783770 114442022 121354036 133121126 148470577 162735069 170906794 174518805
40976 174518805 181950942 198685891 219922907 236104099 243547767 246457787 250524432
40969 250524432 257910085 266814337 272579068 270532294 260845677 249334789 240657027 232458362
40961B32458362j2829941j6915666j4862674r176503o606054r469180j3926469
40954A48671875j4764077r945654k516682J041200k887088r798001j1622418p052112
40946I1127043k808372l423090n118487k732170K118042M079543K123902J56634
40938H5523045J015487L360861M268213K892213J299120J716093K726896J58758
40930A02960686o228037r977429o302450l41150l63039m646755l964329K731089
40922G3868586N324809j697465j0391212j1667519p751590n409239m248688j54643
40914C7873039N128820O580411M532282K957236K068729k12725k359013k055253
40906E4513526k118416n968127r575730o156714K412747P063210M131654j129559
$$ plain form
40961 232458362 219628421 202712755 187850081 178673578 172067524 162598344 148671875
40954 148671875 133907798 123962144 121445462 122486662 119599574 109801573 98179155 91127043
40946 91127043 88318671 84895581 79777094 77044924 79162966 83242509 85366411 85523045
40938 85523045 86538532 89899393 94167606 97059819 98358939 100075032 102801928 102960686
40930 102960686 96732649 86755220 80452770 80111620 79748581 75101826 71137497 73868586
40922 73868586 79193395 77495930 67104718 55437199 47685609 42276370 38027682 37873039
40914 37873039 43001859 49582270 54114552 57071788 59140517 58927792 56568779 54513526
40906 54513526 52395110 46426983 36851253 30694539 33107286 40170496 44302150 43172591
40898D3172591l757308m297449l971704j749864J880660L914493L288664J885564
40890D0365647O53202p37545q98673J275977K489265q02084m875506k710159M617121
40881C9377245Q549041N872046K412184K179864J866521o57071j415958J393789
40873E9577661K634543n58018k715420J01009J953521l154864r530465p611300
40865D0696667Q44434N627065L700896J790733L978240O442097N747049L876520
40857G2703701K818795J274606q87935j207154Q5331n85857l116822k255840L600447
40848G2429272P958722M790480l063276q192219p396680k472880L515448O569256
40840G4138123K737413o063896j0999179o785669J77499N06731m544706n955266
$$ plain form
40898 43172591 39415283 35117834 31146130 29396266 31276926 35191419 38480083 40365647
40890 40365647 41018849 40281304 39382631 40658608 43147873 42345789 37470283 34760124 39377245
40881 39377245 47926286 53798332 56210516 58390380 60256901 59599830 58183872 59577661
40873 59577661 62212204 61654186 58938766 59039775 60993296 57838432 48307967 40696667
40865 40696667 41541101 47168166 50869062 52659795 56638035 63080132 68827181 72703701
40857 72703701 75522496 76797102 75909167 74702013 74787344 74201487 71084665 68828825 72429272
40848 72429272 80387994 85178474 82115198 73922979 66526299 64053419 67568867 74138123
40840 74138123 76875536 70811640 59812461 53026792 53204291 53711022 49166316 43211050
40832D3211050j324868K753260K627957K220196L615620K596148k122134l987142
40824D9590087Q28576N493360K751765l138488l509092N55148J207741k029481
40816E1749616k105646K242215M094463R91725m38387L760649P644055N101678
40808G3040368o61571l175965k205254j349668j069818L16582K706445N880886
40800G3482005J0635619J4108313J0013266p75958o400681J279133J3591473J6083190
40792A32016360Q545356L264773N438384P143095J863332n790145q325728m971438
40784A39183989P01030O060667R009297Q015719N223624M377127M326178Q01226
40776A77698857m396999m065678K112861M805014j030961p988361q103419n000244
$$ plain form
40832 43211050 41886182 44639442 47267399 49487595 53103215 55699363 53577229 49590087
40824 49590087 50418663 55912023 58663788 55525300 52016208 52571356 53779097 51749616
40816 51749616 49643970 51886185 55980648 56972373 56533986 60294635 67938690 73040368
40808 73040368 72378797 69202832 66997578 65647910 64578092 64894674 67601119 73482005
40800 73482005 84117624 98225937 108239203 107463245 101062564 102341697 115933170 132016360
40792 132016360 140561716 143826489 149264873 156407968 158271300 152481155 144155427 139183989
40784 139183989 139885019 145945686 154954983 162970702 168194326 172571453 176897631 177698857
40776 177698857 173301858 169236180 171349041 176154055 175123094 167134733 159031314 154031070
40768A54031070o233620r916826q397266j374085M075525M864649M857289O877141
40760A48783877R039076R384302Q225333N732284K348383R70118L180781M244666
40752A91908820j560654j0772693j3277238o458866M39491q60914p086652j0153868
40744A42177426q969749q379741r704715r251756n780170l372770n126660q270921
40736H3320944q303965n338320l243655l902986n612692o692314o909744m721737
40728C8595531K252306J1160193J2905997K892128r897514j1827499k259412N534885
40720D9356615K643605m679439o538616l541828k344198l354181k074303O59845
40712C0127500n70731n416357o948486k356389L037678M376622L229932K420287
$$ plain form
40768 154031070 147797450 137880624 129483358 128109273 132184798 137049447 141906736 148783877
40760 148783877 157822953 167207255 175432588 181164872 183513255 184483373 187664154 191908820
40752 191908820 190348166 179575473 166298235 159839369 160278860 159417946 152331294 142177426
40744 142177426 133207677 124827936 115123221 105871465 100091295 96718525 91591865 83320944
40736 83320944 75016979 69678659 66435004 62532018 56919326 50227012 43317268 38595531
40728 38595531 40847837 52008030 64914027 67806155 57908641 46081142 43821730 49356615
40720 49356615 52000220 47320781 40782165 37240337 34896139 31541958 29467655 30127500
40712 30127500 29556769 24140412 17191926 14835537 17873215 22249837 25479769 27900056
40704B7900056R47363k372268m916640l856830o54274J297804J209129M86592
40696B0040932j83234j049543j997069k629680k721605k174387j688694k732780
40688D863940m750061l883341J978315Q274539Q729471M411563J956765K827631
40680B4408822J502475m053567p882435n722049k027314k012752k994951l34478
40672H83751L151156J642427l136480m137144j78457L186213L638029M744567
40664I794062P389937O543611L0393n995497n271956p02110j7960m625788q083434
40655i38742n233711J523241N980109N141462J126625j951206j396772K537229
40647F788235O618392O568778J220599m750891m627872K068682P300572L701318
$$ plain form
40704 27900056 28847419 26475151 21558511 17701681 17047407 18345211 19554340 20040932
40696 20040932 19857698 18808155 16811086 14181406 11459801 9285414 7596720 4863940
40688 4863940 113879 -3769462 -1791147 6483392 15212863 19624426 21581191 24408822
40680 24408822 25911297 21857730 13975295 8253246 6225932 4213180 1218229 883751
40672 883751 4034907 5677334 2540854 -1596290 -1774747 1411466 5049495 9794062
40664 9794062 17183999 23727610 23758003 17762506 12490550 11788440 11770480 7144692 -938742
40655 -938742 -6172453 -4649212 1330897 6472359 7598984 5647778 4251006 6788235
40647 6788235 13406627 19975405 21196004 16445113 11817241 13885923 21186495 24887813
40639B4887813n351218r326965m249513K492795K984333j034476k980547j757690
40631E664532r88235o73572K692903P651246P148093o83837p374937m696559L592149
40622A2331783O411256J85913o873426o175028M79757M471506J793932l062331
40614I563362m065989o49432L597839O209631O972175N534669J709213j940209
40606B6931259j739823J533414K264730k462989p935885p630313j757606L728133
40598A2930920N147678L937397K216130K77492q09097J245807N545273O770109
40590C7261709J538854o139088r016351n249668p018J353421r06582k611373j253775
40581A4970129J594136K861351J739832M16793J243052L572503M046384N92853
$$ plain form
40639 24887813 19536595 10209630 5960117 8452912 11437245 10402769 7422222 5664532
40631 5664532 4676297 4002725 6695628 14346874 21494967 20811130 13436193 8739634 12331783
40622 12331783 18743039 18928952 12055526 5880498 6360255 10831761 12625693 9563362
40614 9563362 5497373 4847941 8445780 14655411 21627586 27162255 28871468 26931259
40606 26931259 25191436 26724850 28989580 26526591 18590706 10960393 9202787 12930920
40598 12930920 18078598 22015995 24232125 24509617 23700520 24946327 30491600 37261709
40590 37261709 38800563 32661475 23645124 18395456 18388438 19741859 18835277 16223904 14970129
40581 14970129 16564265 19425616 21165448 21582241 22825293 26397796 30444180 31037033
40573C1037033m166307m871157K53753O193044O488258J593412j300544J872697
40565C7100189O054952M431357j283219l518785m42745J937132k8830k578238
40557D1671813k468833k838626o235626q082310l846005K035240K201998j899839
40549B0537812k767115N42601J571278j805146l844263j069530K094793R35089
40541A6195519k984647o132001p919325q059428m734747J048631M553099M213285
40533c819614M207573O742786P571291L392617k069960m269010m432289m580547
40525B742847j999968M479440Q304868L633966m336620o322110k742274j040579
40517B719570k106694m24339L319153J939490m270627n254887K775641R753261
$$ plain form
40573 31037033 26870726 21999569 22253322 28446366 34934624 36528036 35227492 37100189
40565 37100189 43155141 47586498 46303279 42784494 42341749 44278881 44250051 41671813
40557 41671813 39202980 36364354 30128728 22046418 18200413 20235653 22437651 20537812
40549 20537812 17770697 18313298 19884576 18079430 14235167 13165637 15260430 16195519
40541 16195519 13210872 7078871 -840454 -8899882 -13634629 -12585998 -8032899 -3819614
40533 -3819614 387959 7130745 14702036 18094653 16024693 11755683 7323394 2742847
40525 2742847 742879 5222319 13527187 17161153 12824533 6502423 3760149 2719570
40517 2719570 612876 188537 3507690 5447180 1176553 -4078334 -1302693 8450568
40509H450568O516259j926746n560078m238641m300828n703078k816660L978195
40501e601009P097257K978528k841438l772582J3439L684875L636218l10018n306008
40492d20738o811931k482238M098324O350817K685711j150647M45603N432027
40484H146928O793659J655015n255996p815134n712883l353207k804308j369441
40476i715367K652948N335142K029394m835480p707057l730673K248821N518413
40468h203859O861802P537668M824733k214848p194113l857775L272910L730131
40460D756649l486281p602072j795177O305736N314119l810147r425684n210474
40452a4953331K432424M289554K68737k309343K07738L125210Q04347m654280
$$ plain form
40509 8450568 14966827 13040081 7480003 3241362 -1059466 -6762544 -9579204 -5601009
40501 -5601009 1496248 4474776 1633338 -2139244 -2125805 1559070 5195288 4885270 -420738
40492 -420738 -7232669 -9714907 -5616583 734234 3419945 2269298 2714901 8146928
40484 8146928 14940587 16595602 11339606 3524472 -2188411 -5541618 -8345926 -9715367
40476 -9715367 -7062419 -1727277 302117 -4533363 -12240420 -15971093 -13722272 -8203859
40468 -8203859 -1342057 6195611 11020344 8805496 1611383 -2246392 1026518 4756649
40460 4756649 1270368 -6331704 -8126881 -1821145 3492974 -317173 -9742857 -14953331
40452 -14953331 -12520907 -8231353 -7962616 -10271959 -10064221 -6939011 -6134664 -10788944
40444a0788944n772691k50281N081539L285612k862243m516314R85104O818563
40436h019655O588892K366302j25954p5227o96336k276116j555570K081084M546768
40427B834188K632848j559278l501671j530830K061303L735881J741429k132007
40419D281863l667974j021889J880899j9525m731452m605978J932059N922800
40411b9197N72535o515208k665663J0064566J5287556N291931o968827o190564
40403H847129L421284N642769l020110r451747n378144N92436j864796q262205
40395i473384p292052J273152P291112O032606K907274K320226J387016k425457
40387B020493n246007l138059Q14193R51520k501814m103467q55349M392455O651642
$$ plain form
40444 -10788944 -16561635 -16811916 -11730377 -8444765 -11307008 -15823322 -14838218 -8019655
40436 -8019655 -1430763 935539 809585 734358 38022 -2238094 -3793664 -1712580 2834188
40427 2834188 5467036 3907758 406087 -1124743 936560 4672441 6413870 4281863
40419 4281863 613889 -408000 1472899 1453374 -3278078 -7884056 -5951997 -29197
40411 -29197 543338 -5971870 -8637533 1427033 16714589 22006520 15037693 8847129
40403 8847129 12268413 17911182 14891072 5439325 61181 653617 -1211179 -9473384
40395 -9473384 -16765436 -15492284 -8201172 -2168566 738708 3058934 4445950 2020493
40387 2020493 -3225514 -6363573 -5549380 -4597860 -7099674 -11203141 -12058490 -7666035 -1014393
40378a014393L818788j288418l032429J143731O438488N473211j625766o328616
40370C584596l326804J954915J877524k073791k954003j06939O83091k311318
40362b672729m367436l246832k552454l811767k787536K461563O640467N344350
40354d992374K244240K350540L357494O43279l369528k925153P51689J512426
40346d27387o69879P7577L921368L631511k803753p069522k981501L759842M725419
40337B163675J328101N55670K785879K597594o01004j689847M31304M66371m009220
40328D028523p831485n993405q26152K200549J994095J526689K660883M498326
40320B258023N180787L100936j894963o756313o934253j886861L275921L736253
$$ plain form
40378 -1014393 2804395 1515977 -1516452 -372721 6065767 11538978 9913212 3584596
40370 3584596 257792 2212707 4090231 2016440 -937563 -1044502 -361411 -2672729
40362 -2672729 -7040165 -10286997 -12839451 -16651218 -19438754 -16977191 -10336724 -4992374
40354 -4992374 -2748134 -397594 2959900 3603179 233651 -2691502 -1939813 -427387
40346 -427387 -1097266 -1019689 2901679 6533190 3729437 -3340085 -6321586 -2561744 2163675
40337 2163675 3491776 4047446 6833325 9430919 8829915 7140068 7571372 8037743 4028523
40328 4028523 -3802962 -9796367 -10622519 -8421970 -6427875 -4901186 -2240303 2258023
40320 2258023 7438810 10539746 8644783 1888470 -5045783 -6932644 -3656723 79530
40312G9530L96589k650009l399896k021807J450425N701314O683907K171232l578311
40303D832974m540900j533096o53215l084720l010697K010333N135415j08662
40295i52568q728193r657040p46434Q337836R026291L759094L06397R00521J555580
40286C801484j99070k137015k142242j781000k844196l220923K95371N935002
40278b292589P440411J964127n293513p036609k994071M00670o25884k286072
40270a0723530K31424N010537O439891M081889L104182N530959O609019K419682
40262B2704053l663490o305657o305468p716688r058296m496458N524685J1695470
40254B378151P286804k664139p879411n280118l86137J594644J178001J393023
$$ plain form
40312 79530 476119 -2173890 -5573786 -7595593 -6145168 -443854 6240053 8411285 4832974
40303 4832974 292074 -1241022 -1894237 -4978957 -7989654 -5979321 -843906 -952568
40295 -952568 -9680761 -19337801 -20084235 -11746399 -2720108 1038986 1345383 2245904 3801484
40286 3801484 3602414 1465399 -676843 -2457843 -5302039 -8522962 -8227591 -2292589
40278 -2292589 5147822 7111949 1818436 -5218173 -8212244 -7811574 -8437458 -10723530
40270 -10723530 -10492106 -5481569 958322 5040211 8144393 13675352 20284371 22704053
40262 22704053 19040563 12734906 6429438 -1287250 -10345546 -14842004 -9317319 2378151
40254 2378151 9664955 7000816 -878595 -6158713 -6544850 -4950206 -3772205 -2379182
40246b379182L097425M350869K544789k684583p434474o217493J008418O729175
40238i85056M390931k860364o467310m031816r35848p61291p36415J559501L248950
40229g578718J349110j971491l119228k121567m72372J966324M088587K107613
40221e751742l932427o571874n72102P210425N846243l239053p180848k72710
40213a4464088P607751N474322l438295p349491k134507N316001P731307M723870
40205C466870l29135m762812o602238m540695j96226K396569J483953k92531p0084
40196i446329J132648P42954n95211L65144M307225P617175O749614K369727k069802
40187A1173145m317328m361643k802355l66458J364453R52371p75962j302437
$$ plain form
40246 -2379182 718243 5069112 7613901 4929318 -2505156 -8722649 -7714231 -985056
40238 -985056 3405875 545511 -5921799 -9953615 -10889463 -11650754 -12387169 -10827668 -7578718
40229 -7578718 -6229608 -8201099 -11320327 -13441894 -13914266 -11947942 -7859355 -5751742
40221 -5751742 -9684169 -16256043 -16828145 -9617720 -3771477 -7010530 -14191378 -14464088
40213 -14464088 -6856337 -1382015 -4820310 -12169801 -14304308 -8988307 -1257000 3466870
40205 3466870 3137735 -1625077 -8227315 -12768010 -12964236 -10567667 -9083714 -9376245 -9446329
40196 -9446329 -8313681 -7570727 -8165938 -7800794 -3493569 4123606 10873220 13242947 11173145
40187 11173145 6855817 2494174 -308181 -674639 689814 1642185 866223 -436214
40179d36214K83029J914774J168834j740083m086752l132342J256716N464780
40171F92742M515843k184848q172085o273534K168825Q284404O886366K147455
40163H065168k80045j649966n672260r628661p138196J096965O517824M353121
40155d336050K943M64418M107036L955949j242915m922651k258672K867063L507677
40146B144798l87522k207726J120416M216140J533886l579227l646537J349203
40138E43431M228019K415952J457017M263936N068349o39842p175012o842276
40130C319574j771157L88879j423548k340394j248373p92388J27627M247906P596548
40121H104674L650742m172455n281000J209678L963979k394543q080665l611099
$$ plain form
40179 -436214 -153185 1761589 2930423 1190340 -2896412 -6028754 -4772038 692742
40171 692742 5208585 3023737 -5148348 -11421882 -9253057 -968653 5917713 8065168
40163 8065168 7785123 6135157 462897 -9165764 -16303960 -15206995 -8689171 -4336050
40155 -4336050 -4333107 -3868689 238347 4194296 2951381 -1971270 -4229942 -1362879 2144798
40146 2144798 1757276 -450450 669966 4886106 6419992 2840765 -805772 543431
40138 543431 4771450 7187402 8644419 12908355 17976704 17336862 10161850 3319574
40130 3319574 1548417 1937296 513748 -1826646 -3075019 -3867407 -3739780 508126 8104674
40121 8104674 11755416 7582961 2301961 3511639 7475618 5081075 -2999590 -6610689
40113f610689N481575P883048K983356j037134o34779M47472o88163k680742l405825
40104A738119j876025J761570M821653L636304p26415k602526l22965J111660
40096G541375p27467j129712K144626K976991k197309n833096j093689N192265
40088F873984K961324l614545k557097N509902P932949N75977o454815n890683
40080E336996l009197l816755m840444r48997N044483O881009L318546k377388
40072E588253o711801p015820l124478M59616m93015k525033Q99340P308005P128430
40063A513497o62710n451611j509466L124163M73331m649762l998407M15482J582664
40054i162819O1560J075992L454794J825457k454329k420756K770030N871789
$$ plain form
40113 -6610689 -1129114 6753934 9737290 8700156 8065377 8512849 7824686 5143944 1738119
40104 1738119 -137906 1623664 6445317 10081621 9355206 6752680 6429715 7541375
40096 7541375 6813908 5684196 7828822 10805813 8608504 2775408 1681719 6873984
40088 6873984 9835308 6220763 3663666 9173568 17106517 17682494 11227679 5336996
40080 5336996 2327799 -1488956 -6329400 -7278397 -2233914 4647095 7965641 5588253
40072 5588253 -1123548 -8139368 -11263846 -10804230 -11297245 -13822278 -12922938 -5614933 1513497
40063 1513497 850787 -4600824 -6110290 -2986127 -2512796 -7162558 -11160965 -10745483 -9162819
40054 -9162819 -9101259 -8025267 -4570473 -2745016 -5199345 -7620101 -4850071 1021718
40046A021718K494712k825964l501442R30032N339573M875300m91786n606861
40038B235282m974699O81503M698345K918216j235497k497208q35433O88375J541853
40029C220737K849625L683709K538194K99040j802031m408569o793308n144471
40021e557074J496207P285202O609898J676810k023439l948402o209161p069685
40013g739644m175507j152133k694789n182128j165230P584353J0943674N363110
40005A781706j028537p93203L253693M477828J836382j458255l780799n314398
39997a025583n548747l803889l84621M036120P949676Q172552L182555k963597
39989I614466m643164k532757k116125m155399l242930K480773P001489N201834
$$ plain form
40046 1021718 3516430 690466 -2810976 -1880944 3458629 8333929 7842143 2235282
40038 2235282 -2739417 -2057914 2640431 5558647 4323150 1825942 990509 1678884 3220737
40029 3220737 6070362 9754071 12292265 12591305 10789274 6380705 -412603 -5557074
40021 -5557074 -4060867 3224335 9834233 11511043 9487604 5539202 -669959 -7739644
40013 -7739644 -11915151 -13067284 -15762073 -20944201 -22109431 -14525078 -3581404 1781706
40005 1781706 753169 -40034 3213659 7691487 9527869 8069614 4288815 -1025583
39997 -1025583 -6574330 -10378219 -10762840 -6726720 1222956 9395508 12578063 9614466
39989 9614466 4971302 2438545 322420 -3832979 -7075909 -4595136 2406353 7608187
39981G608187J30635k599835k764922l317352m200821l254379p09448J461320
39973g646615K847291L917628L923296K447445J181871J464752J907575Q53333
39965A0896576r08587k212485l869486o231564o791254l519776J054162K419037
39957i163377j06110k828240k393007J053057M833073O160355M137473O17873
39949B311097j444870j093462Q1270M45284l52358k377057n090809n892752k383127
39940a5796784L035740M619254J162229j326316K302029Q620066R606178K739258
39932A4961654o141311r561696n786239L80056K925982P15458j960540j357701
39924e824337J017699J897521J934717L324226L640947j220282q000052p766432
$$ plain form
39981 7608187 7738822 5138987 2374065 -943287 -5144108 -8398487 -9107935 -7646615
39973 -7646615 -4799324 -881696 3041600 5489045 6670916 8135668 10043243 10896576
39965 10896576 9987989 7775504 3906018 -2325546 -9116800 -12636576 -11582414 -9163377
39957 -9163377 -9269487 -12097727 -14490734 -13437677 -8604604 -2444249 1693224 2311097
39949 2311097 866227 -227235 -145965 299319 -53039 -2430096 -7520905 -13413657 -15796784
39940 -15796784 -12761044 -8141790 -6979561 -8305877 -6003848 2616218 12222396 14961654
39932 14961654 8820343 -741353 -6527592 -6147536 -3221554 -2506096 -4466636 -5824337
39924 -5824337 -4806638 -2909117 -974400 2349826 5990773 4770491 -3229561 -10995993
39916a0995993J121028R215903Q794066L406854K2384j294011l481255m409807
39908B379169o32896M762764N747934K172554j652362m285727o288421n238245
39900c035230M86537N338437K585022m579148o553464j557162K522233J117127
39892c675648j225814k00633J560078P71402m54516R99927M008515N815114N674544
39883A3272969L631462J9401k459329j265196M57663k743183q566751q194644
39875e847608k34217N314388J730107m310265l780053J337886L784066L291686
39867A285990L617003K757861l036372q998564p077361J30686K367413j344842
39859a0298186j060221O396105J0645989M404651m205943m447877P00931J309773
$$ plain form
39916 -10995993 -9874965 -659062 8135004 11541858 11564242 10270231 6788976 2379169
39908 2379169 1746273 6509037 12256971 14429525 12777163 8491436 2203015 -3035230
39900 -3035230 -2548693 2789744 5374766 795618 -5757846 -7315008 -4792775 -3675648
39892 -3675648 -4901462 -5102095 -3542017 -2770615 -3225131 -2225204 1783311 7598425 13272969
39883 13272969 16904431 16923832 14464503 13199307 13656970 10913787 2347036 -5847608
39875 -5847608 -6081825 -767437 962670 -3347595 -7127648 -5789762 -2005696 1285990
39867 1285990 4902993 7660854 4624482 -4374082 -11451443 -11320757 -8953344 -10298186
39859 -10298186 -11358407 -4962302 5683687 10088338 5882395 1434518 2135449 3445222
39851C445222k588102k600853K346759M048336n83239m184257j423122K583888
39843A044632J714907r97645K94290L447130K243133k144604k638078J513794
39835D477559L023121j141522m200217n35922M830252L973268j694562m314626
39827D417351k025229o30203l040835m516651p13313N124705O451559J691502
39819F758886m548298o691611l235516J698974J793816l877527p537036j634024
39811a7272336R167521J1735051K308076p014460m758391L879337N644641p40835
39803B948604l703250K515467Q824492M794740o357112j2258285p100060K615269
39795g720135O975952L352431k367690l362586M65383L104443O87244l290518
$$ plain form
39851 3445222 857120 -1743733 603026 4651362 4068123 -116134 -1539256 1044632
39843 1044632 2759539 1761894 2056184 5503314 7746447 5601843 2963765 4477559
39835 4477559 7500680 6359158 2158941 1623019 6453271 10426539 8731977 4417351
39827 4417351 2392122 1761919 -1278916 -5795567 -6508880 -1384175 5067384 6758886
39819 6758886 2210588 -4481023 -7716539 -6017565 -4223749 -8101276 -15638312 -17272336
39811 -17272336 -8104815 3630236 5938312 -1076148 -5834539 -1955202 3689439 2948604
39803 2948604 -754646 1760821 10585313 15380053 9022941 -3235344 -10335404 -7720135
39795 -7720135 -744183 2608248 240558 -3122028 -2656645 447798 1135042 -2155476
39787b155476l281534K55820K440910K184907L128841O114955O793152K690041
39779A8171616k769383n881988p108495o953884l142136L725034P211409L655754
39771F907927q37267J091238O295147N960888k34629m029921k274415j066924
39763A1812044m144871o291393k806469J980265J736399j712979j942538J558829
39755A89287L001991o11056n430023o260305k567581J844422L315183J958048
39747d560034J026981K181177K682580J2063k370697O76439O304287N910853j001699
39738A0861950m114821J648219O558191R17361q665717r400686k904793j525398
39730f625694o535819n812902M697254J2630445Q432911l75461k775532q02431
$$ plain form
39787 -2155476 -5437010 -5181190 -2740280 -555373 2573468 8688423 15481575 18171616
39779 18171616 15402233 9520245 2411750 -4542134 -7684270 -3959236 3252173 6907927
39771 6907927 6070660 7161898 13457045 19417933 19183304 15153383 12878968 11812044
39763 11812044 7667173 1375780 -1430689 549576 2285975 572996 -1369542 189287
39755 189287 3191278 2580222 -2849801 -9110106 -11677687 -9833265 -6518082 -4560034
39747 -4560034 -3533053 -1351876 1330704 1342767 -1027930 -351491 5952796 11863649 10861950
39738 10861950 6747129 8395348 14953539 15870900 7205183 -2195503 -5100296 -6625694
39730 -6625694 -13161513 -18974415 -14277161 -1646716 6786195 6410734 3635202 2832771
39722B832771j858398l612237N82501O880037N142440m051125r179148n056609
39714h319768R10106J867149O18316J600468K538962j68803l995857m272114j646453
39705a0867994j60071m73786K04735K899856N452792N615795K944307j424879
39697D190755m783582m068653N51375M522464L827726J87209j214398J234878
39689D447774L491644J360172m012691p476346n797404q81800K995348L985991
39681a887312L461838K469119j62981m580823o879484k870514N225200R617110
39673D392153O146937l12023k299615N84571K197477p35235m167331l361720l51957
39664B093257r67764n751244q337983m098682L255278O496891L972812L46191
$$ plain form
39722 2832771 974373 -2637864 -2055363 4824674 9967114 5915989 -3263159 -8319768
39714 -8319768 -7409662 -5542513 -4924197 -3323729 -784767 -953570 -4949427 -9221541 -10867994
39705 -10867994 -11028065 -11501851 -11297116 -8397260 -2944468 2671327 5615634 4190755
39697 4190755 -592827 -4661480 -4110105 412359 4240085 4427294 3212896 4447774
39689 4447774 7939418 9299590 5286899 -2189447 -7986851 -8868651 -5873303 -1887312
39681 -1887312 1574526 4043645 3880664 -700159 -7579643 -10450157 -5224957 4392153
39673 4392153 10539090 10227067 7927452 8512023 10709500 9974265 5806934 2445214 2093257
39664 2093257 1125493 -4625751 -12963734 -17062416 -13807138 -7310247 -3337435 -2991244
39656b991244n22494N61232J376557J436724Q78232l33362q03929J277116M053649
39647D932481K774417l075105p346482n165596L00141K883716J828085M50550
39639b417793n68936k747661m507861k583547J781941L815783K381381P31085
39631d115608J81656j031951k170442K55439N575881Q046849N174783J143432
39623A3060039n95278k017606m485716m399905K24795M378536L071417p75024
39615H461258j634925o29927k507037o346510o957053m002584k002174j687404
39607a7306356O89179M603642M064651j933139n265054P0057Q167382Q613642
39599A704004J75489q647120j0535672n317234L403302J1388329J3473174O515491
$$ plain form
39656 -2991244 -3513738 -2952506 -1575949 -139225 739007 405645 -398284 878832 4932481
39647 4932481 7706898 4631793 -2714689 -7880285 -7580144 -4696428 -2868343 -2417793
39639 -2417793 -2986729 -5734390 -10242251 -12825798 -11043857 -7228074 -4846693 -4115608
39631 -4115608 -3933952 -4965903 -7136345 -6880906 -1305025 6741824 11916607 13060039
39623 13060039 12464761 10447155 5961439 1561534 1786329 6164865 9236282 8461258
39615 8461258 6826333 6196406 3689369 -2657141 -9614194 -13616778 -15618952 -17306356
39607 -17306356 -16617177 -12013535 -7948884 -9882023 -15147077 -15077020 -6909638 1704004
39599 1704004 1879493 -6767627 -17303299 -22620533 -19217231 -7828902 5644272 12159763
39591A2159763m830449j0111814m534945M693234P194096K068815k724767k050998
39583A862935Q93525J324604k26779m73007R65704J964618J688581P20924r73309
39574G747796l169067l913194k081843j05487p01959k031067j94356L903023M831564
39565D285410O47609l645008k678481K299580N302768K624334l669597q050993
39557b884378o592069r16517K994485J508787k026185j888133J952037M201428
39549c650545K166851j231961k678705j998007K69474L816155N811952K571556
39541E076770l931717o597593k970366R24487j27715k955560k124568J570611
39533a1135651M071642M976885N573508L917718j484167o083100m356895J418524
$$ plain form
39591 12159763 7329314 -2782500 -7317445 -2624211 4569885 6638700 3913933 1862935
39583 1862935 2756460 4081064 3854285 3381278 4346982 6311600 8000181 8721105 7747796
39574 7747796 4578729 665535 -1416308 -1521795 -2223754 -4254821 -4449177 -546154 4285410
39565 4285410 4933019 1288011 -1390470 909110 6211878 8836212 5166615 -2884378
39557 -2884378 -9476447 -10392964 -7398479 -5889692 -7915877 -9804010 -7851973 -3650545
39549 -3650545 -1483694 -2715655 -5394360 -7392367 -7122893 -3306738 2505214 5076770
39541 5076770 1145053 -5452540 -8422906 -7498419 -7626134 -10581694 -12706262 -11135651
39533 -11135651 -7064009 -2087124 3486384 7404102 5919935 -163165 -4520060 -3101536
39525c101536M129225K100793k13850o47582j320521k470031j406979J536314
39517a394167K550631J110215J018630L146454L308676l14468l511233k826632
39509C088106p48463n87069r55980M36446J541270m97349l297091k069493K571272
39500e18351M671480J384713k779462k166267K220088M169703Q86634l221918
39492D646620l051605k86456m17428l494921l606860J067490M048311N45843m085058
39483d634064k437925K702914K652259k823333m972703k27619M711315M683842
39475c45314L921304P007194R499925M606353n451311j1707654r642475k511546
39467d623524M375014P452888M900073j526287n503132k363536L773144M191369
$$ plain form
39525 -3101536 1027689 3128482 2914632 2267050 946529 -1523502 -2930481 -1394167
39517 -1394167 1156464 2266679 3285309 6431763 9740439 9425971 5914738 3088106
39509 3088106 2339643 1752574 796594 1233040 2774310 2276961 -1020130 -3089623 -518351
39500 -518351 4153129 5537842 2758380 592113 2812201 6981904 7868538 4646620
39492 4646620 1595015 1308559 891131 -2603790 -6210650 -5143160 -1094849 -549006 -4634064
39483 -4634064 -7071989 -4369075 -1716816 -4540149 -9512852 -9740471 -5029156 -345314
39475 -345314 3575990 10583184 20083109 24689462 19238151 7530497 -2111978 -4623524
39467 -4623524 -248510 7204378 12104451 10578164 5075032 2711496 6484640 10676009
39459A0676009k539607q049019n414718J724347M721707J349017k790864l010453
39451c333581r45696k50157r00339o02538O36991J053461J099956K713642M551355
39442D023094K603472k845104n501874j532341M143004M361024l63001l457868
39434A430406j978055Q00101J781466J571642J016076r26768m267106o389399
39426f961637m944258l77954M639012O634460L483908k294149m307938K00162
39418c928394N806802N993998K082282j88522K7896k32343j8683L329337N687551
39409A8559924K64308r189849j0430516q88076P149046M418439k555734l339350
39401C988192R13874K246199q81054m013997n329601n641791l741781Q72203M121126
$$ plain form
39459 10676009 8136402 87383 -5327335 -3602988 1118719 2467736 -323128 -3333581
39451 -3333581 -4279277 -4529434 -5429773 -6032311 -5395320 -4341859 -3241903 -528261 4023094
39442 4023094 6626566 3781462 -1720412 -3252753 890251 5251275 4888274 1430406
39434 1430406 -547649 252452 2033918 3605560 4621636 3694868 -572238 -6961637
39426 -6961637 -11905895 -12283849 -7644837 -1010377 2473531 179382 -4128556 -3928394
39418 -3928394 1878408 7872406 9954688 9766166 9794062 9561719 9543036 12872373 18559924
39409 18559924 18824232 9634383 -796133 -1684209 5464837 9883276 7327542 3988192
39401 3988192 4902066 7148265 6267211 2253214 -3076387 -8718178 -12459959 -11587756 -7466630
39392g466630K878496P34315J877841L382296N23448m187958m721026r45307K818240
39383e106285N275157O935682N089553j935746q615898q613522m542931l078520
39375a4592510l486835m18393M620708N190335J878953J426600M208760L636717
39367B464335j251419l702939j464343r4907j481806j12579N320283P385313K235124
39358I297062l400741l558312k204831m335528o541024m304399j204696k206124
39350a8458593l911750n41039N138199N980325K206556K25924J948350L418814
39342c993214K604328R96780j311492m781689n695520o2489P795251Q488022P81670
39333D821647n723409l688421K642024M858067J839858r40649l05032J387974
$$ plain form
39392 -7466630 -4588134 -3853819 -1975978 1406318 1929766 -2258192 -6979218 -7924525 -5106285
39383 -5106285 168872 7104554 12194107 10258361 1642463 -6971059 -11513990 -14592510
39375 -14592510 -18079345 -18497738 -13877030 -8686695 -6807742 -5381142 -1172382 2464335
39367 2464335 1212916 -2490023 -3954366 -4049273 -5531079 -5643658 -323375 7061938 9297062
39358 9297062 5896321 2338009 133178 -4202350 -10743374 -15047773 -16252469 -18458593
39350 -18458593 -22370343 -22911382 -17773183 -11792858 -9586302 -9360378 -7412028 -3993214
39342 -3993214 -1388886 -392106 -1703598 -6485287 -12180807 -12243296 -4448045 4039977 4821647
39333 4821647 -901762 -4590183 -1948159 2909908 4749766 3809117 3504085 4892059
39325D892059R92879j125546k156938n51672J948877J954758j479338m864218
39317c89139l869454J108293M842862L289571k093182o856646q493779p360812
39309a9822286m328428r415L977454N379170L842194J660927J060107J794183
39301f446094K335418K203994J739016P23208q03845j237746O25491K802781K170255
39292D112478p90559k508571j770809q50730n72215J114194L985760M085310K53286
39283G058144k961184k611782k234573m591977n206574J01565O184537N469710
39275A207866K78825j049270K073574K689689q13740k675281j040752n27262j891553
39266a747904l03N058368N794398L68575l021808j11443J992723j823181m734525
$$ plain form
39325 4892059 5884938 4759392 2602454 2050782 3999659 5954417 4475079 -389139
39317 -389139 -4258593 -3150300 1692562 4982133 2888951 -3967695 -12461474 -19822286
39309 -19822286 -24150714 -24160129 -20182675 -14803505 -10961311 -9300384 -8240277 -6446094
39301 -6446094 -4110676 -1906682 -167666 555542 -248303 -1486049 -860558 1942223 4112478
39292 4112478 3321919 813348 -957461 -1808191 -2380406 -1266212 2719548 6804858 7058144
39283 7058144 4096960 1485178 -749395 -5341372 -10547946 -10446381 -4261844 1207866
39275 1207866 1486691 437421 2510995 5200684 4386944 1711663 670911 143649 -1747904
39266 -1747904 -1748207 3310161 9104559 9473134 6451326 6339883 8332606 6509425 1774900
39257A774900l81335M682447J918723m003334l329071J682791J194229m569060
39249a029710n983765j020279J964910n10911j665513K354451N035456O97365
39241a57996n359593m371503L394165R288342O849576j834265q881601q259592
39233i332467j878921K436839O36473k530896j388514J773514J576928l86263
39225i093307J290763M749497K771479m182386p005357k093555L222692K853130
39217g487044L97031P71675J980746J128507R35124L316974L239364k948819q443265
39208g109707m362215O056472J0831212N591523k092203n109270n310414p028978
39200h533580q827574o369903M1034N449662O861212O376972O994266P621229
$$ plain form
39257 1774900 1393565 6076012 7994735 3991401 662330 2345121 3539350 -1029710
39249 -1029710 -7013475 -8033754 -6068844 -6579755 -8245268 -5890817 -855361 -157996
39241 -157996 -5517589 -9889092 -6494927 2793415 9642991 7808726 -1072875 -9332467
39233 -9332467 -11211388 -8774549 -8138076 -10668972 -12057486 -10283972 -8707044 -9093307
39225 -9093307 -7802544 -3053047 -281568 -4463954 -11469311 -13562866 -10340174 -7487044
39217 -7487044 -7090013 -6318338 -4337592 -3209085 -2273961 1043013 4282377 1333558 -7109707
39208 -7109707 -11471922 -5415450 5415762 11007285 8915082 3805812 -1504602 -8533580
39200 -8533580 -17361154 -23731057 -23690023 -18240361 -11379149 -5002177 1992089 9613318
39192I613318M660995j707402n928228l977100M82216P67530l214371n167498
39184d470540k445294R7605j434647l458016j068772L776585N455050L086790
39176d61239M96859l06430n16657n00196Q09521K814587L531005K622147P89103
39167I278700k708979p894542j0712289o977171N86276M696402L535505K771730
39159g424368N891273Q386229N123774j370456m864016m327107l450696l161476
39151e196843n92867M357483P023226M485837j29866k534209l058624m250590
$$ plain form
39192 9613318 14274313 12566911 6638683 2661583 3143799 3911329 696958 -4470540
39184 -4470540 -6915834 -6818229 -8252876 -11710892 -12779664 -9003079 -3548029 -461239
39176 -461239 35620 -270810 -787467 -1287663 -478142 2336445 5867450 8489597 9278700
39167 9278700 6569721 -1324821 -12037110 -19014281 -18428005 -13731603 -10196098 -7424368
39159 -7424368 -1533095 6853134 11976908 10606452 5742436 1415329 -2035367 -5196843
39151 -5196843 -5789710 -1432227 5590999 10076836 9946970 7412761 4354137 103547
$$ [...]
##END NTUPLES=NMR SPECTRUM
##END=
