##TITLE=31Pdec_PhEPA0207
 D2O, 24 sc
 5.07.2021
##JCAMPDX= 6.0         $$ Bruker NMR JCAMP-DX V2.0
##DATA TYPE= NMR SPECTRUM
##DATA CLASS= NTUPLES
##ORIGIN= UXNMR, Bruker Analytische Messtechnik GmbH
##OWNER= root
$$ XWIN-NMR		Version 3.5
$$ Mon Jul  5 10:14:03 2021 Russian Standard Time (UT+4h)  she@DPX200
##.OBSERVE FREQUENCY= 81.013821
##.OBSERVE NUCLEUS= ^31P
##.ACQUISITION MODE= SIMULTANEOUS
##.ACQUISITION SCHEME= undefined
##.AVERAGES= 24
##.DIGITISER RES= 16
##SPECTROMETER/DATA SYSTEM= spect
##.PULSE SEQUENCE= zgpg30
##.SOLVENT NAME= D2O
##.SHIFT REFERENCE= (INTERNAL, D2O, 0, 248.564)
##AUDIT TRAIL= $$ (NUMBER, WHEN, WHO, WHERE, WHAT)
$$ ##TITLE= Audit trail, XWIN-NMR		Version 3.5
$$ ##JCAMPDX= 5.01
$$ ##ORIGIN= Bruker BioSpin GmbH
$$ ##OWNER= she
$$ F:/spectra/data/she/nmr/P31/1/pdata/1/auditp.txt
$$ ##AUDIT TRAIL=  $$ (NUMBER, WHEN, WHO, WHERE, WHAT)
(   1,<2021-07-05 10:12:25.81 +0400>,<she>,<DPX200>,
      <created by zg, POWCHK disabled, PULCHK disabled
       configuration hash MD5:
       00 E9 B6 7A A2 85 ED C7 34 08 36 98 17 FE 4E 26
       data hash MD5: 32K
       42 2A 2A 9A E6 C5 58 66 89 5F 14 78 78 E6 59 40>)
(   2,<2021-07-05 10:12:28.76 +0400>,<she>,<DPX200>,
      <Start of raw data processing
       efp BC_mod = 2 LB = 1 FT_mod = 6 PKNL = 1 PHC0 = -7050.882 PHC1 = -788.114 SI = 64K 
       data hash MD5: 64K
       41 AC 66 2A 37 4E DB 57 48 0F E5 E4 8A EA 8C 4D>)
(   3,<2021-07-05 10:12:46.89 +0400>,<she>,<DPX200>,
      <pk PHC0 = 40.38012 PHC1 = -68.60001 
       data hash MD5: 64K
       1C CC A3 9E 73 03 34 58 76 E6 27 1D 59 FD 75 B3>)
(   4,<2021-07-05 10:12:50.26 +0400>,<she>,<DPX200>,
      <abs ABSG = 5 
       data hash MD5: 64K
       DA E5 A4 91 05 5D 33 7E AA 47 A3 5C 05 0D 04 86>)
(   5,<2021-07-05 10:13:18.64 +0400>,<she>,<DPX200>,
      <pk PHC0 = 6.823489 PHC1 = -8.599999 
       data hash MD5: 64K
       D7 6E 61 23 A2 05 24 9E 8F 7D 7D DA 2E 5E 62 5D>)
(   6,<2021-07-05 10:13:22.26 +0400>,<she>,<DPX200>,
      <abs ABSG = 5 
       data hash MD5: 64K
       B3 14 57 DC E4 66 11 E6 A3 8C C9 08 D0 D7 E6 BB>)
$$ ##END=
$$ 
$$ hash MD5
$$ 7B F1 F8 F4 E2 C9 A3 84 C5 DD 88 96 46 F2 71 CE
##$RELAX= 
##$RELAX= 
##$RELAX= 
##$RELAX= 
##$RELAX= 
##$RELAX= 
##$RELAX= 
##$RELAX= 
$$ Bruker specific parameters
$$ --------------------------
##$DU= <F:/spectra>
##$EXPNO= 1
##$NAME= <P31>
##$PROCNO= 1
##$TYPE= <nmr>
##$USER= <she>
##$AMP= (0..31)
100 100 100 100 100 100 100 100 100 100 100 100 100 100 100 100 100 100 
100 100 100 100 100 100 100 100 100 100 100 100 100 100 
##$AQSEQ= 0
##$AQ_mod= 1
##$AUNM= <au_zg>
##$AUTOPOS= <>
##$BF1= 81.014009
##$BF2= 200.13
##$BF3= 200.13
##$BF4= 200.13
##$BF5= 200.13
##$BF6= 200.13
##$BF7= 200.13
##$BF8= 200.13
##$BYTORDA= 1
##$CFDGTYP= 0
##$CFRGTYP= 5
##$CHEMSTR= <none>
##$CNST= (0..31)
1 1 145 1 1 1 1 1 1 1 1 1 1 1 1 1 1 1 1 1 1 1 1 1 1 1 1 1 1 1 1 1 
##$CPDPRG= <waltz16>
##$CPDPRG1= <>
##$CPDPRG2= <waltz16>
##$CPDPRG3= <>
##$CPDPRG4= <mlev>
##$CPDPRG5= <mlev>
$$ [...]
##$SUBNAM3= <"">
##$SUBNAM4= <"">
##$SUBNAM5= <"">
##$SUBNAM6= <"">
##$SUBNAM7= <"">
##$SUBNAM8= <"">
##$SUBNAM9= <"">
##$SW= 501.771253377433
##$SWIBOX= (0..15)
0 1 3 0 0 0 0 0 0 0 0 0 0 0 0 0 
##$SW_h= 40650.406504065
##$TD= 32768
##$TD0= 1
##$TE= 0
##$TE2= 300
##$TE3= 300
##$TEG= 300
##$TL= (0..7)
0 120 53 12 22 120 120 120 
##$TP= (0..7)
150 150 150 150 150 150 150 150 
##$TP07= 0
##$TPNAME0= <>
##$TPNAME1= <>
##$TPNAME2= <>
##$TPNAME3= <>
##$TPNAME4= <>
##$TPNAME5= <>
##$TPNAME6= <>
##$TPNAME7= <>
##$TPOAL= (0..7)
0.5 0.5 0.5 0.5 0.5 0.5 0.5 0.5 
##$TPOFFS= (0..7)
0 0 0 0 0 0 0 0 
##$TUNHIN= 0
##$TUNHOUT= 0
##$TUNXOUT= 0
##$USERA1= <user>
##$USERA2= <user>
##$USERA3= <user>
##$USERA4= <user>
##$USERA5= <user>
##$V9= 5
##$VALIST= <valist>
##$VCLIST= <CCCCCCCCCCCCCCC>
##$VD= 0
##$VDLIST= <DDDDDDDDDDDDDDD>
##$VPLIST= <PPPPPPPPPPPPPPP>
##$VTLIST= <TTTTTTTTTTTTTTT>
##$WBST= 1024
##$WBSW= 4
##$XGAIN= (0..3)
0 0 0 0 
##$XL= 0
##$YL= 0
##$YMAX_a= 6528
##$YMIN_a= -6319
##$ZGOPTNS= <>
##$ZL1= 120
##$ZL2= 120
##$ZL3= 120
##$ZL4= 120
##$ABSF1= 248.5645
##$ABSF2= -253.2056
##$ABSG= 5
##$ABSL= 3
##$ALPHA= 0
##$AQORDER= 0
##$ASSFAC= 0
##$ASSFACI= 0
##$ASSFACX= 0
##$ASSWID= 0
##$AUNMP= <proc_1d>
##$AZFE= 0.1
##$AZFW= 0.5
##$BCFW= 0
##$BC_mod= 2
##$BYTORDP= 0
##$COROFFS= 0
##$CY= -3
##$DATMOD= 1
##$DC= 0
##$DFILT= <>
##$DTYPP= 0
##$F1P= 0
##$F2P= 0
##$FCOR= 1
##$FTSIZE= 65536
##$FT_mod= 6
##$GAMMA= 0
##$GB= 0
##$INTBC= 1
##$INTSCL= 5.30512e-09
##$ISEN= 30
##$LB= 1
##$LEV0= 0
##$LPBIN= 0
##$MAXI= 10000
##$MC2= 0
##$MEAN= 0
##$ME_mod= 0
##$MI= 50
##$NCOEF= 0
##$NC_proc= -7
##$NLEV= 6
##$NOISF1= 182.463
##$NOISF2= 159.3651
##$NSP= 0
##$NTH_PI= 0
##$NZP= 0
##$OFFSET= 248.5645
##$PC= 4
##$PHC0= -7003.678
##$PHC1= -865.3141
##$PH_mod= 1
##$PKNL= yes
##$PPARMOD= 0
##$PSCAL= 0
##$PSIGN= 0
##$REVERSE= no
##$SF= 81.014009
##$SI= 65536
##$SIGF1= 159.3651
##$SIGF2= -187.1042
##$SINO= 113.3802
##$SIOLD= 16384
##$SREGLST= <1H.CDCl3>
##$SSB= 0
##$STSI= 65536
##$STSR= 0
##$SW_p= 40650.406504065
##$SYMM= 0
##$S_DEV= 0
##$TDeff= 32768
##$TDoff= 0
##$TI= <>
##$TILT= no
##$TM1= 0
##$TM2= 0
##$TOPLEV= 0
##$USERP1= <user>
##$USERP2= <user>
##$USERP3= <user>
##$USERP4= <user>
##$USERP5= <user>
##$WDW= 1
##$XDIM= 65536
##$YMAX_p= 408848788
##$YMIN_p= -11594488
$$ End of Bruker specific parameters
$$ ---------------------------------
##NTUPLES= NMR SPECTRUM
##VAR_NAME=  FREQUENCY,     SPECTRUM/REAL,   SPECTRUM/IMAG
##SYMBOL=    X,             R,               I
##VAR_TYPE=  INDEPENDENT,   DEPENDENT,       DEPENDENT
##VAR_FORM=  AFFN,          ASDF,            ASDF
##VAR_DIM=   65536,         65536,           65536
##UNITS=     HZ,            ARBITRARY UNITS, ARBITRARY UNITS
##FACTOR=    0.620285442955139, 1,           1
##FIRST=     20137.2065510759, 0,            0
##LAST=      -20513.1999529892, 0,           0
##MIN=       -20513.1999529892, -11594488,   0
##MAX=       20137.2065510759, 408848788,    0
$$ Real data points
##PAGE= N=1
##DATA TABLE= (X++(R..R)), XYDATA
$$ [...]
13137a468685k12241p96010K76407Q01966k49286r93836m13936j19602o31914
13128c807137J65562K615097L309700M78233k381501j749965M42915N59399o49608
13119a017305k72594R71435K58013j694080j682351J87628Q43812j4448L79678
13110b040212K164279J942437j245384l630451k317187N83343J627440Q07223
13102b108512K73929N94459P22387L42977J79217N30988Q31296M73134m40070
13093A399805j048389o38287J95302J80630m10760J34638J660168J369230j566488
13084A275849l342962q25385K836110K338940j580611l273763r53326J234785
13076b290363N39381n15923O24391K306202K182312R86489K24488m66917j249439
$$ y = [-1468685, -1680926, -2476936, -2200529, -1398563, -1647849, -2641685, -3055621, -3175223, -3807137, -3641575, -1026478, 2283222, 2761455, 379954, -1370011, -927096, -367697, -1017305, -1289899, -318464, -60451, -1754531, -3436882, -3249254, -2405442, -2419890, -2040212, 124067, 2066504, 821120, -2809331, -5126518, -4543175, -2915735, -2108512, -1834583, -1240124, -517737, -174760, 4457, 535445, 1366741, 1839875, 1399805, 351416, -286871, -91569, 89061, -321699, -187061, 1473107, 2842337, 1275849, -2067113, -2892498, -56388, 2282552, 701941, -2571822, -3525148, -2290363, -1750982, -2266905, -1642514, 663688, 2846000, 3832489, 4056977, 3590060, 2340621]
13067B340621o95251J104989J371293q05773k101146k14882J790341K02727k999647
13058f728k934128O84020L264338K085107n58590j288361K07479J632515Q88563
13049C974215j882012m061282k910453R47244L656911K892878P11247J2675L05915
13040C647338m76804j825972j597960m3494M91196m83528j103193o10395l21627
13031b324439p54923n80384P63211J780815J296094K38205k3508L09763J44508
13022H49342p96456j707955j542945R4182K219695K828010J022565j407328j823257
13013b64147o6554J474982J170768j00055q71548j085638j265106j051600J34436
13004a924462J686681K297564J639629O44884J41501k6887l70845q68069j099710
$$ y = [2340621, 1645370, 2750359, 4121652, 3315879, 1214733, 999851, 2790192, 2992919, -6728, -2940856, -2256836, 1007502, 3092609, 2534019, 1245658, 1453137, 3085652, 3974215, 2092203, -1969079, -4879532, -3932288, -275377, 2617501, 3328748, 3341423, 3647338, 3170534, 1344562, -253398, -296892, 194304, -289224, -1392417, -2002812, -2324439, -3079362, -3659746, -2896535, -1115720, 180374, 418579, 395071, 704834, 849342, 52886, -1655069, -3198014, -3103832, -884137, 1943873, 2966438, 1559110, -264147, -330701, 1144281, 2315049, 2214994, 1343446, 257808, -1007298, -2058898, -1924462, -237781, 2059783, 3699412, 4344296, 4485797, 4458910, 4088065, 3219996, 2120286]
12995B120286r40226o53447m30475l15973n49900j316741j973703j353162O03215
12986d810126K260610K148325P70245l46253p14050q17778o51134J25405R30911
12977a103845Q06457L2417m11507p29494j722779k496888j150996J868551L545760
12968a362324K278994j32758j470868j787669j813902j008613Q30302J845299
12960b621539L89381j992071k090131P60347L720373L772454R44756j947772k350584
12951a414786o42761N72692P3061l59301Q09994J730511N9241k354001j710410
12942c235760J214964J646814j351614k921476l29477K509780J776924j0661R33366
12933B32860K678241J262220j854743k167798J17307R18824l72879o28851M73271
$$ y = [2120286, 1180060, 526613, 96138, -219835, -769735, -2086476, -4060179, -5413341, -4810126, -2549516, -401191, 369054, 22801, -691249, -1509027, -2160161, -2034756, -1103845, -297388, -264971, -676478, -1405972, -3128751, -5625639, -6776635, -4908084, -1362324, 916670, 783912, -686956, -2474625, -4288527, -5297140, -4466838, -2621539, -2232158, -4224229, -6314360, -5554013, -1833640, 1938814, 2883570, 935798, -1414786, -2057547, -1484855, -1411794, -1771095, -961101, 769410, 828651, -1525350, -3235760, -2020796, -373982, -1725596, -4647072, -4976549, -2466769, -689845, -700506, 232860, 2911101, 4173321, 2318578, 150780, 268087, 1186911, 814032, 185181, 658452]
12924F58452j2622j947636j642165J128279J865956q66574k385272L49524L318062
12915D66004J848033j953349k892395o93898O21422m20657j204244J90957K451296
12906a586831L469352K659171O82094j234351j860572j300559j155883k075957
12898b403536k362919o96601J224322J060087m22865p29823J72072K24874n56288
12889d490677J20388K347282K952606M74857j929043r17038K070679L088569J293352
12880E010975p89635j625440j975381k054109q24870J174575J530827j60484j093092
12871h06634K07122J132800n17669k169468m91487K334557J389832k685624l795115
12862e401686K67310M068909K677686j239099k231887k39637P10525m39350j047759
$$ y = [658452, 645830, -1301806, -2943971, -1815692, 50264, -816310, -3201582, -2852058, 466004, 2314037, 360688, -2531707, -3225605, -2604183, -3024840, -4229084, -4038127, -1586831, 1882521, 4541692, 5223786, 3989435, 2128863, 828304, -327579, -2403536, -4766455, -5463056, -4238734, -3178647, -3601512, -4331335, -4159263, -3934389, -4490677, -4370289, -2023007, 929599, 1404456, -524587, -1441625, 629054, 3717623, 5010975, 4221340, 2595900, 620519, -1433590, -2258460, -1083885, 446942, 286458, -806634, -599512, 533288, 15619, -2153849, -2645336, -310779, 1079053, -1606571, -5401686, -5134376, -1065467, 1612219, 373120, -1858767, -2098404, -1387879, -1827229, -2874988]
12853b874988j22137L63259l59730n01722O37998J169306J0325j076042l61252
12844c114983J159272J549418P64638J54187K24424K93565j50643p66895r32218
12835h19235n37322j23169r9968N5534J037522K009772J095363j613609l168594
12826b163706j434306J749875L012598J869206M49035k09352r08473j747296j567083
12817i49502j72679J135425J527858J259787L62055j232986k336618j538638K79225
12808a666073P28590n57372j445099o29386Q97154K055738K855070K789549P70461
12799E798632k276874l335457j351818Q41967M27992j480317j897245n22114J78433
12790c616801r94066k051542n84257K730314M491070K569257j041814k439471
$$ y = [-2874988, -2997125, -2633866, -2993596, -3495318, -2857320, -1688014, -1677689, -2753731, -3114983, -1955711, -406293, 358345, 512532, 736956, 1030521, 879878, 112983, -819235, -1356557, -1479726, -1579694, -1524160, -486638, 1523134, 2618497, 1004888, -2163706, -3598012, -1848137, 1164461, 3033667, 3482702, 3273350, 2364877, 617581, -949502, -1122181, 13244, 1541102, 2800889, 3162944, 1929958, -406660, -1945298, -1666073, -937483, -1494855, -2939954, -3569340, -2672186, -616448, 2238622, 5028171, 5798632, 3521758, 186301, -1165517, -323550, 104442, -1375875, -3273120, -3795234, -3616801, -4610867, -6662409, -7246666, -4516352, -25282, 2543975, 1502161, -937310]
12782i37310p13037J088855N20944q95700n85933Q55569J023427j73577q55621
12773f72383o99607q27682q03271O94838K465933J854898o24324j654874n79625
12764h46097l20058j856485k211417K16900K480907J780459k61677q34921l17649
12755b170038m58048r12460o21260k86859n90893j90624J642409K679268J119354
12746B10849q79487m46034J189285Q32103j255714k007165p08454L64997J43113
12737b556507J8354Q05242J560878J719809J727939J349894j58323k006088k383016
12728G8182j261179m63952o74236n21856Q78226K332468K158989J84009k124542
12719E86109k785997j013277J439974J697445m33535j684611N6352K339406J790607
$$ y = [-937310, -1650347, -561492, -40548, -936248, -1522181, -666612, 356815, 183238, -672383, -1371990, -2199672, -3002943, -2308105, 157828, 2012726, 1388402, -266472, -846097, -1166155, -3022640, -5234057, -5017157, -2536250, -755791, -1017468, -1852389, -2170038, -2628086, -3540546, -4161806, -4448665, -5039558, -5230182, -3587773, -908505, 210849, -668638, -1114672, 74613, 906716, -348998, -2356163, -3064617, -2699620, -2556507, -2538153, -1732911, -172033, 1547776, 3275715, 4625609, 4467286, 2461198, 78182, -1182997, -1646949, -2321185, -2843041, -1964815, 367653, 2526642, 2710651, 586109, -2199888, -3213165, -1773191, -75746, -509281, -2193892, -2137540, 201866, 1992473]
12710A992473p63202k012714j466636j205376j316300Q0450K364733K450857N6606
12701A80891j270791K21086J735817O97854j251287j412481j93925N51476Q78925
12692A37565J574193J580546l27099k537838k278465K27374J895982J028809p84852
12683E16215j304180l91419N17961N45054J53468J48196M59748K98988m37795
12674E06236o67285K12953R51233J95010r91334m70256J271707J405802o98053
12665A716013k063192o53674J346225R80316r26026j383624K1133R02097n5124
12656a15856j628908k315814j839753m24527J495817K773668K452425J221661
12648A618713N18981M06601j03278r74690j227070q40751o39536m47158N17327
$$ y = [1992473, 1229271, -783443, -2250079, -3455455, -4771755, -4691305, -2326572, 124285, 180891, -1089900, -868814, 867003, 1564857, 313570, -1098911, -1292836, -741360, 137565, 1711758, 3292304, 2965205, 427367, -1851098, -1623724, 272258, 1301067, 516215, -787965, -1179384, -661423, -116369, 37099, 185295, 645043, 944031, 506236, -161049, 51904, 1003137, 1198147, 206813, -263443, 1008264, 2414066, 1716013, -347179, -1000853, 345372, 1325688, 399662, -983962, -962829, -60732, -115856, -1744764, -4060578, -5900331, -6324858, -4829041, -2055373, 397052, 1618713, 2137694, 2544295, 2441017, 1466327, 239257, -601494, -1241030, -1688188, -1170861]
12639a170861J489035Q37749q64292j108039N46760J510923M03994n93421M40331
12630A492179J615752K75540k303432k572792k31144J259404j66259k418619k574929
12621e624300p45445P23443N67880k08310K3025J499644K664653J754132r75008
12612c20286l017072k272705M72735K538520K386094P41314q04815j170665k26540
12603a673420Q82557L70596j830884l047135j075899K207267K946801P81120p83746
12594a222743P1003R19776l90422j889898q23060J545182J793122k62617j490186
12585a749843n04789M77279l96025j528186m30719K274629L446124J641791r91008
12576B239253j637879m34375K07830n67398r59893P8370O65213p70596k139450
$$ y = [-1170861, 318174, 1155923, 291631, -816408, -269648, 1241275, 1645269, 1051848, 1492179, 3107931, 3383471, 1080039, -1492753, -1723897, -464493, -630752, -3049371, -5624300, -6369745, -5646302, -5078422, -5286732, -5263707, -3764063, -1099410, 654722, -320286, -3337358, -5610063, -5137328, -2598808, -212714, 528600, -276215, -1446880, -1673420, -790863, -420267, -2251151, -5298286, -6374185, -4166918, -1220117, -438997, -1222743, -1151740, -231964, -622386, -2512284, -3335344, -1790162, 2960, -259657, -1749843, -2254632, -1777353, -2173378, -3701564, -4132283, -1857654, 1588470, 3230261, 2239253, 601374, 166999, 374829, -192569, -1152462, -1074092, -408879, -1179475, -3318925]
12567c318925q24495J274256K06069k912438k550945K292537N435335K698858
12559B300252j532278j389180J335698R35652k462477l556086q42941J675052
12551c536308J682246J283860J751002J236453p23524j512213j71969O70863l71421
12542C08989r91028K56443J114861r3923j279240n30871M02786k70596p40885
12533a823464Q68603K367954Q93774j939751k389263l59445J148971J088015R55904
12524H11298J159314N51480o70779r36063j22985M27742N21443R60651J095937
12515C798038m50177k597116k480564J07721J858898O03436j644133j781685R4192
12506b491390J271975L45542j110077q34285J094882K204895P02799k067794l239850
$$ y = [-3318925, -4143420, -2869164, -2663095, -5575533, -8126478, -5833941, -398606, 2300252, 767974, -621206, 714492, 1650144, -812333, -4368419, -5211360, -3536308, -1854062, -570202, 1180800, 2417253, 1693729, 181516, 9547, 680410, 308989, -682039, -425596, 689265, 595342, -683898, -1214769, -811983, -1082579, -1823464, -954861, 1413093, 2306867, 367116, -2022147, -2381592, -1232621, -144606, 811298, 1970612, 2522092, 1851313, 915250, 792265, 1220007, 1741450, 2702101, 3798038, 3347861, 750745, -1729819, -1622098, 236800, 840236, -803897, -2585582, -2491390, -1219415, -873873, -1983950, -2818235, -1723353, 481542, 1184341, -883453, -4123303]
12497d123303k143948p42385k39461M15131J702560J858940K8743j267863L25613
12488d185973K744003K165000j071929k844576j339121Q35236J144515L69392
12480b183453J43102J65922l62894p26897m8631Q43058P32916J37453L45278J026990
12470G2844N91577j149990k267401j248222P80434J407187J99601o54347M98897
12461a769420K189373J849237k62962j301614j05597J199726P97466q4883K07037
12452B718363N92392p59992k813858k947937j086529L41404L18401K68252R19782
12443b449722R01687n80760j889286j169851R47422K163384J333716m24797j175497
12434b343704k72640R66051Q39049n58871j527219j253936p43429p13246l91617
$$ y = [-4123303, -6267251, -7009636, -7249097, -6833966, -5131406, -3272466, -3243723, -4511586, -4185973, -1441970, 723030, -348899, -3193475, -4532596, -3697360, -2552845, -2183453, -2040351, -1874429, -2237323, -2964220, -3012851, -2169793, -1436877, -1299424, -954146, 72844, 664421, -485569, -2752970, -4001192, -3220758, -1813571, -1613970, -2268317, -1769420, 419953, 2269190, 2006228, 704614, 599017, 1798743, 2596209, 2511326, 2718363, 3310755, 2550763, -263095, -3211032, -4297561, -3956157, -3637756, -3369504, -2449722, -1548035, -2128795, -4018081, -5187932, -4240510, -2077126, -743410, -1168207, -2343704, -2616344, -1650293, -811244, -1370115, -2897334, -4151270, -4894699, -5607945, -5999562]
12425e999562M71719N19703m86785j45207K703002M697391K242457k390189l590066
12416a977537n03712K039332J080781p45159n00627N35392J60960o15613R5460
12407d30723J247509O40273j195399j856422o97700Q44065J598252J252373l21717
12398A080511k265759k377490K01062K860810K429011m80170k394388j810877
12390b757290n67178l64531m72458L03138J340991J154581l95296j830337j617794
12381e206174L44367K448069K640971N41165j862915k298438p81812O84849P46790
12372b743128n885l67549n2036M49299P14405O16290K08997k20947k95472J7964
12362a678062L23789K80885J3658k0560M25879Q58700K40488j669190l218968
$$ y = [-5999562, -5527843, -5008140, -5494925, -5640132, -2937130, 1760261, 4002718, 1612529, -1977537, -2481249, -441917, 638864, -106295, -606922, -71530, 89430, -526183, -430723, 816786, 1457059, 261660, -1594762, -2292462, -1448397, 149855, 1402228, 1080511, -1185248, -3562738, -3361676, -500866, 1928145, 1447975, -946413, -2757290, -3324468, -3688999, -4161457, -3858319, -2517328, -1362747, -1758043, -3588380, -5206174, -4861807, -2413738, 227233, 768398, -1094517, -3392955, -4174767, -3489918, -2743128, -2749013, -3116562, -3168598, -2719299, -2004894, -1388604, -1179607, -1400554, -1696026, -1678062, -1354273, -1073388, -1059730, -1080290, -654411, 204289, 444777, -1224413, -4443381]
12353d443381k256073Q48257K900426J857828j46120K20760K328748K317717p74516
12344B853646k951056j069952K161741K004309j357227l379713k011089L9355
12336c709986M22296N45249J988594K948894J209596j664716k413792r59834Q1257
12327a552442j01582R4670J055864J145909j3355o03453J29557M65471p44804
12318a24165k069227j840140l87197J237788K621060K954276J067839k019170
12310A441064l022999p46615J743815J375094o76926j378961m61501J46126p4289
12301a655192r9732K50462M64452Q49496J423841O31388k037157l604007j250111
12292e026560K695306L392237O37168r54321P48186K363064P16993k390208l461203
$$ y = [-4443381, -6699454, -5851197, -2950771, -1092943, -1239063, -1018303, 1310445, 3628162, 2853646, -97410, -1167362, 994379, 2998688, 1641461, -1738252, -3749341, -3709986, -3287690, -2742441, -753847, 2195047, 3404643, 1739927, -673865, -1633699, -1552442, -1654024, -1559354, -503490, 642419, 629064, 25611, 155168, 620639, -124165, -2193392, -4033532, -4420729, -3182941, -561881, 2392395, 3460234, 1441064, -1581935, -2328550, -584735, 790359, 113433, -1265528, -1727029, -1580903, -1655192, -1754924, -1504462, -1040010, -190514, 1233327, 1864715, -172442, -3776449, -5026560, -2331254, 1060983, 1698151, 743830, 1492016, 3855080, 4572073, 2181865, -1279338]
12283a279338k265824q65523R4376J326012K471028K323081R84810j13854j53675
12274B521093M32449R57442R87697J25641j604772l126588k966488r25127J353395
12265b245258J993545J020257K40650O62993J001737q2514j273246m28004J343237
12256B233397P16603k162652k953723M0105K402969L10841l039375k392680J068753
12247c775762J940084l69959j180223J115339K627846J016433r30710q00117m16149
12238g73218j545880k247198n38884J944256K851775K506843J885866M34650j599180
12229B919030j964299j97751P19534o76650j277551J288509L803964K169636j854957
12220D929465l281792j302161N40713K60150q75431j671463j962904r17544J769516
$$ y = [-1279338, -3545162, -4410685, -4316309, -2990297, -519269, 1803812, 2788622, 2674768, 2521093, 2953542, 3910984, 4898681, 5024322, 3419550, 292962, -2673526, -3598653, -2245258, -251713, 768544, 1009194, 1672187, 2673924, 2591410, 1318164, 890160, 2233397, 2950000, 787348, -2166375, -2126270, 276699, 587540, -2451835, -4844515, -3775762, -1835678, -2205637, -3385860, -2270521, 357325, 1373758, 443048, -357069, -773218, -2319098, -4566296, -5105180, -3160924, -309149, 2197694, 4083560, 4518210, 2919030, 954731, 756980, 1476514, 799864, -477687, 810822, 4614786, 6784422, 4929465, 1647673, 345512, 886225, 1146375, 270944, -1400519, -3363423, -4280967, -2511451]
12211b511451L605758K035443j077229j552417Q86398K457917J272850o35948
12203D481321j503729j956474k206343j097310Q43148J071392p46552j553674
12195b668221L39079K484274K273529P37532M9313j48580j194228k228033j536267
12186a891602J82218P03376k07608o43000L20853J479049J592196R35039M44057
12177B914578M79560O83081L71653q26385k201031k346483j030519P1284m23284
12168b307546j415534q31218J138851K122755J005950n42444o72531R5909R8548
12159a307260q05188j224844l96135R69654J861214J915190J218091J42727n50945
12150A822504l39134K47082K22163m76948j126975j555067k059125k071745o32807
$$ y = [-2511451, 1094307, 3129750, 2052521, 500104, 1386502, 3844419, 5117269, 4481321, 2977592, 1021118, -1185225, -2282535, -1439387, -367995, -1114547, -2668221, -2329142, 155132, 2428661, 3166193, 3215506, 3066926, 1872698, -355335, -1891602, -1709384, -1006008, -1213616, -1856616, -1535763, -56714, 1535482, 2470521, 2914578, 3394138, 4077219, 4448872, 3622487, 1421456, -925027, -1955546, -1884262, -2307546, -3723080, -4554298, -3415447, -1292692, -286742, -829186, -1501717, -1405808, -1307260, -2112448, -3337292, -3733427, -2763773, -902559, 1012631, 2230722, 2373449, 1822504, 1483370, 1730452, 1952615, 1475667, 348692, -1206375, -3265500, -5337245, -5970052]
12141e970052J466239J984319N19370n43250L13127J213379l6813k222836k579389
12132e855906r74954N62731J470670K686572L608907K379502n87988k427550j771895
12123i09911k72949L11433p009q42397j925998j785953R55240M248193L958646
12114C729295k32523l651739k992644m85631L63976j66784Q13O44388M11502o2524
12104b441871N57440J529489J458747R51230J064135P54383j124678k798279j803602
12095a853006Q67966K076251J136186K6883k59846m53643n80384J44716J180225
12086B285348J103362J7815p86343j035253j081980l32005J324422J764759m96976
12077B763149k871323j836336J373101K370382M13490r70420k46061J15034j193157
$$ y = [-5970052, -4503813, -2519494, -2000124, -2543374, -2230247, -1016868, -1053681, -3276517, -5855906, -6830860, -6268129, -4797459, -2110887, 1498020, 3877522, 3289534, 861984, -909911, -1182860, -871427, -878436, -1720833, -3646831, -5432784, -4477544, -229351, 3729295, 3496772, -154967, -3147611, -3633242, -3269266, -3436050, -3435237, -2790849, -2379347, -2441871, -1884431, -354942, 1103805, 2055035, 3119170, 3873553, 2748875, -49404, -1853006, -985040, 1091211, 2227397, 2254280, 1994434, 1540791, 960407, 1105123, 2285348, 3388710, 3406525, 2620182, 1584929, 502949, 170944, 1495366, 3260125, 2763149, -108174, -1944510, -571409, 1798973, 2212463, 1242043, 995982, 1111016, -82141]
12068h2141j921015p62299J43663o01188r58842N32352J725843P10502o21440
12059a834565j2185J063010J72299j619915j687963l36193K74232J97848J000106
12050b783326K016655J110813j212169k049193o29085O55115K89143k54264N51558
12041b304753J725110J510110l3144j420623j632132p66330L30157O22709r6399
12032b065295o24619K02523J530080J352487m91035j831920j228381J25884N02776
12023b527500J87789N40223J514943J740360O93857o29575j221943j089827o39162
12014a430835k8345N54686P43458M80468R3788l06829q36715j037770k1367J973828
12004A84367L061462J797153p26752k037986j296027N0489N52115L60710K49166
$$ y = [-82141, -2003156, -2765455, -2621792, -3222980, -4181822, -3649470, -1923627, -1213125, -1834565, -1846750, -783740, -611441, -2231356, -3919319, -4255512, -3981280, -3783432, -2783326, -766671, 344142, -868027, -2917220, -3546305, -2891190, -2602047, -2856311, -2304753, -579643, 930467, 897323, -523300, -2155432, -2921762, -2591605, -1968896, -2065295, -2689914, -2487391, -957311, 395176, -95859, -1927779, -3156160, -3030276, -2527500, -2339711, -1799488, -284545, 1455815, 2149672, 1520097, 298154, -791673, -1430835, -1459180, -904494, -161036, 319432, 413220, 106391, -730324, -1768094, -1789461, 184367, 3245829, 5042982, 4316230, 2278244, 982217, 1032706, 1584821, 1945531, 2194697]
11995B194697L19565L23224K68559N7978o15888j438457j463134n23245L65446
11986e11255O39312R79023J625854J396064k81485j791617j613007r08029j560934
11977b026074k600418j409475J753633L474134J997331m25684j098620l27162
11969f62335J95544K93124O40731P97939N0676q05930n86629O0052m34385j790851
11959b242064k057160o02963R38308J147350O17706N78486J033687J158598O12850
11950A184798l75542j467015j975598j006629J142493K428104J268362j041843
11942A57130j672229o8938J271480M33891j212921j220195L75868J447418R36215
11933D47719k81696j288193j886712j583814M1253J693412J348438m96261r48848
$$ y = [2194697, 2514262, 2837486, 3106045, 3164023, 2548135, 1109678, -353456, -876701, -511255, 128057, 1107080, 2732934, 4128998, 3847513, 2055896, 442889, -465140, -2026074, -4626492, -6035967, -4282334, -808200, 1189131, 763447, -335173, -662335, -466791, -173667, 467064, 1265003, 1315679, 509749, -76880, -16828, -451213, -2242064, -4299224, -4902187, -3963879, -2816529, -2198823, -1620337, -586650, 571948, 1184798, 809256, -657759, -2633357, -3639986, -2497493, -69389, 1198973, 157130, -1515099, -1584037, -312557, 121334, -1091587, -2311782, -1935914, -488496, 447719, 166023, -1122170, -3008882, -4592696, -4551443, -2858031, -1509593, -2005854, -2954702]
11924b954702Q46827K003764M14770j565382p36568J613330J582836j037501k268110
11915b100736j43019K211009J242046j974926l491887j758483R44097J797298
11907c274601N82287o52220l07605Q48765Q03151p50775j715524o61896P74979
11898d353439L37055j143544j019591P28822J382353M9209q47046L62715K041157
11889b462309K258329J585677J081107J97009j110149q91559J381591K440324
11881D480020k71571l793012l451620l0760J473116l90087j975015j049561K56724
11872d751766L27521Q66211K501110K307220r45948l233214j140951K178094J810409
11863h1314r18723r57020J672459J997212j114702k775324j82089K915664K480503
$$ y = [-2954702, -2107875, -104111, 310659, -1254723, -1991291, -377961, 1204875, 167374, -2100736, -2243755, -32746, 1209300, -765626, -4257513, -6015996, -5071899, -3274601, -2692314, -3344534, -3652139, -2803374, -2000223, -2750998, -4466522, -5128418, -4353439, -4016384, -5159928, -6179519, -5450697, -4068344, -4019135, -4866181, -4503466, -2462309, -203980, 1381697, 2462804, 2659813, 1549664, 658105, 2039696, 4480020, 4208449, 415437, -3036183, -3066943, -1593827, -1983914, -3958929, -5008490, -4751766, -4424245, -3558034, -1056924, 1250296, 304348, -2928866, -4069817, -1891723, -81314, -1000037, -1957057, -284598, 1712614, 597912, -2177412, -2359501, 556163, 3036666]
11854C036666K5160j035702p91081j023192j342580q00130n51919j336193r84200
11845d803171J779065L707399J495303k441249l324981j205440K55387M61083
11837d076604J592109K767640R87102k165518j621316K305757L172821j153013
11829A808978m278018j307977L289623L074371l39554r16971J772792K866932
11821E970176O69692j523066j582159j103330j487312j852000j438525o95668
11813c042192K80104J484841J520354n78844k570535j438242J778110L139425
11805E73021J623342M2806K408q2524j087043j163093O97308K204835R49551k062835
11795A697776l802738k714437K64142K841879K921417M48574j985427j962879
$$ y = [3036666, 3061826, 2026124, 1235043, 211851, -1130729, -1930859, -2482778, -3818971, -4803171, -3024106, 683293, 2178596, -262653, -3587634, -4793074, -4537687, -4076604, -2484495, 283145, 1270247, -895271, -2516587, -210830, 2961991, 1808978, -2469040, -3777017, -487394, 2586977, 2247423, 1330452, 3103244, 5970176, 6639868, 5116802, 3534643, 2431313, 944001, -907999, -2346524, -3042192, -2762088, -1277247, 243107, -335737, -2906272, -4344514, -2566404, 573021, 2196363, 2239169, 2241577, 2159053, 1072010, -91083, 606225, 2811060, 3760611, 1697776, -2104962, -4819399, -4555257, -1713378, 1208039, 1656613, -328814, -2291693]
11787b291693n21729m53559j537770o01358K968682N176417K831805j646117l424901
11778D99777j567818N65229M15826r46286j342857o97410n12905j130650j066112
11769e783206O25221K522541K556612R42395k50560l01462n11108j308642j209642
11760b717851K28524J037653J68740m15590P51303J664652K86525j508410r25038
11751a429492R67189J335399N07346M47484J60250k251968m289429j759330L522827
11742b789724M956882Q64593l063020k563098j73887M95283K57517R11283J175517
11733G1346k30596j382543o44816N9685j052101j908974k07733K142878K001156
11724a151698J05966m56317Q74202K054121J777755K09155k094867l750481k880536
$$ y = [-2291693, -2813422, -3266981, -4804751, -5406109, -2437427, 2738990, 5570795, 3924678, 499777, -1068041, -502812, -86986, -1033272, -2376129, -3073539, -3586444, -4717094, -5783206, -5157985, -2635444, -78832, 863563, 613003, 311541, -199567, -1508209, -2717851, -2489327, -1451674, -1282934, -1698524, -947221, 717431, 1003956, -504454, -1429492, -462303, 873096, 1380442, 1827926, 1988176, -263792, -4553221, -6312551, -2789724, 2167158, 3031751, -31269, -2594367, -2768254, -2272971, -2015454, -1104171, 71346, -159250, -1541793, -2186609, -2126924, -3179025, -5087999, -5295732, -3152854, -1151698, -1045732, -1502049, -627847, 1426274, 3204029, 3413184, 1318317, -2432164, -5312700]
11715e312700O0957J927063J197620J9248Q5887p0180j204942p59916K330298
11706a726665M068610J122760l111624l203033J28357J824711N54205n16226J99727
11697f59178J164040J576432J883454J056854j824148l932438j729845K700628
11689B35799L638073J53102k744473j918001K59347J124153J318654J481073K49365
11680C797092k193150k853065o06291J565875J276625J70022M04425J083894O63987
11671C309414j05374j43194k98839j310615j907827j060436J79087Q68206J664212
11662A194634K426245J303303j683464l217795j414514R06859N22046j345528
11654a308214j662798o22908m62834j131801q23375M00074Q86373M15847O0180
$$ y = [-5312700, -5251743, -3324680, -2127060, -2107812, -2021925, -2092105, -3297047, -4056963, -1726665, 2341945, 3464705, 353081, -2849952, -2721595, -896884, -342679, -858905, -659178, 504862, 2081294, 3964748, 5021602, 3197454, -734984, -2464829, 235799, 3873872, 4026974, 1282501, -635500, -376153, 748000, 2066654, 3547727, 3797092, 1603942, -1249123, -1855414, -289539, 987086, 1157108, 1561533, 2645427, 3309414, 3204040, 3060846, 2762007, 1451392, -456435, -1516871, -1337784, -469578, 1194634, 3620879, 4924182, 3240718, 22923, -1391591, -484732, 37314, -1308214, -2971012, -3593920, -4056754, -5188555, -6011930, -5611856, -4725483, -4309636, -4249456]
11645d249456o026M9867J109880L176161L674300R28061k240121k104780J20599
11636D58485K85904j761598k065482N83933K586908J417573p93212j237923k99632
11627h25044L97976N91798K34068j255856k822790j856163J589335L584973J611568
11618A249865j654486k299331l98382J360023J920378J808288Q68125q90127j857724
11609A06629j149076o38911j726984k116519N32173L650838K960925n96273k107784
11600a084982m35997O14869o22106j014117J144792K497319L04031k518905j872172
11591b987268J157648K454302J229091J42141L11073J29753j162796k038744j271726
11582b036526L56218J469159J639630J161615L47455p13366k039731l087383k435358
$$ y = [-4249456, -4255482, -4205615, -3095735, 80426, 3754726, 4682787, 2442666, 337886, 458485, 744389, -1017209, -3082691, -2498758, 88150, 1505723, 712511, -525412, -825044, -427068, 164730, 398798, -857058, -3679848, -5536011, -3946676, -361703, 1249865, -404621, -2703952, -3102334, -1742311, 178067, 1986355, 2854480, 1964353, 106629, -1042447, -1681358, -3408342, -5524861, -4992688, -1341850, 1619075, 1022802, -1084982, -1520979, -906110, -1528216, -2542333, -1397541, 1099778, 1403809, -1115096, -2987268, -1829620, 624682, 1853773, 1995914, 2306987, 2436740, 1273944, -764800, -2036526, -1680308, -211149, 1428481, 2590096, 2937551, 2224185, 184454, -2902929, -5338287]
11573e338287M48589L229008K822765m6873j347113J70475R61109j165379k870056
11564c135762q30960K082070J084084k524601l283317l15475J757172P36114r5754
11555d526429J776906L860233L001428J39145j763563j725830o57395M32054N98989
11546A135538n49456j563418o36178J103517P08940j613610k249498j9168J650998
11537b032335L10235j595120r94234J033761J823130J542701J743970J901235
11529C733343P95876n74007p25456o21786j691046k577192j264063R44676J140103
11520h39552m67269j116260j83223K94533l70867n04390N38822J134640L32832
11511a180734o20700o01364k03728j65335j68230j1968j60172l56133M98274K182035
$$ y = [-5338287, -4889698, -1660690, 1162075, 1115202, -231911, -61436, 899673, -265706, -3135762, -3966722, -1884652, -800568, -3325169, -6608486, -6923961, -5166789, -4430675, -4526429, -2749523, 1110710, 4112138, 4251283, 2487720, 761890, 104495, 536549, 1135538, 586082, -977336, -1613514, -509997, 198943, -1414667, -3664165, -3683333, -2032335, -1722100, -3317220, -4311454, -3277693, -1454563, 88138, 1832108, 3733343, 4529219, 3955212, 3229756, 2607970, 916924, -1660268, -2924331, -1979655, -839552, -1306821, -2423081, -2606304, -2311771, -2682638, -3187028, -2648206, -1513566, -1180734, -1801434, -2402798, -2606526, -2771861, -2940091, -2952059, -3112231, -3468364, -2970090, -788055]
11501g88055K645109Q94192j103415r41450Q44310J671374O90416k81604O2313
11492C693190L18131j214501l161116k492668O95142K525020P66092j605301p88711
11483a264722J883397K029898o61544j819794N27752K674466J061973k295252
11475B136174l147466j105233Q54981J220346J009519R36008M85607l83085r18826
11466A088025r51995r25893p71794j75470L77750J41232o11734q96643k62551
11457b989073R66576K071163K071348M79557j589564k285987j447722o77482o49797
11448d050981l11241O73673J017355K66466k83668k13132q20977k007503j338570
11439g068578J837199M280966L257168M02501j210563j247976q51942J6810J168206
$$ y = [-788055, 1857054, 2751246, 1647831, 706381, 1550691, 3222065, 3912481, 3630877, 3693190, 4011321, 2796820, -364296, -2856964, -2161822, 363198, 1129290, -476011, -1264722, 618675, 2648573, 1987029, 167235, 694987, 3369453, 4431426, 2136174, -1011292, -2116525, -1261544, -41198, 968321, 1904329, 2389936, 2006851, 1088025, 136030, -789863, -1561657, -1737127, -1359377, -1218145, -1829879, -2726522, -2989073, -2022497, 48666, 2120014, 2599571, 1010007, -1275980, -2723702, -3401184, -4050981, -4362222, -3688549, -2671194, -2404728, -2688396, -2901528, -3722505, -5730008, -7068578, -5231379, -950413, 2306755, 2709256, 1498693, 250717, -601225, -584415, 583791]
11430E83791Q53531j178043k065749l26218J173252J57632p26397J148317K801798
11421B421914N05599k949713k343393R35871J160957j679704j856728J912718
11413a892479M006398J271627k189224k235844n52846j41986k81903M86701P96188
11404g33368n26991j513768m67171Q22492L26692o94160l56338L99375j8502o63971
11394c425710N3736J334411J493955P07152k5262p79546j492608r04836J082565
11385a956143K067490N24415j441292j213325K99404N04418m92087l72524J278424
11376h01220K215443R44085j245164k068152q06789J224225K146231J385048J50841
11367C144548k23183l887k73045j032007j452761j405208j104257p0214J536433
$$ y = [583791, 1437322, 259279, -1806470, -2132688, -959436, -801804, -1528201, -379884, 2421914, 2927513, -22200, -2365593, -1429722, -268765, -1948469, -3805197, -1892479, 2113919, 3385546, 1196322, -1039522, -1592368, -1734354, -2016257, -1529556, -733368, -1260359, -2774127, -3241298, -2418806, -2092114, -2786274, -3142612, -2743237, -2761739, -3425710, -3371974, -2037563, -543608, 163544, 138282, -641264, -2133872, -3038708, -1956143, 111347, 635762, -805530, -2018855, -1719451, -1215033, -1707120, -2079644, -801220, 1414223, 2358308, 1113144, -955008, -1761797, -537572, 1608659, 2993707, 3144548, 2921365, 2917478, 2644433, 1612426, 159665, -1245543, -2349800, -2420014, -883581]
11358h83581J721495m49227k102934m19743K005284N85368l116680k877653J839414
11349c698257M043011L07772l313672r94514L499594L298438n57045j774444O14783
11340A425666J851413K38548q60218J43312O38293p93910j978138j452965n99473
11331a387472k58624N36658J340510R6948k488480k715400J64751K033526L17027
11322b360556j804373p73358J432478Q82512j476562j350701J722891L505694
11314b21975J677437q44865p10351R44793P62212j531402k829966j303676J008640
11305c049153J130525p48617j627905J11630K425697K328282j01097j881004j138451
11296b550093O37311J038963J22167r9401J031431J799712Q47575o18422n98075
$$ y = [-883581, 837914, 388687, -1714247, -2133990, -128706, 456662, -2660018, -5537671, -3698257, 344754, 652526, -2661146, -3655660, -156066, 3142372, 2585327, 810883, 1425666, 3277079, 3515627, 2655409, 2798721, 3437014, 2643104, 664966, -787999, -1387472, -1646096, -1109438, 231072, 328020, -2160460, -4875860, -4711109, -2677583, -2360556, -4164929, -4938287, -3505809, -2623297, -4099859, -5450560, -3727669, -221975, 1455462, 610597, -99754, 845039, 1607251, 75849, -2754117, -4057793, -3049153, -1918628, -2667245, -4295150, -4183520, -1757823, 570459, 469362, -1411642, -2550093, -1912782, -873819, -751652, -851053, 180378, 1980090, 2827665, 2209243, 1611168]
11287A611168N97877P26170r14415k148870r61030J451791K158248M37113j428142
11278A529910j425075l61767l52788j728725k593271j333259J250117K704939
11270b309919J638815p10269j868748q67824R94018K089220K171136J665187M00409
11261C202025j690120l266391k621206j05147J868845J658337J53467p79106o33934
11252b213230l00147m16826o22915l62237K52688O72717P19946P49230R62910
11243e57864J035544P44976M46953L03634l26610j661971k287816q29242J486449
11234a645947K024592N64221m85543j03776k5626j041106j127437P22334J878871
11225G60583J33212k248628j937179J37383P17832j83057Q1429J497288J282928
$$ y = [1611168, 2209045, 2935215, 2020800, -128070, -1089100, 362691, 2520939, 2958052, 1529910, 104835, -256932, -609720, -2338445, -4931716, -6264975, -5014858, -2309919, -671104, -1381373, -3250121, -4117945, -3123927, -1034707, 1136429, 2801616, 3202025, 1511905, -1754486, -4375692, -4480839, -2611994, -953657, -800190, -1579296, -2213230, -2513377, -2930203, -3553118, -3915355, -3662667, -2989950, -2270004, -1520774, -557864, 477680, 1222656, 1669609, 1973243, 1646633, -15338, -2303154, -3132396, -1645947, 378645, 942866, 457323, 353547, 327921, -713185, -1840622, -1118288, 760583, 893795, -1354833, -3292012, -3154629, -2436797, -2619854, -2538425, -1041137, 241791]
11216B41791r35489k158800r24744O18200N83505m4677J08018N95659O73182O33630
11206f09725O13147J65533l30296O6006Q35024M63553q73719j435522p74871m7226
11196a928096L58202Q19970N56776j157744k387157q55508J603454J315256p67677
11187b442524j35747L259254M052614K79723k966129j725070O99958n1767k079199
11178a108887j209125J550447K098692K46426p13497J19512O73417K44641M8152
11169A949778J1629j014416k147702j222621J306079K405171P54407j584070k214438
11160a756183j159957j68148n13917j632348j516927Q38541L381245L122446M88443
11151A083195j066479l54578P7196r49769q16754J686639K910612n2218l787999
$$ y = [241791, -693698, -2852498, -3777242, -3159042, -2575537, -2620214, -2512196, -1916537, -1243355, -609725, 3422, 168955, -161341, -95335, 739689, 1203242, 329523, -1105999, -1880870, -1928096, -1569894, -749924, -193148, -1350892, -3738049, -4593557, -2990103, -1674847, -2442524, -2578271, 680983, 4733597, 5013320, 2047191, 322121, 1022079, 970312, -1108887, -2318012, -767565, 1331127, 1577553, 864056, 983568, 1656985, 1901626, 1949778, 1961407, 946991, -1200711, -2423332, -1117253, 1287918, 2042325, 458255, -1756183, -2916140, -3084288, -3598205, -5230553, -6747480, -5908939, -2527694, 594752, 1083195, 16716, -337862, -260666, -1210435, -2027189, -340550, 2570062, 2517844, -1270155]
11142a270155l222262O79574K764666J480820j54988l29460k71590n84766j87959
11133a096120Q35231J067210O17833Q33602J248194J78790j741157k031222m22119
11124e09758Q01752N76846M2369k01948o15639n85262Q54721K190109R10506j971074
11114A492622k653167l38762J581404J069715J74805O56231P87493r94825k482168
11105g06652q78271K475893L688756J612375j096243j839789q35524K07947N80886
11096C209378R00735J466771J259727o51044l004935l188648q45951J041086J25753
11087C12872j894274j991966m78169j8357q30435l80270J928705L224208J510990
11078A383304j253120k068166p95988N58745R28193Q16050P96431Q79343R46754
$$ y = [-1270155, -4492417, -3812843, -1048177, 432643, 277655, -51805, -323395, -908161, -1096120, -260889, 806321, 1424154, 2257756, 3505950, 3684740, 1943583, -87639, -509758, 291994, 868840, 911209, 709261, 93622, -491640, 363081, 2553190, 3463696, 1492622, -1160545, -1499307, 82097, 1151812, 1326617, 1982848, 2770341, 1775516, -706652, -1584923, 890970, 4579726, 6192101, 5095858, 3256069, 2420545, 2628492, 3209378, 4110113, 5576884, 6836611, 6185567, 3180632, -8016, -853967, 187119, 312872, -1581402, -3573368, -4051537, -4069894, -4900329, -5280599, -3351894, -127686, 1383304, 130184, -1937982, -2733970, -2175225, -1247032, -430982, 365449, 1244792, 2191546]
11069B191546Q05064P1211j318622k647145k856844j483846P37662K148494J581248
11060g71232j57749r39136N8371J299768J188146K52069n7375L84088P30020P85999
11050B772969P59247K70911q23766j501277j054844n60046j116302j678647p19703
11041c651458Q80225R91593l13822r30593o2316R67117J166047R07979M82152
11032D36924k92516r25056o68994q3818k78460p25119P3760J731950K010968P6164
11022A355803k197020k636472r85021J455874K960530K279486p3418j716088j128162
11013f84488J34290j91873j403295j073425P19408J537519Q32840O41592J512652
11004B025220J249186r66820k437439r89030J456992J807432L58954k64692M63211
$$ y = [2191546, 2996610, 3067821, 1749199, -897946, -3754790, -5238636, -4500974, -2352480, -771232, -928981, -1868117, -1809746, -509978, 678168, 930237, 872862, 1256950, 1986970, 2772969, 3532216, 3803127, 2979361, 1478084, 423240, -136806, -1253108, -2931755, -3651458, -2771233, -1779640, -2093462, -3024055, -3086371, -2119254, -953207, -45228, 436924, 144408, -780648, -1449642, -1533460, -1811920, -2537039, -2463279, -731329, 1279639, 1355803, -841217, -3477689, -4462710, -3006836, -46306, 2233180, 2159762, 443674, -684488, -550198, -742071, -2145366, -3218791, -2499383, -961864, -129024, 512568, 2025220, 3274406, 2307586, -129853, -1118883, 338109, 2145541, 2504495, 2239803, 2703014]
10995B703014M93258j032692k175847j263008K93245r4222k147902k571791M02314
10986e393631L941084L883828L29181k441233j759942L43913Q45094j62912r11703
10977a326321j172235j494387j014057J091953L104907K596570Q0872j782812
10969H4490j985561j558727q64183N64657J808111J241184m35265p15994P55117
10960a106171J483225Q4368j546040j127331Q31829J920271P67240j604760k748158
10951c045527j183013J597529K353395K33095j784932j105214P02247P29103n15554
10942b018871m97590N39104J41399j500205j468262P61072K119729R02160o52899
10933a674363k06839J280756J682932Q01184k98812j124203j550482j329909p66064
$$ y = [2703014, 3196272, 2163580, -12267, -1275275, -982030, -1076252, -3224154, -5795945, -5393631, -1452547, 2431281, 2760462, 319229, -1440713, -1096800, -251706, -414618, -1326321, -2498556, -3992943, -5007000, -3915047, -810140, 1786430, 1867302, 84490, -1901071, -3459798, -4323981, -3759324, -1951213, -710029, -1145294, -1861288, -1106171, 377054, 461422, -1084618, -2211949, -1380120, 540151, 1307391, -297369, -3045527, -4228540, -2631011, -277616, -44521, -1829453, -2934667, -2232420, -1503317, -2018871, -2516461, -1977357, -1835958, -3336163, -4804425, -4043353, -1923624, -1021464, -1674363, -1881202, -600446, 1082486, 1883670, 1584858, 460655, -1089827, -2419736, -3185800]
10924c185800m83452q4953J300832K912419K828334R37096o52299o73136j36523
10915B762518j71172m41607l73146j84544j41577k54480q31026j834250k073694
10906c542978q77068J63147n20466j361272L9461K270588J740229j122601j803429
10897e014389J170348L527339J740285j704724k357848j21388J614891J151050
10889E564j88416p81649l58802N11295R65022L81811o54304o99279N88534J836177
10879A605953J835644R16338J6730m52736n10167m55771q31100j451756j017615
10870c44480Q68559K221734J243421o48595q92318J69928L69983k13762K4884
10861B799354L04490j301861l167597j819545J423534J339201k408661l632001
$$ y = [-3185800, -3669252, -3754205, -2453373, 459046, 3287380, 4224476, 3572177, 2899041, 2762518, 2591346, 2149739, 1776593, 1592049, 1450472, 1195992, 364966, -1469284, -3542978, -4420046, -4256899, -4777365, -6138637, -6099176, -3828588, -2088359, -3210960, -5014389, -3844041, -316702, 1423583, -281141, -2638989, -2760377, -1145486, 5564, -182852, -964501, -1323303, -812008, 153014, 534825, -119479, -818758, -230224, 1605953, 3441597, 4357935, 4374665, 3921929, 3411762, 2955991, 2124891, 673135, -344480, 524079, 2745813, 3989234, 3340639, 2448321, 2618249, 2988232, 2774470, 2799354, 3103844, 1801983, -1365614, -3185159, -1761625, -422424, -2831085, -6463086]
10853f463086N60972M530531K943144p11082k03120L049986K633357j957891m269068
10844A13743r72278L254130K917653q41498k910526j477613N66880N40324n32084
10835F58731j39399J540289J621928j074781l595595k658157M56303J628168J993
10826a560520j095845J79003J396476M09804q33794J89000K007472J516657q51399
10817A356854j885737p03749L19835k54290q59926J30083J680650J641285k12604
10808A212401j890173j559889M69570K146680J854079O3798j338985j237595l04177
10799e84291J91982l2846k58000Q085K32334m73918j876325k330601p37677J548049
10789d313208K094967O96105m39425j73250N8728p92943j331652l34150Q02477
$$ y = [-6463086, -5902114, -1371583, 1571561, 860479, 657359, 3707345, 6340702, 4382811, 113743, -858535, 2395595, 5313248, 4471750, 1561224, 83611, 650491, 1190815, 658731, 519332, 2059621, 3681549, 2606768, -988827, -3646984, -3190681, -1562513, -1560520, -2656365, -2477362, -1080886, -671082, -1504876, -1315876, 691596, 2208253, 1356854, -528883, -1232632, -912797, -1167087, -2027013, -1896930, -216280, 1425005, 1212401, -677772, -2237661, -1768091, 378589, 2232668, 2296466, 957481, -280114, -584291, -392309, -425155, -683155, -675070, -442736, -916654, -2792979, -5123580, -5861257, -4313208, -2218241, -1522136, -1961561, -2134811, -2076083, -2869026, -4200678, -4534828, -3732351]
10780c732351M38994m37910j66077N75639L29316k75003k1129K05125p30225j318293
10770e131914K61385K381122K132136M7999r48013j94042P07263J261675J668817
10761B186428N15253k827872m935626k309238K476220L790212J276801l94876
10753b22698M29240P21290o41718r50212N65602J016164n01137j117586K18698
10744d82357Q06289l19725m52370J108662J013164j851153l426877j045351K025589
10735b624129K080473N16700K07094M54333n15403j545856r66322r1217o30464
10726c114791j165438K86500K386551K484163P89399l95761k44176K55978M04904
10717A687329K85573K7429j77543j34604j49138m25069k85970N10592O18148o91945
$$ y = [-3732351, -3293357, -3731267, -3897344, -3321705, -2992389, -3267392, -3288521, -3083396, -3813621, -5131914, -4870529, -2489407, -357271, -309272, -1257285, -1451327, -744064, 517611, 2186428, 2701681, -126191, -5061817, -7371055, -4894835, -1104623, 172178, -222698, 206542, 927832, 286114, -664098, -98496, 917668, 416531, -701055, -482357, 323932, 4207, -448163, 660499, 1673663, -177490, -3604367, -4649718, -2624129, -543656, -26956, 180138, 634471, 119068, -1426788, -2393110, -2484327, -3114791, -4280229, -3993729, -1607178, 876985, 1666384, 1270623, 1026447, 1282425, 1687329, 1972902, 2000331, 1822788, 1688184, 1539046, 1113977, 828007, 1338599, 1956747, 1264802]
10707A264802j601183o62655K64534o42131j285972N29925K058396m5304k870461
10698b990049j505823J983080J708833j401565j099661K529691K748539j561265
10690D11780l441351j2742K815808J175232p66039K04959N59041j845823k565931
10681c465066R45585L695639J780104q78718k52351P17532j119576k451207j28716
10672a156774K195351P33487j355007k06205J404663k75647k613974j688155M50534
10663b511727J76498r74038j38706J207856J152728J659580L536612K985115j211829
10654E882089l538375q20334J544258q73552l190038k04666L574702J824173k275916
10645A922341k158386N15149K02258j701019m27980K181081J230559j498610j007890
$$ y = [1264802, -336381, -999036, -734502, -1376633, -2662605, -2132680, -74284, -119588, -2990049, -4495872, -2512792, -803959, -2205524, -3305185, -775494, 1973045, 411780, -3029571, -3042313, -226505, 948727, 182688, 387647, 946688, -899135, -3465066, -2519481, 1176158, 2956262, 2077544, 1825193, 2542725, 1423149, -1028058, -1156774, 1038577, 1772064, 417057, 210852, 1615515, 1339868, -1274106, -2962261, -2511727, -2335229, -3309267, -3447973, -2240117, -1087389, 572191, 4108803, 7093918, 5882089, 2343714, 1523380, 3067638, 2194086, -995952, -1200618, 2374084, 4198257, 1922341, -236045, 279104, 481362, -1219657, -1647637, 533444, 1764003, 265393, -742497]
10636g42497J269242O80674j281989k37837J896727N11968k167361q84140K288168
10627A332955J305450k593312k931151N58375K147584L98200q36527m76870p93199
10618a888495j214417M80290K375883J330306n31467M26631K064911N62063j756883
10609A848822q40704P52360j280468l870608j806573J933248J166647k003142
10601d100418j318587J626562P54455k317052j211795K687179K665263m66646
10593a681039j57171K854558J789704k778506l310356J018873L164045J068575
10585A968683q4349J012350M9986k672416j687910K705181L809664K01747k276185
10576C026751j346714j016649k392075j703888J282232K230113N41912m0715O80898
$$ y = [-742497, 526745, 1207419, -74570, -312407, 1584320, 2096288, -71073, -955213, 1332955, 2638405, 45093, -2886058, -2327683, -180099, 218101, -618426, -1095296, -1888495, -3102912, -2622622, -246739, 1083567, 552100, 978731, 3043642, 3605705, 1848822, 1008118, 1760478, 480010, -3390598, -5197171, -3263923, -2097276, -4100418, -5419005, -3792443, -3037988, -5355040, -6566835, -3879656, -1214393, -1681039, -1838210, 1016348, 2806052, 27546, -3282810, -2263937, 900108, 1968683, 1884334, 2896684, 2946670, 274254, -1413656, 1291525, 5101189, 5302936, 3026751, 1680037, 663388, -1728687, -3432575, -2150343, 79770, 621682, 580967, 1261865]
10567A261865m91429k620438j924260M81410P49504J73055J934566L087960l17051
10558B335182l842415j361933K935200J287860l191223k111251K332544J660951
10550D4915k369003j168518L591567K620230l153224l943300Q14070K222482r81805
10541b322586j453270J287648O81567k337604q87648L012325J599078k583979
10533c004469q96881L874974K391734k274903k37750M503388N44395p494718n505682
10524h099912L401132L843459k988745k303204M748484L318721m694602l079763
10516e854430O164193N043322n190445n227050M545265L977811o738077n980384
10508i259795O487865P340889m436492m311260Q412298O737241r562548r042416
$$ y = [1261865, 770436, -1850002, -3774262, -3292852, -2543348, -2370293, -435727, 2652233, 2335182, -1507233, -2869166, 66034, 1353894, -1837329, -3948580, -1616036, 44915, -2324088, -3492606, 98961, 2719191, -434033, -4377333, -3563263, -1340781, -2322586, -3775856, -2488208, -1806641, -4144245, -5031893, -2019568, -420490, -3004469, -3901350, -26376, 2365358, 90455, -147295, 4356093, 4900488, -2594230, -8099912, -4698780, -855321, -3844066, -6147270, -1398786, 1919935, -2774667, -5854430, 309763, 5353085, 162640, -5064410, -519145, 3458666, -3279411, -9259795, -2771930, 4568959, 132467, -4178793, 4233505, 10970746, 1408198, -7634218]
10500g634218R890651J1270969q851723j0402435J2146090J2847230j4923493
10493D343071j4743175K3458665K6554383k3273635j8205055J01976258J99763512
10486B99874024J08974764j01745467j99263148j06095171J5909874K4093148
10480D1748024k6116027k4581258J4040784J4716428j4727312j5344551R147713
10473a116199J0711432q808576r083228Q393984Q147228q474196q703734P287846
10465a645443R004572n286334q016331L915485O019540n292700p917394K293186
10457f925419N746584j776074l273195M198290M566183m168227n449791L749806
10449c331843P310523J67580m389473j097645L47909k200846M32086P059834N457646
$$ y = [-7634218, 2256433, 13527402, 4675679, -5726756, 6419334, 19266564, 4343071, -10400104, 13058561, 39612944, 16339309, -1865746, 100110512, 299874024, 408848788, 307103321, 107840173, 1745002, 17654876, 41748024, 15631997, -8949261, 5091523, 19807951, 5080639, -10263912, -1116199, 9595233, 786657, -8296571, 97413, 8244641, -229555, -8933289, -1645443, 7359129, 2072795, -5943536, -2028051, 3991489, -1301211, -9218605, -6925419, -1178835, -2954909, -6228104, -2029814, 2536369, -1631858, -7081649, -3331843, 3978680, 4146260, -243213, -1340858, -992949, -3193795, -2761709, 4298125, 9755771]
10440I755771l595703n623896J179528K697962m448740o760286O75287N493347
10432f26730J189649k464835O59803K612829j372798l515665M62517K681962j308288
10423a681556l693259O87481M711700K379320r75612K35328K129145K51659k052273
10414A991933j050480O30676L80302L04956J113120k01487k956675j965868K567446
10405H13923L577752j068350m628235k842169N4636L65967P21705K701170K566105
10396B262504j019445l048614n54264K278364J583608l10817l12893M19858L27000
10387A625301M35407O91406r60791l620112l382533k1169K248373J937929J835220
10378G89031K449266R93717j922540k086206L47918L71992k636964l188095N45542
$$ y = [9755771, 6160068, 536172, 1715700, 4413662, -35078, -6795364, -6120077, -626730, 562919, -1901916, -1242113, 1370716, -2082, -3517747, -3055230, -373268, -1681556, -5374815, -4687334, 24366, 2403686, 1428074, 1663402, 3792547, 4044206, 1991933, 941453, 1572129, 1952431, 2257387, 3370507, 3169020, 212345, -1753523, 813923, 4391675, 3323325, -1304910, -4147079, -4092443, -3726476, -3004771, -303601, 2262504, 1243059, -1805555, -2359819, -81455, 1502153, 1191336, 878443, 1298301, 1625301, 2060708, 2752114, 1791323, -1828789, -5211322, -5232491, -2984118, -1046189, 789031, 3238297, 4232014, 2309474, 223268, 571186, 943178, -1693786, -4881881, -4336339]
10369d336339L292540J893360P0302O91286R47828r65402j718412L88685J409627
10360A673475j002333k746755m26056K529753J834947p61259j474523p59936p87835
10351a920522p29027P92279K018324J063905m92480o96013p39364j912556k267418
10342d882872k4654K560016K447653N46009k96854N2467k32074j118827r17409
10333a866545N28602J484024R05313l42603p93098n1910P99249N13341m38057
10324G38316l14693R25929J047239o25712j349226N49488K137513M45790k082336
10315A472308j332855J414398J502259j377611l081473j971596m38255K56020
10307c556805J185915J877628O82747q77847K89623K720536J762044k332265l894932
$$ y = [-4336339, -1043799, 849561, 919863, 1611149, 2558977, 1593575, -124837, 263848, 1673475, 671142, -2075613, -2501669, 28084, 1863031, 1101772, -372751, -1132687, -1920522, -2649549, -1857270, 161054, 1224959, 732479, 36466, -702898, -2615454, -4882872, -4907526, -2347510, 100143, 646152, 349298, 401765, 169691, -949136, -1866545, -1337943, 146081, 1051394, 708791, -84307, -136217, 663032, 1176373, 738316, 423623, 1349552, 2396791, 1771079, 421853, 971341, 3108854, 3554644, 1472308, 139453, 1553851, 3056110, 1678499, -1402974, -3374570, -3812825, -3556805, -2370890, -493262, 189485, -688362, -398739, 2321797, 4083841, 1751576, -2143356]
10298b143356p93523K232672J329568j022015j071832N40358J229659P12407L9107
10289A053045n85989r43555l78414N11775L58169l90265k93398l3656j025196
10280a727484j585405Q10023L893923K764462k097208m815403k921449j96261
10272e874802M71995Q13894J897045J422618j002192j735299O38381K295798O75041
10263c97521j207790m59143P09418k91658j314875M21835K889004K489771j01146
10254B737895j546460j075715m57313n80646j082030j696517j677526J66308K946290
10245b265714L575796J064056j584913j600169K5093R62031P66371n6478j426453
10236e40380k453590j581444N85389J459205N87385L01788J281310J391652J94325
$$ y = [-2143356, -2936879, -704207, 625361, -396654, -1468486, -928128, 301531, 1013938, 1053045, 467056, -476499, -854913, -343138, 15031, -375234, -668632, -702288, -1727484, -3312889, -2502866, 1391057, 4155519, 2058311, -2757092, -5678541, -5874802, -5402807, -4588913, -2691868, -1269250, -2271442, -4006741, -3368360, -1072562, -397521, -1605311, -2064454, -1355036, -1646694, -2961569, -2539734, 349270, 2839041, 2737895, 1191435, 115720, -341593, -922239, -2004269, -3700786, -5378312, -5212004, -2265714, 1310082, 2374138, 789225, -810944, -785851, 176180, 942551, 886073, -540380, -2993970, -4575414, -3990025, -2530820, -1943435, -1641647, -360337, 1031315, 1225640]
10227A225640K00167J871768J991594o92104k761432j753065n4485k52399r39752
10218a164068l25892K42161k98653n9701J554936J421162j544253k867184M38794
10209b602698L742997J482533l647957m616204o73340K549706K211193J026810
10201e26960J040489O49435j095257k084270p64150J238947J673534N69093m76764
10192B24097l90957N19337R19499q7713j323390o04499J801916K767710O51132
10183D477132k133542k616000j138817K18027Q36520J002154L29044r27459j037597
10174i90538M52080J241305k16169j999154j805413k93958J028235K453219L868837
10165C738444K984709q13025l695879k372688O88425J137364n42275p93684N12203
$$ y = [1225640, 1425807, 3297575, 5289169, 4597065, 1835633, 82568, 28083, -224316, -1164068, -1489960, -1247799, -1546452, -1606153, -51217, 1369945, -174308, -3041492, -2602698, 1140299, 2622832, -1025125, -5641329, -6314669, -3764963, -1553770, -526960, 513529, 1162964, 67707, -2016563, -2780713, -1541766, 131768, 700861, 224097, -166860, 352477, 1271976, 1184263, -139127, -743626, 1058290, 3826000, 4477132, 2343590, -272410, -1411227, -1193200, -356680, 645474, 974518, 47059, -990538, -538458, 702847, 486678, -1512476, -3317889, -3611847, -2583612, -130393, 3738444, 6723153, 5910128, 2214249, -158439, 529986, 1667350, 1125075, 331391, 843594]
10156H43594M43952j207617j585037M7871J350027J261624J151667J268558p335
10147C567304k560712l597495j487623J865878L420283K141397n00944j981032
10139H67056j081575L25157o98959l419915l463356M92498L579520J720375j689364
10130c368563r01304L061097M199721R68553k224732k573170j905449j625132
10122d368979l36170K076723K994718J465653j28889l06945m12224j018197n57814
10113e92124R61155J049522p05156j312197L96458J383046l41504k155497j429861
10104b746158J06455l3469n59533P15825K338437J688906j81398l76098P91367
10095A744334P32127n64148q21059l5329n11794k250138k398388j46428J552900
$$ y = [843594, 1287546, 79929, -1505108, -1457237, -107210, 1154414, 2306081, 3574639, 3567304, 1006592, -2590903, -4078526, -2212648, 1207635, 3349032, 2848088, 867056, -214519, 110638, -588321, -4008236, -7471592, -6979094, -3399574, -1679199, -3368563, -4269867, -1208770, 2990951, 3959504, 1734772, -838398, -2743847, -4368979, -4705149, -2628426, 366292, 1831945, 1703056, 1396111, 983887, -34310, -592124, 369031, 1418553, 713397, -598800, -202342, 1180704, 839200, -1316297, -2746158, -2639703, -2673172, -3232705, -2516880, -178443, 1510463, 1329065, 952967, 1744334, 2476461, 1912313, 1091254, 1055925, 544131, -1706007, -4104395, -4250823, -2697923]
10086b697923O02957j077149q95191N34915J084603O70907O64200J061682P27816
10077F76817k55610p65642p65340j043612j077258L49926K198231J690629j185797
10068a77656k603897l60270K220244R53588k586643l226999j84337J831615K48192
10059c886163j413376L92139L286755K861644k19065j434803N11346K224099J264214
10050C586790o54536j114039m71550l11074p03145p61209m47694k58833r0386
10041a225676K96334M54048N0266j81886M74759J137098K54262j807336k614522
10032c162653r29811J100530O36314j548803j728010J307831L942368K642355
10024B260121r57191k574556j356128k5211J84175O98863J620094R13336j267248
$$ y = [-2697923, -2094966, -3172115, -4067306, -3532391, -2447788, -1776881, -1112681, -50999, 676817, 421207, -344435, -1109775, -2153387, -3230645, -2880719, -682488, 1008141, -177656, -2781553, -3141823, -921579, 32009, -2554634, -5781633, -5965970, -4134355, -3886163, -5299539, -4907400, -1620645, 1240999, 1021934, -412869, 98477, 2322576, 3586790, 2932254, 1818215, 1346665, 1035591, 332446, -428763, -876457, -1135290, -1225676, -929342, -475294, -425028, -606914, -132155, 1004943, 1259205, -548131, -3162653, -4092464, -2991934, -2355620, -3904423, -5632433, -4324602, -382234, 2260121, 1302930, -1271626, -2627754, -2652965, -2468790, -1769927, -149833, 763503, -503745]
10015e03745j635436R12966K925463J772685k82402l22646M50062k68798j259013
10006A789136k68297J406354J111275m28930p96570m29393j176291k115214j346660
9997b254590k09234q54904j407880R56938L712031K140633k134529k882920M66374
9988b468081J899096o98994k094499O28683K765850N39637k080597n16305K376362
9979C51152J610449j258790j417450O58656P12322j380756j720028O03208K420402
9970E79165K084017J109360L55114r09767k151306j885464p99813q13462j343805
9961c775961l38846J391979J046146j087238j725895j18601P99072m00016j323017
9952e532377N4215K368480L432443K847996R55373j885655l895957k737044R26398
$$ y = [-503745, -2139181, -1226215, 1699248, 3471933, 3189531, 2866885, 3316947, 3048149, 1789136, 1520839, 2927193, 4038468, 3609538, 2812968, 2383575, 1207284, -907930, -2254590, -2463824, -3318728, -4726608, -3769670, -57639, 2082994, -51535, -2934455, -2468081, -568985, -1267979, -3362478, -2733795, 32055, 571692, -1508905, -2025210, 351152, 1961601, 702811, -714639, -55983, 656339, -724417, -2444445, -1841237, 579165, 2663182, 3772542, 4127656, 3217889, 1066583, -818881, -1618694, -2432156, -3775961, -4114807, -2722828, -1676682, -2763920, -4489815, -4608416, -3809344, -4209360, -5532377, -5478162, -3109682, 322761, 3170757, 4126130, 2240475, -1655482, -4392526, -3466128]
9943c466128L362321K447089m7427j690957k179964j940520q57257L47597J94422
9934c830824q45818m28559J695462K724534J226736n45830n12394J19024k79201
9925f76870o76205K65373J236393M36102j243968j761030j036487k64126L23467
9916c397351Q95191Q00649j06768m80214M06873J235187R23112L72151L77004
9907A025834J04303o67942m18465J112673J642186J72604r92636l74401k72j275933
9897C27951j967947n03470P44612J22598K25504K442107K872614q45866l668448
9888b50345q57339L214259J966924k014352j742322J705176J856388q66304r30366
9879B081719L83707k465366o164830k491554M648322K964458m933117j359251
$$ y = [-3466128, -103807, 2343282, 2295855, 604898, -1575066, -3515586, -4372843, -4025246, -3830824, -4676642, -5105201, -3409739, -685205, 541531, -4299, -516693, -397669, -676870, -1353075, -1087702, 148691, 584793, -659175, -2420205, -3456692, -3720818, -3397351, -2502160, -1701511, -1808279, -2288493, -1881620, -646433, 276679, 648830, 1025834, 1130137, 462195, 43730, 1156403, 2798589, 2971193, 1978557, 1604156, 1603884, 327951, -1639996, -2143466, -1398854, -1276256, -1050752, 1391355, 4263969, 3418103, -250345, -1107684, 2106575, 4073499, 2059147, 316825, 2022001, 3878389, 3012085, 2081719, 2465426, 60, -6164770, -8656324, -4008002, -1043544, -5976661, -7335912]
9871g335912J6138843K4500020Q421861j3986444j6819288l513070K925755l008310
9863G323455o003616K51762M229671k69626l738217J39232L381794m72007m672405
9854A70043k357811J428391K01771k285344m03153K404532O17844k874411k480952
9845e579090J59110N45723j9721J568308K759859J47189k911238j604891J596041
9836c338710J559416k10142P53420K629062P03215k868333k035710K204860L174932
9827B572010k9818j654744J37233R37374o80666n80201K154137K387805j745802
9818C497328m386252j223045L256885K910146q36418k390341q49850J51820p67920
9809f37647j317829j43129J294303J566061J090171P23322M52318j23666r93096
$$ y = [-7335912, 8802931, 33302951, 41724812, 27738368, 10919080, 7406010, 10331765, 7323455, 1319839, 1571601, 5801272, 5531646, 1793429, 1932661, 5314455, 4842448, 170043, -2187768, -759377, -557606, -2842950, -3246103, -841571, -223727, -3098138, -5579090, -5419980, -4874257, -4893978, -3325670, -565811, -418622, -3329860, -4934751, -3338710, -1779294, -1989436, -1236016, 1393046, 2096261, -772072, -2807782, -602922, 2572010, 2542192, 887448, 1024681, 1962055, 1281389, 701188, 2855325, 5243130, 3497328, -888924, -2111969, 1144916, 4055062, 3218644, 828303, -21547, 130273, -637647, -1955476, -2098605, -804302, 761759, 1851930, 2575252, 3027570, 2903904, 1910808]
9800A910808j519275q21740J046910K333835J215704j597520l301554k409981
9792c142813k65681J282669K078079K743269L015303K109704J4763k281884l454366
9783B099043k708627o89180P14220M01622m60324j15344J178787J714292J003073
9774C137562P8924n61903j303842j733162p63737J184412K106353J128759l73411
9765B899955r61640q34637o97066m61508P3696M73634M42022M49801R18303J476326
9755C778886J512261R10859k6047r22522j497412j710692j600614r17296L66974
9746a05603J122190O9499j804264j820350L24316J445231k77921j925946l08099
9737c280947K499936K170418p97032j831897K06455J392067m90648k437464j545453
$$ y = [1910808, 391533, -430207, 616703, 2950538, 4166242, 2568722, -732832, -3142813, -3408494, -2125825, -47746, 2695523, 5710826, 7820530, 7835293, 5553409, 2099043, -609584, -1298764, -584544, -182922, -643246, -758590, 420197, 2134489, 3137562, 3216486, 2654583, 1350741, -382421, -1146158, 38254, 2144607, 3273366, 2899955, 1938315, 1103678, 406612, -54896, 18800, 492434, 934456, 1384257, 2302560, 3778886, 5291147, 6202006, 6175959, 5253437, 3756025, 2045333, 444719, -472577, -105603, 1016587, 1086086, -718178, -2538528, -2214212, -768981, -1046902, -2972848, -3280947, -781011, 1389407, 592375, -1239522, -1033067, 359000, -131648, -2569112, -4114565]
9728d114565M20736O39393m4113O30350J933752J640582K91067L02932J547490
9719C247624J274554j359141l629879l023168n25859J080754P80736k05422p00268
9710c060069p72680o55946J01271J566026K471057J717248L89092N17423J770051
9701D043473J522724r96347k979579k091838o0795K04003p09677o4262K025858
9692H93560K493332K49925k071620k099765p49810j23327m71890n72582J62994
9683b289183J001639P84633o42870j588267q1010K844086L229317m98139m261883
9674a501677l396491O75954K718734J518335P15370J885940J999478p92288l488129
9665C35226k813365N0469J832438J538329K18536j245594k061313j250266Q06475
$$ y = [-4114565, -3693829, -3054436, -3098549, -2468199, -534447, 1106135, 1397202, 1700134, 3247624, 4522178, 3163037, -466842, -3490010, -4015869, -2935115, -2154379, -2359801, -3060069, -3832749, -4488695, -4387424, -2821398, -350341, 1366907, 1755999, 2273422, 4043473, 5566197, 4569850, 1590271, -501567, -562362, -358359, -1068036, -1132298, 893560, 3386892, 3636817, 1565197, -534568, -1284378, -1407705, -1879595, -2452177, -2289183, -1287544, -502911, -1145781, -2734048, -2815058, 29028, 3258345, 2760206, -1501677, -4898168, -4222214, -1503480, 14855, 730225, 2616165, 4615643, 3823355, 335226, -2478139, -2427670, -595232, 943097, 1161633, -83961, -2145274, -3395540, -2589065]
9656b589065K243080K175118J440659N36739o22012q37522J000168K514062K44401
9647F105628l899862l976560N71324K910385p02096m646038k819760J888981L077249
9638a490749J107579Q22699K297495J539300j300309j930623K82787J389330K277
9629B719786q86948J01468P50279J21753n8443K22911j027161k764979j349586
9620b170920K510391L225704r78417m622917l235926L62231J623888J069141J251252
9611i65573J393067p0021j164806L28271K070581P24125j984858j978716J47488
9602a500442L10458j759211k009670Q98602L232502K096233n71526j589751p16600
9593a609405N36679J528174K108618J685992L07105p67162p24203k50316k38174
$$ y = [-2589065, -345985, 1829133, 3269792, 3806531, 3184519, 2346997, 3347165, 5861227, 6105628, 2205766, -1770794, -1199470, 1710915, 1008819, -3637219, -6456979, -4567998, -1490749, -383170, 439529, 2737024, 4276324, 2976015, 1045392, 1328179, 2717509, 2719786, 1832838, 1934306, 2684585, 2806338, 2747895, 2970806, 1943645, -821334, -2170920, 339471, 3565175, 2586758, -2036159, -5272085, -4909854, -3285966, -2216825, -965573, 427494, 357473, -807333, -479062, 1591519, 2315644, 330786, -1647930, -1500442, -1189984, -2949195, -4958865, -4060263, -827761, 1268472, 696946, -892805, -1609405, -1072726, 455448, 2564066, 4250058, 4557163, 3790001, 3065798, 2815482, 2577308]
9584B577308o69725j209653j628408j397682k05790J075699J356961J025885J009534
9575A934129O86971r57804k575116j836946M14635Q47546r41657j472367P99277
9566c101332K666178J527484k06946N55844K027735N86451k712567l411122o41769
9557b710044J671879Q48241j225033j656378k85469J220221J584153M00349j601942
9548a754023k389520p39544J464923J389468m79037j116897J4643L17477r62502
9539d255012j112611J080767K646183J249022o94408O5351K281641K422450L00789
9530C984172j234830j059773o02254n02762J15346J048949P51877r01915k061893
9521d63083j604275m07111L90562O22026M10514n8265M003J121257K146833J402276
$$ y = [2577308, 1907583, 697930, -930478, -2328160, -2533950, -1458251, -101290, 924595, 1934129, 2621100, 1663296, -911820, -2748766, -2334131, -1486585, -2428242, -3900609, -3101332, -435154, 1092330, 885384, 1441228, 3468963, 4055414, 1342847, -2068275, -2710044, -1038165, -189924, -1414957, -3071335, -3356804, -2136583, -552430, -152081, -1754023, -4143543, -4883087, -3418164, -2028696, -2507733, -3624630, -3609987, -3292510, -4255012, -5367623, -4286856, -1640673, -391651, -1086059, -1020708, 1260933, 3683383, 3984172, 2749342, 1689569, 1087315, 584553, 699899, 1748848, 2500725, 1598810, -463083, -2067358, -2474469, -2083907, -1461881, -1051367, -1109632, -1105629, 15628, 2162461, 3564737]
9511C564737p34432k034881j338785K56671J222037J168448N15923q3885L3102
9502B568935P55244Q57071l84570j705928j354656L91954J601738J097071p61356
9493C065503k888054l747110k038272J217553K753390J257832k89559Q71583K526129
9484B728995J004877k254020k488177P28073K816461J499190m26636o71083o64587
9475B273093j418016j117951P35405J393458j80180q98318P60001J271075j716707
9466A101860m158558j764174K342776K229032j159870j695970J668760L393402
9458A957258P32393j993538p89778J835740J502579j197459k367857r34636O04019
9449f51279M85399l72256o04532l12395l37026r22375j491372j217185J40211
$$ y = [3564737, 2830305, 795424, -543361, -286690, 935347, 2103795, 2619718, 2535833, 2568935, 3324179, 4181250, 3796680, 2090752, 736096, 1128050, 2729788, 3826859, 3065503, 177449, -3569661, -5607933, -4390380, -1636990, -379158, -668717, 202866, 2728995, 3733872, 1479852, -1008325, -280252, 2536209, 4035399, 3608763, 2937680, 2273093, 855077, -262874, 472531, 1865989, 1685809, 787491, 1547492, 2818567, 1101860, -3056698, -4820872, -2478096, -249064, -1408934, -3104904, -1436144, 1957258, 2689651, 696113, -93665, 1742075, 3244654, 2047195, -320662, -1255298, -651279, -165880, -538136, -1142668, -1455063, -1792089, -2714464, -4205836, -5423021, -5282810]
9440e282810J644188J829372M22341j002417p33968R15858J862001P87132j124797
9431f83100j492710L75262K509761K467325K3538k751195l682145k221054M79388
9422d974930K390848J975790k26734j728420q89582Q87875J106567k85853j160520
9413b904959o16862J66039N03184J107228J957569J817923O80969J84656O26241
9404C521988K16625j432117j927169j4439J867523J261601n38058j017043n16418
9395A422493p74093j251700k95141J261771J098543n69213j192614p449R58456
9386F51053K72768r63976j101747l5044J146802J370565L71481q42532p62582
9377A06788O18374J543959J050469K56064K0124o02982j930578k102939l68584
$$ y = [-5282810, -3638622, -1809250, -1386909, -2389326, -3123294, -2207436, -345435, 441697, -683100, -2175810, -1800548, 709213, 3176538, 3200076, 448881, -3233264, -5454318, -4974930, -2584082, -608292, -835026, -2563446, -3453028, -2565153, -1458586, -1744439, -2904959, -3521821, -3355782, -2852598, -1745370, 212199, 2030122, 2711091, 2895747, 3521988, 3738613, 2306496, 379327, 364888, 2232411, 3494012, 2955954, 1938911, 1422493, 648400, -603300, -898441, 363330, 1461873, 892660, -299954, -307403, 651053, 923821, -40155, -1141902, -1176946, -30144, 1340421, 1711902, 869370, 106788, 725162, 2269121, 3319590, 3575654, 3595778, 2992796, 1062218, -1040721, -1409305]
9368a409305N58617j363773l257109j235605L050682M372616J645655j073511
9360A288267j299503r48385j541778j298209R39210K691902J433817j386029k404783
9351b525491p67334J458951K099290P27167j321269j996600n85688J072153P27829
9342a110992j084202j858340r33831p1082o8263L93264J755949K211841P17452
9333d8204r12579o10715R29695J468408L02206j180304j303114K89869K207987
9324A143249K347486K11219k068073k222614p99257N3414P959M23809J260171
9315C57363R59070m77199j135016m02985J50017k58812l88015N32626J503074
9306H40123J670491J241350Q2703j957922l050183r39775K771205L484103J21058
$$ y = [-1409305, -850688, -2214461, -5471570, -6707175, -3656493, 716123, 2361778, 1288267, -11236, -959621, -2501399, -3799608, -2860398, -168496, 1265321, -120708, -2525491, -3292825, -1833874, 265416, 992583, -328686, -2325286, -2910974, -1838821, -1110992, -2195194, -4053534, -4987365, -5058447, -5126710, -4733446, -2977497, -765656, -48204, -960783, -1571498, -641803, 826605, 1128811, -51493, -1354607, -1064738, 1143249, 3490735, 3701954, 1633881, -588733, -1387990, -1334576, -1326617, -902808, 357363, 1316433, 839234, -295782, -698767, -548750, -807562, -1195577, -662951, 840123, 2510614, 3751964, 3834667, 1876745, -1173438, -2113213, 657992, 4142095, 4263153]
9297D263153k794517j595759J341724J576175r61251k668004j719124J86400Q29509
9288a541694J3138p49712n6058J574827J824826k84470k109060p20176K080355
9279C1976J749283j844370l665060j123670K145307K324810Q12846N14101P24131
9270A669354m87434j976686j630288l31933m7296j20108Q46028J497028l7698
9261f19033k180750k033272o9077R56811N31655K80847N24428L98949L15110R56351
9251i37981J004285p77043k463600j534843O99398R91735n56922j008970L66274
9242d217667J485006J436536J314810J327411N76355n27963q20075p65007j200311
9233a390905q54786J328179K867931J046573j818828j371135J506624J953530
$$ y = [4263153, 1468636, -127123, 1214601, 2790776, 1829525, -838479, -2557603, -2371203, -1541694, -1528556, -2278268, -2334326, -759499, 1065327, 780857, -1328203, -2048379, 31976, 1781259, -63111, -3728171, -4851841, -2706534, -381724, 431122, 945223, 1669354, 1181920, -794766, -2425054, -2756987, -2804283, -2924391, -2078363, -581335, -619033, -2799783, -4833055, -4902132, -3945321, -3413666, -3132819, -2608391, -2209442, -1894332, -937981, 66304, -710739, -3174339, -4709182, -4009784, -3018049, -3574971, -4583941, -4217667, -2732661, -1296125, 18685, 1346096, 1922451, 1394488, 574413, -190594, -1390905, -2245691, -917512, 1950419, 2996992, 1178164, -192971, 1313653, 3267183]
9225C267183p48622k311333j029258m3022q79327q78569J032624J879729L82580
9216F71985m26354Q86672J116888j398984k901614m99458K530226K186606J13090
9207B279057k44817J95274r29064j901978p1177K322730J485789r05406l00009
9198A930399K523555K461183j063040k916515q48983J000632o93105l163125k533882
9189c302881J71654J544112J262251J397073K111459J572485m62671j803157q65211
9180A625114J169160J814327K13513j800438j711719N44892K149770Q76993j855659
9171C025953k949722j947355j107629j262148m71956K100653L709683J702281
9163B799760k044471l141422n43171K308466K441509R14626K61953N02908j22661
$$ y = [3267183, 2518561, 207228, -822030, -865052, -1744379, -2622948, -1590324, 289405, 671985, 245631, 1132303, 2249191, 850207, -2051407, -2550865, -20639, 2165967, 2279057, 2034240, 2229514, 1300450, -601528, -672705, 1650025, 3135814, 2230408, 1930399, 4453954, 6915137, 5852097, 2935582, 2086599, 3087231, 2394126, -768999, -3302881, -3131227, -1587115, -324864, 1072209, 3183668, 4756153, 4293482, 2490325, 1625114, 2794274, 4608601, 4822114, 3021676, 1309957, 1854849, 4004619, 4881612, 3025953, 76231, -1871124, -2978753, -4240901, -4712857, -2612204, 1097479, 2799760, 755289, -2386133, -2929304, -620838, 1820671, 2735297, 2997250, 3500158, 3377497]
9154C377497j509424j474625N29317J951372P17480j579801k006265n64540K22033
9145c36956n61894j138231k83124Q85613J178260J099942J178560O42401p13259
9136A951312j264141m3691J145326K94639j422578j307525O07573J603222M57514
9127B021651r11095n22298R44269J439993K84474j289979j714299p03491M52996
9118B221K91947r13418j267139J86492J930072J985512N47583p02877j097812
9109I62581j193499j099248m18600L91201L79146j93332j34299O30819Q39094
9100A63863j45750j530574k300549j955729l05125J928467K679479P11760j951457
9091b705615k081306J65623J366209J20585q03076Q32185K747238J538960j819324
$$ y = [3377497, 1868073, 393448, 922765, 2874137, 3591617, 2011816, 5551, -558989, -336956, -898850, -2037081, -2320205, -1434592, -256332, 843610, 2022170, 2664571, 1951312, 687171, 643480, 1788806, 2083445, 660867, -646658, -39085, 1564137, 2021651, 1110556, 588258, 1532527, 2972520, 3256994, 1967015, 252716, -450775, 2221, 294168, -619250, -1886389, -1699897, 230175, 2215687, 2763270, 2060393, 962581, -230918, -1330166, -1748766, -1357565, -978419, -1171751, -1306050, -675231, 163863, 18113, -1512461, -3813010, -5768739, -6073864, -4145397, -1465918, -754158, -2705615, -4786921, -4621298, -3255089, -3134504, -3937580, -3105395, -358157, 1180803, -638521]
9082f38521l081852p41749K060863K067374p0150j412695p66806M42414O60585
9073a480537K2325n68586r97001j591559j758056l91259K033728L189594J717818
9064A76467p47914j666063p93739K33023O82371J081510J295028N84759m33702
9055D11740k72659P20246N76684q86727j514726m93635K49601l52722m67082J116268
9045i13012K295253J161790l73165K32970J455826J38986k748582l200957o51104
9036b601995J096925j2421j457749q12452O01717Q26754P18870J593619K048304
9027B001572K80892k159622k184816J55300J791489J102290m36562j098728q83808
9018a431993k35717R03701J938736J477562n53846k203698k056564j155411j074583
$$ y = [-638521, -3720373, -4462122, -2401259, -333885, -404035, -1816730, -2583536, -2141122, -1480537, -1458212, -2026798, -3023799, -4615358, -6373414, -6764673, -4730945, -1541351, 176467, -571447, -2237510, -3031249, -2798226, -2115855, -1034345, 260683, 845442, 411740, 139081, 859327, 1436011, 549284, -965442, -1459077, -1209476, -1562198, -2029280, -913012, 1382241, 2544031, 2170866, 2403836, 3859662, 3998648, 1250066, -1950891, -2601995, -1505070, -1517491, -2975240, -3787692, -3185975, -2359221, -1640351, -46732, 2001572, 2282464, 122842, -2061974, -1906674, -115185, 987105, 550543, -548185, -1431993, -1667710, -764009, 1174727, 2652289, 2098443, -105255, -2161819, -3317230, -4391813]
9009d391813j327948m28795J262989J811874P77622L1079Q56627J893861J192568
9000A678064p53639j577328l20519J301512J220863m49581j831228j651410m78022
8991b861288L42937M18071N56122J300939J784392Q15304r66626j248769Q75022
8982A016104L047058K320652q32121k945388k044398J03326Q00875j99205j183644
8973H3259j016066R1232J404507K049932J324421k84071j184488q26905o76822
8964I64999j701920k204713k86951K462635K500871n22548k944856k093738M15694
8955c410527J578794R92384L01005L41158P00836J038350J152534N40286o84634
8946B550186j294442p63697n08663j591606k332845n79338K380437L056445R12517
$$ y = [-4391813, -5719761, -6148556, -4885567, -3073693, -2296071, -2264992, -1408365, 485496, 1678064, 924425, -652903, -973422, 328090, 1548953, 1099372, -731856, -2383266, -2861288, -2518351, -2100280, -1544158, -243219, 1541173, 2356477, 1389851, 141082, 1016104, 4063162, 6383814, 5551693, 2606305, 561907, 665233, 1466108, 1266903, 83259, -932807, -841575, 562932, 2612864, 3937285, 3653214, 2468726, 1641821, 964999, -736921, -2941634, -3228585, -765950, 1734921, 1212373, -1732483, -3826221, -3410527, -1831733, -839349, -538344, -197186, 503650, 1542000, 2694534, 3234820, 2550186, 1255744, 492047, -16616, -1608222, -3941067, -4520405, -2139968, 916477, 1828994]
8937A828994q03793j59743P14976k43670j114853P71458L610939K959708j575508
8928E988508n130326l937914L7843K315682J464572m36340j310200r60915k22694
8919b191784J9709o54208j460618q07195J450732L073288K174823n8063j111164
8910D35520o85156l88419o30722l56496M07364M24882k21653j69748L86302j86925
8900i85051j468295q89032J736522L029249J217523q90700n74100M29585n58881
8891A046820k180441j569493L17677L59401j088783q14156J513699K709116J349855
8882A643695m19742r02040q77428r09896k20971Q47872O29740o70163q20271N33311
8872a165893J165183L58361R6770J067300J265413J1045n76614J63706j32045
$$ y = [1828994, 1025201, 865458, 1580434, 1336764, 221911, 993369, 4604308, 7564016, 5988508, 858182, -3079732, -3041889, -726207, 738365, 302025, -1008175, -1969090, -2191784, -2172075, -2826283, -4286901, -5094096, -3643364, -570076, 1604747, 1546684, 435520, -249636, -638055, -1268777, -1625273, -1217909, -793027, -1014680, -1184428, -798126, -985051, -2453346, -3342378, -1605856, 1423393, 2640916, 1750216, 1176116, 1605701, 1046820, -1133621, -2703114, -2385437, -2026036, -3114819, -3928975, -2415276, 293840, 1643695, 1223953, 321913, -555515, -1465411, -1686382, -838510, -208770, -878933, -1699204, -1165893, -710, 357651, 454421, 1521721, 2787134, 2798179, 2221565, 2385271, 2253226]
8863B253226j993263k130702P20386K418802j86042l489052k521178J184764K444238
8854a298821O78392l62834L96798M46486p36831p45733Q02068J343624J52497
8845F75646m45971M30729P31939l58667p59358N26234J404358L77143r93255j075203
8835E13595p09884r46080q71126L70914J596665J434074L63368n22537j084616
8826A44373j352171r83211m23476o31712r31183M58548K902915L246468O25938
8817C056489j603691p90671R88548M77364j587995k076211o26424K34912m99204
8808b426883j020547m6642J173013J042274L2889j98653P29597J371178M47906
8799A104132j148275j208870O45051J920973O55071j357689j020186J131951J558515
$$ y = [2253226, 259963, -1870739, -1150353, 1268449, 1082407, -2406645, -4927823, -3743059, -1298821, -620429, -983263, -586465, -139979, -876810, -1622543, -820475, 523149, 675646, 229675, 660404, 1392343, 1033676, 274318, 800552, 2204910, 2582053, 1588798, 513595, -196289, -1142369, -2013495, -1642581, -45916, 1388158, 1751526, 1228989, 144373, -1207798, -2191009, -2614485, -3246197, -4177380, -3718832, -815917, 2430551, 3056489, 1452798, 662127, 1650675, 2128039, 540044, -1536167, -2162591, -1927679, -2426883, -3447430, -3494072, -2321059, -1278785, -1245896, -1444549, -714952, 656226, 1104132, -44143, -1253013, -607962, 1313011, 1968082, 610393, -409793, 722158, 2280673]
8790B280673o06024j999429l38101K014180J805256m37167j852806j351153m615
8781d89186J025241R59959o23670k522450k354968K1188J624456P46781k77704
8772a890353Q40897K183058Q99806j620350j897873j30393N02484n29555n88655
8763b230934J083567K016518P99367r74689j819139k039206j565401M61753K912051
8754a356113K875416Q5938k005311j192177N03109O68319K25726Q39359J402480
8745B046746K59136j183879n84502R60668M09063j891203k210394O73154L150158
8736A628947J945652j219061k467943j311689m31283q13631m06871J789678L290877
8727B004676J721842j145148j607145O00022K026479P04197j213332j063287M69789
$$ y = [2280673, 1674649, -324780, -662881, 1351299, 3156555, 2719388, 866582, -484571, -489186, 536055, 1496014, 872344, -1650106, -4005074, -3983886, -2359430, -1612649, -1890353, -1049456, 1133602, 2033408, 413058, -1484815, -1615208, -1112724, -1642279, -2230934, -1147367, 869151, 1668518, 693829, -1125310, -3164516, -4729917, -4268164, -1356113, 1519303, 1605241, -400070, -1592247, -1089138, -420819, -195093, 644266, 2046746, 2305882, 1122003, 537501, 1498169, 1907232, 16029, -2194365, -1521211, 1628947, 3574599, 2355538, -112405, -1424094, -1855377, -2669008, -3075879, -1286201, 2004676, 3726518, 2581370, 974225, 1574247, 3600726, 4304923, 3091591, 2028304, 2498093]
8718B498093Q69479m70619j945275k228857j413172k98085J83065m54715j234946
8709d495032l78727J939625K992445J178575j331514j671791m12622n329m34197
8700b618567L30621K178725K660344J114260k89702l09515l71359j432908j902870
8691f40971l70407J693309J815487j59447k088746k102865l08785J438096J225520
8682E01191o66454j570937K05883K561965K263390j90508j288434q733Q81723
8673B689086k19315j157595r5393J165021L98219j185555j099718M17672J356338
8664B268760J297239J090176N09194r56757j971930q90145J125346J282437o93056
8655C061264k155610j454857R8983P03916M70205M71746Q45459Q65907K19138
$$ y = [2498093, 3367572, 2896953, 951678, -1277179, -2690351, -2988436, -2805371, -3260086, -4495032, -4873759, -2934134, 58311, 1236886, -94628, -1766419, -2179041, -2184370, -2618567, -2287946, -109221, 2551123, 3665383, 3375681, 3066166, 2694807, 1261899, -640971, -1011378, 681931, 2497418, 2337971, 249225, -1853640, -2162425, -724329, 501191, -165263, -1736200, -1530317, 1031648, 3295038, 3104530, 1816096, 1807363, 2689086, 2469771, 1312176, 1216783, 2381804, 2780023, 1594468, 494750, 912422, 2268760, 3565999, 4656175, 5165369, 4208612, 2236682, 1346537, 2471883, 3754320, 3061264, 905654, -549203, -450220, 253696, 723901, 1195647, 2041106, 2907013, 3126151]
8646C126151n23266n58821J61064O43520j9231j202346j319106j12571Q33332
8637A028726M63103k81791l24401k73310r49897j456498n64437R22978J166108
8628b69419R1898o51741k11887O86601J228243J225779N96846m03023p11768K91263
8618A872792J373249Q24941j012888k177146j808908q17065j9113N66785N67698
8609f29655o54201k323154k429058l64205J947073K336635Q05529r89428j745862
8600d046326j307620j25975J255597K259176K254880Q69937j318894k644733j841406
8591d645364K02389J346045J076586Q42215J041670Q3464k155780k653809L43024
8582d519560L540203K792925n30919j577668M42710J470888l88343j973723p22673
$$ y = [3126151, 2602885, 2044064, 2205128, 2848648, 2829417, 1627071, 307965, 195394, 1028726, 1491829, 1210038, 885637, 612327, -337570, -1794068, -2358505, -1435527, -269419, -177521, -829262, -1041149, -354548, 873695, 2099474, 2696320, 2293297, 1581529, 1872792, 3246041, 4070982, 3058094, 880948, -927960, -1745025, -1764138, -1197353, -629655, -1283856, -3607010, -6036068, -6400273, -4453200, -2116565, -1311036, -2300464, -4046326, -5353946, -5479921, -4224324, -1965148, 289732, 1159669, -159225, -2803958, -4645364, -4442975, -3096930, -2020344, -1178129, -136459, -52995, -2208775, -4862584, -4519560, -979357, 1813568, 1282649, -295019, 147691, 1618579, 1230236, -743487, -1466160]
8573a466160J199401R00796o72255j039649k61892J86920L47980P73713N91350
8564E60204o80640j276661L5463J221356J55365j321805k22140K185807K090498
8555B747447m80991j665898l17238K90280j465452k517517n83755J508886N04740
8546a979498j499435l18426L187160L994430N46999k965574k810040m08743Q13954
8537a439173K13747o57303j085235j099110m653K236287L262247R46088k680838
8528c07943l299421l40300K091349J295008l74481N4050J214514J83001j960829
8519a445052j518670J618922L400787J736987p14792j216711q36016j495262k169967
8510b639774r96733Q98102R37854o69013j347998k91451P58360P67431O27453
$$ y = [-1466160, -266759, 634037, -38218, -1077867, -1339759, -1152839, -804859, -31146, 560204, -120436, -1397097, -1361634, -140278, 15087, -1306718, -1528858, 656949, 2747447, 2266456, 600558, 283320, 573600, -891852, -3409369, -3993124, -2484238, -1979498, -3478933, -3797359, -610199, 3384231, 3931230, 965656, -1844384, -2253127, -1439173, -1225426, -1882729, -2967964, -4067074, -4071727, -1835440, 1426807, 2372895, -307943, -3607364, -3947664, -1856315, -561307, -935788, -881738, 332776, 515777, -1445052, -2963722, -1344800, 2055987, 3792974, 3078182, 1861471, 1025455, -469807, -2639774, -3636507, -2738405, -1800551, -2469564, -3817562, -4109013, -3350653, -2583222, -1955769]
8501a955769P48832J07076j412505j993901m58247J866566L032830K776643J847150
8492D558675N12385r53636j593417j070978o28622j238708j766655p13488R96519
8483a897925J070286n82788j553050n30796Q96135R07024P1607m0297N20164N28661
8473f10979j55895n03455j62277J68743J59190J98928K73192o3960m38196L49
8463a134360O19941l62369k690999l338741o90278K465631K650060R10977R85263
8454e84875K960734K911347m41803k984425j377799J680252J772104l99072p43009
8445B793454J237749J983154J52046j410345r55963o39077k041580k829162p86692
8436b496416J953862K188691P59606N57902J175509n6252k477422k315986R68600
$$ y = [-1955769, -1206937, -1099861, -2512366, -4506267, -4964514, -3097948, -65118, 2711525, 4558675, 5071060, 4117424, 2524007, 1453029, 824407, -414301, -2180956, -2894444, -1897925, -827639, -1410427, -2963477, -3494273, -2598138, -1691114, -1619507, -1659804, -1139640, -610979, -766874, -1270329, -1432606, -1263863, -1104673, -905745, -632553, -696513, -1134709, -1134360, -514419, -876788, -3567787, -6906528, -7596806, -5131175, -2481115, -1570138, -584875, 2375859, 5287206, 4845403, 1860978, 483179, 2163431, 3935535, 3536463, 2793454, 4031203, 6014357, 6166403, 4756058, 3800095, 3161018, 1119438, -1709724, -2496416, -542554, 1646137, 2405743, 2963645, 4139154, 4082902, 1605480, -710506, 258094]
8427B58094L069234J227670j656934j779787j9466M09742n67809n48294N87493
8418I79943N84108p07904o03382J748322L242818J192696k492368l709043j442083
8409a206893J445775K104195N57873j209486j540989k15277J672674K508369J423963
8400E540204q69204k697489k890216j531232L88526J660269J541180L71965n90415
8391I23588m63154K54436M41964j00850n67111m94241l50347n76804q25299n61350
8381b319168J50187Q82937J364907J346850N35367p53805j422680q78433q1452
8372a175290k99187j055993o36175J173489K297861J151843j026551j934367j424762
8363b929132j228522j783733j435135O18908K495962K160787N15219J15330J328400
$$ y = [258094, 3327328, 4554998, 2898064, 1118277, 1098811, 1508553, 940744, 392450, 979943, 1564051, 856147, 252765, 2001087, 5243905, 6436601, 3944233, 235190, -1206893, 238882, 2343077, 2900950, 1691464, 150475, -64802, 1607872, 4116241, 5540204, 4671000, 1973511, -916705, -2447937, -2059411, -399142, 1142038, 1514003, 923588, 460434, 714870, 1156834, 1055984, 488873, -5368, -355715, -932519, -1757818, -2319168, -2168981, -1286044, 78863, 1425713, 1961080, 1207275, -215405, -1093838, -1175290, -1474477, -2530470, -3166645, -1993156, 304705, 1456548, 429997, -1504370, -2929132, -4157654, -5941387, -7376522, -6757614, -4261652, -2100865, -1585646, -1470316, -141916]
8354a41916J756413j83323k794396l230819j105403J240158J763798R28105O05980
8345a161403J486408K254346J371006q58803k510109k242240o74810O63994J127836
8336e43775J130233J047128Q08879M36164J39274j85956q51559j663624j976544
8327a659780j577360q78983j58818O55559J309485J190464L17259m22603m63562
8318a688339k94429n40861r88097j032996n03276M58131J674349K582055K335587
8309B002124R56354k84412l95545N0576n894m31341l85233K3606j25451r13539
8299D91245j316010p16900L57329J201656J652155J590211P14867o94894j564701
8290A714958j184888j23642M94628K51820m16778r61831j127988q52764k84658
$$ y = [-141916, 1614497, 1431174, -1363222, -4594041, -5699444, -4459286, -2695488, -1767383, -1161403, 325005, 2579351, 3950357, 3091554, 581445, -1660795, -2335605, -1671611, -543775, 586458, 1633586, 2442465, 2878629, 3017903, 2831947, 1980388, 316764, -1659780, -3237140, -4116123, -4274941, -3619382, -2309897, -1119433, -802174, -1224777, -1688339, -1982768, -2523629, -3511726, -4544722, -5047998, -4589867, -2915518, -333463, 2002124, 2958478, 2674066, 2278521, 2329097, 2323203, 1891862, 1506629, 1530235, 1404784, 491245, -824765, -1541665, -1184336, 17320, 1669475, 3259686, 3974553, 3279659, 1714958, 530070, 406428, 901056, 1152876, 736098, -225733, -1353721, -2206485, -2491143]
8281b491143P4622l02421j192405j411578R893K215252K798109N85058k263750
8272a978363k352358N67887K971691K169090j80081q33594K08514K44251j329944
8263e12907j874391Q1875K087525J256719j407205k454102p52377J448225J909760
8254b16878Q04162m67546j057726p16609M50566J467720R51742r29958j995755
8245a710282p69112J150307J043544r38033j683625M74387L090667K692855o31602
8236B719106l445105l247095q31387J531866K467549J688767l83236k250702k024904
8227c775141L13799K393647K320514R89994K58455N1599q15799j881890j550033
8218a694855j25154K42811r13034j412504k0517J354840P43710n87457k35143
$$ y = [-2491143, -2416521, -2718942, -3911347, -5322925, -5313032, -3097780, -299671, 285387, -1978363, -4330721, -3762834, -791143, 1377947, 1197866, 364272, 572786, 817037, -512907, -2387298, -2305423, -217898, 1038821, -368384, -2822486, -3574863, -2126638, -216878, 587284, 119738, -937988, -1654597, -1204031, 263689, 1215431, 285473, -1710282, -2479394, -1329087, -285543, -1223576, -2907201, -2432814, 657853, 3350708, 2719106, -725999, -3973094, -4804481, -3272615, -805066, 883701, 500465, -1750237, -3775141, -3461342, -1067695, 1252819, 2242813, 2501268, 2552867, 1737068, -144822, -1694855, -1820009, -1577198, -2490232, -3902736, -3923253, -2568413, -1824703, -2412160, -2647303]
8209b647303J259530J180564r07070k263617j073925R83563J462367M87585l09130
8200a827436o96810j460445j872496j91074K952215M122797J448079k293463k852145
8191b670778J14409K817658K240222n91902k493220j735478P43206K612157K164937
8182C201211r5682j760131j248586J25274K15347m59958L16598K142345J906452
8173D342870j007718k897078j218620J281516R02961j265776j674328k75770K00963
8164a610980l61932L89383K108901J655675j208990k759799j309901J86760m66235
8155c377118r41467J160271L699889L283381N30786j359750j365266p65713j61941
8146G03072N22938M09053r76189j853088n89158J189457Q60449q81854j203622
$$ y = [-2647303, -1387773, -207209, -1114279, -3377896, -4451821, -3468258, -2005891, -1518306, -1827436, -2524246, -3984691, -5857187, -6048261, -3096046, 1026751, 2474830, 181367, -2670778, -2556369, 261289, 2501511, 1909609, -583611, -2319089, -1575883, 1036274, 3201211, 3105529, 1345398, 96812, 222086, 437433, -22525, 294073, 2436418, 4342870, 3335152, 438074, -780546, 500970, 1403931, 138155, -1536173, -1811943, -1610980, -1972912, -1583529, 525372, 2181047, 972057, -1787742, -3097643, -2910883, -3377118, -4318585, -3158314, 541575, 3824956, 4355742, 2995992, 1630726, 865013, 703072, 1226010, 1635063, 658874, -1194214, -1783372, -593915, 266534, -615320, -1818942]
8137a818942J58135Q02907l4228n51142R3851N89783K78532J33757L67190j9976
8127a33o94470o4246J326354Q30252j588512k239368N69945L117779J669230j557992
8117A368839j774308R48941K198963N10516o97751O89655J876903K2603k849508
8108B294853l062066j031054p9958q14408p14836Q34173J264332l82405j300567
8099b991936K64884J509934l84579k930884j765296K204609L846112J620627n65637
8090H07834r9376O59641n56904j687616l52678J480728P10719j551102j885866
8081b474620j41061R05762M41484K78901J021367J186820K64350m84698m98329
8072D99976m39860k07055Q43968J678435M77965k015470k905880j311194N82518
$$ y = [-1818942, -1660807, -857900, -892128, -1443270, -1349419, -759636, -481104, -347347, 19843, -133, -694603, -758849, 567505, 1397757, -190755, -2430123, -1860178, 1257601, 2926831, 1368839, -405469, 543472, 2742435, 3252951, 2555200, 3244855, 5121758, 5144361, 2294853, -767213, -1798267, -1878225, -2692633, -3407469, -2573296, -1308964, -1691369, -2991936, -2727052, -1217118, -1601697, -4532581, -6297877, -4093268, -247156, 1373471, 807834, 708458, 1368099, 811195, -876421, -1229099, 251629, 962348, -588754, -2474620, -2615681, -1709919, -1268435, -989534, 31833, 1218653, 1483003, 998305, 499976, 60116, -146939, 697029, 2375464, 2853429, 837959, -2067921, -3379115, -2796597]
8063b796597J064463P99055O86235N05947K98395N75203P37469j32313q01859
8054I35998O67048K864487K220191j097233k720104r15613N82038j144042l426129
8045b033359k723457k82343P03516M07765P50367J115424J1962j125717k14941
8036c390783J200809N31569o18735J079049M026737L291038j052830l111158j62842
8027A792854L075855J864746j583558k239177N5203J269811k84793k146349j973973
8018a69381m73520L28198k93505j391600j554173k90421J348152J872520J261443
8009F37713Q14903Q44868Q8940j706628k404417l91732K435526K803815N80958
8000C703946j096811k59886J475376J600245M6488j379578j713748j509601j299269
$$ y = [-2796597, -1732134, -933079, -246844, 259103, 557498, 1132701, 1870170, 1737857, 935998, 1603046, 4467533, 6687724, 5590491, 2870387, 1954774, 2536812, 1392770, -2033359, -4756816, -5039159, -4335643, -3927878, -3177511, -2062087, -2050125, -3175842, -3390783, -2189974, -1658405, -2277140, -1198091, 2828646, 6119684, 5066854, 1955696, 1792854, 4868709, 6733455, 5149897, 2910720, 2965923, 4235734, 3950941, 1804592, -169381, -642901, -314703, -608208, -1999808, -3553981, -3844402, -2496250, -623730, 637713, 1452616, 2297484, 2386424, 679796, -1724621, -2116353, 319173, 3122988, 3703946, 2607135, 2347249, 3822625, 5422870, 5469358, 4089780, 2376032, 866431, -432838]
7991d32838q56831j65225O9428m91556r44374j82442J477669K467388J730706
7982B671925k55474k135510k722275j549271P00198K236060J671655j71723r69925
7973e24340J79069J656249J737276Q10720K00366L9456k82242n65636l32172j76937
7963B741809q71459j638432j103348L92442J250909J102425Q81949O50148l89256
7954C017187j623312j323500K41700O27747p99561j405041M53012K267312J074086
7945B529630j652626k037482K48788J557523j09585k291502j999820J15971J277548
7936b361555N58079n61042p21881l3427P80001J150664O68653n04400j206074
7927b230982l80877J217918J565795L3633j560596j308091L05391J318119J011101
$$ y = [-432838, -1289669, -1454894, -1385466, -1877022, -2821396, -3003838, -1526169, 941219, 2671925, 2416451, 280941, -2441334, -3990605, -3290407, -1054347, 617308, 445585, -524340, -345271, 1310978, 3048254, 3858974, 4059340, 4098796, 3816554, 3250918, 2918746, 2741809, 1870350, 231918, -871430, -478988, 771921, 1874346, 2756295, 3406443, 3017187, 1393875, 70375, 312075, 939822, 140261, -1264780, -811768, 1455544, 2529630, 877004, -1160478, -911690, 645833, 536248, -1755254, -3755074, -3639103, -2361555, -1803476, -2364518, -3086399, -3119826, -2339825, -1189161, -520508, -1024908, -2230982, -2611859, -1393941, 171854, 205487, -1355109, -2663200, -2357809, -1039690, -28589]
7918b8589L52313K4216l95848r90522p85519O06379J740697R97961j022791j961277
7908a462980n40414J868445K723685J006259j657714k607991j106254O77766M53167
7899f46031q72514m15881K003476K905932K41959l018774k925910l14923Q43474
7890b199192j79849k06341J947598L141933J104186j693090j905974k58780M40637
7881A91128R1018N52653J394124L20739k259021k927264n05818J717627Q32394
7872e92420j331634j229016Q92562J651714j6004j376243m18771J088473O96178
7863f35161q04176r34915L11249O68787m00466q26181L56875J193211J80160r32509
7853a823126M3526J868453J596533p42500k111339r92720Q30188J454409J214540
$$ y = [-28589, 323724, 347940, -47908, -1038430, -1823949, -1217570, 523127, 1521088, 498297, -1462980, -2003394, -134949, 2588736, 3594995, 1937281, -670710, -1776964, -1099198, -646031, -1518545, -1934426, 69050, 2974982, 3216941, 198167, -2727743, -3042666, -2199192, -2379041, -2585382, -637784, 2504149, 3608335, 1915245, 9271, -249509, 191128, 282146, 834799, 2228923, 2549662, 290641, -2636623, -3142441, -1424814, -592420, -1924054, -3153070, -2260508, -608794, -624798, -2001041, -2419812, -1331339, -635161, -1439337, -2374252, -2063003, -1394216, -1794682, -2620863, -2263988, -1070777, -890617, -1823126, -1779600, 88853, 1685386, 942886, -1168453, -2161173, -1330985, 123424, 1337964]
7844A337964R20139R8678j503339k462304j480944M61991J342857P52025J199
7835e31734J12745Q32781J286466Q02588m98587j385550n03463J667063K723335
7826D505644J142292j580388k665881j397767L76541Q19305J00820l15241L20376
7817A305701J161482Q79890n33156j617331j401898o79793m59553j81404Q91838
7808f34224J462816r7000k229385j564876J697492L242183Q88406k006914j680399
$$ y = [1337964, 2258103, 2356781, 853442, -1608862, -3089806, -2627815, -1284958, -532933, -531734, -418989, 413792, 1700258, 2502846, 2004259, 618709, 115246, 1782309, 4505644, 5647936, 4067548, 1401667, 3900, 380441, 1199746, 1300566, 985325, 1305701, 2467183, 3347073, 2813917, 1196586, -205312, -885105, -1344658, -1526062, -634224, 828592, 731592, -1497793, -3062669, -1365177, 1877006, 2765412, 758498, -921901]
$$ [...]
##END NTUPLES=NMR SPECTRUM
##END=
