##TITLE=31Pdec_PhEPA0107
 , 24 sc
 2.07.2021
##JCAMPDX= 6.0         $$ Bruker NMR JCAMP-DX V2.0
##DATA TYPE= NMR SPECTRUM
##DATA CLASS= NTUPLES
##ORIGIN= UXNMR, Bruker Analytische Messtechnik GmbH
##OWNER= root
$$ XWIN-NMR		Version 3.5
$$ Fri Jul  2 08:59:18 2021 Russian Standard Time (UT+4h)  she@DPX200
##.OBSERVE FREQUENCY= 81.013821
##.OBSERVE NUCLEUS= ^31P
##.ACQUISITION MODE= SIMULTANEOUS
##.ACQUISITION SCHEME= undefined
##.AVERAGES= 24
##.DIGITISER RES= 16
##SPECTROMETER/DATA SYSTEM= spect
##.PULSE SEQUENCE= zgpg30
##.SOLVENT NAME= CDCl3
##.SHIFT REFERENCE= (INTERNAL, CDCl3, 0, 248.564)
##AUDIT TRAIL= $$ (NUMBER, WHEN, WHO, WHERE, WHAT)
$$ ##TITLE= Audit trail, XWIN-NMR		Version 3.5
$$ ##JCAMPDX= 5.01
$$ ##ORIGIN= Bruker BioSpin GmbH
$$ ##OWNER= she
$$ F:/spectra/data/she/nmr/P31/1/pdata/1/auditp.txt
$$ ##AUDIT TRAIL=  $$ (NUMBER, WHEN, WHO, WHERE, WHAT)
(   1,<2021-07-02 08:57:59.00 +0400>,<she>,<DPX200>,
      <created by zg, POWCHK disabled, PULCHK disabled
       configuration hash MD5:
       00 E9 B6 7A A2 85 ED C7 34 08 36 98 17 FE 4E 26
       data hash MD5: 32K
       5B 61 07 08 C3 DB CF FC 63 7C FB 54 A4 5B 88 6C>)
(   2,<2021-07-02 08:58:07.34 +0400>,<she>,<DPX200>,
      <Start of raw data processing
       efp BC_mod = 2 LB = 1 FT_mod = 6 PKNL = 1 PHC0 = -7382.216 PHC1 = 62.28613 SI = 64K 
       data hash MD5: 64K
       3E 53 5E 5E 01 C7 1A 5B 3F 14 FF 6E FC CA 48 2F>)
(   3,<2021-07-02 08:58:34.35 +0400>,<she>,<DPX200>,
      <pk PHC0 = 106.9416 PHC1 = -264.9999 
       data hash MD5: 64K
       B7 D8 9B A9 DD B0 03 18 D3 6C AF B3 FC 91 FF 85>)
(   4,<2021-07-02 08:58:38.89 +0400>,<she>,<DPX200>,
      <abs ABSG = 5 
       data hash MD5: 64K
       5B 37 98 DD E5 EE 6A DE 5B 72 37 A5 08 B0 C0 AB>)
$$ ##END=
$$ 
$$ hash MD5
$$ A3 B5 A2 A8 46 48 2D CF 71 EA C2 C3 79 4F 3B F1
##$RELAX= 
##$RELAX= 
##$RELAX= 
##$RELAX= 
##$RELAX= 
##$RELAX= 
##$RELAX= 
##$RELAX= 
$$ Bruker specific parameters
$$ --------------------------
##$DU= <F:/spectra>
##$EXPNO= 1
##$NAME= <P31>
##$PROCNO= 1
##$TYPE= <nmr>
##$USER= <she>
##$AMP= (0..31)
100 100 100 100 100 100 100 100 100 100 100 100 100 100 100 100 100 100 
100 100 100 100 100 100 100 100 100 100 100 100 100 100 
##$AQSEQ= 0
##$AQ_mod= 1
##$AUNM= <au_zg>
##$AUTOPOS= <>
##$BF1= 81.014009
##$BF2= 200.13
##$BF3= 200.13
##$BF4= 200.13
##$BF5= 200.13
##$BF6= 200.13
##$BF7= 200.13
##$BF8= 200.13
##$BYTORDA= 1
##$CFDGTYP= 0
##$CFRGTYP= 5
##$CHEMSTR= <none>
##$CNST= (0..31)
1 1 145 1 1 1 1 1 1 1 1 1 1 1 1 1 1 1 1 1 1 1 1 1 1 1 1 1 1 1 1 1 
##$CPDPRG= <waltz16>
##$CPDPRG1= <>
##$CPDPRG2= <waltz16>
##$CPDPRG3= <>
##$CPDPRG4= <mlev>
##$CPDPRG5= <mlev>
##$CPDPRG6= <mlev>
##$CPDPRG7= <mlev>
##$CPDPRG8= <mlev>
##$CPDPRGB= <>
##$CPDPRGT= <>
##$D= (0..31)
0 1 0 0 0 0 0 0 0 0 0 0.03 2e-05 3e-06 0 0 0 0 0 0 0 0 0 0 0 0 0 0 0 0 
0 0 
##$DATE= 1625201878
##$DBL= (0..7)
120 120 120 11 120 120 24 19 
##$DBP= (0..7)
150 150 150 150 150 150 150 150 
##$DBP07= 0
##$DBPNAM0= <>
##$DBPNAM1= <>
##$DBPNAM2= <>
$$ [...]
##$SUBNAM3= <"">
##$SUBNAM4= <"">
##$SUBNAM5= <"">
##$SUBNAM6= <"">
##$SUBNAM7= <"">
##$SUBNAM8= <"">
##$SUBNAM9= <"">
##$SW= 501.771253377433
##$SWIBOX= (0..15)
0 1 3 0 0 0 0 0 0 0 0 0 0 0 0 0 
##$SW_h= 40650.406504065
##$TD= 32768
##$TD0= 1
##$TE= 0
##$TE2= 300
##$TE3= 300
##$TEG= 300
##$TL= (0..7)
0 120 53 12 22 120 120 120 
##$TP= (0..7)
150 150 150 150 150 150 150 150 
##$TP07= 0
##$TPNAME0= <>
##$TPNAME1= <>
##$TPNAME2= <>
##$TPNAME3= <>
##$TPNAME4= <>
##$TPNAME5= <>
##$TPNAME6= <>
##$TPNAME7= <>
##$TPOAL= (0..7)
0.5 0.5 0.5 0.5 0.5 0.5 0.5 0.5 
##$TPOFFS= (0..7)
0 0 0 0 0 0 0 0 
##$TUNHIN= 0
##$TUNHOUT= 0
##$TUNXOUT= 0
##$USERA1= <user>
##$USERA2= <user>
##$USERA3= <user>
##$USERA4= <user>
##$USERA5= <user>
##$V9= 5
##$VALIST= <valist>
##$VCLIST= <CCCCCCCCCCCCCCC>
##$VD= 0
##$VDLIST= <DDDDDDDDDDDDDDD>
##$VPLIST= <PPPPPPPPPPPPPPP>
##$VTLIST= <TTTTTTTTTTTTTTT>
##$WBST= 1024
##$WBSW= 4
##$XGAIN= (0..3)
0 0 0 0 
##$XL= 0
##$YL= 0
##$YMAX_a= 1437
##$YMIN_a= -2511
##$ZGOPTNS= <>
##$ZL1= 120
##$ZL2= 120
##$ZL3= 120
##$ZL4= 120
##$ABSF1= 248.5645
##$ABSF2= -253.2056
##$ABSG= 5
##$ABSL= 3
##$ALPHA= 0
##$AQORDER= 0
##$ASSFAC= 0
##$ASSFACI= 0
##$ASSFACX= 0
##$ASSWID= 0
##$AUNMP= <proc_1d>
##$AZFE= 0.1
##$AZFW= 0.5
##$BCFW= 0
##$BC_mod= 2
##$BYTORDP= 0
##$COROFFS= 0
##$CY= -3
##$DATMOD= 1
##$DC= 0
##$DFILT= <>
##$DTYPP= 0
##$F1P= 0
##$F2P= 0
##$FCOR= 1
##$FTSIZE= 65536
##$FT_mod= 6
##$GAMMA= 0
##$GB= 0
##$INTBC= 1
##$INTSCL= 5.30512e-09
##$ISEN= 30
##$LB= 1
##$LEV0= 0
##$LPBIN= 0
##$MAXI= 10000
##$MC2= 0
##$MEAN= 0
##$ME_mod= 0
##$MI= 50
##$NCOEF= 0
##$NC_proc= -7
##$NLEV= 6
##$NOISF1= 182.463
##$NOISF2= 159.3651
##$NSP= 0
##$NTH_PI= 0
##$NZP= 0
##$OFFSET= 248.5645
##$PC= 4
##$PHC0= -7275.274
##$PHC1= -202.7138
##$PH_mod= 1
##$PKNL= yes
##$PPARMOD= 0
##$PSCAL= 0
##$PSIGN= 0
##$REVERSE= no
##$SF= 81.014009
##$SI= 65536
##$SIGF1= 159.3651
##$SIGF2= -187.1042
##$SINO= 113.3802
##$SIOLD= 16384
##$SREGLST= <1H.CDCl3>
##$SSB= 0
##$STSI= 65536
##$STSR= 0
##$SW_p= 40650.406504065
##$SYMM= 0
##$S_DEV= 0
##$TDeff= 32768
##$TDoff= 0
##$TI= <>
##$TILT= no
##$TM1= 0
##$TM2= 0
##$TOPLEV= 0
##$USERP1= <user>
##$USERP2= <user>
##$USERP3= <user>
##$USERP4= <user>
##$USERP5= <user>
##$WDW= 1
##$XDIM= 65536
##$YMAX_p= 312470252
##$YMIN_p= -94841889
$$ End of Bruker specific parameters
$$ ---------------------------------
##NTUPLES= NMR SPECTRUM
##VAR_NAME=  FREQUENCY,     SPECTRUM/REAL,   SPECTRUM/IMAG
##SYMBOL=    X,             R,               I
##VAR_TYPE=  INDEPENDENT,   DEPENDENT,       DEPENDENT
##VAR_FORM=  AFFN,          ASDF,            ASDF
##VAR_DIM=   65536,         65536,           65536
##UNITS=     HZ,            ARBITRARY UNITS, ARBITRARY UNITS
##FACTOR=    0.620285442955139, 1,           1
##FIRST=     20137.2065510759, 0,            0
##LAST=      -20513.1999529892, 0,           0
##MIN=       -20513.1999529892, -94841889,   0
##MAX=       20137.2065510759, 312470252,    0
$$ Real data points
##PAGE= N=1
##DATA TABLE= (X++(R..R)), XYDATA
$$ [...]
##PAGE= N=2
##DATA TABLE= (X++(I..I)), XYDATA
13157b40545J338392L5966j263720n87222j00280n64328r3367Q85205j51207k106121
13147b847227j209385J817819K270378j92251q56488J293030J749441p73977j727057
13138d75717M18629Q31051k300645l175832J504705N380497K158993l763446m089362
13129c511127O98967L454768J880094p2845m01224r82240j939338j011615J164049
13120g20511J126784j354558k502464o80418J318222J182479J36408j84917l23281
13111b002256j010451j420772p41547N49551J709616K345211J982948Q36934N32970
13102B782204J904858K801704P58815k813089m197407k704925j034933m44168
13094b946941O00297K377816K515632J66631j878836j309798L31705O03890l0553
$$ y = [-240545, 1097847, 1133813, -129907, -717129, -817409, -1381737, -1475104, -589899, -741106, -2847227, -4056612, -2238793, 31585, -160666, -1017154, 275876, 2025317, 1251340, -475717, -57088, 773963, -1526682, -4702514, -3197809, 2182688, 4341681, 578235, -3511127, -2812160, 642608, 2522702, 2449857, 2048633, 1066393, -872945, -1884560, -720511, 406273, -948285, -3450749, -4131167, -2812945, -1630466, -1494058, -1678975, -2002256, -3012707, -4433479, -5175026, -4625475, -2915859, -570648, 1412300, 2249234, 2782204, 4687062, 7488766, 8247581, 5434492, 1237085, -1467840, -2502773, -2946941, -2346644, 31172, 2546804, 2713435, 834599, -475199, -143494, 460396, 429843]
13085D29843J27322O32996N9669q71834l15154J228300J328188n10466j989148
13076A19716j497711j92065K80221J52743L35066M51584j57944n51233O20647
13067d38976K442151K461129L35303j394182r73820J90140K01691k37699M82252
13058C067989J578518R27956j281334k684041k347409j567317r46690M68970K493615
13049b89743L047287J313563p35726j281123r17570o89716k33887N03960R9752
13040H16797j695276k303023J55348L395430L731678J072607j461172j954429
13032A757960j182855m16462k00112q09280j726389j307419Q80390K338046Q11269
13023A45148j777274j729518O86249J624839k3004q06271J385438L428485J685705
$$ y = [429843, 557165, 1190161, 1249830, 377996, 62842, 1291142, 2619330, 2108864, 119716, -1377995, -1570060, -1289839, -1137096, -802030, -350446, -508390, -1059623, -438976, 2003175, 4464304, 4799607, 3405425, 2431605, 2621745, 2823436, 2585737, 3067989, 4646507, 5574463, 4293129, 1609088, -738321, -2305638, -3252328, -2783358, -289743, 2757544, 4071107, 3335381, 2054258, 1136688, 446972, 213085, 717045, 816797, -878479, -3181502, -3026154, 369276, 4100954, 5173561, 3712389, 1757960, 575105, 158643, -41469, -850749, -2577138, -3884557, -3004167, -666121, 145148, -1632126, -3361644, -2675395, -1050556, -1073560, -1879831, -494393, 2934092, 4619797]
13014D619797k139551l318687r09619J272493M74220j367101j045066J146506
13006a267008K230286J167392J88845J093573K390016J663392o59186k068984
12998D738326j789812j366643j519460j091731K39636Q42540r1394j024196p47558
12989a810292k91272n66757m65030P96011J777646J407341J046904J610478J273771
12980D778800j058974k783173j611517J94446k17942q97251J161088L358088J063925
12971C987490l548818l572092J616476M846107K117676k108548l052949k128797
12963a843455j855536p83427J985415K944013P5209k264043O0743L678788K992548
12954D990255p82877k201823n04581N85170R3922K53268Q32884m90885k511471
$$ y = [4619797, 2480246, -838441, -1748060, -475567, -1347, -1368448, -2413514, -1267008, 963278, 2130670, 2319515, 3413088, 5803104, 7466496, 6807310, 4738326, 2948514, 1581871, 62411, -1029320, -789684, 52856, -38538, -1062734, -1810292, -2101564, -2668321, -3133351, -2337340, -559694, 847647, 1894551, 3505029, 4778800, 3719826, 936653, -674864, -480418, -698360, -1595611, -434523, 2923565, 3987490, 438672, -3133420, -1516944, 3329163, 5446839, 3338291, 285342, -1843455, -3698991, -4482418, -2497003, 447010, 522219, -1741824, -1681081, 1997707, 4990255, 4207378, 2005555, 1500974, 2086144, 2180066, 2433334, 3266218, 2775333, 263862]
12945B63862j543227J740604K632837J77346j414085k68135L21604j452663k328291
12936a870148k3517K324633J467182n31559k56794J184555O73721j134295j159391
12927F74387M61856N77682j492578k641307p79759K074507K754207J051624n29002
12918B151617k61831Q01877N26583j216938k137737o89479J416924J344993p95466
12909A140543k000770n87884J657387K147938O00889j293052j927599q44623J079408
12900b7763K058759J073596p87877j771960j794348j705935r93832J239451L396857
12891F86948K665527m78216k265033r58436R68621J070495J00299n40913j275018
12882b5726k274374j921516L03426K000313J327033q8586j14824M26974o4955
$$ y = [263862, -1279365, 461239, 3094076, 3271422, 1857337, 1589202, 1910806, 458143, -1870148, -1893665, 430968, 1898150, 1366591, 1109797, 2294352, 2968073, 1833778, 674387, 1136243, 1713925, 221347, -2419960, -3199719, -1125212, 1628995, 2680619, 2151617, 1889786, 2691663, 3218246, 2001308, -136429, -825908, 591016, 1936009, 1140543, -860227, -1448111, 209276, 2357214, 2958103, 1665051, -262548, -1107171, -27763, 2030996, 3104592, 2316715, 544755, -1249593, -2955528, -3949360, -2709909, 686948, 3352475, 2874259, 609226, -349210, 619411, 1689906, 1790205, 1249292, -25726, -2300100, -4221616, -3918190, -1917877, -590844, -679430, -794254, -367280, -432235]
12873d32235o58079K03497J356050O97208j038044j364679R616J105417Q88925
12864G67676K03791Q299M96064J285379J256198m68758k377106j619891J458923
12855A010575K786057N59757j613508n07824J346963J49365k424603k016423R78306
12846B68665K189503M04537j330004j322935r76076q57743K54531J912894J808181
12837B351553k70699j905685j870685j114661P384J865668L086295J803337p20039
12828C232468j589860j049425j492945k225087l20124L209547L708454L14212
12820C787240k375813j598158o6602l60578q88822k4438N21981n71406j313839
12811b890435j51177J099484P70033J68627L81675K7330j244290r66535J593180
$$ y = [-432235, -1090314, -886817, 469233, 1166441, 128397, -1236282, -1226666, -121249, 767676, 971467, 979766, 1475830, 2761209, 4017407, 3548649, 1171543, -448348, 1010575, 3796632, 4356389, 2742881, 2235057, 3582020, 3731385, 1306782, -709641, 268665, 2458168, 2862705, 1532701, 209766, -766310, -1624053, -1369522, 543372, 2351553, 2080854, 175169, -1695516, -2810177, -2802793, -937125, 2149170, 3952507, 3232468, 1642608, 593183, -899762, -3124849, -3444973, -235426, 3473028, 3787240, 1411427, -186731, -253333, -613911, -1502733, -1527171, -1005190, -1576596, -2890435, -3041612, -1942128, -1172095, -1003468, -621793, -594463, -1838753, -2805288, -1212108]
12802a212108L048659J183113j196475j011319J99121k99184j635092j693874
12794b617159j046599q32194J04100K253557K927002O66936j120774P03993L386945
12785D425807K528909p95694k185565r06418L16666O28001J131099J133850p99454
12776E477201l149240l263719j726296p53551J32372K333842L874206J965910
12768D890725j490958k249879m80930J73791o64847j26897J633769J303075j111353
12759A876496j631564Q33777K540597J242818o49656q78183n30457o71665k60782
12750A871381P20727K88237j509434j646977P80726K423977Q38303j784886k292611
12741c10557p87968R07496K019596K139790O71696j276868j284739N51099J162492
$$ y = [-1212108, 1836551, 3019664, 1823189, 811870, 1010991, 711807, -923285, -2617159, -3663758, -4495952, -4391852, -2138295, 788707, 1455643, 334869, 1038862, 4425807, 6954716, 6159022, 3973457, 3067039, 3383705, 4011706, 5142805, 6276655, 5477201, 2327961, -935758, -2662054, -3415605, -3283233, -949391, 2924815, 4890725, 3399767, 1149888, 668958, 842749, 177902, 51005, 1684774, 2987849, 1876496, 244932, 1078709, 3619306, 4862124, 4212468, 3334285, 2803828, 2132163, 1871381, 2592108, 2880345, 1370911, -276066, 504660, 2928637, 3766940, 1982054, -310557, -1098525, -191029, 1828567, 3968357, 4640053, 3363185, 2078446, 2629545, 3792037]
12732C792037o36018k100827j082499O98987Q75424j71006j097020j766604j779078
12723c266604j8972K429393K356636m78200k023115j75967J620615K07105j860509
12714a209618q32751J747304J942262J69595k00980P69304R3548k022052k018616
12705a562004P33183K469091J016762j049477r60236J75309O1257q46710o47752
12696f10577N81921J151454O00993Q3778K68741N77305N55782O25499J052718
12687D887614J187873M46396n58794p55592k28190p7306o51039j127134j161469
12678A962359j450604j917437j153604R00324J654855m51455k673775j471172
12670d600509J870534K865755O21065j168518l88030P09936J87940l82978L99116
$$ y = [3792037, 3156019, 1055192, -27307, 671680, 1547104, 1376098, 279078, -1487526, -3266604, -3285576, -856183, 1500453, 1022253, -1000862, -1176829, 443786, 650891, -1209618, -2042369, -295065, 1647197, 1816792, 1615812, 2385116, 2478664, 456612, -1562004, -828821, 1640270, 2657032, 1607555, 647319, 822628, 883885, 37175, -610577, -28656, 1122798, 1723791, 1807569, 2076310, 2653615, 3209397, 3834896, 4887614, 6075487, 6521883, 5963089, 5207497, 4979307, 4902001, 4250962, 3123828, 1962359, 511755, -1405682, -2559286, -1658962, -4107, -455562, -3129337, -4600509, -2729975, 135780, 756845, -411673, -799703, -89767, 98173, -284805, 114311]
12661A14311P71593o39997j607735j3137J942639R87284j724805k246271J61402
12652b254716K317206J952313Q9935j285527j292985O5586J957904K660195J320222
12643E530133n66953j121878p37463q81957j267634n79955P69038J197750P35284
12634C076365O56051P97154J5942r84696l77108J155731Q16043j593729k703217
12625H58536p33909J493225Q68386j272209j517459K64126J120259j23382j323907
12616c66334o88456O90356J080154Q25903J122963J416534J85585k041216k670144
12607d44655o68251J603627J451704n55500j708872j040093q1423J2071p1671
12598a503063L22073M78756j00379l80084N67180J741458J528046J18805q35183
$$ y = [114311, 885904, 245907, -1361828, -1374965, 567674, 1554958, -169847, -2416118, -2254716, 62490, 2014803, 2104738, 819211, -473774, -408188, 1549716, 4209911, 5530133, 4963180, 3841302, 3103839, 2221882, 954248, 374293, 1143331, 2341081, 3076365, 3732416, 4529570, 4545512, 3560816, 3183708, 4339439, 5155482, 3561753, 858536, 124627, 1617852, 2486238, 1214029, -303430, -39304, 1080955, 957573, -366334, -1054790, -364434, 715720, 1541623, 2664586, 4081120, 4266705, 2225489, -444655, -1112906, 490721, 1942425, 1386925, -321947, -1362040, -1443463, -1431392, -1503063, -1180990, -702234, -802613, -1182697, -615517, 1125941, 2653987, 2772792, 1937609]
12589A937609o28309j85997l63410p56837n73509J02269M62811J25817l44100
12580b23656k22396L32998N24853K14945J90855P24763Q14135k60561j532048
12571E63888j735422j232383r57538l12775J683082L638897K909683k64655k450332
12562A842445j679988J03145M42896k28355k72735J63924m1972o30442m93195
12553g94277L03107P76452O58866L49729r8494o99345r13829m43069N3099L1253
12543g76508N3421O98786J356312J190709N15902J10274j28887p66036j617613
12534F36360j931062j421583m85980K99891O19432P42471J255193J864985J224605
12525B804312q11309j891564l35755J515181L88083k140535j297540L040920N126108
$$ y = [1937609, 1309300, 1123303, 759893, 3056, -570453, -468184, -5373, 120444, -223656, -446052, -113054, 411799, 626744, 817599, 1542362, 2356497, 2095936, 563888, -1171534, -2403917, -3361455, -3674230, -1991148, 1647749, 4557432, 4292777, 1842445, 162457, 265602, 708498, 480143, 207408, 371332, 329360, -301082, -794277, -491170, 285282, 944148, 1293877, 1195383, 496038, -417791, -860860, -807761, -776508, -723087, -24301, 1332011, 2522720, 3038622, 3148896, 3020009, 2253973, 636360, -1294702, -2716285, -3202265, -2902374, -2282942, -1540471, -285278, 1579707, 2804312, 1993003, 101439, -234316, 1280865, 1668948, -471587, -1769127, 1271793, 6397901]
12516F397901J793035k721356l415609j517525q72384j259314k67570J071507
12508g91315N8780j988546j365216J486088K416334M91985p04147O24402J783459
12499B011824O48976r04194p12380R5199l79123j421539j274959j35391N92041
12490a479546O34489O24780N85999J65102l64350m89045k99945k04495l02508
12481a129519m59190m81186j20224N17104P81526M41824L14003Q97154J113864
12472A875356r6973j610642j435922K12641J251970R48755N19382M13064m91615
12463A586016k254024k783401p26128K240464L430292K353424O82409j45375j62505
12454D221172j73556o91023j443106j622239q47814J39345K46858n24049j013302
$$ y = [6397901, 8190936, 5469580, 2053971, 536446, -335938, -1595252, -1862822, -791315, -732535, -2721081, -4086297, -2600209, -183875, 308110, -396037, 228365, 2011824, 2660800, 1756606, 1044226, 1139425, 760302, -661237, -1936196, -2071587, -1479546, -845057, -220277, 365722, 530824, 166474, -322571, -622516, -827011, -1129519, -1588709, -2069895, -2190119, -1673015, -891489, -449665, -135662, 761492, 1875356, 1778383, 167741, -1268181, -1055540, 196430, 1145185, 1664567, 2077631, 1586016, -668008, -3451409, -4177537, -1937073, 1493219, 3846643, 4529052, 4383677, 4221172, 4047616, 3356593, 1913487, 291248, -556566, -417221, -170363, -694412, -1707714]
12445a707714l67691R52130J776039J522383P57434M25478M91822j13573j609517
12436B126791k292658q38779J087671Q68814q11476q98994O53306M68075k014610
12427a651860k490398J177638M361495K441563j583789j765645J271374J893721
12419C654099q61827k119340Q9293J679932j19154k227170j350406P03294O83763
12410A32484q51319j322952m47052K66341L15467O2532n08879j046984n88827
12401c989189N44662O43118m23279n57368R73481K024970J168385p1571l14722
12392a513o32261j657186j518593O99643K379176J308933m45678K869J431263
12383A566653Q36514j198477j612293j58351N62629j45204k53575R77129J768098
$$ y = [-1707714, -2075405, -1123275, 652764, 2175147, 2932581, 3358059, 3849881, 3736308, 2126791, -165867, -1004646, 83025, 951839, 140363, -758631, -105325, 362750, -1651860, -4142258, -2964620, 1396875, 3838438, 2254649, 489004, 1760378, 3654099, 2792272, 672932, 762225, 2442157, 2323003, 95833, -1254573, -551279, 132484, -718835, -2041787, -2488839, -2222498, -1907031, -1844499, -2353378, -3400362, -3989189, -3444527, -2801409, -3224688, -3782056, -2808575, -783605, 384780, 313209, -1513, -633774, -2290960, -3809553, -3109910, -730734, 578199, 132521, 135390, 1566653, 2403167, 1204690, -407603, -565954, -3325, -148529, -402104, 575025, 2343123]
12374B343123J126973K87334J60334L1924m74718n38136J020O0019o45533r14192
12364A438148j81435M09696j24621j116790j350636n05267R38538K139640K078810
12355C726083N30488j087128j203940m24035p16717k176310k559030o84722J570825
12346c024486J801682J92907j111572p98185N98957J824465K048169J222669Q54
12337B755460q23615j014694q16745m00320J57k15128j110282j380015N3464J801377
12327a150341J420259o60423j128611J188195K929866J019804k326982k581796
12319a290029L19273J862280l21828l196201k979706j39326K146300K340334J220561
12310c8342k66481j560907j789366n98996P59143Q72552J84076l8262k3758p91247
$$ y = [2343123, 3470096, 3757430, 3917764, 3949688, 3474970, 2936834, 2937854, 2997873, 2352340, 1438148, 1256713, 1666409, 1541788, 424998, -925638, -1430905, -492367, 1647273, 3726083, 4256571, 3169443, 1965503, 1541468, 824751, -1351559, -3910589, -4595311, -3024486, -1222804, -1029897, -2141469, -2939654, -2340697, -516232, 1531937, 2754606, 2755460, 1931845, 917151, 100406, -299914, -299757, -514885, -1625167, -3005182, -2951718, -1150341, 269918, -390505, -1519116, -330921, 2598945, 3618749, 1291767, -1290029, -970756, 891524, 569696, -2626505, -5606211, -5745537, -3599237, -1258903, -38342, -304823, -1865730, -3655096, -4254092, -3494949, -2622397, -2438321, -2476583, -2500341, -3291588]
12300c291588j649167p86694J596126L071123K326952O37035n12246j113580j283751
12291a005790m88911Q12653R38263k73573o29803Q72090J859033J73503k278203
12282b0738k133984K33569J348381P365j243768m59830Q64687O18225n60406o51129
12272a997628L15386K98501j452110k883440j721388J333814L239099K417871
12264d49895N88978K5933L38873l11679j719016j836328l84765M97749j20949
12255c371099m25553Q32007K097678J802535R56257R17952Q44622l16180j413108
12246A925111j220146r22461j672504j768314M04752K577198J692708p17543p23527
12237d24726J367848J513238r57952j931342N85926K960594J664140j336741j864000
$$ y = [-3291588, -4940755, -5727449, -4131323, -1060200, 1266752, 1903787, 1391541, 277961, -1005790, -1494701, -682048, 256215, -17358, -647161, 224929, 2083962, 2257465, -20738, -2154722, -1921153, -572772, -565407, -1809175, -2269005, -1404318, -786093, -1346499, -1997628, -1682242, -1383741, -2835851, -5719291, -7440679, -6106865, -2867766, -449895, 139083, 165016, 503889, 192210, -1526806, -3363134, -3747899, -3250150, -3371099, -3796652, -2964645, -866967, 935568, 1891825, 2809777, 3654399, 3338219, 1925111, 704965, -217496, -1890000, -3658314, -3253562, -676364, 1016344, 298801, -424726, 943122, 2456360, 1498408, -432934, 152992, 3113586, 4777726, 3440985, 1576985]
12228A576985M15162K160431J140011j508994l108653k085416P12503K722908
12220B024937K326845O80968j86090l85902j286300k331829j640869L05257Q14164
12211C21181o03792j222011M01707K039376J523123O2459j96313L36764j07837
12202B554657j488121k038041p54571J502679K827445J741325j185848l199162
12194c9637k270941R0835Q33252k68475p81468J14361P02133K98919K91956Q84024
12184a45041L42073j373956j776744j20822R98854O7754q49015j00997O15884
12175b342010j19401l60565J500138K961375J057592k435529l230631o17142K056869
12166a529304K174536L18147j472498j705333k52312J304874J027889o83593j316748
$$ y = [1576985, 1992147, 4152578, 5292589, 3783595, 674942, -1410474, -697971, 2024937, 4351782, 5032750, 4846660, 4460758, 3174458, 842629, -798240, -492983, 321181, -282611, -1504622, -1102915, 936461, 2459584, 2522043, 2325730, 2662494, 2554657, 1066536, -971505, -1726076, -223397, 2604048, 4345373, 3159525, -39637, -2310578, -2219743, -1386491, -1654966, -2436434, -2322073, -1619940, -1321021, -1029065, -145041, 197032, -1176924, -2953668, -3074490, -2075636, -2007882, -2856897, -2957894, -2342010, -2461411, -2821976, -1321838, 1639537, 2697129, 261600, -2969031, -3586173, -1529304, 645232, 963379, -509119, -2214452, -2466764, -1161890, -134001, -817594, -2134342]
12157b134342l1779J098679Q08141P11344J877926K368597N85882j698953k243351
12148A342144j612865j042682P2017J765532J729984p69819k360838o28047J479001
12139b5573N14526j423339n46762J640288J085998j260097j092736J304739J508806
12130A705850r20880j590307O94643J697018o33567k476420q24860J514211J029209
12121A94897p97876p11066P74579R62845j71260l76526Q97720J899155J340826
12112D013294k75908j618716j544128Q4044J733932J396781q47303k612548k132852
12103a803404j73971J365256J389086p6024j888687j963515O78674L781710L859424
12094E168549P56406j964701j769562j6348P55447J38684p20487j071764o53441
$$ y = [-2134342, -2166121, -1067442, -259301, 452043, 2329969, 4698566, 5284448, 3585495, 1342144, -270721, -1313403, -1241386, 524146, 2254130, 1484311, -876527, -1504574, -25573, 488953, -934386, -1481148, 159140, 1245138, -14959, -1107695, 197044, 1705850, 784970, -805337, -110694, 1586324, 952757, -1523663, -2348523, -834312, 194897, -602979, -1314045, -539466, 423379, 252119, -124407, 773313, 2672468, 4013294, 3737386, 2118670, 574542, 658586, 2392518, 3789299, 2941996, 329448, -1803404, -1977375, -612119, 776967, 700943, -1187744, -3151259, -2472585, 1309125, 5168549, 5924955, 3960254, 2190692, 2174344, 2929791, 3068475, 2347988, 1276224, 622783]
12085F22783N84910J755372J440467l04179j742138j848743j319462p18791L78041
12076a151740J632477J500421k25983j368755l40178J417088J493051k34729j808754
12067I12898j661399K24232K604192L496543J593861j836761l622441k295847
12059e84722Q0221P39231l40829j114433n61440M79473J066456J232203J250343
12050B246503R09116p7210j374539k117330j780085q60448l58465n27744p15870
12041d656072n59551l45208J95871J995280M557059N314874K715799j276352l523692
12032D418008l377844k171577n85819J015553J139655p86397k078711j39565K698180
12023A31483J900958j933908l298379j47818K874384J596993j745689k657025
$$ y = [622783, 1207693, 2963065, 4403532, 4099353, 2357215, 508472, -810990, -1529781, -1151740, 480737, 1981158, 1755175, 386420, 46242, 1463330, 2956381, 2721652, 912898, -748501, -524269, 2079923, 5576466, 7170327, 5333566, 1711125, -584722, -504501, 234730, -106099, -1220532, -1781972, -1302499, -236043, 996160, 2246503, 3155619, 3078409, 1703870, -413460, -2193545, -3053993, -3412458, -3940202, -4656072, -5215623, -5560831, -5364960, -3369680, 1187379, 6502253, 9218052, 7941700, 4418008, 1040164, -1131413, -1717232, -701679, 437976, -348421, -2427132, -2566697, 131483, 2032441, 98533, -3199846, -3347664, -473280, 1123713, -621976, -3279001]
12015c279001q24861R63772J594310J774279J325704l01521j977572k148836j213774
12006d087500m05408M78717J960378K820069J708455j94800o93537L0940P3945
11997A691259p43172p34759M83035J231586N33165m87844n86385j11209M312k39855
11987A040133j88069L13119O17817L8671j163244j674371n59379J206523J631606
11978A262806M34309m01976M78994J732273J383404j60036q68674k98380j92445
11969C370275j669695l296570k822742k02400K071349J859545k5870r45901J0611
11960a651398R76460M12827l81325N07560K156820J935948m29901k366486k057821
11951h97316l64598J008564J241310K62186j090016r85935J064103K351791L37372
$$ y = [-3279001, -4103862, -3140090, -1545780, 228499, 1554203, 1252682, -724890, -2873726, -4087500, -4492908, -4014191, -2053813, 766256, 2474711, 2279911, 1586374, 1617314, 1691259, 948087, 213328, 696363, 1927949, 2461114, 1973270, 1386885, 1275676, 1279988, 1040133, 852064, 1165183, 1783000, 1821671, 658427, -1015944, -1575323, -368800, 1262806, 1697115, 1295139, 1774133, 3506406, 4889810, 4729774, 3861100, 3562720, 3370275, 1700580, -1595990, -4418732, -4621132, -2549783, -690238, -716108, -1662009, -1651398, -674938, -262111, -643436, -135876, 2020944, 3956892, 3526991, 1160505, -897316, -1261914, -253350, 987960, 1250146, 160130, -825805, 238298, 2590089, 2927461]
11942B927461k749855k496147P10806J971756j75897j418830P80015K719225Q94142
11933C162676j987048j831395p8k53513j904578j452735R36084J935508R00385
11924d94694K33137O01696M48806j51017L83698J378563O11404j262130j304333
11915D45130N10498J030957o40336j737479p47961L70699J37138j27904N67750
11906a91508R50864L46949K57182J296109J515350l03124k263850k159752m75875
11897a027655J018875J638128J382861K52027q41937n49088N60069M09604j040288
11888A802596j470745l26861J12330p89969l07121K534080L948749R99890k956560
11879C546389k708267J082206L128866J314028j323722k095048j743746j361833
$$ y = [2927461, 177606, -2318541, -1607735, 364021, 188124, -1230706, -450691, 2268534, 3162676, 1175628, -655767, -655845, -909358, -2813936, -4266671, -3330587, -1395079, -494694, -261557, 340139, 788945, 637928, 1021626, 2400189, 3011593, 1749463, 445130, 955628, 1986585, 1346249, -391230, -1139191, -768492, -631354, -759258, -191508, 759356, 1106305, 1363487, 2659596, 4174946, 3871822, 1607972, -551780, -1027655, -8780, 1629348, 3012209, 3264236, 2422299, 1873211, 2433280, 2842884, 1802596, 331851, 4990, 117320, -672649, -979770, 1554310, 5503059, 6502949, 3546389, 838122, 1920328, 5049194, 6363222, 5039500, 2944452, 1200706, -161127]
11871a61127j64429K064484L271074J867157p10845j940618j444923p40312o27613
11862A412848l74394O78403J864300J930801N74786j181984k136525k038543j339332
11853f09640l21720Q09583J379182Q78966p064k44888j59453p41935j365123l56263
11843g38355J761550K148433j10686k191065j706691k71543m70031j398203l87767
11834c364358K147346L071022J383049n01697o47077Q910j12191q57864j185705
11825e8565p91498q6472L74818R9266p55436j087783k37850P42260N79549o0126
11815a281837K66940J012381L81096j277766j490129L78203J733325N17891j704693
11806a464589j965529J83973K413205K518453N73421j383702j367729M35134J710670
$$ y = [-161127, -325556, 1738928, 5010002, 6877159, 6166314, 4225696, 2780773, 2040461, 1412848, 1038454, 1716857, 3581157, 5511958, 6086744, 4904760, 2768235, 729692, -609640, -931360, -121777, 1257405, 2136371, 2129307, 1884419, 1724966, 983031, -382092, -738355, 1023195, 3171628, 3060942, 869877, -836814, -1108357, -1578388, -2976591, -3364358, -1217012, 1854010, 3237059, 2735362, 2088285, 2097195, 1985004, 1127140, -58565, -850063, -936535, -561717, -462451, -1217887, -2305670, -2543520, -1801260, -1221711, -1281837, -1014897, -2516, 378580, -899186, -2389315, -2011112, -277787, 240104, -1464589, -3430118, -3246145, -832940, 1685513, 2258934, 875232, -492497, -57363, 1653307]
11797A653307Q50676r14328j438387p74420m01234k29943Q64181J971033R57517
11788B538402j403363j727876O09758K078661N51952j377472r08291O02070P11623
11779A675464K18814Q59391J271625o36407l100471k620849L04284J778677M81004
11770B31532r50190n94256M44004Q70293Q92663M17976j187928k726650j733391
11761d335947J495687L434918K188545J8460m38104K46622K85706j85734r9329
11752B610824K77632J13822l43367n72312q72240j238393o87065Q67768J764767
11743A921436J164069N88256J102681J059545r27850k744982j652136J000841
11735A511860J506956m41968j522876l72248M97667n87424j491590n6925K031513
$$ y = [1653307, 2503983, 1589655, 151268, -623152, -1024386, -1254329, -390148, 1580885, 2538402, 1135039, -592837, 16921, 2095582, 2647534, 1270062, 361771, 963841, 1675464, 1894278, 2753669, 4025294, 3388887, 288416, -2332433, -2028149, -249472, 231532, -718658, -1312914, -868910, 1383, 894046, 1312022, 124094, -2602556, -4335947, -2840260, 594658, 2783203, 2801663, 2363559, 2610181, 2895887, 2710153, 2610824, 2888456, 3002278, 2658911, 2086599, 1214359, -24034, -711099, 156669, 1921436, 3085505, 3673761, 4776442, 5835987, 4908137, 2163155, 511019, 1511860, 3018816, 2576848, 1053972, 681724, 1179391, 591967, -899623, -956548, 1074965]
11726A074965J845864k25203j314186l87725R30963J315115R75025L3193j824049
11717B423962l542604k872462M31751L305325K818558j57448k243824j750195
11709a586937J5027J205636J458477J236829O34147m18773j494546j817088q72175
11700a639403J055403K588793K045164n38120k663071k049075K41426J091320
11692A32437k99016j473122o36444Q53366J106183N86139N97458P56882J64980
11683A788863l47919M05053J350095N28506j377085j536886Q06889K898618J964927
11674F481061j380710l936534l282800q7242K503574K064605k58419j119460M51145
11665A435220J746305O98993r64725r43906k35908p76291j376077J61324K397949
$$ y = [1074965, 2920829, 2695626, 1381440, 993715, 1924678, 3239793, 4214818, 4248011, 2423962, -1118642, -3991104, -3559353, -254028, 2564530, 2407082, 163258, -1586937, -1571910, -366274, 1092203, 2329032, 2963179, 2544406, 1049860, -767228, -1639403, -584000, 2004793, 4049957, 3511837, 848766, -1200309, -958883, 132437, -166579, -1639701, -2276145, -1422779, -316596, 269543, 867001, 1623883, 1788863, 1440944, 1845997, 3196092, 3724598, 2347513, 810627, 1617516, 4516134, 6481061, 5100351, 1163817, -2118983, -2206225, 297349, 2361954, 2103535, 984075, 1435220, 3181525, 3880518, 2915793, 1971887, 1735979, 959688, -416389, -255065, 2142884]
11656B142884K006367p11505k408970k231550k127006j934060N27072L947867
11648g88901L829151n9326k095103O50304L482418J372290l253676m468150j387514
11639b718507J794986K243666Q03218p75926j399616l59946J667748K332909N97838
11630D186370j310099j061705L19428M50217o62410j273670p89565K13458J354850
11621A426874J937172Q72147j136979j578333l1111P30885n08329j072742N43812
11612A183396J327676p93826k226407N67373M158152K961811j637688l557537
11604A982950j781233q67699k209473j996154J110864K973960Q95709j992399
11596a883475j983987Q252J235540J380515J355602Q55399l52094j008347l21010
$$ y = [2142884, 4149251, 3437746, 1028776, -1202774, -3329780, -5263840, -4736768, -788901, 3040250, 2980924, 885821, 1536125, 5018543, 6390833, 3137157, -1330993, -2718507, -923521, 1320145, 2123363, 1347437, -52179, -412125, 1255623, 3588532, 4186370, 2876271, 1814566, 2133994, 2584211, 1921801, 648131, -141434, 72024, 1426874, 3364046, 4236193, 3099214, 1520881, 1489770, 2220655, 1712326, 639584, 1183396, 2511072, 1717246, -509161, 58212, 4216364, 7178175, 5540487, 1982950, 201717, -665982, -2875455, -4871609, -3760745, -786785, 108924, -1883475, -3867462, -3859210, -2623670, -1243155, 112447, 967846, 615752, -392595, -713605]
11587g13605N56605N14657J20172J06521Q6850k21005j99581M47858J131579J322592
11577C152643P28217j014484l121116l214231n08808J860938Q31097j614345j355396
11568d255485J132704J724147k04748r43512P91902J739343P9339j582595j099206
11559b618111M6344M78658J312571K623341K059943n30059j541296N26748K038356
11550D396495K53880j896530q74097J473196J259857j152621k505778j884446
11542i30044o80279N55582J643747J314596m19291q36802J151212K105175n20419
11533C383477l154637j353951K373585K056740j982773l543819o08598J760681
11525a069295P8859k197715r36201K006345K316362M8660j281863n75616j37611
$$ y = [-713605, -157000, 357657, 477829, 584350, 671200, 450195, 250614, 698472, 1830051, 3152643, 3880860, 2866376, -254740, -3468971, -3977779, -2116841, -1285744, -2900089, -4255485, -3122781, -1398634, -1603382, -2546894, -1754992, -15649, 63690, -1518905, -2618111, -2571767, -2093109, -780538, 1842803, 3902746, 3372687, 1831391, 2358139, 4396495, 4650375, 2753845, 1879748, 3352944, 4612801, 3460180, 954402, -930044, -1610323, -1054741, 589006, 1903602, 1484311, 647509, 1798721, 3903896, 3383477, 228840, -1125111, 1248474, 3305214, 1322441, -2221378, -2829976, -1069295, -990436, -3188151, -4124352, -2118007, 198355, 247015, -1034848, -1610464, -1748075]
11516a748075j277896k219355j004482J639875L298654K662291N99370j030472
11508I19910j114092n1965Q27923N73826n11258j202332o20181P97133J709100
11499A328064J291063J1301j035355j144351k67554J050869J741855J093152k8751
11490D040293J8830J057905R06946j132649k599992j575770l5329p32953k460498
11481b513217j987445L91240J385546M03088K40360J661460J893969j40869j500142
11472a66010j89915J505838J211849L86520J052021J739112K14830k096300k134232
11463A523713k08516N02697j185364l023356k638032j72274K359927K983010J282661
11454A424466j092329j955471r97167K81057J007792J562692J721733O19202r71093
$$ y = [-1748075, -3025971, -5245326, -6249808, -4609933, -1311279, 1351012, 1950382, 919910, -194182, -246147, 581776, 1155602, 644344, -557988, -1178169, -381036, 1328064, 2619127, 2630428, 1595073, 450722, 183168, 1234037, 2975892, 4069044, 4040293, 4059123, 5117028, 6023974, 4891325, 2291333, 715563, 680234, -52719, -2513217, -4500662, -4109422, -2723876, -2320788, -2080428, -418968, 1475001, 1334132, -166010, -355925, 1149913, 2361762, 2748282, 3800303, 5539415, 5754245, 3657945, 1523713, 1315197, 1817894, 632530, -2390826, -5028858, -5201132, -2841205, 141805, 1424466, 332137, -1623334, -2620501, -2339444, -1331652, 231040, 1952773, 2571975, 1600882]
11445A600882j020885L37375O81809n17567q98688L42093P17024q74675j570131
11436a202763N82462K731689J634588j073047j814721p66023n59218j261888q88831
11427b617752L18691K70901q72131p53885J064820K300317J563121J45463k72029
11418A147516K66892O23770Q7925q89205j014507K47628J376906N65832j218802
11409A193955j286024M07291J051001r4199l43762J317074J968771N3886j289479
11400B978514L93259K101774K62454k934161k952627k29184R89087m33041j618080
11391a442005r00834L55300Q29483O34242K2368n73632j53135R10876L81390j945682
11381a881629k546134M65014L374588K351681k01582K67031K746082K730910N189
$$ y = [1600882, 579997, 917372, 1599181, 1081614, 182926, 525019, 1242043, 367368, -1202763, -620301, 2111388, 3745976, 2672929, 858208, 92185, -467033, -1728921, -2617752, -2299061, -2028160, -2900291, -3654176, -2589356, -289039, 1274082, 1419545, 1147516, 1414408, 2038178, 2126103, 1236898, 222391, 470019, 1846925, 2412757, 1193955, -92069, 315222, 1366223, 1272024, 928262, 2245336, 4214107, 4267993, 2978514, 3371773, 5473547, 5736001, 2801840, -150787, -379971, 609116, 176075, -1442005, -2342839, -1987539, -1158056, -523814, -501446, -1075078, -1228213, -317337, 64053, -1881629, -4427763, -3962749, -588161, 1763520, 1561938, 1828969, 4575051, 7305961, 7311150]
11372G311150j688448j463989j687906k340972j121319J071079Q14885j486953
11364e92473j856239K37056J073817k95850l81758J869380K561252l32720l002220
11355g19755j747651J452862K520675J013597o57863j105645n99531J18034L076
11346B77799j357547k163783k09492L147518L818933O84549k566296k444154K32168
11337e80305K365077K261508L54811j573344j384263J114749K930772J290384
11329F779389k242383l830772k714065j146246K6014J602175K511668P29900k314695
11320e99015k857383n38618J419843J747093K008858K063317J21400k336181j605640
11311e76326J479844J996262p03231j690355O65112J636887j099403k759357K74473
$$ y = [7311150, 5622702, 4158713, 2470807, 129835, -991484, 79595, 894480, -592473, -2448712, -2211656, -1137839, -1433689, -1815447, 53933, 2615185, 2282465, -719755, -2467406, -1014544, 1506131, 2519728, 1861865, 756220, 156689, 274723, 277799, -1079748, -3243531, -3453023, -305505, 3513428, 4197977, 1631681, -812473, -580305, 1784772, 4046280, 4401091, 2827747, 1443484, 2558233, 5489005, 6779389, 4537006, 706234, -2007831, -3154077, -3128063, -1525888, 985780, 1715680, -599015, -3456398, -3995016, -2575173, -828080, 1180778, 3244095, 3365495, 1029314, -576326, 903518, 2899780, 2196549, 506194, 1171306, 2808193, 1708790, -1050567, -776094]
11302g76094L927903L289578M04218l65433N6078j479230l535506k606450K19986
11293h64950R59663o95876j645709q09751K16781O79727R15056M38418p68289
11284a574930p81689J166596K276022L52856k009585j348902R13195R84490j011632
11275a033579j812120n72202P78796J513190K229606K206889P53192j18568J366446
11266E311650K560934p7953m451318n100128j521653J284738P91916j02801Q35940
11257d68675J567413L79080n87015O91996K229237J261288j165405j865447j85774
11248A856698J570287J510802K4786j228785j007105M14960J322857M72859r97620
11239C939739q58693Q87861J720276K10955j854183k029765m45252P96562M67228
$$ y = [-776094, 3151809, 6441387, 6845605, 6480172, 6536250, 5057020, 1521514, -1084936, -864950, 94713, -601163, -2246872, -3056623, -2839842, -2160115, -1245059, -806641, -1574930, -2356619, -1190023, 1085999, 1438855, -570730, -1919632, -1006437, -21947, -1033579, -2845699, -3417901, -2639105, -1125915, 1103691, 3310580, 4063772, 3945204, 5311650, 7872584, 7794631, 3343313, -1756815, -3278468, -1993730, -1201814, -1304615, -468675, 1098738, 1477818, 890803, 1582799, 3812036, 5073324, 3907919, 2042472, 1856698, 3426985, 4937787, 4962573, 3733788, 2726683, 3141643, 4464500, 4937359, 3939739, 3081046, 3968907, 5689183, 5900138, 4045955, 2016190, 1570938, 2367500, 2834728]
11230B834728p89055j685828j431187j390J779936K555518J559874m59120j822612
11221B540864j539754k28982N73780l8730j492560k392494j921546m69983R60082
11212d009323J667486J650152J430926J444593J396503N83943p74654j213862
11204B175764O0807J524373J003745j200954k472930j414562L41125N37659p73976
11195b18949j670144r26906P35311J654526R83523m21862q80649J11772J192542
11186E59164R84251l5830m57531m4035L20868K21387r8634n90556j060469o30571
11176h31956R24802K078629J523111L38238J82418M07705m75598j504827o32662
11167B009860J217947J044256j328965k864169k164315j026292n26351N53304
$$ y = [2834728, 2045673, 359845, -1071342, -1072732, 707204, 3262722, 4822596, 4363476, 2540864, 1001110, 772128, 1345908, 1307178, -185382, -2577876, -4499422, -4969405, -4009323, -2341837, -691685, 739241, 2183834, 3580337, 4164280, 3389626, 2175764, 2236571, 3760944, 4764689, 3563735, 1090805, -323757, 17368, 555027, -218949, -1889093, -2815999, -2080688, -426162, 557361, 135499, -745150, -633378, 559164, 1543415, 1507585, 1050054, 1006019, 1326887, 1548274, 1449640, 859084, -201385, -831956, 92846, 2171475, 3694586, 4032824, 4215242, 4622947, 4147349, 2642522, 2009860, 3227807, 4272063, 2943098, 78929, -2085386, -3111678, -3638029, -3084725]
11159c084725K226064K136902k83904k036327j101868L86509m5117j094161k03939
11150c100566J981613K620727Q56990j394945k107224j006001N36252O97867p15239
11141a630526j358396O89577L339390K774083n51247j948306M23864K594096J014955
11132E347490k052604k453310m00235P36909j15589j017139o87662J02133M19863
11123a20144K64604n6385k74423j56310J66511M01448O92046J076079Q37392j26330
11113B704488k98660Q88021R76806j714346l885343j544320K753468K958845n90447
11104B248512j480909J731479K818704j114154m142052j649464J669036J79183
11096B60335k833632j168744L383021M245992R29660j261631m94043O9230q73778
$$ y = [-3084725, -858661, 1278241, 994337, -1041990, -2143858, -1757349, -1802466, -2896627, -3100566, -1118953, 1501774, 2358764, 963819, -1143405, -2149406, -1613154, -915287, -1630526, -2988922, -2299345, 1040045, 3814128, 3262881, 1314575, 1738439, 4332535, 5347490, 3294886, 841576, 441341, 1178250, 1062661, 45522, -642140, -540007, -120144, 144460, 88075, -186348, -342658, -176147, 225301, 917347, 1993426, 2830818, 2704488, 2405828, 3293849, 4270655, 2556309, -1329034, -2873354, -119886, 2838959, 2248512, 767603, 2499082, 5317786, 4203632, 61580, -1587884, 81152, 260335, -2573297, -3742041, -359020, 3886972, 4816632, 3555001, 3060958, 3130188, 2256410]
11087B256410j123811o8076L54834j68219p8716L49676m66513j721549j343692
11078b009656n9461j05365q73045j73509J271256J106359k5851K14096J094145
11069D38969K39547j254589l62095J987544J943650o89692k183685j088028L76267
11060e92112J016473J688679J778419j01235k021518q29363J764195J145654j981418
11051A867774j994354K009382M020142Q41751k775816k119072M83219Q23536l18487
11042B838075k74985r7249j827944l381306j474648K335215L493850J222878r36030
11033A897856q27120L8449J5673l07967o2306J76961k48644o24039N9628J329432
11023A447923J532366k2126j779091j522739O39185J949056N08662j999724k611469
$$ y = [2256410, 1132599, 1064523, 1419357, 1251138, 1172422, 1522098, 1055585, -665964, -2009656, -2069117, -2174482, -3047527, -3221036, -1949780, -843421, -869272, -655176, 438969, 678516, -576073, -938168, 1049376, 2993026, 2303334, 119649, -968379, -592112, 424361, 2113040, 3891459, 3790224, 1768706, 939343, 2703538, 3849192, 1867774, -126580, 1882802, 5902944, 6744695, 3968879, 1849807, 2333026, 3156562, 2838075, 2563090, 2465841, 637897, -2743409, -4218057, -1882842, 1611008, 2833886, 1897856, 1070736, 1109185, 1124858, 816891, 754585, 931546, 682902, 58863, 118491, 1447923, 2980289, 2958163, 1179072, -343667, 295518, 2244574, 2753236, 753512, -1857957]
11014a857957j157424L7687j4638N0420J023902J718136J254593N72832N24715
11005B152266K40945j192968k655433k135350M35760K677291K339564p7996j802449
10996a8370j098248N41959N45632r25230j275630K69208J290071J81202j070024
10987a559430j21300J867066K108113L78656j141390j080260K36469J941745K713749
10978E343418J138361k003193l475792j766094M30805L15753p38707j14206J174729
10969C05074M57960j487535j654541m9054O50275N1103K65484J329367Q14770
10960F82903j480964k513757o90478J766344K257440Q98310o77416j274932l73769
10951a406319J472923K286785P48661j512658j803183j22109J183550R47866O124
$$ y = [-1857957, -3015381, -2977694, -2992332, -2941912, -1918010, -199874, 1054719, 1627551, 2152266, 2393211, 1200243, -1455190, -3590540, -3154780, -477489, 1862075, 1784079, -18370, -1116618, -574659, -29027, -954257, -2229887, -1960679, -670608, -489406, -1559430, -1680730, 186336, 2294449, 2673105, 1531715, 451455, 687924, 2629669, 5343418, 6481779, 4478586, 1002794, -763300, -332495, -16742, -755449, -869655, 305074, 763034, -724501, -2379042, -2428096, -1777821, -1726718, -1461234, -131867, 682903, -798061, -3311818, -4002296, -2235952, 21488, 919798, 242382, -1032550, -1406319, 66604, 2353389, 3102050, 1589392, -213791, -335900, 847650, 1795516, 1801640]
10942A801640q65538j380328q04146R46659K039106R56742r65078j554778r56829
10933g82550l11193P71032K404194K333143o24681l167064j805868J360205J856935
10924B034153k0563n67560L45746l48892k267864j640580J642786L114246R59268
10915C250740j324533r59296L81799N30345J03768J33070J51992O018L13852M53235
10905C040990o81456j879865j109849O11960Q13059K33967J262855K620508J088276
10896F000445k047046k361332K7583O39037j228985j494540O74249J141921j162375
10887A88957j902974M56992J444338j102668k602037J85279L155651J827200j369244
10878B81494j930984n44484k74746o27083M34541J885830J733008Q35066O87898
$$ y = [1801640, 936102, -444226, -1248372, -301713, 1737393, 2694135, 1729057, 174279, -782550, -1093743, -322711, 2081483, 4414626, 3789945, 622881, -1182987, 177218, 2034153, 2013590, 1446030, 1791776, 1442884, -824980, -2465560, -822774, 2291472, 3250740, 1926207, 966911, 1348710, 1879055, 1982823, 2115893, 2267885, 2273903, 2587755, 3040990, 2359534, 479669, -630180, -18220, 794839, 1028806, 2291661, 4912169, 6000445, 3953399, 1592067, 1619650, 2258687, 1029702, -464838, 209411, 1351332, 188957, -1714017, -1257025, 187313, -915355, -3517392, -3332113, -176462, 1650738, 281494, -1649490, -2193974, -2468720, -3095803, -2661262, -775432, 957576, 1792642, 2480540]
10869B480540L78657p06542n18000J680226K553021j36474l084808k382086L66580
10860F31114J251513M10632N20422J383000P70616r57835j408508k98773M78449
10851B780630Q6580o81841j065572o08473P36954J412681m81051l438552l280604
10842d539248O88124L967185L420386J461249J031186P75218j250629l126833
10834B426638k404059m56775M27877R63402J995823J370396j950505m177730j978467
10825c783400J713696K262372O43879O42115J556702Q8900k400294j378167K654550
10816B000353M005942M41370l783104m705106l319856j823521J14139K848502
10808d221281M164364K217582r60429j593497R73084L458144K722545m74251k477692
$$ y = [2480540, 2859197, 2152655, 1634655, 3314881, 5867902, 5731428, 2646620, 264534, 631114, 1882627, 2293259, 2813681, 4196681, 4967297, 4009462, 2600954, 2302181, 2780630, 2867210, 2185369, 1119797, 511324, 1248278, 2660959, 2179908, -1258644, -4539248, -3851124, 116061, 3536447, 4997696, 6028882, 6804100, 5553471, 2426638, 22579, -434196, -6319, 957083, 2952906, 4323302, 2372797, -1804933, -3783400, -2069704, 192668, 836547, 1478662, 3035364, 3124264, 723970, -654197, 2000353, 6006295, 6447665, 2664561, -2040545, -5360401, -7183922, -7069783, -4221281, -56917, 2160665, 1200236, -393261, 579823, 4037967, 6760512, 6286261, 3808569]
10799C808569j341268O72913K80398k089089k976244j107911R05303P93228k90011
10790a344112l05836N19214Q21440M52674J04955P1638M35542J040941Q91822
10781B688278n47093j545264j91159J959932J663464p20420j739244p64093o52309
10772A52092j909161j567004P53998J387930o19672j132370J737943L665026J267204
10763C735986k090310j980454L64585J531752J719877K390610K207122N8577j608847
10754F328898j030333q44537l001139m112613j067650K725556K458374k26324
10746A230232n23803J382101J625428k59082j563145j799904k236202j854205
10738c998580P36220L084087K007936o57958o84194J686966K623481J042760q39698
$$ y = [3808569, 2467301, 3140214, 3420612, 1331523, -1644721, -2752632, -1847329, -1054101, -1344112, -1649948, -1130734, -309294, 143380, 248335, 319973, 755515, 1796456, 2688278, 2141185, 595921, 404762, 2364694, 4028158, 3307738, 1568494, 804401, 152092, -1757069, -3324073, -2570075, -1182145, -1801817, -2934187, -1196244, 2468782, 3735986, 1645676, -334778, 29807, 1561559, 3281436, 5672046, 7879168, 7937745, 6328898, 5298565, 4454028, 1452889, -2659724, -3727374, -1001818, 1456556, 1230232, 706429, 2088530, 3713958, 3454876, 1891731, 91827, -2144375, -3998580, -3262360, -178273, 1829663, 1171705, 487511, 2174477, 4797958, 5840718, 5001020]
10729E001020j865500k197278r41844J904088L145203O69956k311918k094306
10721A309421n99624j254385k096081L64799L385075J784043k558742l210538
10713b876032p0127P95184j878296k460668J370250M558874L306613N77916j08156
10704C215558j21332j469419k377167q51716J325564J537769L00515k91087L34270
10695A602955J458069K255417J779191o2624j350747n36796M73780j074161l709881
10686H35203l406933j43924J817787O80741n62204L37312J522481R56775j99604
10677A837634k24478K68391L8066o10145r09385q77512m96770M34858J138017
10668E98676N81085m29696j19383J229203J512620J75813j045717r04126M0793
$$ y = [5001020, 3135520, 938242, -3602, 1900486, 5045689, 5715645, 3403727, 1309421, 709797, -544588, -2640669, -2275870, 1109205, 2893248, 334506, -2876032, -2946159, -2150975, -4029271, -6489939, -5119689, -560815, 2745798, 3323714, 3215558, 3094226, 1624807, -752360, -1604076, -278512, 1259257, 1559772, 1268685, 1602955, 3061024, 5316441, 7095632, 7033008, 5682261, 5145465, 5619245, 4545084, 835203, -2571730, -2715654, -897867, -217126, -779330, -442018, 1080463, 2037238, 1837634, 1613156, 1881547, 1919613, 1309468, 400083, -477429, -974199, -539341, 598676, 1179761, 750065, 630682, 1859885, 3372505, 3548318, 2502601, 1598475, 1639268]
10659A639268Q85321J133593K91791j261091j646426N3614J607168M71720k073755
10650A101203k534780l20183J717360J575864J75518p87631o77078L29124J405224
10641A984621J314811j0930r16975l41432O41408Q53776P25071O34932o5979q90005
10631C929298j7185J955206J612023j610193l366642j114024J316234j69049l199197
10622f63529l018280Q6761K362722K716067K404616J251991j034811k216996p54055
10613A134486Q12272l1171j229707j18440J445158O86045q36362o21906k18571
10604A021804j493605j840446J038583L549262J781033j270478q92581Q69413
10596B762985n63495l259780k148007J503495K336241L15482k78380Q11086N33613
$$ y = [1639268, 2524589, 3658182, 3949973, 2688882, 1042456, 1096070, 2703238, 3174958, 1101203, -1433577, -1753760, -36400, 1539464, 1714982, 927351, 250273, 579397, 1984621, 3299432, 3288502, 2371527, 2030095, 2671503, 3525279, 4250350, 4885282, 4819303, 3929298, 3912113, 5867319, 7479342, 5869149, 2502507, 1388483, 2704717, 2535668, -663529, -3681809, -3595048, -1232326, 1483741, 3888357, 5140348, 4105537, 1888541, 1134486, 1946758, 1915587, 685880, 567440, 2012598, 2698643, 1862281, 1240375, 1021804, -471801, -2312247, -1273664, 2275598, 4056631, 2786153, 1893572, 2762985, 2199490, -1060290, -3208297, -1704802, 631439, 946921, 668541, 1479627, 2013240]
10587B013240m47787N35154J581374m76869k565395J07857M293016K913605k632637
10578E321558m266281m59316K257758R70984j34778J271056K210399J105705N9648
10569H336733m20307j836919k799500p22651K172379J644525r54020j112343O02297
10560D910194M38881p17019L28327J624436k07499j956351P85154L718885K83734
10551I208742n355457l980246K673714M653824O87576j308739M39673j14559l214312
10542C690216k232466K759793M085633N37738q65025J491024J591668j512367
10534I546214j970738O36613M41065k360281j537667K200507J907232j717572
10526G145373j318181K402510J859064k027688j387237K483806J364680k722846
$$ y = [2013240, 1565453, 2100607, 3681981, 3205112, 639717, 747574, 5040590, 7954195, 5321558, 1055277, 595961, 2853719, 3824703, 3689925, 4960981, 7171380, 8277085, 8336733, 7916426, 6079507, 3280007, 2557356, 4729735, 6374260, 5420240, 4307897, 4910194, 5349075, 4632056, 4960383, 6584819, 6377320, 4420969, 5206123, 8925008, 9208742, 3853285, -126961, 2546753, 7200577, 7888153, 6579414, 7019087, 6904528, 3690216, 1457750, 4217543, 8303176, 8840914, 7975889, 9466913, 11058581, 9546214, 7575476, 8212089, 8653154, 6292873, 4755206, 6955713, 8862945, 7145373, 5827192, 8229702, 10088766, 8061078, 6673841, 9157647, 10522327, 7799481]
10518G799481p34944M479035K315168m035633j965130N835981M940160l128389
10510A5505729k867616N202876M855003l988101m219421M795413N266555l366781
10502B1183657k321486P895236N897772o811504m385974J1869778J0601771p788409
10494C6140841m533351K1965889K2106364r875363n323086N6476390P5457026
10487A92414710k8322877j61907854j63698846l2011162P3142926N7092706l059470
10480f6349867q118161K2577899K1613664n502046r529744Q853466J1799545k196472
10472b6851716m059647O998568P102854l427833l660140N475163N050130l606415
10464a6979036l073379M685633K837985o079497m478508N861611O248127m156007
$$ y = [7799481, 7064537, 11543572, 13858740, 9823107, 7857977, 13693958, 18634118, 15505729, 12638113, 17840989, 22695992, 18707891, 14488470, 19283883, 24550438, 21183657, 18862171, 26757407, 32655179, 25843675, 21457701, 33327479, 43929250, 36140841, 31607490, 53573379, 75679743, 65804380, 60481294, 116957684, 192414710, 164091833, 2183979, -161514867, -193526029, -120383103, -63290397, -66349867, -74468028, -51890129, -30276465, -35778511, -45308255, -36454789, -24655244, -26851716, -30911363, -23912795, -16809941, -20237774, -23897914, -18422751, -13372621, -16979036, -20052415, -15366782, -12528797, -18608294, -23086802, -17225191, -10977064, -15133071]
10456a5133071o920029K195428P217238J574433k639412J109746L852657L86803
10448h356207j969168Q69392K754807O05438n71430P38670l8486k454448q64316
10439i285748L259282K325487k896370l358379K205635M726469N24897l221119
10431e719846j672408P84495K51653n69306M92671Q96475n18095j019646J62625
10422f911382M25087n33555k71154P91155l8870j792807j211624P71067P91869
10413g980214o7990J484406L507248J608550k311344k537980L97523Q52547j520016
10404f567270j505471J636506K832275N50897r52524J73684Q09842k88698m39340
10395c750099Q92418Q20821r81044j451908j85466o7553j236189o93883J394222
$$ y = [-15133071, -22053100, -19857672, -12640434, -11066001, -13705413, -12595667, -8743010, -8356207, -10325375, -9455983, -6701176, -6095738, -6667168, -5928498, -5966984, -8421432, -9285748, -6026466, -3700979, -6597349, -9955728, -7750093, -3023624, -2498727, -5719846, -7392254, -6607759, -6356106, -6925412, -6432741, -5536266, -6054361, -7074007, -6911382, -6486295, -7019850, -7291004, -6499849, -6538719, -8331526, -9543150, -8772083, -7980214, -8048204, -6563798, -3056550, -1448000, -3759344, -6297324, -5899801, -5047254, -6567270, -8072741, -6436235, -3603960, -3053063, -4005587, -3831903, -3022061, -3310759, -3750099, -2857681, -2036860, -3017904, -4469812, -4655278, -4722831, -5959020, -6652903, -5258681]
10386e258681J302535j484910l066677j590598N84713J784516K714854K961688
10378b052560J166567j102873q94508Q25101O51076j027904r46435N54618J47331
10369b679587j801770j674787L45360L68619j703011j575089J606516L436524
10361c677225J718313m04881m85630k17589r87365j213106m8804Q23268O53918
10352c839101P13034R69098n9902j527424q05804J640274K460157R59299j26511
10343C83120K85440M49316o3210J84781P64051n3381j152759j88758J115680p56970
10333I67310l875934k792068J869275L273697o10517l530202j265688J897072
10325d067055J013414j635188j392936J091215K092771J015631j71801q43163
$$ y = [-5258681, -3956146, -5441056, -8507733, -10098331, -9513618, -7729102, -5014248, -2052560, -885993, -1988866, -2883374, -2058273, -1407197, -2435101, -3381536, -2826918, -2679587, -4481357, -6156144, -5810784, -5442165, -7145176, -8720265, -7113749, -3677225, -1958912, -2363793, -2849423, -3067012, -4054377, -5267483, -5316287, -4493019, -3839101, -3126067, -2156969, -2216871, -3744295, -4550099, -2909825, -449668, 509631, 383120, 668560, 1117876, 1054666, 1239447, 2003498, 1950117, 797358, 608600, 1724280, 967310, -2908624, -5700692, -3831417, -557720, -1168237, -4698439, -5964127, -4067055, -3053641, -4688829, -6081765, -4990550, -2897779, -1882148, -2053949, -2897112]
10317b897112j241254o07682J007447J485174o7378j274146k45941J273825J021273
10308a545794j74827m59541j53549l22338l79128M22352J079659O29899j9583
10299i22850L4475o5307r87827j495774n65459N89113M44605m37169n47466L73025
10289c580634J469223J824556P40495j441536k524868o08351K650040L480485
10281B009410J185102r84214q38692J6397l37860j096352r26863m35940m90757
10272a899769m25444K19961L43229n25591p68519O59820J991184J089420j318382
10263f34091k719679k012662j21544J534057J903819O66828j096235j466318J00990
10254c844835J853024J719300m24276k792505l318369j291442J767463L132237
$$ y = [-2897112, -4138366, -4746048, -3738601, -2253427, -2320805, -3594951, -3840892, -2567067, -1545794, -1720621, -2180162, -2333711, -2656049, -3035177, -2612825, -1533166, -903267, -922850, -888375, -953682, -1941509, -3437283, -4002742, -3413629, -2969024, -3406193, -3953659, -3580634, -2111411, -286855, 453640, -987896, -3512764, -4121115, -1471075, 2009410, 3194512, 2210298, 1371606, 1388003, 1050143, -46209, -973072, -1409012, -1899769, -2325213, -2105252, -1762023, -2287614, -3056133, -2396313, -405129, 684291, -634091, -3353770, -5366432, -5487976, -3953919, -2050100, -1383272, -2479507, -3945825, -3844835, -1991811, -272511, -696787, -3489292, -6807661, -8099103, -6331640, -3199403]
10246c199403J757550l61310q13641J16328M61691l02860j050769j081567m80897
10237d954878P01354J773238J216405p24315j088113J436114L324275J083758
10229B767838k669988k655500Q77425K661098O54275j719881j921774j407879
10221c414386j319331l10595J592395J752785l72846j553562N0351J951650J670597
10212D7058K98479l63259o88327j175836q58334L02665O38379J178L63461J803591
10202C69055J791604J4717m37679J360684K089480J20520j325925j04930O67329
10193D544855j650067l867361k182609J063120J192050j165341j731913J55971
10185c641295J361058P81790L09317N62516K44182m71958j2510J146902Q01741
$$ y = [-3199403, -1441853, -1803163, -2616804, -2500476, -2038785, -2341645, -3392414, -4473981, -4954878, -4253524, -2480286, -1263881, -1988196, -3076309, -1640195, 1684080, 2767838, 97850, -2557650, -1680225, 980873, 1635148, -84733, -2006507, -3414386, -4733717, -5044312, -3451917, -1699132, -2071978, -3625540, -3575189, -1623539, 47058, 345537, -17722, -706049, -1881885, -2740219, -2437554, -1799175, -1797997, -1434536, 369055, 2160659, 2175376, 1737697, 3098381, 5187861, 5308381, 3982456, 3877526, 4544855, 2894788, -972573, -3155182, -2092062, -900012, -2065353, -3797266, -3641295, -2280237, -1498447, -1189130, -626614, -382432, -854390, -866900, 280002, 1081743]
10176A081743j031432j777249k84737J595231J787686K12436j821707k679930
10168b917959j265988J494345K781956J182474j200576j698257p32235l87213
10160b743453q29669p33419p2539K34887N64484J790479K951666K285340J05838
10151C553614j632161k109579j889384j113351L58962J618745J586037P24876
10143A097759K12658J78014K26412M96356O89137l06258k124243k312956r0417
10134a933538J623059M96724j368557j017885M59724M16923k94732P49851K402462
10125A534031J709100l94648m07960J374809J298882r27985j616923J43242Q12583
10116C525131j076681k255958p44798O86244j11403p05117J009530K321038L40443
$$ y = [1081743, 50311, -1726938, -2011675, -416444, 1371242, 1583678, -238029, -2917959, -4183947, -2689602, 92354, 1274828, 74252, -1624005, -2356240, -2743453, -3573122, -4306541, -4379080, -4144193, -3579709, -1789230, 1162436, 3447776, 3553614, 1921453, -188126, -2077510, -3190861, -2831899, -1213154, 372883, 1097759, 1310417, 1488431, 1714843, 2211199, 2900336, 2594078, 469835, -1843121, -1933538, -310479, 186245, -1182312, -2200197, -1740473, -1323550, -1618282, -868431, 1534031, 3243131, 2848483, 2440523, 3815332, 5114214, 4186229, 2569306, 2712548, 3525131, 2448450, 192492, -552306, 133938, 22535, -682582, 326948, 2647986, 2988429]
10107B988429k437354j917976Q35483J540067k38102r36024O16123J433773l15064
10098A569355k251296j607273P38030J901396R27831n97285r46699K1513J167517
10089I23089J322905L41067q20630j160273o95914k08966j33504j73181K7130
10080e78277K57229q6632j291043k712167k961926j186806J623140L092297J759898
10071b084287j167323k767523j285468K016238M072477L204817Q37048m10231
10063B415748j5221J27915j152825k323501j377098J022296K200662R10951j315460
10054D93467k256298j312284L74709J255868P03471m78882r62892n11509o4579
10045b758929q485L73891J102225Q59789n49742r56500R29326K735232J645656
$$ y = [2988429, 551075, -1366901, -531418, 1008649, 770547, -165477, 450646, 1884419, 1569355, -681941, -2289214, -1551184, 350212, 1278043, 680758, -265941, -244428, 923089, 2245994, 2587061, 1766431, 606158, -89756, -298722, -432226, -605407, -578277, -321048, -407680, -1698723, -4410890, -7372816, -8559622, -6936482, -3844185, -2084287, -3251610, -6019133, -7304601, -5288363, -1215886, 1988931, 2825979, 2415748, 2400527, 2528442, 1375617, -947884, -2324982, -1302686, 897976, 1808927, 493467, -1762831, -3075115, -2700406, -1444538, -741067, -1219949, -2182841, -2694350, -2758929, -2767414, -2393523, -1291298, -431509, -981251, -1937751, -1008425, 1726807, 3372463]
10036C372463r05843j155405J010700J813354l82095k613825k135000k64430M34610
10027h25471k8276l19303n64285j383737j763542m15026J683851K345202J236595
10018c3992M90l29941k97191m72255m65281J78265J061749J360552P84193j12477
10008A674112n37657l40847o2197j7826P1014J56908m94467j874826k463004j202897
9998e091687O85453J426799J211669J134229P90177n93788j679379p14824R76636
9989a854715O23356j258407j540866J41939R13782K4491J09121J882310K308157
9980A349168P7821j639051n52777Q79195R5j584781j467529o46239o55847p5342
9970d315287K146494L301977J180586j473799j330089j55125j082066k255208
$$ y = [3372463, 2466620, 1311215, 2321915, 4135269, 3753174, 1139349, -995651, -1260081, -825471, -853747, -1173050, -1737335, -3121072, -4884614, -5299640, -3615789, -1270587, -33992, -33502, -363443, -660634, -1132889, -1598170, -1419905, -358156, 1002396, 1786589, 1674112, 1136455, 795608, 733411, 715585, 786599, 943507, 449040, -1425786, -3888790, -5091687, -4406234, -2979435, -1767766, -633537, 156640, -437148, -2116527, -2831351, -1854715, -1231359, -2489766, -4030632, -3888693, -2974911, -2950420, -2841299, -958989, 1349168, 1426989, -212062, -764839, 114356, 114451, -1470330, -2937859, -3584098, -4239945, -4315287, -2168793, 1133184, 2313770, 839971, -490118, -645243, -1727309, -3982517]
9962c982517j39428L182269K607531j328391l013819p15178J367958N02219j040024
9953b559380r93253m07025m24493j70605P03970J062828P92094R05354R06176
9944a84334m12821j780995j012485P35565O66846l90741N10376K350721J461595
9935A943727j307663j332906J386076J624218j866108l750382j109842J870203
9927b542677J356259m18867m77150j55435j001675j139627L84413Q37420r16449
9918d073788j643970J37136R48694q25737j057336K452993M624799J189055l539861
9909a788015l451986k81883M01990j293660j205609Q84349J745444J016923R61397
9900c011050J657919J541519R07385P01497J64318r21532r01616m5990j131152
$$ y = [-3982517, -4121945, -939676, 1667855, 339464, -2674355, -3389533, -2021575, -1519356, -2559380, -3552633, -3959658, -4384151, -4554756, -3850786, -2787958, -1995864, -1090510, -184334, -597155, -2378150, -3390635, -2655070, -1988224, -2378965, -1868589, 482132, 1943727, 636064, -696842, 689234, 2313452, 447344, -3303038, -4412880, -2542677, -1186418, -1605285, -2082435, -2237870, -3239545, -4379172, -3994759, -3157339, -4073788, -5717758, -5580622, -4631928, -5457665, -6515001, -4062008, 562791, 1751846, -1788015, -5240001, -5521884, -5119894, -6413554, -7619163, -6734814, -4989370, -3972447, -3011050, -1353131, 188388, 1095773, 1797270, 1961588, 1040056, 138440, 92450, -1038702]
9891a038702l486048k567506J349089J796452k428991l698192R82922L543363
9883e547613o63891l658519K12650K768510k269540n500154O69926M844790l388086
9874a2531927j0706683k760158L845079j3806724l6226606j9708623L2678895
9867e9216747O2556139L5831578r121416j9497639k8848Q315423l964975j0637784
9859D235731j049148O074719J62393n269463p34883L695450R6101l213327O64871
9850D662444M324311R79361l275206j785763J144310L2493j755997j19589J445959
9841E652323o40067k767459j320647N92916k53582j208862Q8924P33682j030267
9832a53039j561602Q95591J882492j046400k963934j74087K753574Q67867k548969
$$ y = [-1038702, -4524750, -7092256, -5743167, -3946715, -6375706, -10073898, -9090976, -5547613, -6211504, -9870023, -9657373, -6888863, -9158403, -14658557, -13988631, -9143841, -12531927, -23238610, -25998768, -22153689, -35960413, -72187019, -91895642, -59216747, 3339392, 39170970, 30049554, 10551915, 10523067, 18838490, 14873515, 4235731, 3186583, 9261302, 9423695, 4154232, 3419349, 7114799, 7210900, 3997573, 4662444, 8986755, 9966116, 6690910, 4905147, 6049457, 6081950, 4325953, 4206364, 5652323, 5012256, 2244797, 924150, 1517066, 1263484, 54622, 143546, 877228, -153039, -1714641, -819050, 1063442, 17042, -2946892, -3120979, -367405, 500462, -2048507]
9823b048507k025819Q50172J218760l98009j32804J781873J972554M6161j583905
9814c19524k064097j995830j097887L99962N42226r35148r83710J763137L805867
9805h85004K077053j048260j715834k12206J009448J531451J608984J64176k211687
9796C18121k063986J274183K989840P7895l084757j592635J869527J826200q47031
9787G67357j415463L1538k45604j709167l99785L041616L599745L67779k022678
9778B015338j214405O0951J17407R52171K912842K673239q61291l771935l116133
9769b31816j186021q59130r53359M40864J779792J007901l20145K50041J559190
9760A487317R04583j135556j820968r73420o87313r74689K83584K822327L310277
$$ y = [-2048507, -4074326, -3224154, -2005394, -2403403, -2536207, -754334, 1218220, 1264381, -319524, -2383621, -4379451, -5477338, -5077376, -4535150, -5470298, -6454008, -4690871, -885004, 1192049, 143789, -1572045, -1784251, -774803, 756648, 2365632, 2529808, 318121, -1745865, -471682, 2518158, 2596053, -488704, -2081339, -211812, 1614388, 767357, -648106, -616568, -862172, -2571339, -2971124, 70492, 3670237, 4038016, 2015338, 800933, 861884, 979291, 1931462, 4844304, 7517543, 6656252, 2884317, -231816, -1417837, -2276967, -3230326, -2789462, -1009670, -1769, -321914, -71873, 1487317, 2391900, 1256344, -564624, -1538044, -2225357, -3200046, -2916462, -94135, 3216142]
9751C216142M47336k451088j946433P42148J761167j6843k107443k320609j218238
9742c893861l83639r5231L91556J346483K288920K680807K229066Q69178r87773
9733D445506k400928k539535j396272J80198J063052P16970j30182j06081Q78514
9724G11242J037942o94082k263832q87794K369655L273011L99859k589941k298057
9715i41997k54189K46138o48123o01561L53760L10267n19864j04440J510289K189969
9705A540249J528924J209598J439124N88141j150527j357275M06618J416464J37393
9696E758709j427452j353409p70198j224955j683329n47669J234089J487409J07464
9687A580659r81665n86385M60810N50354p69040j959487j029655J429811K067953
$$ y = [3216142, 3663478, 1212390, -734043, 8105, 1769272, 1752429, -355014, -2675623, -3893861, -4277500, -4372731, -3981175, -2634692, -345772, 2335035, 4564101, 5433279, 4445506, 2044578, -494957, -1891229, -1711031, -647979, 68991, -61191, -167272, 711242, 1749184, 1055102, -1208730, -2096524, 273131, 3546142, 3946001, 1356060, -941997, -1196186, -950048, -1598171, -2199732, -1845972, -1535705, -2055569, -2160009, -649720, 1540249, 3069173, 4278771, 5717895, 6306036, 5155509, 3798234, 4204852, 5621316, 5758709, 4331257, 2977848, 2207650, 982695, -700634, -1248303, -14214, 1473195, 1580659, 598994, 12609, 473419, 1023773, 254733, -1704754, -2734409, -1304598, 763355]
9678G63355n94636l017427j251546K627232L065190l83745k229821K49037K918850
9669B146489J769385j059078j717914q33827j005976j518163k63833J461417R13076
9660a08424r10114p42633J168129J426634n01556j177057J092668L361547K490693
9651F099887m59375k179421j484659P3607P98836M81541j42735n30818q01233
9642A855630j263841j590544r62016N74053J558713P88624q72248j346323L0048
9633a227904J620598J530048o3784j220478p87828J48747L796q41480q04521n4787
9623a697593m00284j688537j210956J637963L168367P26471k562794k259753M84253
9614c802863J241163j44821N6909K173261K334330m32974k279895j166338J97803
$$ y = [763355, 168719, -2848708, -4100254, -1473022, 1592168, 1208423, -1021398, -772361, 2146489, 3915874, 2856796, 1138882, 305055, -700921, -2219084, -2482917, -1021500, -108424, -1018538, -1761171, -593042, 833592, 332036, -845021, 247647, 3609194, 6099887, 5640512, 3461091, 1976432, 2050039, 2848875, 3330416, 3187681, 2656863, 1855630, 591789, -998755, -1960771, -1386718, 171995, 960619, 88371, -1257952, -1227904, 392694, 1922742, 1858958, 638480, -149348, -601, 3195, -838285, -1642806, -1697593, -2097877, -3786414, -4997370, -3359407, -191040, 535431, -2027363, -4287116, -3802863, -2561700, -2706521, -2649612, -476351, 1857979, 1425005, -854890, -2021228, -1823425]
9605a823425n9701M7681J454077J579852l49201q67163J533442L053648J216591
9596E785801n07829P94964J699557j252198m281416k108147K694907L345048m54148
9587E716539k726205j034660Q92291L83903o23556k21244M36154J4660r35188
9578A902694j609739j652806m11366J561301J363191k267641n228410k807434
9570i150210K897207N354813K890203K20934N17100J478967N72943r21283j155870
9561B704804q72726j112718j082308l03121o2437r03142j112546N72206K680437
9552E08449K880388Q30866j622597k174755j29802K281204J739654j616704l463587
9543g66884j330361J253249J56278k512220j892886J353918K287239K17831n88106
$$ y = [-1823425, -1883126, -1835445, -381368, 1198484, 849283, -17880, 1515562, 4569210, 5785801, 5277972, 6072936, 7772493, 6520295, 2238879, 130732, 2825639, 6170687, 5716539, 2990334, 1955674, 2847965, 3231868, 2608312, 2387068, 2823222, 2837882, 1902694, 292955, -1359851, -1771217, -209916, 1153275, -1114366, -6342776, -9150210, -6253003, -898190, 1992013, 2212947, 2730047, 4209014, 4781957, 3860674, 2704804, 1832078, 719360, -362948, -666069, -728506, -1631648, -2744194, -2171988, 508449, 3388837, 4219703, 2597106, 422351, 292549, 2573753, 4313407, 2696703, -766884, -2097245, -843996, -687718, -3199938, -5092824, -3738906, -1451667, -1233836, -1821942]
9534a821942J058426J295644j309432k788570p27433J643397J355517M55404J368248
9525E29259K198490O06949j474359j051596J012730J979086J555701R26819r8158
9516F184921j771663k469238j077168O69968Q38927J60684q6220n05090j390807
9507E54314r63868J251320K165934k78475k918937j758248J647934K550674K61574
9498B512222j429538m33350J229381J281209l9j177639j278960j1125J584126
9489B276287J382640q00715j828534L56901K631393Q05613l384881m123382k07298
9480b891976L116715K095257n65982r07304L41253L05004o83892j87741J611146
9471B232480K077493M27583j351929j852110j704593j403372l29154J220723J431675
$$ y = [-1821942, -763516, 532128, -777304, -3565874, -4293307, -2649910, -1294393, -838989, 529259, 2727749, 3334698, 1860339, 808743, 1821473, 3800559, 5356260, 6283079, 6184921, 4413258, 1944020, 866852, 1536820, 2375747, 2536431, 2450211, 1945121, 554314, -409554, 841766, 3007700, 2729225, -189712, -1947960, -300026, 2250648, 2512222, 1082684, 649334, 1878715, 3159924, 3159885, 1982246, 703286, 692161, 2276287, 3658927, 2858212, 1029678, 1386579, 4017972, 4823585, 1438704, -2684678, -2891976, 224739, 2319996, 1754014, 846710, 1187963, 1492967, 809075, 621334, 2232480, 4309973, 4737556, 3385627, 1533517, -171076, -1574448, -1903602, -682879, 748796]
9462G48796k09672j477806o06215O91526k16725k336645k089064J053956L185699
9453a256150J536965j352860j381177J176447K474027R06242j083429j118755
9445i8690P6407O57277L98384J85090L17424M84902L92574k89017j542132k206394
9435a624175r90307J277439K100656P18635p66210o38235L4346k62531o80323
9426h30705K88753J670826J145458j215438k767145j908607J70246J665635K235730
9417D54753K268913J631243J35610j627608k735088k728893j658274o983J180451
9408c085876J022044J02895P6545J290857J909273N55209j182497p37830J382254
9399A332874J896575m02799k528608j526462J216236K171291P46346o53825q87873
$$ y = [748796, 539124, -938682, -1544897, -853371, -1070096, -3406741, -5495805, -4441849, -1256150, 280815, -1072045, -2453222, -1276775, 1197252, 2103494, 1020065, -98690, -22283, 634994, 1033378, 1218468, 1535892, 2020794, 2413368, 2124351, 582219, -1624175, -2614482, -1337043, 763613, 1482248, 716038, 77803, 112149, -150382, -830705, -541952, 1128874, 2274332, 1058894, -1708251, -3616858, -3446612, -1780977, 454753, 2723666, 4354909, 4490519, 2862911, 127823, -2601070, -4259344, -4266327, -3085876, -2063832, -1960937, -1884392, -593535, 1315738, 1870947, 688450, -49380, 1332874, 3229449, 2826650, 298042, -1228420, -12184, 2159107, 2905453, 2251628, 1363755]
9390A363755j193751j965754j703696p2961J002944O26169M38582J260783J221006
9381I77077n86436j622227m3284J505598K9797k267608j247993J911086K161433
9372H17443j009276k392304M91796L283391J831356j356074j589044N74544J048560
9363A700392o42472r52359J241853K429764M8734l246727l251156o6734K323663
9354d15042J522949p15422j579552p36441K50027N17150L70871j1214o63121r62509
9344b422304l05953N27362L89195m0544Q12973K226230J557417j440382l462391
9335b158397k236920L05366J266933P62960M95794N98211L88851L47141Q20240
9326E90179O07799o74049r01140J095552K640765J118677j436803j527286L3325
$$ y = [1363755, 170004, -1795750, -3499446, -3572407, -2569463, -1943294, -1504712, -243929, 977077, 390641, -1231586, -1274870, 230728, 260525, -2007083, -3255076, -1343990, 817443, -191833, -2584137, -2092341, 1191050, 3022406, 1666332, 77288, 651832, 1700392, 1057920, 105561, 1347414, 3777178, 3825912, 579185, -2671971, -2738705, -415042, 1107907, 392485, -1187067, -1923508, -1673481, -1156331, -785460, -796674, -1459795, -2422304, -2728257, -2200895, -1811700, -1852244, -1039271, 1186959, 2744376, 1303994, -2158397, -4395317, -4089951, -2823018, -2060058, -1564264, -966053, -577202, -230061, 590179, 1197978, 523929, -377211, 718341, 3359106, 4477783, 3040980, 1513694, 1547019]
9317A547019m5995j518834j315926P03311J737523J282186J357324J762925L43518
9308E853051j928580j618699Q75980J338509r55288j806086L71622J611325m44131
9299C297703k285172r01085R34902o0411j756512o94925J653518J676046j99032
9290A665032r67467n13630r14266j878885j370965K37050P14083Q942M8144R67371
9280b004591R95521q1749n08355K39508N55526n55071j908505j811846J6661K353563
9270b709338L495300K676010R41750j25405o61430j960069l492805k894480J75073
9261d555394K718489K411766N69640m76955n75679n60061k51114M05922M76353
9252A62967J26466J043229K883948K381751j455394m455173k946645N65460J359395
$$ y = [1547019, 1501024, -17810, -1333736, -630425, 1107098, 2389284, 3746608, 5509533, 5853051, 3924471, 2305772, 3181752, 4520261, 3564973, 1758887, 2130509, 3741834, 3297703, 1012531, 111446, 1046348, 985937, -770575, -1465500, 188018, 1864064, 1665032, 697565, 183935, -730331, -2609216, -3980181, -3743131, -3029048, -3020106, -2971962, -2004591, -1009070, -1090819, -1599174, -1359666, -804140, -1359211, -3267716, -5079562, -5062901, -2709338, 785962, 3461972, 4403722, 4278317, 3616887, 1656818, -1835987, -4730467, -4555394, -1836905, 574861, 1144501, 667546, 91867, -468194, -719308, -313386, 162967, 289433, 1332662, 4216610, 6598361, 5142967, 687794, -2258851, -1693391, -333996]
9243c33996l00533n07500J352472J984977J45439j381827m25669J570738K197032
9234D301133J070859o61552j848820j839268r25638l22498n66195n91484L51700
9225a031763J072990M09786n77344m42450L6841m95808j090851r1444J439810
9216g70233J036329r44680j557024K22417K075451J917887N06468k88720o6725
9207B131170Q9439p23277j996274k108236l47059J456848Q69832j304555j486032
9198c418144J392603L816567K709287k34602j657565j330975q44934L9655K062045
9189B533937L324496J510551j759124k614336n32134J177304L01957j862848k975083
9180h95280k033402M13136K367619J523479j640716l278875j055800K177342K500620
$$ y = [-333996, -634529, -1142029, 210443, 2195420, 2340859, 959032, 533363, 2104101, 4301133, 5371992, 4710440, 2861620, 1022352, 96714, -225784, -791979, -1383463, -1031763, 41227, 451013, -126331, -568781, -531940, -1027748, -2118599, -2210043, -770233, 266096, -678584, -2235608, -2013191, 62260, 1980147, 2486615, 2197895, 2131170, 2220609, 1497332, -498942, -2607178, -2954237, -1497389, -627557, -1932112, -3418144, -2025541, 1791026, 4500313, 4265711, 2608146, 1277171, 432237, 471892, 2533937, 5858433, 7368984, 5609860, 2995524, 2463390, 3640694, 3942651, 2079803, -895280, -2928682, -2515546, -147927, 1375552, -265164, -3544039, -4599839, -2422497, 78123]
9171G8123P33589M23684J736420J753177p2164j282258r78476p46851r78865l49854
9161C16525P71278L50484j390830j840953l84657O76557K68044O5908R92619J540445
9151A365420P03438l49221n72451m41629k92450K71552P92823K27431q80781r55396
9141a31264k06153k80440j135583j057581K25709J267988J551291J520353N36727
9132B291047j818678l101265p66687K811179K746577q06705k567815l71064J856866
9123B73455J058310l32769M82035J617916K67578k038431j901165M67223J810730
9114A704882O48424j235724j537054J3812J476830P25240j551909j777154J507126
9105b5527M086561J364422l923940m653240j0351L062727P25540k133150n20368
$$ y = [78123, 811712, 1235396, 2971816, 4724993, 4652829, 3370571, 2392095, 1645244, 666379, 316525, 1087803, 1438287, 47457, -1793496, -2178153, -1501596, -1233552, -1167644, -175025, 1365420, 2068858, 1719637, 1147186, 705557, 413107, 684659, 1477482, 1704913, 824132, -131264, -337417, -617857, -1753440, -2811021, -2585312, -1317324, 233967, 1754320, 2291047, 472369, -2628896, -3395583, -584404, 2162173, 1355468, -1212347, -1583411, 273455, 1331765, 998996, 1481031, 3098947, 3366525, 1328094, -573071, -105848, 1704882, 2353306, 1117582, -419472, -405660, 1071170, 1796410, 244501, -1532653, -25527, 4061034, 5425456, 1501516, -3151724, -3162075, -99348, 626192, -1506958, -2027326]
9096b027326K639794K160075p38975j454856j82315o39596k668236k484966K90316
9087e106085J688041k169j608935l36181K270334L249513K198080O20642o17412
9078B355828j527186j900472j386515k94961M74775M10029Q9949N28361J515823
9069B65631J361783o67995k509768j761237O46511J746396J150195J151839K052265
9060C435620J311900j425043k590463l23226J910492N33172k413292k540972J67646
9051a934166J969360J278128L084l99276n73590r67653r47307n32124n80923r20742
9041c605209l22593J325898K481053J917646J04190j478896j631770l50172R57770
9032f02083P99119m37306r08441p2900O13872L58264K70717Q64938O59395j042109
$$ y = [-2027326, 612468, 2772543, 2033568, 578712, 396397, -243199, -2911435, -5396401, -5106085, -3418044, -3420213, -5029148, -5365329, -3094995, 154518, 2352598, 2973240, 2355828, 828642, -1071830, -2458345, -2753306, -2278531, -1868502, -1778553, -1250192, 265631, 1627414, 959419, -1550349, -3311586, -2665075, -918679, 231516, 1383355, 3435620, 4747520, 3322477, 732014, 408788, 2319280, 2852452, 439160, -2101812, -1934166, 35194, 1313322, 1316406, 917130, 343540, -624113, -1571420, -2103544, -2684467, -3605209, -3927802, -2601904, -120851, 1796795, 1900985, 422089, -1209681, -1559853, -602083, 197036, -240270, -1148711, -1221611, -607739, -249475, 21242, 886180, 1545575, 503466]
9022E03466k229498j199966M94793N46676l85566j22479J221871J664683P17155
9013A211135k91012o76604q68104q78355l91531P5913p1963j80664N52994J445143
9003g3048J474737J078335R89743M44934j317781k809449j961582N88323K168181
8994E82393J605506O7582j125402j541248j008322R2219M11624o17727j268384
8985b801759K52342K729462L290101J346475j010073k169315k275633j569135
8977b207535J03898J847532J976025L75995j050080r43294j37313n8962n36070
8968f29804j48628J494621K630101J238753j853346l116056q51308J802660R52220
8959A519213j965652j992425J437901L111945J43144l322418k553146Q01987K215004
$$ y = [503466, -1726032, -2925998, -2431205, -1884529, -2270095, -2392574, -1170703, 493980, 1211135, 920123, 243519, -624585, -1502940, -1894471, -1818558, -1890521, -2071185, -1518191, -73048, 1401689, 2480024, 3469767, 3914701, 2596920, -212529, -2174111, -1585788, 582393, 2187899, 2255481, 1130079, -411169, -1419491, -1327272, -915648, -1533375, -2801759, -2549417, 180045, 3470146, 4816621, 3806548, 1637233, -638400, -2207535, -2103637, -256105, 1719920, 2095915, 1045835, 102541, -34772, -93734, -629804, -778432, 716189, 3346290, 4585043, 2731697, -384359, -1235667, 566993, 1519213, -446439, -2438864, -1000963, 2110982, 2254126, -1068292, -3621438, -2819451, -604447]
8950f04447J353046J007645J429156O33705j117804j712385j076274o34845j3091
8941g35294J684837K570325L72488k849008l012131l40330J311117R01521R55461
8932H58986K000119J533767q32995k209763j421977n72411o14527L8033J391156
8923A70388J084027r03671j488065j8570K70999j704394k405679J73409K691996
8914b129560J961365j62862q21515q77715j797874j788174O22588K595129J196530
8905a202088j323374j206058M83414K48842j302874q13235J358978J727710K30279
8896a798406N11988L198640M249389J474304j928964k419277r24625k47340o43102
8887A472607n82927R1847K34518m47231j094983j000481j91815P35989R57984
$$ y = [-604447, 748599, 1756244, 3185400, 3819105, 2701301, 988916, -87358, -722203, -735294, 949543, 3519868, 3892356, 1043348, -1968783, -2309113, -997996, -96475, 858986, 2859105, 4392872, 3559877, 1350114, -71863, -644274, -1258801, -1220768, 170388, 1254415, 350744, -1137321, -1155891, -884892, -2589286, -4994965, -4821556, -2129560, -168195, -331057, -1152572, -2030287, -3828161, -5616335, -4993747, -2398618, -1202088, -2525462, -3731520, -3248106, -2999264, -4302138, -5115373, -3756395, -2028685, -1798406, -1286418, 1912222, 6161611, 7635915, 5706951, 3287674, 2363049, 2115709, 1472607, 889680, 981527, 1216045, 768814, -326169, -1326650, -1518465, -782476, 175508]
8878A75508L29027n9185O66452J441142O69740q67152p69949J054001J769788
8869D409372j52822k549727k873799j661762p68549j13101J303497K499719J568651
8860A661479p93252j641051l8466J465441N25026j786997k748180j601647N3678
8851d903969P21350M86131K74843O45375J322305J444663M97664p42649q91601
8842a145888m6051p0555j692905k529513o9145L963625M937404J495601k311299
8833B531274k528780m75170J20j417678j575472N41430J946579M51737j686785
8824b212745j079529J703726K948081J041778j562585j992872n74349L26795j61468
8815a563168o42825L8085J090388J239184P71720Q82783J487732J225051k14982
$$ y = [175508, 504535, 445350, 1111802, 2552944, 3222684, 2355532, 1585583, 2639584, 4409372, 4256550, 1706823, -1166976, -2828738, -3597287, -3710388, -2406891, 92828, 1661479, 868227, -772824, -811290, 654151, 1179177, -607820, -3356000, -4957647, -4903969, -4182619, -3696488, -3421645, -2776270, -1453965, -9302, 488362, -254287, -1145888, -1191939, -1262494, -2955399, -5484912, -5554057, -1590432, 3346972, 4842573, 2531274, 2494, -472676, -472556, -1890234, -3465706, -2924276, -977697, -525960, -2212745, -3292274, -1588548, 1359533, 2401311, 838726, -1154146, -1728495, -1401700, -1563168, -2205993, -2167908, -1077520, 161664, 933384, 1816167, 3303899, 4528950, 4313968]
8806D313968j318584j002026k23995k34282n03909k529M89265n13651k215013
8797a210756k077076L35547K363832J982698M04835l52641m88113j039097j146912
8788a227683N84335K771405K358051o74689k614413j193487J106280Q44317j353005
8779F01111k178133p45031P55618J042999J122741J305958K03616j995333k409092
8770b295546J76401K536950J466390j190857j417534O73317J443967j16178j188426
8761H8484k89673O30939K65882P8934P46788K91371k001758l268601j439762J043902
8751c853494R90860n85985o58806P17277J154996L89627K74400R97021P39885
8742A65781r29628k140762j400564P79290K773999K915966N77447k335878k502930
$$ y = [4313968, 2995384, 1993358, 1769363, 1535081, 1031172, 1028643, 1517908, 1004257, -1210756, -3287832, -2952285, -588453, 1394245, 1799080, 1446439, 958326, -80771, -1227683, -643348, 2128057, 4486108, 3811419, 1197006, 3519, 1109799, 1954116, 601111, -1577022, -2322053, -1566435, -523436, 599305, 1905263, 2108879, 113546, -2295546, -2119145, 417805, 1884195, 693338, -724196, -50879, 1393088, 1276910, 88484, -201189, 429750, 695632, 774566, 1521354, 1812725, -189033, -3457634, -4897396, -3853494, -2862634, -3448619, -4107425, -3390148, -2235152, -1845525, -1571125, -574104, 165781, -763847, -2904609, -4305173, -3525883, -751884, 2164082, 2741529, 405651, -2097279]
8733b097279M34655K674734J623218k52993l6031L65931j816426l811663j112433
8724d028287L845920L987187j264547m489461j639515K189663J539515j302753
8716a162278j496583L45727P57152J49710J218056L076655K527520j41228j618607
8707C656124j168981j217972k496235k818213j188696M94511P12658L53458N02211
8698c171135O62052K39168j55699L6493K31934j70737o35307k87458P77941J584686
8688h88062J396928N09402p5653P7077R1995r43418k132090j584965O32024K075971
8678h40791J296325o9903J21321J344549J486559M5087j478844j768961q53180
8669g17838M25702R88221J74035j245226j480606J2774J670313J998066J330758
$$ y = [-2097279, -1662624, 1012110, 2635328, 2382335, 2346304, 2712235, 895809, -2915854, -4028287, -182367, 3804820, 2540273, -1949188, -3588703, -1399040, 140475, -1162278, -2658861, -2313134, -1555982, -1406272, -188216, 2888439, 5415959, 5274731, 3656124, 2487143, 1269171, -1227064, -4045277, -5233973, -4739462, -4026804, -3673346, -3171135, -2509083, -2269915, -2425614, -2389121, -2157187, -2327924, -2963231, -3250689, -2472748, -888062, 508866, 1018268, 942615, 1019692, 1111687, 168269, -1963821, -3548786, -2916762, -840791, 455534, 385631, 506952, 1851501, 3338060, 3383147, 1904303, 135342, -717838, -292136, 696085, 870120, -375106, -1855712, -1842938, -172625, 1825441, 3156199]
8660C156199N27293m42967j346245r25545R19707J831900L1285k647892l059596
8651a955861j070049P69182J067457O73700L97344P1834j97411N0794M32415J66651
8641D06056m08014l67030R6475J72584J73276Q94019J610394P49348j492966l055400
8631a221258k614898p72074J220093K436568K271530R37553l15934o79484p11127
8622E50969o23789P22496L141722L452642l07927m566885m198171m9132K126342
8613B48267L04490j351206O1755J516678k78836k970515k387695P23172K240111
8604a893779J198550L79597J038780J248666p3103j105202l82573O47996J21701
8595A180633j085245p89277Q46382J280000o45662k747264k352161P5414J774595
$$ y = [3156199, 3683492, 3240525, 1894280, 968735, 1888442, 3720342, 3751627, 1103735, -1955861, -3025910, -2256728, -1189271, -515571, -118227, -46393, -243804, -193010, 239405, 406056, -1958, -368988, -272513, -99929, 73347, 967366, 2577760, 3327108, 1834142, -1221258, -3836156, -4608230, -3388137, -951569, 1319961, 2257514, 1941580, 1262096, 550969, -72820, 649676, 3791398, 7244040, 6936113, 2369228, -1828943, -1878075, 248267, 552757, -798449, -736694, 779984, 501148, -2469367, -4857062, -4133890, -1893779, -695229, -315632, 723148, 1971814, 1898711, 793509, 410936, 1058932, 1180633, 95388, -693889, 152493, 1432493, 786831, -1960433, -4312594, -4237180, -2462585]
8586b462585J636094J196654J369758O82576j676002l304464j724066J425187
8578b856848K485598J219714N57149J179436N72600j676522k089295R38223L498184
8569C828239J678040k250717l152857o00986J209999K55069j030488n72158K82342
8560c53517r5013o62840M1093J002108M38914r40848p88885J193710K538982J404817
8550C778521q63782j541963n7855J517015J376079Q8702p40225p81595p96587
8541A978310r09664o30017k81585o69786j284468p09596Q28203J348023K66974
8532f3606m68965M29607J403644O87004q03880j258213r54000j102204j118696
8523c249309L01505K347034K997780K111373J048581p1112j909567l288638k284699
$$ y = [-2462585, -826491, 370163, 1739921, 2422497, 746495, -2557969, -4282035, -2856848, -371250, 848464, 1405613, 2585049, 3157649, 1481127, -608168, 330055, 3828239, 5506279, 3255562, 102705, -498281, 711718, 966787, -63701, -635859, -353517, -448530, -1111370, -1070277, -68169, 370745, -570103, -1358988, -165278, 2373704, 3778521, 2914739, 1372776, 1314921, 2831936, 4208015, 4296717, 3556492, 2774897, 1978310, 1068646, 438629, 157044, -512742, -1797210, -2506806, -1678603, -330580, -63606, -532571, -102964, 1300680, 1987684, 1183804, -74409, -1028409, -2130613, -3249309, -2947804, -600770, 2397010, 4508383, 5556964, 5485852, 3576285, 287647, -1997052]
8514a997052J12735P72498p84579j707565o07576M73866R3907j33411J001573
8505b775604J663488K84941j268348o92615Q85949J065896K67720M06598R72055
8496H10080o542j911137k042195n0036J433347R25032j04576j84676R9697k2996
8486a054002R8125J000066J654711Q18070j178291k744996k447893r1026K599983
8477a345253K792119l38129l659880l333716J29510K475678J535654l56592n18616
8468b619225M75781Q86854Q47537J169271J148770r5376j536969j661467q12955
8459b197779j81988L39323J269578J714599P11837n48334k24264J139731J462618
8450C485321M91268j58393l0647l17466j238128j464947o32734j31638p07347
$$ y = [-1997052, -1884317, -1111819, -1896398, -3603963, -4211539, -3737673, -3643766, -3777177, -2775604, -1112116, -827175, -2095523, -2788138, -1902189, -836293, -568573, -161975, 810080, 803538, -1107599, -3149794, -3199830, -1766483, -841451, -946027, -1130703, -1031006, -1054002, -955877, 44189, 1698900, 2516970, 1338679, -1406317, -3854210, -3945236, -1345253, 1446866, 1108737, -2551143, -5884859, -5755349, -3279671, -1744017, -2100609, -2619225, -2143444, -1256590, -409053, 760218, 1908988, 1813612, 276643, -1384824, -2197779, -2379767, -2040444, -770866, 943733, 1655570, 1107236, 882972, 2022703, 3485321, 3976589, 3818196, 3787549, 3470083, 2231955, 767008, 134274, 2636, -704711]
8441g04711j277909q87468l6802O39531J281885J686659J039453m09091j096649
8432B34898m70080J31573j06956K7054J502199K880844K168915k46219k173992
8423C948236k405101j455952j81097Q74784J124238L11204q22216j191721o02036
8414c99661K76401P81486N58851m00141j347895j105511L84485J499814Q62476
8405A110305p38255j313391j70338J414744J725155J86502k162713l305510j978632
8396e232133P46015K361587J800366L77763m75250q12338p49692N09479K656838
8387A182635L220519P74328k291434k739728r87056J79356K49115Q79873J734413
8378B202021N30432k250928k839286P5880K744927J793432q69918j405601K33451
$$ y = [-704711, -1982620, -2870088, -2906890, -2267359, -985474, 701185, 1740638, 1331547, 234898, -235182, -103609, -210565, -183511, 1318688, 4199532, 6368447, 6122228, 3948236, 1543135, 87183, -93914, 780870, 1905108, 2216312, 1394096, 202375, -399661, -123260, 658226, 1217077, 816936, -530959, -1636470, -1251985, 247829, 1110305, 372050, -941341, -1111679, 303065, 2028220, 2214722, 52009, -3253501, -5232133, -4486118, -2124531, -324165, 53598, -421652, -1233990, -1983682, -1474203, 1182635, 4403154, 5177482, 2886048, 146320, -840736, -661380, -412265, 467608, 2202021, 2732453, 481525, -2357761, -2281881, 463046, 2256478, 1386560, -19041, 214410]
8369B14410J222958P39799L65395N00286j50865j546488j813418l39834J068112
8360B60355Q87827j47793n10191K07020J423971K329392K069002M02683j498347
8351E423919k066658j307076n50045l19351j1491L04972k83220j524131j832676
8342b165757q29324n4733k64925j51879R58215J354105j95608j749083p95023
8333c894012J801800L046408K107555P32901o0130r29526j904193j850192o95693
8324a645082J47291J49002L08236Q87946P32589l89208r84764l84003Q2266l46154
8314a441881l09076J080383K185154J376951j59299m04352J84401j62219j155674
8305A194388r91295K75861O47351m84384j425087j042038l18964k87454k87380
$$ y = [214410, 1437368, 2177167, 2542562, 3042848, 2891983, 1345495, -467923, -807757, 260355, 1148182, 1000389, 490198, 697218, 2121189, 4450581, 6519583, 6922266, 5423919, 3357261, 2050185, 1500140, 1180789, 1169298, 1474270, 1191050, -333081, -2165757, -2995081, -3049814, -3314739, -3466618, -2508403, -1154298, -1349906, -3098989, -3894012, -2092212, 954196, 3061751, 3794652, 3734522, 2804996, 900803, -949389, -1645082, -1497791, -1348789, -1040553, -152607, 579982, 190774, -793990, -1177993, -1095727, -1441881, -1750957, -670574, 1514580, 2891531, 2732232, 2327880, 2512281, 2350062, 1194388, 203093, 478954, 1126305, 641921, -783166, -1825204, -2144168, -2431622, -2719002]
8296b719002O28787J871094K022111P17013r24795j435231l47814J263273J735900
8287B811336P20321l36868j97381M55992K97285m92063p38916k94197J0356q3285
8277B152580k91598p91099j503563j122992J049499K979424K153355m46058j507607
8268B671941m42356K2138j236649j803108o6872J828268J416328m45710j575642
8259C68338j729852j574528o11472J311052K301948R43318j011727j093758J15165
8250i81516L78702l17922k79419M37246K25203q04477p92785N79367J490638R54243
8240H89280M2579j76755J15056M71189N33863m35813k350588l033137p18838K404833
8230b258331K232214j303517l534055j421142K409684L716580K091597J34628
$$ y = [-2719002, -2090215, -219121, 1802990, 2520003, 1595208, 159977, -187837, 1075436, 2811336, 3531657, 3194789, 2997408, 3453400, 3750685, 3258622, 2519706, 2225509, 2235865, 2152580, 1860982, 1069883, -433680, -1556672, -507173, 2472251, 4625606, 4179548, 2671941, 2229585, 2251723, 1015074, -788034, -854906, 973362, 2389690, 1943980, 368338, -1361514, -2936042, -3547514, -2236462, 65486, 1008804, -2923, -1096681, -981516, -602814, -920736, -1200155, -762909, -537706, -1342183, -2134968, -1555601, -64963, 889280, 931859, 755104, 870160, 1341349, 1875212, 1439399, -911189, -3944326, -4663164, -2258331, -26117, -1329634, -4863689, -6284831, -3875147, -158567, 1933030, 2067658]
8222B067658p71787j208160j360686n49492R75041J705993P98879p26738j137262
8213b06554K1538J290277Q53086j081456k090901n50015J937385K603965J360706
8204D138031M27794M31249l05509k056345k400699k23170J753903P77936j716569
8195H26621k400540j000717J379l45928o14987j88123k14806q70962m10833J851065
8185c367831L695045K686921n24911k978188k743387m77171J759273K283988Q56128
8176A189867j079609j390652O29321L086999L202951M99043k401550k758984r28304
8167D9082M99901M98542P32011K162796K642513J09767l202009l031463N69533
8158A030673K770049Q88392j813812j489743M19565J15302k124427k710444q54866
$$ y = [2067658, 1295871, 87711, -1272975, -1822467, -847426, 858567, 1657446, 930708, -206554, -185016, 1105261, 1958347, 876891, -1214010, -1764025, 173360, 2777325, 4138031, 4565825, 4997074, 4691565, 2635220, 234521, 11351, 1765254, 2543190, 826621, -1573919, -2574636, -2573257, -2919185, -3534172, -3722295, -3937101, -4808063, -5218896, -3367831, 327214, 3014135, 2489224, -488964, -3232351, -3709522, -1950249, 333739, 1189867, 110258, -1280394, -651073, 2435926, 5638877, 6137920, 3736370, 977386, 49082, 548983, 1047525, 1779536, 3942332, 6584845, 6694612, 3492603, 461140, 1030673, 3800722, 4689114, 2875302, 1385559, 1805124, 1920426, -204001, -2914445, -3769311]
8149c769311M95071j50973q64293k99997K03320j12516L56114K174426K904031
8140I35872R41466j419325j453133j63975k2742o31884p1816R69626K30472j706094
8130b391533j880052J52351J548317Q66048Q4820Q43407J789763J290975J79231
8121B483327n1857L07289L64465M18607P36637K42723j562020k852901j859863
8112a773593J52773N91496n90953j136234k26223M64490k46117j097568k69593
8103d131522K053194L804161L194833N02466k009678k239112o06756M97797N5289
8094A120672k31388R86745K038297P63562j641644k147489o30123M4466j194864
8085h91766j938570l31889K028987K722626J759315N73469l61225j185838j455772
$$ y = [-3769311, -3274240, -3425213, -4289506, -4589503, -4386183, -4498699, -4142585, -1968159, 935872, 1877338, 458013, -995120, -1159095, -1181837, -1813721, -1885537, -915911, -685439, -2391533, -4271585, -4119234, -2570917, -1704869, -1620049, -776642, 1013121, 2304096, 2483327, 2431470, 2738759, 3103224, 3521831, 4258468, 4501191, 2939171, 86270, -1773593, -1620820, -1029324, -1620277, -2756511, -2982734, -2518244, -2764361, -3861929, -4131522, -2078328, 1725833, 4920666, 5423132, 3413454, 1174342, 567586, 1065383, 1120672, 889284, 1876029, 3914326, 4677888, 3036244, 888755, 258632, 303098, -891766, -2830336, -3162225, -1133238, 1589388, 3348703, 3922172, 3560947, 2375109, 919337]
8076I19337r98560p58905j273302j479548m89020P15110R07585O51877R21490
8067h83936R61676l09325j755832j369413L49461R56568j2025l37199J087476
8058a312549K305407J431901l38760p03538J45414M8008j492680k366183j005865
8049c288845J170421J607934L8830j292087o87866R88852J806819J248317L54092
8040A946467L8925K69531O02489N90408j31600j249663j550801l74784J018278
8031A159250Q76451m42275r32857o3738M60046m51159j583964j515889o43872
8022c138007P1597P88274J750061J936275M54694j591665k222470j046996N83555
8013b414682J330748Q22597m13182j115553k98065J167162J230114k86247j075151
$$ y = [919337, -79223, -838128, -2111430, -3590978, -4079998, -3364888, -2457303, -1805426, -883936, 77740, -231585, -1987417, -3356830, -3007369, -2050801, -2062826, -2400025, -1312549, 992858, 2424759, 2085999, 1382461, 1527875, 1575883, 83203, -2282980, -3288845, -2118424, -510490, -471660, -1763747, -2451613, -1462761, 344058, 1592375, 1946467, 1985392, 2254923, 2857412, 3447820, 3316220, 2066557, 515756, 140972, 1159250, 2035701, 1593426, 660569, 596831, 1056877, 605718, -978246, -2494135, -3138007, -3066410, -2278136, -528075, 1408200, 1862894, 271229, -1951241, -2998237, -2414682, -1083934, -261337, -674519, -1790072, -2088137, -920975, 309139, 22892, -1052259]
8004a052259K1093R29658j43767j323828o3871K179099J871422q43914k211094
7995f37461p37540Q57451M89230j32782R66025K323839J439026j035877k183729
7986A348182j003331O58110J086388O02252K16536j3265n06593j000083q77946
7977E10250l67228l81951r29849p06446Q43834J965939P24563j695385j999891
7968b036164N47862K854326K440721P29415J30277J97461p15173j847352j331223
7959I70150J484l94871k292946k615885k29694K281747K460033R16304n68870
7950E27452j468399j794012j046745O43925J818509J416531J44408p37343r09748
7941a405422n97510J89853J287676K125895K349796K001415J084792j15842n92070
$$ y = [-1052259, -1031166, -101508, -245275, -1569103, -1632974, 546125, 2417547, 1573633, -637461, -1375001, -517550, -28320, -161102, 804923, 3128762, 4567788, 3531911, 1348182, 344851, 1002961, 2089349, 2691601, 2908137, 2894872, 2388279, 1388196, 510250, 143022, -238929, -1168778, -1875224, -1031390, 934549, 1659112, -36273, -2036164, -1488302, 1366024, 3806745, 4536160, 4666437, 4863898, 4148725, 2301373, 970150, 971634, 576763, -1716183, -4332068, -4561762, -2280015, 180018, 1096322, 527452, -940947, -2734959, -3781704, -3137779, -1319270, 97261, 241669, -495674, -1405422, -2002932, -1813079, -525403, 1600492, 3950288, 5951703, 7036495, 6920653, 6328583]
7932F328583J36565O19507r04090l516490m237711j998525Q86005J844754R75001
7923A33599M3793m0828J64964k51711j418666k255666j420870P07598J784457
7914b553330L83765j758155j899990J68110K394385L276678K605078O55656j254908
7905B017289r42298J407168K055253j039170l984435k291594J600127J762804
7897E85144j531009k305091R16886K803781O97484j081484M64834J533066j081093
7888A002518l446927j188433K416251J660910j967611k393504J018786K931632
7880C3622Q37218j802236j707788l9327O24877j14187j005416q57904P31249K709893
7870e89999L090452J546417J63004R1333l69356k297644l454123j874863N50105
$$ y = [6328583, 6465148, 7084655, 6180565, 2664075, -1573636, -3572161, -2686156, -841402, 133599, 177392, 136564, 301528, 49817, -1368849, -3624515, -5045385, -4337787, -2553330, -2169565, -3927720, -5827710, -5659600, -3265215, 11463, 2616541, 3272197, 2017289, 1074991, 2482159, 4537412, 3498242, -486193, -2777787, -1177660, 585144, -945865, -3250956, -2334070, 469711, 1167195, 85711, 550545, 2083611, 1002518, -2444409, -3632842, -1216591, 444319, -1523292, -3916796, -2898010, 33622, 870840, -931396, -2639184, -2678511, -2053634, -2167821, -3173237, -4031141, -3299892, -589999, 2500453, 4046870, 4209874, 4301207, 3931851, 1634207, -1819916, -3694779, -3144674]
7861c144674J363527J594904K758383K801069k66466l366203k412669O97147J027485
7852A052503j046174q79941J846170K502985j34838j752338j96688J055512n28859
7843A918332k209012j196783O28327N08159o35580o28576K06391O18456R48395
7834A58109J526370J117655p38669k200919j872755p51828J00096J186028K407229
7825I31316K220166N89807k58874L03803M2496j693628k008958M76793K350248
7816B953169N65031k371924k259391L65271J786279J119927M88503M58601m31103
7807B674363j998885k091353j70752J745325K031003J005366m61902j729877j872315
7798h69027m72668J096275J033237l49593j109695m60992N52962R08441N63975
$$ y = [-3144674, -1781147, -186243, 2572140, 5373209, 5106743, 1740540, -672129, 25018, 1052503, 6329, -873612, 972558, 3475543, 3340705, 1588367, 1391679, 2447191, 1918332, -290680, -1487463, -859136, -350977, -986557, -1615133, -1408742, -790286, 158109, 1684479, 2802134, 2063465, -137454, -2010209, -2762037, -2661941, -1475913, 931316, 3151482, 3741289, 3482415, 3786218, 3828714, 2135086, 126128, 602921, 2953169, 3518200, 1146276, -1113115, -747844, 1038435, 2158362, 2646865, 3105466, 2674363, 675478, -1415875, -1586627, 158698, 2189701, 3195067, 2733165, 1003288, -869027, -1341695, -245420, 787817, 438224, -671471, -1132463, -579501, 328940, 892915]
7789H92915j62408p71750n19334N36577J033774J91144o87479k38579M13431o80765
$$ y = [892915, 730507, -41243, -560577, -24000, 1009774, 1200918, 513439, 274860, 688291, 7526]
$$ [...]
##END NTUPLES=NMR SPECTRUM
##END=
