##TITLE=31Pdec_PhEDiP0706
 CDCl3, 24 sc
 8.6.2023
##JCAMPDX= 6.0         $$ Bruker NMR JCAMP-DX V2.0
##DATA TYPE= NMR SPECTRUM
##DATA CLASS= NTUPLES
##ORIGIN= UXNMR, Bruker Analytische Messtechnik GmbH
##OWNER= root
$$ XWIN-NMR		Version 3.5
$$ Thu Jun  8 13:57:43 2023 Russian Standard Time (UT+4h)  she@DPX200
##.OBSERVE FREQUENCY= 81.013821
##.OBSERVE NUCLEUS= ^31P
##.ACQUISITION MODE= SIMULTANEOUS
##.ACQUISITION SCHEME= undefined
##.AVERAGES= 24
##.DIGITISER RES= 16
##SPECTROMETER/DATA SYSTEM= spect
##.PULSE SEQUENCE= zgpg30
##.SOLVENT NAME= CDCl3
##.SHIFT REFERENCE= (INTERNAL, CDCl3, 0, 248.564)
##AUDIT TRAIL= $$ (NUMBER, WHEN, WHO, WHERE, WHAT)
$$ ##TITLE= Audit trail, XWIN-NMR		Version 3.5
$$ ##JCAMPDX= 5.01
$$ ##ORIGIN= Bruker BioSpin GmbH
$$ ##OWNER= she
$$ F:/spectra/data/she/nmr/P31/1/pdata/1/auditp.txt
$$ ##AUDIT TRAIL=  $$ (NUMBER, WHEN, WHO, WHERE, WHAT)
(   1,<2023-06-08 13:56:43.07 +0400>,<she>,<DPX200>,
      <created by zg, POWCHK disabled, PULCHK disabled
       configuration hash MD5:
       00 E9 B6 7A A2 85 ED C7 34 08 36 98 17 FE 4E 26
       data hash MD5: 32K
       7B 03 76 64 89 A1 C4 E1 18 DE 25 0A 81 F6 55 B5>)
(   2,<2023-06-08 13:56:45.40 +0400>,<she>,<DPX200>,
      <Start of raw data processing
       efp BC_mod = 2 LB = 1 FT_mod = 6 PKNL = 1 PHC0 = -10639.03 PHC1 = 2.68486 SI = 64K 
       data hash MD5: 64K
       7D 38 BE AA BA FB 68 5E 1B 16 E8 9C DB 42 0F 4E>)
(   3,<2023-06-08 13:57:00.62 +0400>,<she>,<DPX200>,
      <pk PHC0 = -5.904722 PHC1 = 0 
       data hash MD5: 64K
       EB E8 0B 9F B8 EB 6D 6B 35 33 43 60 50 61 67 63>)
(   4,<2023-06-08 13:57:03.48 +0400>,<she>,<DPX200>,
      <abs ABSG = 5 
       data hash MD5: 64K
       88 F7 78 AD 52 25 9D AE 2E 53 47 4F BD 6F 67 2F>)
$$ ##END=
$$ 
$$ hash MD5
$$ 00 6D 72 C5 D7 53 62 3D 52 5D A8 F8 3B 79 27 86
##$RELAX= 
##$RELAX= 
##$RELAX= 
##$RELAX= 
##$RELAX= 
##$RELAX= 
##$RELAX= 
##$RELAX= 
##$RELAX= 
$$ Bruker specific parameters
$$ --------------------------
##$DU= <F:/spectra>
##$EXPNO= 1
##$NAME= <P31>
##$PROCNO= 1
##$TYPE= <nmr>
##$USER= <she>
##$AMP= (0..31)
100 100 100 100 100 100 100 100 100 100 100 100 100 100 100 100 100 100 
100 100 100 100 100 100 100 100 100 100 100 100 100 100 
##$AQSEQ= 0
##$AQ_mod= 1
##$AUNM= <au_zg>
##$AUTOPOS= <>
##$BF1= 81.014009
##$BF2= 200.13
##$BF3= 200.13
##$BF4= 200.13
##$BF5= 200.13
##$BF6= 200.13
##$BF7= 200.13
##$BF8= 200.13
##$BYTORDA= 1
##$CFDGTYP= 0
##$CFRGTYP= 5
##$CHEMSTR= <none>
##$CNST= (0..31)
1 1 145 1 1 1 1 1 1 1 1 1 1 1 1 1 1 1 1 1 1 1 1 1 1 1 1 1 1 1 1 1 
##$CPDPRG= <waltz16>
##$CPDPRG1= <>
##$CPDPRG2= <waltz16>
##$CPDPRG3= <>
##$CPDPRG4= <mlev>
##$CPDPRG5= <mlev>
##$CPDPRG6= <mlev>
##$CPDPRG7= <mlev>
##$CPDPRG8= <mlev>
##$CPDPRGB= <>
##$CPDPRGT= <>
##$D= (0..31)
0 1 0 0 0 0 0 0 0 0 0 0.03 2e-05 3e-06 0 0 0 0 0 0 0 0 0 0 0 0 0 0 0 0 
0 0 
##$DATE= 1686218202
##$DBL= (0..7)
120 120 120 11 120 120 24 19 
##$DBP= (0..7)
150 150 150 150 150 150 150 150 
##$DBP07= 0
##$DBPNAM0= <>
##$DBPNAM1= <>
$$ [...]
##$SUBNAM3= <"">
##$SUBNAM4= <"">
##$SUBNAM5= <"">
##$SUBNAM6= <"">
##$SUBNAM7= <"">
##$SUBNAM8= <"">
##$SUBNAM9= <"">
##$SW= 501.771253377433
##$SWIBOX= (0..15)
0 1 3 0 0 0 0 0 0 0 0 0 0 0 0 0 
##$SW_h= 40650.406504065
##$TD= 32768
##$TD0= 1
##$TE= 0
##$TE2= 300
##$TE3= 300
##$TEG= 300
##$TL= (0..7)
0 120 53 12 22 120 120 120 
##$TP= (0..7)
150 150 150 150 150 150 150 150 
##$TP07= 0
##$TPNAME0= <>
##$TPNAME1= <>
##$TPNAME2= <>
##$TPNAME3= <>
##$TPNAME4= <>
##$TPNAME5= <>
##$TPNAME6= <>
##$TPNAME7= <>
##$TPOAL= (0..7)
0.5 0.5 0.5 0.5 0.5 0.5 0.5 0.5 
##$TPOFFS= (0..7)
0 0 0 0 0 0 0 0 
##$TUNHIN= 0
##$TUNHOUT= 0
##$TUNXOUT= 0
##$USERA1= <user>
##$USERA2= <user>
##$USERA3= <user>
##$USERA4= <user>
##$USERA5= <user>
##$V9= 5
##$VALIST= <valist>
##$VCLIST= <CCCCCCCCCCCCCCC>
##$VD= 0
##$VDLIST= <DDDDDDDDDDDDDDD>
##$VPLIST= <PPPPPPPPPPPPPPP>
##$VTLIST= <TTTTTTTTTTTTTTT>
##$WBST= 1024
##$WBSW= 4
##$XGAIN= (0..3)
0 0 0 0 
##$XL= 0
##$YL= 0
##$YMAX_a= 11058
##$YMIN_a= -10943
##$ZGOPTNS= <>
##$ZL1= 120
##$ZL2= 120
##$ZL3= 120
##$ZL4= 120
##$ABSF1= 248.5645
##$ABSF2= -253.2056
##$ABSG= 5
##$ABSL= 3
##$ALPHA= 0
##$AQORDER= 0
##$ASSFAC= 0
##$ASSFACI= 0
##$ASSFACX= 0
##$ASSWID= 0
##$AUNMP= <proc_1d>
##$AZFE= 0.1
##$AZFW= 0.5
##$BCFW= 0
##$BC_mod= 2
##$BYTORDP= 0
##$COROFFS= 0
##$CY= -3
##$DATMOD= 1
##$DC= 0
##$DFILT= <>
##$DTYPP= 0
##$F1P= 0
##$F2P= 0
##$FCOR= 1
##$FTSIZE= 65536
##$FT_mod= 6
##$GAMMA= 0
##$GB= 0
##$INTBC= 1
##$INTSCL= 6.047779e-11
##$ISEN= 30
##$LB= 1
##$LEV0= 0
##$LPBIN= 0
##$MAXI= 10000
##$MC2= 0
##$MEAN= 0
##$ME_mod= 0
##$MI= 50
##$NCOEF= 0
##$NC_proc= -5
##$NLEV= 6
##$NOISF1= 182.463
##$NOISF2= 159.3651
##$NSP= 0
##$NTH_PI= 0
##$NZP= 0
##$OFFSET= 248.5645
##$PC= 4
##$PHC0= -10644.93
##$PHC1= 2.68486
##$PH_mod= 1
##$PKNL= yes
##$PPARMOD= 0
##$PSCAL= 0
##$PSIGN= 0
##$REVERSE= no
##$SF= 81.0140089999694
##$SI= 65536
##$SIGF1= 159.3651
##$SIGF2= -187.1042
##$SINO= 113.3802
##$SIOLD= 16384
##$SREGLST= <1H.CDCl3>
##$SSB= 0
##$STSI= 65536
##$STSR= 0
##$SW_p= 40650.406504065
##$SYMM= 0
##$S_DEV= 0
##$TDeff= 32768
##$TDoff= 0
##$TI= <>
##$TILT= no
##$TM1= 0
##$TM2= 0
##$TOPLEV= 0
##$USERP1= <user>
##$USERP2= <user>
##$USERP3= <user>
##$USERP4= <user>
##$USERP5= <user>
##$WDW= 1
##$XDIM= 65536
##$YMAX_p= 367506228
##$YMIN_p= -157602217
$$ End of Bruker specific parameters
$$ ---------------------------------
##NTUPLES= NMR SPECTRUM
##VAR_NAME=  FREQUENCY,     SPECTRUM/REAL,   SPECTRUM/IMAG
##SYMBOL=    X,             R,               I
##VAR_TYPE=  INDEPENDENT,   DEPENDENT,       DEPENDENT
##VAR_FORM=  AFFN,          ASDF,            ASDF
##VAR_DIM=   65536,         65536,           65536
##UNITS=     HZ,            ARBITRARY UNITS, ARBITRARY UNITS
##FACTOR=    0.620285442955139, 1,           1
##FIRST=     20137.2065510682, 0,            0
##LAST=      -20513.1999529968, 0,           0
##MIN=       -20513.1999529968, -157602217,  0
##MAX=       20137.2065510682, 367506228,    0
$$ Real data points
##PAGE= N=1
##DATA TABLE= (X++(R..R)), XYDATA
$$ [...]
38780C10695k30590k106o7085j91819k6881L63145N15515J59150l72263n09401
38770e1640j68238J52010M8173k59672k61576J41812N24356M99809J67715j00862
38760F91887j45673r3644m3354N2751J47908M9119k04852k06944K38032O32761
38750A117991L73746k98201n29432q0901L24253J07875l47688m02607j26089j1695
38740A27252j40834k34309k45408k88926j94297K35853O51633M89629j42620n29181
38730b71208l40815R570J09578Q2233J71566K75828J89205j2540j01094k1303
38720I1020R1029Q9461o4313k51450k80223j43987q7842k34635l18695p4128K89449
38709h94314L67006J78257R6853K43203L63922K77061N6077j86419l54359l06377
$$ y = [310695, 80105, 77999, 10914, -180905, -207786, 155359, 670874, 830024, 457761, -51640, -219878, -67868, -19695, -279367, -540943, -399131, 125225, 625034, 792749, 691887, 546214, 452570, 409216, 461967, 609875, 658994, 454142, 247198, 485230, 1117991, 1491737, 1193536, 664104, 583203, 907456, 1015331, 667643, 265036, 138947, 127252, -13582, -247891, -493299, -782225, -976522, -740669, -89036, 400593, 257973, -271208, -612023, -602453, -492875, -410642, -239076, 36752, 225957, 213417, 112323, 91020, 182049, 271510, 207197, -44253, -324476, -468463, -556305, -790940, -1109635, -1183763, -894314, -527308, -349051, -252198, -8995, 354927, 631988, 688065, 501646, 147287, -159090]
38699a59090p9441M404j68284j90466J85534M31867K8851m82336j91528O25370
38689D881P78393L2461n15503k24749J52728j10791n09729l26836R3134N9856
38679e66155k08320p4720L06169K98793n7006j81620l651N1218n6562J494J46608
38668c43752K0587j86284N1703N46173N14127r9689l86019R4178N46441J86105
38658I43570n02079n15688J26472M57248L0797m96747m31198k9238K2186k66358
38648f61035k04986M31008Q95841M83700l88537p18776l46765q8846l69765n46714
38638a514875j2220P46207Q53975L23947j20295j65694p4328O1824L90256O66525
38628A155322L94720k80022n96755l18037j05595m21593p49515m16008L45456
$$ y = [-159090, -238531, -234127, -402411, -592877, -407343, 24524, 53375, -428961, -620489, 4881, 783274, 815735, 300232, 75483, 228211, 117420, -392309, -719145, -626011, -566155, -774475, -849195, -543026, -244233, -301239, -482859, -486510, -435292, -491854, -490360, -343752, -323165, -509449, -457746, 88427, 602554, 502865, 116846, 211024, 757465, 943570, 441491, -74197, 52275, 509523, 540320, 43573, -387625, -416863, -394677, -661035, -866021, -435013, 460828, 944528, 555991, -162785, -509550, -598396, -968161, -1514875, -1527095, -780888, 73087, 397034, 276739, 111045, 36717, 98541, 488797, 1155322, 1550042, 1270020, 673265, 355228, 249633, -171960, -921475, -1337483, -992027]
38619i92027P45976N26167J26442m1798J0763J14440J72381J13203q9855l24171
38609C61521m45927m49044l83300k11488O8297K69490K08640j3408j23625k1527
38599g40371J69339L30435M16038L28060k2756m61340n66532j22679N11353O64706
38589E06253P7695p11423q67759k00292N74602O72569J70852k07106j25781J9528
38579i0862j14679k34325L0611L99605L22050j38610l96696k51046q4194r3651
38569f51797K7678M02855N84195K77511p5160K815J69501j73955p45489o63476
38559h45322J51898P36809M78109n9367j36975M1872j24426m92629l85795K60899
38549c74927P32111N31904o4953n57756p79888p41566l76880K58244P97514Q45584
$$ y = [-992027, -246051, 280116, 406558, 364760, 375523, 489963, 662344, 775547, 685692, 361521, -84406, -533450, -916750, -1128238, -1059941, -790451, -581811, -595219, -718844, -740371, -571032, -240597, 175441, 503501, 480745, 19405, -547127, -669806, -158453, 506253, 583948, -127475, -995234, -1195526, -620924, 51645, 222497, 15391, -110390, -90862, -205541, -439866, -409255, -9650, 312400, 173790, -222906, -473952, -558146, -651797, -624119, -221264, 362931, 640442, 565282, 568097, 737598, 563643, -181846, -845322, -693424, 43385, 521494, 462127, 325152, 367024, 242598, -250031, -635826, -374927, 357184, 889088, 824135, 266379, -513509, -1255075, -1631955, -1373711, -576197, 269387]
38539B69387L79531k22873m96385k54690K38960N02377L24971o6244l76800n34679
38529b36445n02338j85223K13989J98955k48418l79916K43769Q72583N83194k16337
38519C43813l50476K50372M73275q1790m40955M3988N44542R6243q39530j095762
38509a056280m70997K24661M11679K35154M9533M5949K37583L93908K21801j23282
38499A69709j34582J91404K26833k20079m94552k52525j28132n17249o45054J24494
38489a679733R10935N54610m18062n54844J89791M85345j00331m81304L6145O96527
38479c60921O52807J67459j20317j39981p2345O5494R9519k15417m94899n8726
38469d77327P43959O81015m27915j161065n96198K68110J84752l78927k37645
$$ y = [269387, 648918, 426045, -70340, -325030, -86070, 416307, 741278, 675034, 298234, -236445, -738783, -924006, -710017, -511062, -759480, -1139396, -895627, -23044, 560150, 343813, -6663, 243709, 716984, 635194, 194239, 238227, 782769, 879012, 39482, -1056280, -1527277, -1302616, -890937, -655783, -606250, -560301, -322718, 71190, 292991, 169709, 35127, 226531, 453364, 233285, -261267, -513792, -641924, -1159173, -1804227, -1679733, -768798, -214188, -632250, -1187094, -997303, -511958, -612289, -1093593, -1057448, -360921, 291886, 459345, 339028, 199047, 126702, 192196, 291715, 76298, -418601, -477327, 266632, 947647, 519732, -641333, -1237531, -969421, -784669, -1163596, -1401241]
38460a401241M31314N02530j13011m24333j23369N3519j97844k48495J86443M52330
38450h82157J22471k23676R276M45588M02377m4889l30110l06200k25133r3978
38440a126431K77802O90814O37976O0902m48410l80605P4195L33872J36426k48045
38430H496m00775j83758J74001L17573J13724k01408k76999o6096J36609J29248
38420b49385P0681J33166J03663k96031p71325o34145K16836R46483P66868m1058
38410B45753n30093l26765M3488N9376j02610j2269K68127K97688k272j57899
38400b17476J41407M52539J09061p25590j065853m08199M86072O34112K28329
38391c65598J85118N44516M04828m26654q98233l47385M03848L79052n5874k1424
$$ y = [-1401241, -969927, -467397, -580408, -1004741, -1128110, -1074591, -1272435, -1520930, -1334487, -882157, -759686, -983362, -974086, -528498, -126121, -171010, -501120, -807320, -1032453, -1126431, -848629, -157815, 480161, 541063, 92653, -287952, -213757, 120115, 256541, 8496, -392279, -576037, -402036, -84463, 29261, -172147, -449146, -515242, -378633, -249385, -178704, -45538, 58125, -237906, -1009231, -1643376, -1426540, -480057, 286811, 245753, -284340, -611105, -567617, -508241, -610851, -623120, -354993, -57305, -59577, -217476, -76069, 376470, 485531, -240059, -1305912, -1714111, -1228039, -593927, -365598, -180480, 364036, 768864, 342210, -556023, -903408, -499560, -120508, -176382, -197806]
38381a97806L33203L03093N5977K58131O31288K98218n45816p44850q1846L45482
38371F55074k2206l45654N3349N26314K93638k23857k14712J36668N9010m76376
38361D41248p43924l71372K49258N80781M88230K07176L0841k6317k50929o81381
38351g6389p37433J4298Q74789O76628m84358j175787n95699L84660O32512K45320
38341b41459k7727k869O5828J40889J90512o1284n08489m58410K55468O95003
38331D7462J59396o36091o63875j60709j304j01730K66715R25442Q99293M4915
38321G79514o27458m19622K29434N70403M08087j1159l15718j42646M55241P74552
38311A700628K35371p15062j113251p48385k21746R2969L32344M60883J72677
$$ y = [-197806, 135397, 438490, 494467, 752598, 1383886, 1682104, 1136288, 391438, 309592, 655074, 632868, 287214, 340563, 866877, 1160515, 936658, 721946, 858614, 917624, 441248, -302676, -674048, -424790, 155991, 644221, 851397, 882238, 855921, 604992, -76389, -813822, -799524, 75265, 751893, 267535, -908252, -1503951, -1119291, -486779, -241459, -269186, -272055, -206227, -65338, 125174, 63890, -444599, -903009, -647541, 47462, 206858, -429233, -1093108, -1253817, -1255121, -1356851, -1090136, -164694, 734599, 779514, 152056, -267566, -38132, 532271, 940358, 929199, 613481, 470835, 926076, 1700628, 1935999, 1220937, 107686, -640699, -862445, -769476, -437132, 23751, 196428]
38302A96428m25607p62180n53185l7539N11863R13138Q42278J94795m18778l06629
38292A54584K49312L68368q0005l81214j99526M9019J06300J88440K61119k4802
38282F91595m79252m43935L7316J50747k65978l50180K45083N85155k0552p67582
38272f17583o07072Q6940K24229k12230k93369K20324N57345K78056r2693k4626
38262d80679K51047L12150K56207L66966M83787K36659k54334m23924p1713K87900
38252I64066J30853l21231m47963j70392p842j66975k00155J64147M69218K77847
38242F91573p3749q3270K9008k16323n86145m86821l5097J40296J2605R7364L46635
38231a63924J71143l41564l44758L44776Q06930M38368j67387k87736j03654n0992
$$ y = [196428, -229179, -991359, -1544544, -1582083, -1070220, -157082, 685196, 879991, 461213, 154584, 403896, 772264, 692259, 311045, 111519, 160538, 266838, 455278, 716397, 691595, 212343, -231592, -194276, -43529, -309507, -659687, -414604, 170551, 149999, -617583, -1224655, -1137715, -913486, -1125716, -1419085, -1198761, -641416, -363360, -456053, -480679, -229632, 82518, 338725, 705691, 1189478, 1426137, 1171803, 747879, 676166, 964066, 1094919, 773688, 325725, 155333, 147491, -19484, -219639, -55492, 413726, 691573, 617824, 534554, 563562, 347239, -238906, -725727, -760824, -620528, -607923, -510559, -163924, 7219, -334345, -679103, -334327, 472603, 910971, 743584, 455848, 352194, 301202]
38221C01202N810K35936K34747k50966o19531k64325L79611M63352j0588l59153
38211A16095l15946j46675O9241M37637O60596K60919n61675r67906n04174L83546
38201e68342R38793Q18240K07772m29079o76965m88376j79246o73R9723J70579
38191a07574O3143k02283k68122j973J60670j08088l83886r4599N19168P05110
38181B81566L07409r3503j20547l4152j24537k37449j30190J00020J75812j7635
38171A06794l84861p04889o89337j86027N65109J041761R07762L08672k94253
38162F70731n01995k46306J79203L57371J13057l33327n76843l73081J46829N02244
38152f2117K41182m84406q69797l38997O29235J017601N66242j5838j76739j60447
$$ y = [301202, 307012, 542948, 777695, 526729, -92802, -357127, 22484, 485836, 475248, 116095, -199851, -346526, -277285, 160352, 820948, 1081867, 520192, -447714, -951888, -568342, 370451, 1188691, 1396463, 967384, 290419, -197957, -377203, -377876, -278153, -107574, -44431, -246714, -514836, -516809, -356139, -464227, -848113, -942712, -423544, 281566, 588975, 495472, 374925, 340773, 216236, -21213, -151403, -51383, 124429, 106794, -278067, -982956, -1672293, -1858320, -1293211, -251450, 656312, 964984, 670731, 168736, -77570, 101633, 459004, 572061, 238734, -338109, -711190, -564361, -62117, 179065, -305341, -1175138, -1514135, -884900, 132701, 698943, 683105, 506366, 345919]
38142C45919k76599k61216J30917M71694K38052l12641m69514o9672L68167L91324
38132E56431M6171l47289m90110k61020J40461L20300J53220p3336j15459n2702
38122a23333L8699K43901M08788J20183n56730q83820m52924J83775M19676M96468
38112a05317P89399Q34284O4041r17863r49807n5109N42789K01300l94742m70106
38102d61131j64002N6745J44010J82211M5020k08463j75031K22273M33691Q9946
38092A65269l78339l93283o3027J36874J33046J55118J62512l2496k35359o3136
38082d12821L65676M96734J69601j38943p8617N6600j01889l20346j51957K24522
38072A08560J63144m27149q15184m55796K28307M74925K17230j1029M8554J66587
$$ y = [345919, 69320, -191896, -60979, 410715, 648767, 336126, -133388, -203060, 165107, 556431, 602602, 255313, -234797, -495817, -355356, -35056, 118164, 44828, -70631, -123333, -84634, 159267, 568055, 688238, 131508, -752312, -1205236, -1021461, -601785, -105317, 684082, 1518366, 1582407, 664544, -285263, -340372, 202417, 403717, 8975, -461131, -625133, -568388, -424378, -242167, -197147, -405610, -580641, -358368, 75323, 165269, -213070, -606353, -669380, -532506, -399460, -244342, -81830, -114326, -349685, -412821, -47145, 449589, 619190, 480247, 401630, 458230, 356341, 35995, -115962, 108560, 271704, -155445, -970629, -1426425, -1198118, -723193, -505963, -516992, -468438, -301851]
38062c01851J78440J86089K08236J26031j305j2946k382j25998j65041J34698
38052B23971M14204J38423l90052l53972K01779L48722j67509m74720q3915L03380
38042A60311R8472j98564r1616m2800m01290m67943K36867P86724K58699n70988
38032b32128m43671K45017K31201k81251r83R80657J127822L9043q30179n07553
38022C27975J53082J43457k17854k96268l02980n30475n30579K4077N68157N69801
38012i1607L94190M60783L78940k23995p71433n54275J08784L93366J74667o8776
38002B00644j21241p6118Q3957K93868J95464k67869m92874q2799M01084K49682
37992C83798k79823m28913j44678Q147r9650m1852K90900M52888J67724k68828
$$ y = [-301851, -123411, 62678, 270914, 396945, 395640, 382694, 380312, 254314, 89273, 223971, 638175, 776598, 386546, 32574, 234353, 583075, 415566, -59154, -143069, 160311, 258783, 60219, -31397, -74197, -475487, -943430, -706563, 80161, 338860, -232128, -675799, -430782, -199581, -480832, -481815, 498842, 1626664, 1665707, 835528, 327975, 481057, 624514, 406660, 110392, -192588, -723063, -1253642, -1229565, -661408, -91607, 302583, 763366, 1142306, 918311, 146878, -407397, -298613, 94753, 269420, 200644, 79403, 3285, 87242, 381110, 576574, 308705, -184169, -266968, 134116, 383798, 103975, -324938, -469616, -461469, -561119, -602971, -312071, 140817, 308541, 39713]
37982C9713m30794k37871O3220J52266q2749l61109k77343J26222L64481K29886
37972d14078O9272J18038R4276j82669l24588k1070L47976L18142J10749J68128
37962B84176L16223R3096l78623n64149l72058j60617k9693K29262N46728N65874
37952E30219K26997j53004l66892m31710l03835L8172L05732J87403j27647j74541
37942b69106J01932L37782L38914K05444l8126m07651o04492k68749L60264N78010
37932C34222J46712l69314l74570M0125L55962L07351Q4754N011J23371J57038
37922H10662j58340o11807o45483j03905M32106L68765j03186l43295j88649m2959
37912e86091j24824j72136J1897J79535L0367k97713l70406K967N18083O83330
$$ y = [39713, -391081, -628952, -565732, -413466, -496215, -857324, -1134667, -1008445, -643964, -414078, -344806, -226768, -132492, -315161, -639749, -660819, -312843, 5299, 116048, 284176, 600399, 693495, 314872, -249277, -621335, -781952, -811645, -582383, -35655, 530219, 757216, 604212, 237320, -194390, -498225, -460053, -154321, 33082, -94565, -269106, -167174, 170608, 509522, 714966, 676840, 269189, -335303, -604052, -243788, 334222, 480934, 111620, -262950, -222825, 133137, 440488, 525242, 530253, 653624, 810662, 652322, 40515, -604968, -708873, -276767, 91998, -11188, -354483, -543132, -586091, -710915, -883051, -871154, -691619, -661252, -958965, -1329371, -1326404, -808321, -124991]
37902a24991L52216j24164l45598l12765k06569P0504O44500J067030O75406l01437
37892A394132p69842k68755L15443P8160n75476o80350k05415J02245j851o3784
37882f75493J39760L08377K24137q496k70046m30326k29691K95557N63881K40439
37872A58099j14512O7487L09553q6508o06243j98078Q25051J017653N1548p34106
37862F89944m38461J40346K1590m18110l17101K23734N28904M76209L36702N4853
37852A298610m66536q25026o40878k28918o6648j8876K23650L95788J28700k23129
37842d23263o5370M02061M70191N7641k49361j82606l3276L7332J64046K57693
37832D35088O7495j96381n5900L33003K72328k91323n25298n0235L15306j81207
$$ y = [-124991, 227225, 103061, -242537, -555302, -761871, -691367, -46867, 1020163, 1695569, 1394132, 624290, 355535, 670978, 749138, 173662, -506688, -712103, -609858, -611709, -675493, -535733, -227356, -3219, -11715, -281761, -712087, -941778, -646221, -82340, 158099, 43587, 111074, 420627, 334119, -272124, -470202, 354849, 1372502, 1424050, 689944, 251483, 391829, 413419, -4691, -321792, -98058, 430846, 907055, 1243757, 1298610, 832074, 7048, -633830, -862748, -929396, -948272, -724622, -328834, -200134, -423263, -488633, -86572, 383619, 441260, 191899, 9293, -23983, 13349, 177395, 435088, 502583, 306202, 250302, 583305, 855633, 564310, 39012, -11223, 304083, 122876]
37822A22876q89066o15047N06647J054040L21157o85344p21954k1141K52538j76406
37812h51700m15438M7373N39470L98739J01180L81961Q35814M80298n21817r13913
37802H1967k75239K92957p0777o24212k91416N40371O40460j08832o11987l24643
37792g51351P3889j0787j83649N1260L77971L09532Q7655J83552L61677Q1611
37782E81360m24586l86977K04833M66543L4310k83396J67573O85090K42847p51706
37772E35891q84408J27106R33131N71168j53132r5107L66745R0860p59902q50369
37762a18017J48984R16365M40917n44997q02600l30569J4014k2622o136J61738
37752a42923J09116j98117l40259j81169l6272l0468P9519L22638L55343Q0082
$$ y = [122876, -766190, -1381237, -874590, 179450, 500607, -184737, -906691, -927832, -675294, -851700, -1267138, -1219765, -680295, -281556, -180376, 201585, 1037399, 1517697, 995880, 81967, -193272, 99685, 28908, -595304, -886720, -346349, 294111, 185279, -426708, -751351, -677462, -688249, -871898, -820638, -442667, -133135, -45480, 138072, 499749, 581360, 156774, -230203, -25370, 441173, 475483, 192087, 359660, 1044750, 1287597, 535891, -348517, -221411, 711720, 1282888, 1129756, 1034649, 1401394, 1492254, 732352, -118017, 30967, 947332, 1388249, 843252, 40652, -289917, -275903, -298525, -304661, -142923, -33807, -231924, -572183, -753352, -789624, -820092, -740573, -417935, -62592, 17490]
37742A7490j20558j7443R0437n3125j60886J12964N13427M93926K9037l49189
37732E56080l10526r7215l1696l5503R7031K06766l8793n00909n64150J4227O08405
37721i6283M75342k04584n46548j79733L23229L68338R9110r0416k39140m87245
37711e77930n10743P677N95476M72235k18514m64109J53025Q06628O27277r3175
37701G97847m57681k57069k7387n6452n9599J32475K16415j5457k42398j08632
37691g7938J77871J59922j29671k03025J10758L77331K12308j47039k28596k1962
37681B29959J01255K3380j354J41811K27661J01008q8024j88797k32230j76598
37671A38071J18225M74680M19880q8691m44535k81138n6150k24419l87532l1920
$$ y = [17490, -103068, -120511, -30074, -83199, -244085, -131121, 382306, 876232, 905269, 556080, 245554, 148339, 116643, 81140, 178171, 384937, 346144, -154765, -718915, -704688, -96283, 379059, 174475, -372073, -551806, -228577, 139761, 238871, 148455, -90685, -577930, -1088673, -1080996, -485520, -13285, -231799, -695908, -542883, 263745, 891022, 797847, 340166, 83097, 55710, -742, -60341, 72134, 288549, 273092, 30694, -77938, 99933, 259855, 130184, -72841, 37917, 415248, 627556, 480517, 251921, 229959, 331214, 354594, 353240, 495051, 722712, 823720, 735696, 546899, 314669, 138071, 256296, 730976, 1150856, 1062165, 617630, 336492, 280342, 55923, -331609, -363529]
37661c63529L70243K6574o71869n24736N38874J145113M81513n41327p57453l35324
37651f31921p1999R218L24565O33639L85746k11136m83365l74816k90162j69702
37641h79933K39014M76530m9948p43063m39524N96810Q11790j72248q08941o7368
37631a036881R00859O57732k51475l81149K03487K65326l57397n43005J35146
37622d07357P43480N29490j21062n71421p08815n31102M7591O51585O28196R2638
37612C53223j19807J73695K03264k97986m78385J44469O66993J75844p42851r04772
37602h26313k76802K33913K53537J53210J22624L7463L2021K76881L73468j24722
37592B55280p55754o52209R7045N38504K91174n8159o2645L2901K6397J40831
$$ y = [-363529, 6714, 33288, -638581, -1163317, -624443, 520670, 1002183, 460856, -296597, -631921, -703920, -694702, -370137, 263502, 649248, 438112, -45253, -420069, -710231, -879933, -640919, -164389, -214337, -957400, -1396924, -800114, 11676, -160572, -969513, -1036881, -136022, 521710, 270235, -110914, 92573, 357899, 502, -542503, -407357, 336123, 865613, 744551, 173130, -535685, -1066787, -1019196, -367611, 260585, 353223, 233416, 407111, 610375, 312389, -165996, -21527, 645466, 821310, 78459, -826313, -1103115, -869202, -615665, -462455, -339831, -302368, -270347, 6534, 380002, 255280, -500474, -1152683, -1055638, -517134, -225960, -284119, -346764, -313863, -287466, -146635]
37582a46635L97341M20247J72899J27484L80898L60317j92793o62852m73653M4161
37572D27414K20171j1830k45001k80964k03413o0871J30171K72137L10174K43605
37562H01593m1405n54253q15358l07847N76256P87876R0443n08227k16356M37858
37552B50580N53075J80589m4176j9489j02988l11680l74844l10726k80457j51195
37542f11311J74404L37542Q3158j51138O4287K83566j03526o67953n01460K32130
37532h60301M64543n5720l95736k0496M01672K32385j17230m0708K21501J44102
37522b5988j06432n4611J55531J9329l70960l89274J32622O15712N48492J14089
37512F38510j76111j45137k7493m9907j44102r2029J34021K84918J49376j39174
$$ y = [-146635, 250706, 670953, 843852, 971336, 1352234, 1712551, 1519758, 856906, 383253, 427414, 647585, 635755, 390754, 109790, -93623, -154494, -24323, 247814, 557988, 801593, 760188, 205935, -609423, -917270, -341014, 446862, 537305, 29078, -187278, 250580, 803655, 984244, 940068, 920579, 817591, 505911, 131067, -179659, -460116, -611311, -436907, -99365, -16207, -167345, -103058, 180508, 76982, -590971, -1092431, -860301, -395758, -451478, -847214, -867710, -466038, -233653, -350883, -391591, -170090, -25988, -132420, -187031, -31500, -12171, -383131, -772405, -639783, -24071, 524421, 638510, 462399, 317262, 289769, 239862, 95760, 3731, 137752, 422670, 572046, 432872]
37502D32872k70267j83973j14181j92147k54428j42875K2927L5314p9337r8581
37492h44676R0682L46553M25749K30726r2991k97244k64423o3800J98849M51208
37482A80633N48529L12409j82231n47438n10916k61840j64930k68439l21211j59972
37472a375406J42995M07318M24786O7320m74525p47409n57372k09294J5995K87630
37462b017962P53898J020055O66561K5055k23879o8554o5441k96900k42936K00696
37452b49407M04291K2257l92103k51938J54023J68570k04130l51489K8454N34874
37442a36598N96600J27483l88931l97832J08565N32577L84741q5840k86707j56427
37432B97631j45913l60237l33080J63933O40646N34721n2249n59624o14621k58355
$$ y = [432872, 162605, -21368, -135549, -327696, -582124, -724999, -702072, -666758, -746095, -844676, -753994, -407441, 18308, 249034, 156043, -141201, -405624, -469424, -270575, 180633, 729162, 1041571, 859340, 311902, -199014, -460854, -625784, -894223, -1215434, -1375406, -1232411, -825093, -400307, -332987, -807512, -1554921, -2112293, -2321587, -2305592, -2017962, -1264064, -244009, 422552, 447607, 223728, 155174, 89733, -207167, -450103, -249407, 154884, 177141, -214962, -466900, -312877, -144307, -348437, -699926, -671472, -136598, 460002, 587485, 198554, -199278, -90713, 441864, 826605, 740765, 454058, 297631, 151718, -208519, -541599, -377666, 262980, 797701, 745452, 185828, -428793, -687148]
37422f87148J99399L92224K21252K4157J17827K43411m3106m96889m06160K21885
37412b13148N05416J3767n46241m30339Q3884L18679K40315K08387K00954J5039
37402C96713j37940N7386L79957L68688L5924k59530l98452m39836k70755J28625
37392a39220L67910J73035o7563J06626L98355K05560l43916n63644k77127K4595
37382a15389M2533q157N2139J19012J45289J99813J86739j5853k13358j69730
37372B23038p1607j89413k92103l4642K91687J52967k40196j85095L26045N60112
37362E40793K46554o0360J2326J40168L3884j10670j74803l67974o16825m57264
37352h14171J20830M54544K08704j19797q6790N6035N2174J89626N72774N98035
$$ y = [-687148, -487749, -95525, 125727, 149884, 267711, 511122, 468016, -28873, -435033, -213148, 292268, 306035, -240206, -670545, -586661, -267982, -27667, 180720, 381674, 396713, 258773, 316159, 696116, 1064804, 1100728, 841198, 442746, 2910, -267845, -139220, 228690, 401725, 334162, 440788, 839143, 1044703, 700787, 137143, -139984, -115389, -72856, -81013, -28874, 90138, 235427, 435240, 621979, 606126, 392768, 223038, 151431, -37982, -330085, -364727, -73040, 79927, -160269, -345364, -19319, 540793, 787347, 726987, 739313, 879481, 913365, 802695, 627892, 259918, -356907, -814171, -693341, -238797, -30093, -149890, -236680, -180645, -128471, 61155, 633929, 1231964]
37342A231964j00381q08014o67249K1930L05004K0478j66988J4216J21994p2918
37332i9964j78978P8313L62834K77157n5861k67518k75858k45553k20366r2838
37322g18632J19747K22449J39311Q5074K53503M30591K35370k18764l36118O4761
37312B77292L64652R4608k47512l1802L21765j2407p28070p20020O2021M52206
37302a67267L6357j54105M74717R22552K98010n70303m81187J78497K40123k31848
37292E45546k62669J81064K28275k34033m40073k34051k41208m91210k86989L64939
37282h70409N81357J67294k709M09707N66397l676n17860l32792j1346j32876
37272a46913j86760L08882O26766R483q02074n95188L30792O30776L6151m24238
$$ y = [1231964, 1131583, 323569, -343680, -321750, -16746, 3732, -163256, -149040, -27046, -99964, -278942, -200629, 162205, 439362, 383501, 115983, -159875, -405428, -625794, -718632, -598885, -376436, -237125, -152051, 101452, 532043, 767413, 548649, 212531, 277292, 641944, 736552, 489040, 457238, 779003, 766596, 38526, -681494, -619473, -167267, -130910, -285015, 189702, 1112254, 1410264, 839961, 358774, 537271, 777394, 545546, 282877, 463941, 692216, 458183, 18110, -215941, -457149, -948359, -1235348, -870409, -289052, -121758, -124467, 285240, 851637, 847961, 330101, -2691, -14037, -146913, -333673, -24791, 601975, 611458, -190616, -785804, -455012, 175764, 211915, -212323]
37262b12323k38929l2270j84534j58595L44346O86561L83215j1170J62055N30376
37252A268732K97924m48248q50344n24813J517J08856j96065m78566m23604o5034
37242a309645L07465M06761K52637J75939L62149N18008K66947k25112m06945
37233C48204j36631J18757K2355j50776p6660R549k19997m27995k4556P40701
37223B02951Q86415J01138o97481o23227o465K68415Q8657J2318J66876J25830
37213E25427j71094k21512J51041M29789K07143k20829l71006k11842P179J43968
37203B68264J08468j78016n02516m40427J7811L30981J68624j42829k42979k92156
37193i04775m72900m45474J14840Q21438J045063P88425M67420J04226n19288
$$ y = [-212323, -451252, -483522, -668056, -826651, -482305, 204256, 587471, 576301, 738356, 1268732, 1566656, 1118408, 268064, -256749, -255232, -146376, -342441, -821007, -1244611, -1309645, -1002180, -595419, -342782, -166843, 195306, 713314, 980261, 755149, 348204, 211573, 330330, 352685, 201909, 125249, 134798, -85199, -513194, -537750, 202951, 1089366, 1190504, 493023, -130204, -136669, 131746, 220403, 232721, 399597, 525427, 354333, 132821, 283862, 713651, 920794, 699965, 328959, 117117, 124296, 268264, 376732, 198716, -303800, -744227, -726416, -395435, -226811, -369640, -612619, -904775, -1377675, -1823149, -1708309, -886871, 158192, 946617, 1414037, 1518263, 998975]
37184I98975j074206q96581n7883N38389L49224j49382k60634L2992K90542K72914
37174D4350L6895k67275l83617p9365M16109M74857o1374m60896o2359O46993
37164C04318N93853l20399r71049n32200M22528P98051M49906J23121J88225K25303
37154A281657p2557l35374j98860L9600n9784l30595l25150p4112P2357J17808
37144A14990K76475L34191r1717o98484p09151m0692N22951N07721L02566K73233
37134G92083J58277k43097n65496n39513m23021l08853J62945Q50471Q31325j36498
37124E78623q39247l05208O23720O31077J368j06166K22069k2280p14521p11249
37114f41814M7382L80705l2780k12526J46012J10572n15456n36253M74252J139683
$$ y = [998975, -75231, -971812, -1029695, -491306, -142082, -291464, -552098, -519106, -228564, 44350, 81245, -186030, -569647, -649012, -232903, 241954, 180580, -280316, -342675, 304318, 898171, 577772, -393277, -925477, -502949, 295102, 745008, 868129, 1056354, 1281657, 1209100, 873726, 674866, 714466, 654682, 324087, -1063, -75175, -2818, 114990, 391465, 725656, 633939, -64545, -773696, -814388, -291437, 216284, 518850, 792083, 950360, 707263, 141767, -397746, -820767, -1129620, -966675, -116204, 715121, 578623, -260624, -565832, 57888, 688965, 690333, 584167, 806236, 783956, 69435, -641814, -594432, -213727, -246507, -459033, -313021, -202449, -717905, -1254158, -779906, 359777]
37104C59777M98237m04830m04506j18054m67830p62473l2198R09418O91840k06703
37094F2678k81148M18675N66815r240k51301j0750j76553o58819l40624P12963
37084C2696J048837K71374l02083k8370L8189o48651r17749o4582O31182O7911
37074A28754o52262j16026Q69280O31187n03167q29202j32258K13860k31200m41588
37064a062622j3911J66468k55654l81200K33421O95305L67451k8298K08885M81866
37054D11711L4572o22370n63946J4832K75616J94285L50671O21834L29488l91302
37044F55391n71692N3281N47831K11483l85817l74771J04981K78455k3112k61015
37034B35015j64214q0416k66207m17959j81480K59737M38786K38959l8591j42354
$$ y = [359777, 858014, 453184, 48678, -69376, -537206, -1299679, -1331877, -422459, 269381, 62678, -218470, 200205, 767020, 757780, 506479, 495729, 319176, -339643, -680267, 32696, 1081533, 1352907, 1050824, 1022454, 1060643, 411992, -505757, -570339, 60843, 128754, -523508, -639534, 229746, 860933, 357766, -471436, -603694, -389834, -621034, -1062622, -1076533, -910065, -1165719, -1546919, -1313498, -618193, -250742, -279040, -70155, 411711, 446283, -176087, -740033, -725201, -449585, -255300, 95371, 717205, 1046693, 655391, 83699, 136980, 684811, 896294, 510477, 135706, 240687, 519142, 496030, 235015, 70801, -9615, -275822, -693781, -875261, -615524, -176738, 62221, 23630, -118724]
37024a18724j15624p7223j0942J31919K74331K74943R5193j50155k80829j94654
37014a71765J6202J16113j2280j79374r3525K38902M69839L20276r0678l97880
37004B15830l81357j50443j902j08962k96360j90450K86877O90931N59051N3859
36994F77074k35379j10548L3707r5243k55027j48888P7983J25949j1185j79313
36984a20870l22191l37290o2234K92043J77495m10408o49575p5829N47099L65729
36974e96031j21401J14129P64568N74726m42309p76799J72953J034926O39799
36965A364561j54578l3525N44313K52868p17401r38941j46199L86468J9195l25789
36955B50972P6172M94850P4305p00009q55478m45405j67945m9498L83775R21303
$$ y = [-118724, -234348, -311571, -322513, -190594, 83737, 358680, 453873, 303718, 22889, -171765, -155563, -39450, -51730, -231104, -324629, -85727, 384112, 704388, 613710, 215830, -165527, -315970, -317872, -426834, -723194, -913644, -626767, 64164, 623215, 677074, 441695, 331147, 364854, 269611, 14584, -134304, -56321, 69628, 58443, -120870, -443061, -780351, -842585, -550542, -373047, -783455, -1433030, -1508859, -961760, -596031, -717432, -603303, 161265, 735991, 293682, -483117, -310164, 724762, 1364561, 1209983, 1176458, 1720771, 1973639, 1256238, 317297, 171098, 557566, 576761, 250972, 327144, 821994, 896299, 196290, -659188, -1104593, -1272538, -1322036, -938261, -16958]
36945a6958P79297p2351o68778l93886K08491L43392O6325l1175J66304J92154
36935E72815j98384o13825n36398L0416N78681O40527K17847k61819l56911m0071
36925C2878K48113O7240m51216o64105k06333M57365N84868J55399j51968k5232
36915D7009L6350l38572o21835j91685N20882N43893j42944n54105k11377K32386
36905f79998J87287K2414K08482L72489K769m84744l06039L85217O69939K31473
36895F09289l03700m23852l33586l31305k95083q2361J10096J08305O9142J45221
36885g27834J88037M1689j53626j76427j8828J83128L06499K58862P4525k629
36875b6604J70921K94126n398m97807n82965k19680J4666p3342L3832N63523Q69374
$$ y = [-16958, 762339, 689988, 21210, -372676, -164185, 179207, 245532, 214357, 380661, 572815, 374431, -239394, -775792, -745376, -166695, 473832, 691679, 429860, 72949, 32878, 280991, 348231, -102985, -767090, -973423, -516058, 68810, 224209, 72241, 47009, 83359, -255213, -877048, -1068733, -547851, -3958, -146902, -701007, -912384, -679998, -492711, -470297, -261815, 110674, 113443, -371301, -677340, -292123, 377816, 609289, 305589, -118263, -451849, -783154, -1078237, -1160598, -1050502, -942197, -873055, -727834, -539797, -498108, -651734, -828161, -846989, -663861, -357362, -98500, -23975, -26604, 144317, 438443, 433045, -64762, -647727, -867407, -852741, -926083, -892251, -328728, 540646]
36864E40646M01530l52078n66327k51321k987M4615K10810M25921K42657l05824
36854C87642n98584l06047K03749M48432L11337j19893o48366q17008k52571O52296
36844g39013R56336L33305m73414o51331k92427R647Q9987K10174L83661K84715
36834A11640j65994n65545n20808j32336J63170J27211l8855j3679J66378J29893
36824g38925k40832m70866n3266P48714J073188N18676l40437o85343l89362L5541
36814e42912J91156J56455J73317K67408K66516P1469j87502k93263k25127j90240
36804c12723k90077l10089n0566K62321K20698j39706l24931p4602K76292K98926
36794d44457N8976k5616K38384N85872N99072J64655l73872n75414m29566l14921
$$ y = [540646, 942176, 590098, 23771, -227550, -230537, -185922, 24888, 450809, 693466, 387642, -210942, -516989, -313240, 135192, 446529, 326636, -321730, -1138738, -1391309, -739013, 217323, 550628, 77214, -574117, -866544, -856897, -766910, -556736, -173075, 111640, -54354, -619899, -1140707, -1273043, -1109873, -982662, -1021517, -1035196, -868818, -738925, -979757, -1450623, -1503889, -755175, 318013, 836689, 496252, -189091, -578453, -542912, -351756, -195301, -21984, 245424, 511940, 583409, 395907, 102644, -122483, -312723, -602800, -912889, -963455, -701134, -480436, -620142, -945073, -1019675, -743383, -444457, -385481, -411097, -172713, 413159, 1012231, 1176886, 803014, 227600, -201966, -516887]
36784e16887l33966r1336N29213Q44473K82181n56012o34529r2813k8743o36265
36774a234684q07185J6553Q34595O56449j2489j84714N3728R5742J10724N17010
36764D5729P77209J38456p99219p39210K20382O46666J5344n82433l03730K72027
36754c08779L74070J99008J57769M5779k84867l65157J2818K16191j48963m11021
36744e13152N1877O49599N06696j12022l42413j38838n9173p3279K47571O27224
36734H44090L66806l51249n78412p7694L67779K63990J8482R057j1094k31582
36724F20173l37670j36011P2960Q8563J07498J39771j31938n65812m48123L27405
36714b63184P61373J29119p99433p62063K17939R38867O83738n7360m93164m31959
$$ y = [-516887, -850853, -942189, -412976, 431497, 713678, 157666, -476863, -569676, -598419, -1234684, -2041869, -2025316, -1190721, -534272, -546761, -731475, -677747, -582005, -471281, 45729, 822938, 961394, 162175, -577035, -356653, 290013, 305357, -277076, -580806, -308779, 65291, 264299, 422068, 467847, 182980, -182177, -169359, 46832, -102131, -513152, -461275, 188324, 695020, 582998, 240585, 101747, 42574, -30705, 216866, 844090, 1210896, 859647, 281235, 203541, 571320, 835310, 853792, 862849, 851755, 620173, 282503, 146492, 219452, 308015, 415513, 555284, 423346, -142466, -590589, -263184, 498189, 627308, -172125, -934188, -716249, 222618, 906356, 848996, 355832, -76127]
36704g6127j55229O3862J23222Q0640P3598R1364o0501l66835m23054L112M73487
36693a72461M05810o8014k83176j126L37842L28470P2006j36289j55277M3321
36683C71106L58341M41062K4809n44234n74441J5459M79718K40342l29310m73509
36673I343q3828K70600J90425r3572j49506M6323J07848j86235m82295k44624
36663f15521M19432P00426J42736o05682o26636m1850K40895k5637j47128K08064
36653c50901M19339P7799j97828J73789O42895M05872k28580l80177p9143q0142
36643D02923m21151l66617J95740M86962J96776m931K81991M66408O0506m28271
36633H70336l93838j30833j65479k67316J4299L83458K97698J9175J84061N84745
$$ y = [-76127, -231356, -167494, -44272, 36368, 109966, 201330, 140829, -226006, -649060, -645948, -172461, 233349, 165335, -117841, -118967, 218875, 547345, 619351, 483062, 327785, 371106, 729447, 1170509, 1195318, 651084, 76643, 92102, 571820, 812162, 482852, 9343, -74485, 196115, 386540, 292968, 143462, 189785, 297633, 111398, -370897, -615521, -196089, 504337, 647073, 41391, -585245, -627095, -386200, -411837, -558965, -350901, 68438, 146237, -51591, 122198, 765093, 1170965, 942385, 562208, 483065, 402923, -18228, -384845, -189105, 297857, 494633, 489702, 771693, 1238101, 1298607, 870336, 476498, 345665, 180186, -87130, -72831, 310627, 608325, 627500, 811561, 1396306]
36623A396306M05009l92833q98626n86484M5173L58819L29115J64051j10818l74672
36613C35040l30638k1116J14826l8740p5878J37827J38925k67294n01837j47398
36603f56283K41397J0998m17080j69148N70595P10924n4298p06885l98171L45713
36593e22238M81721n6020m14056j14341L85127M59122J24433j43341j05468J6624
36583A11563n2265k43032k58081l963K53999K39815M7226r96J61837K29644j9451
36572D66296l52406l65621k9664K91233L41925K37317J52404K8158k08548l48275
36562B12819j43314K43647L90878K21959Q1276J18124K0317l99763p54188o00854
36552f09099j18853J86079K20473K32063J77741j96526o59537n69719J60498P81963
$$ y = [1396306, 1801315, 1408482, 509856, -76628, -31455, 327364, 656479, 820530, 709712, 335040, 4402, -16714, 98112, 59372, -16506, 121321, 260246, -7048, -508885, -656283, -414886, -403888, -820968, -990116, -419521, 291403, 237105, -469780, -867951, -522238, -40517, -96537, -510593, -624934, -239807, 219315, 343748, 200407, 94939, 111563, 59298, -183734, -441815, -445778, -191779, 48036, 95262, 94266, 256103, 485747, 466296, 113890, -251731, -281395, 9838, 351763, 589080, 741484, 769642, 561094, 212819, 69505, 313152, 704030, 925989, 1007265, 1125389, 1145706, 745943, -8245, -609099, -727952, -541873, -321400, -89337, 88404, -108122, -767659, -1337378, -1176880, -394917]
36542c94917O97773K23935N75R6332J38733q764j67570k18115j49478P7593L66928
36531F63025L99565P5255j77304O0116N28467O02060J42835l89954o09612n57189
36521G37264m04584j98873L0152J78573J47792r6047m50134n90902k38976L39705
36511e46030M97654J31004o9240K88304N56145R3326n26743l44788L32708L23744
36501G36084m74432q32182j45400O16123M84599q0751j45656J84760J55228k93768
36491B04605n27092k93863J3933Q7742M9038Q6549J98207K72770J62869j76050
36481G8708m43406k15537L70317O02036J86378k48675r0797L28392L19245r8024
36471G88637l77664l51091k47937q9769K16636L79188M7903m63925m88206R638
$$ y = [-394917, 302856, 526791, 527366, 623698, 762431, 753667, 586097, 367982, 218504, 296097, 663025, 1062590, 1137845, 960541, 1020657, 1549124, 2151184, 2294019, 1904065, 1294453, 737264, 332680, 133807, 163959, 342532, 490324, 394277, -55857, -646759, -885735, -546030, -48376, 82628, 13388, 301692, 857837, 951163, 424420, 79632, 412340, 736084, 261652, -570530, -715930, -99807, 384792, 304041, 158385, 343145, 498373, 204605, -322487, -616350, -602417, -514675, -465637, -379088, -180881, 91889, 254758, 78708, -364698, -580235, -209918, 392118, 578496, 329821, 239024, 567416, 886661, 788637, 410973, 59882, -188055, -277824, -61188, 318000, 365903, -98022, -586228, -576590]
36461e76590M01666L37834Q8839n9986j49852k23603j97927j29649j62368k09912
36451h81548j09333J3569p511N0458M10982O76694L01588m26654o41031j23642
36441g36428M65887O11062M29691J07276l41962o29629l45320K37282L08069k80340
36431a74412p44909n59585r7948K04312M61559P17365N88574M8169k52353j7188
36421A73584J29686k48586n33592p8393O14085O58827J80051l3224J41775J66830
36411A171043n9773q7043J56680J87427j82617n24508m84141k50120j55012k03089
36401d31153j72885J6932J60764p429l69832l66715K58141Q34221N51608k08510
36391B65142k80501M18888O20871k26497r15342l86334N22840M56742l19205n91114
$$ y = [-576590, -174924, 162910, 251749, 191763, 41911, -181692, -379619, -509268, -671636, -881548, -990881, -977312, -984823, -934365, -523383, 153311, 454899, 28245, -612786, -736428, -270541, 340521, 770212, 877488, 535526, -94103, -439423, -202141, 105928, -174412, -919321, -1478906, -1576854, -1372542, -910983, -193618, 394956, 443125, 190772, 173584, 303270, 54684, -478908, -557301, 56784, 715611, 895662, 862438, 1004213, 1171043, 1111270, 1024227, 1180907, 1368334, 1185717, 661209, 177068, -73052, -228064, -431153, -604038, -587106, -426342, -433771, -803603, -1170318, -912177, -77956, 473652, 265142, -15359, 403529, 1024400, 797903, -117439, -503773, 19067, 475809, 156604, -434510]
36381d34510k56213j55455l58695k11234K08834K36708K6348K65853O53464L02776
36371B77876m04290j72207Q62093J041640j18224j034893n68954L49279N29571
36362G61891K97943L44859L12885j72551l85830J90193N94019j04277j039739
36353G99393q74002k6278J07965m60805m97986K11715N63383Q2100m06053k70587
36343g71155J05197K98906M69429O61352N01652m7327m66012m85972l73375k45719
36333c53024Q8757M39182K37866m76370q70469m71652J68244L31581O5977j25567
36323i65475m2700J36445K04668Q6380j17505j54138P0767K66891J62428k4888
36313c77127N6745K75440K83893J77046K48760L27958J05262j08369J57138M93444
$$ y = [-434510, -690723, -846178, -1204873, -1416107, -1207273, -970565, -944217, -678364, -24900, 277876, -126414, -298621, 563472, 1605112, 1486888, 451995, -116959, 232320, 761891, 1059834, 1404693, 1717578, 1545027, 1159197, 1349390, 1943409, 1839132, 799393, -74609, -100887, 7078, -453727, -951713, -739998, -176615, -94515, -500568, -771155, -665958, -367052, 102377, 763729, 1265381, 1218054, 752042, 266070, -107305, -353024, -264267, 174915, 412781, -63589, -934058, -1405710, -1237466, -905885, -839908, -965475, -1008175, -871730, -667062, -580682, -698187, -852325, -781558, -514667, -352239, -377127, -320382, -44942, 238951, 415997, 664757, 992715, 1097977, 989608, 1146746, 1640190]
36303A640190J05062p05310p57206J12552O39188P0844o73616m78528L55695P96328
36293A105199N59177N9096m55238q72991q57890l16378J84451J54224q2584k755
36283e25689K57546L19851L01443L87015K01952n00808r90694m23297P16803J095521
36273H39643L81783l77943l21665K02360M09064J36403j98981k32075P198J27143
36263I72930k27986p77691p08506J83699Q92610M68168n06292o78305O2345N00305
36253A81277M8383m60751k65217K23753L78013L63387M62374L02051l57003q05508
36243G0759l55854M17749M54901j46250l54599R4406L53787p9925o10176n79725
36233g34927k03647J9745J46836M43630O74824L95667k46182n77525k70848K63979
$$ y = [1640190, 1745252, 1039942, 282736, 395288, 1034476, 1105320, 431704, -46824, 308871, 1105199, 1664376, 1723472, 1268234, 395243, -462647, -779025, -594574, -440350, -522934, -525689, -268143, 51708, 353151, 740166, 942118, 441310, -549384, -972681, -255878, 839643, 1221426, 843483, 521818, 724178, 1133242, 1269645, 1070664, 838589, 845787, 972930, 744944, -32747, -741253, -557554, 335056, 803224, 296932, -381373, -319028, 181277, 229660, -231091, -496308, -272555, 105458, 468845, 931219, 1233270, 876267, 70759, -285095, 132654, 587555, 441305, 86706, 181112, 534899, 454974, -155202, -734927, -938574, -918829, -771993, -328363, 346461, 742128, 495946, -81579, -352427, -88448]
36223h8448M43371J87584r8263q1931J06867Q8785k08589l71580l5575N28654
36213D70875O77146K46959k17441k27240K9932R4597o8109j60320j07678p1259
36203F67462l5269J26530K19162r7036o28883p23064k28804J84383L9493j66119
36193f42145K31518Q96434R07848J76981l85939k27892J07883n5957m81423m70684
36183E6624M4942M77329M65263K41255J35328J57827J57149P7358m2388j27534
36173A643153q8191N6755R7208j32194m64998n79150m44945l34518l56027k75092
36163h77999P0751M39891M90311K62649J17648K34788L81937K28250k42435p00705
36153D05086p99704m86418j3389L13222L84646L08433K15798J00000j20041m01813
$$ y = [-88448, 354923, 542507, 444244, 362313, 469180, 557965, 349376, -22204, -57779, 470875, 1148021, 1394980, 1177539, 950299, 980231, 1074828, 1006719, 846399, 738721, 667462, 632193, 758723, 977885, 880849, 251966, -471098, -699902, -515519, -476026, -642145, -410627, 485807, 1393655, 1570636, 1184697, 956805, 1064688, 1008731, 527308, 56624, 101566, 578895, 1044158, 1285413, 1420741, 1578568, 1735717, 1813075, 1770687, 1643153, 1554962, 1611717, 1708925, 1576731, 1111733, 532583, 87638, -246880, -602907, -877999, -807248, -367357, 122954, 385603, 503251, 738039, 1119976, 1348226, 1105791, 405086, -394618, -881036, -894425, -581203, -196557, 111876, 327674, 427674, 307633, -94180]
36143i4180n35417l67515j8254K43086L30354L89887M75375L89396J6119l75259
36133D53592m26252j78999L1143J04039K31129M18897L81728N1459k08414j43266
36123G15056j7588j70375m46327m51973j83390J5406K4942P2130K76153M35628
36113B69662L55235J13582j00381k23552k91794l06900k15704K0291L31246M97235
36103D48920L12503j19220l89232k32287J39413L05826J37919j31277k30786q7841
36093A53938J64811K82656J17210j75472k91773k04625j68428k29085j28381J34750
36083c44399J56115j36202j64671L51325O89742J25178p92358q83541l8684P06105
36073c31390P18654L85632J13411k24016n67135m16136K51046O75828M31741M8358
$$ y = [-94180, -629597, -997112, -1015366, -772280, -441926, -52039, 423336, 812732, 828851, 453592, 27340, -151659, -120516, -16477, 214652, 633549, 1015277, 1066736, 858322, 715056, 697468, 527093, 80766, -371207, -554597, -539191, -514249, -442119, -165966, 269662, 624897, 738479, 638098, 414546, 122752, -184148, -399852, -379561, -48315, 448920, 761423, 642203, 252971, 20684, 160097, 465923, 603842, 472565, 241779, 153938, 318749, 601405, 718615, 543143, 251370, 46745, -121683, -350768, -479149, -344399, -188284, -324486, -489157, -137832, 551910, 677088, -115270, -998811, -1037495, -331390, 387264, 772896, 886307, 662291, 95156, -320980, -69934, 605894, 1037635, 1085993]
36063A085993K7345N8025j93622l41629o2718J39027j94561n10480j14668N53618
36053D46330N72178M0676j73793Q4795J86412j1129J4838L06659K46940k50167
36043A463739m23308R0132O09669M58964j17836n34076o59334n86776k44573K64969
36033C21570M76388J88930j64357j70079o86L4288Q657N9451L8262j00505m3544
36022F48375L14707N25396K64536j04506j20615Q5145J69296J55344J26004j18159
36012A945523n08660m22663L21955P99585K33292o20182m71471M82316Q24238
36003B583933Q8597o72993o48279k91311k06171j85909O3749K44738J45435J36883
35993A258672L79064L78180k4728j26766L88183N97164k23316j114912p05560
$$ y = [1085993, 1113338, 1171363, 977741, 636112, 573394, 712421, 517860, 7380, -107288, 446330, 1018508, 1059184, 885391, 970186, 1156598, 1145469, 1160307, 1466966, 1713906, 1463739, 1040431, 1130563, 1740232, 2199196, 2081360, 1547284, 887950, 301174, 56601, 321570, 797958, 986888, 822531, 652452, 651766, 686054, 694711, 754162, 792424, 691919, 648375, 963082, 1488478, 1753014, 1648508, 1527893, 1613038, 1782334, 1937678, 2063682, 1945523, 1436863, 1014200, 1336155, 2135740, 2369032, 1748850, 1277379, 1759695, 2583933, 2672530, 1999537, 1351258, 1059947, 853776, 667867, 731616, 976354, 1121789, 1258672, 1637736, 2015916, 1991188, 1864422, 2252605, 2849769, 2626453, 1511541, 805981]
35984H05981N69778R86021Q9748p46574n11270J10047J16667k58342j85840L60061
35974A336277P00962N34717J95531K9730M3550Q6242M7871n7160o1686J34681
35964B990715K92477J01737k55870k72431Q4697K97433J75976J53099M13418M59666
35954D440917L5604k31514J90976P19390M70665l22792o69518l57248j32748l58543
35944C785189m74095l5832N22410N58726R1064l61736m27137j32384J92308J76338
35934C894851j39453k12860K21148N17903l6030r24687r02392J46002R05556N11070
35924C981108l20737n60982k70135k3663J46696L74323L22215j12963j89824N10630
35914C856668R91706J97657j076966j138566J0840O65929P7026n52202j84108
$$ y = [805981, 1375759, 2361780, 2451528, 1704954, 1193684, 1303731, 1420398, 1162056, 976216, 1336277, 2037239, 2571956, 2767487, 2797217, 2840767, 2927009, 2974880, 2917720, 2856034, 2990715, 3283192, 3384929, 3129059, 2856628, 2941325, 3238758, 3414734, 3567833, 3981251, 4440917, 4476521, 4245007, 4435983, 5155373, 5626038, 5303246, 4633728, 4276480, 4143732, 3785189, 3311094, 3275262, 3797672, 4356398, 4447462, 4085726, 3658589, 3526205, 3718513, 3894851, 3755398, 3542538, 3763686, 4281589, 4245559, 3320872, 2418480, 2564482, 3470038, 3981108, 3660371, 3099389, 2829254, 2805591, 2952287, 3326610, 3648825, 3535862, 3346038, 3856668, 4848374, 5046031, 3969065, 2830499, 2841339, 3507268, 3584294, 3032092, 2847984]
35905B847984M88122M15885j22607k35197R6703K71498J77557J25800J44574J26404
35895D336723K38116M93927M17593j64088n37883j12355N24674M62533r5828k67694
35885E295718K3972J23017l6805J22410N93197O82784K69173L1757J98154J67947
35875G471324k58074l60302K61477R09713Q88739N34440M56750N26225L85635
35866A0815927K99968O43583J057255R75551O05169N55574Q18452R26094Q54957
35857A7552530R49744J155180J154746J130935J539296K190250K415292K179679
35849C0267652K187564K761906L434547L845426M264159M943370N690643O419672
35841F3814939P443511Q847518J0224160J1441105J3024258J5293738J7748034
$$ y = [2847984, 3336106, 3751991, 3629384, 3394187, 3490890, 3762388, 3939945, 4065745, 4210319, 4336723, 4574839, 5068766, 5486359, 5322271, 4784388, 4672033, 5196707, 5659240, 5563412, 5295718, 5319690, 5442707, 5405902, 5528312, 6121509, 6804293, 7073466, 7105223, 7303377, 7471324, 7213250, 6852948, 7114425, 8024138, 8912877, 9447317, 9904067, 10430292, 10815927, 11115895, 11759478, 12816733, 13792284, 14397453, 14953027, 15771479, 16697573, 17552530, 18502274, 19657454, 20812200, 21943135, 23482431, 25672681, 28087973, 30267652, 32455216, 35217122, 38651669, 42497095, 46761254, 51704624, 57395267, 63814939, 71258450, 80105968, 90330128, 101771233, 114795491, 130089229, 147837263]
35834A47837263J9883216K2033652K4695510K7468223K9364729K9711929K7929305
35827C28923827K2900393J3825857J856151j0083678j9446752k5474774k8494221
35820B84006803k8863989k7153955k4537223k2104486j9995527j7747834j5275315
35813A28328474j2997368j1199715r805934q705985p837520o975085n897176m803315
35805F0106376m154251m004751l852950l280632k441248j773143j491505j511853
35797C7596043j644187j699068j574216j361424j220055j100118q17883m47339
35789B7731753l11224m63364n49425l87196k84386m66561o03153l60905n8706
35780B4246833j67938m33854k23250L84822O69917M55917L50284N94179O00014
$$ y = [147837263, 167720479, 189754131, 214449641, 241917864, 271282593, 300994522, 328923827, 351824220, 365650077, 367506228, 357422550, 337975798, 312501024, 284006803, 255142814, 227988859, 203451636, 181347150, 161351623, 143603789, 128328474, 115331106, 104131391, 94325457, 85619472, 77781952, 70806867, 64909691, 60106376, 55952125, 51947374, 48094424, 44813792, 42372544, 40599401, 39107896, 37596043, 35951856, 34252788, 32678572, 31317148, 30097093, 28996975, 28179092, 27731753, 27420529, 26957165, 26407740, 26020544, 25736158, 25269597, 24666444, 24305539, 24246833, 24078895, 23645041, 23421791, 23806613, 24476530, 24932447, 25282731, 25876910, 26476924]
35771B6476924Q8876k04785L09529R58971P84695J10088L0943N98876P22723k3866
35761B9852974o72498l89972K38509J73628n10111q78340o18297l99995p54381
35752B6041517j316383j458444j204142j097032j341217j499829j161423o12974
35744A6350073n31173j064797j587715j499273r49331n09114l94429l94212m00869
35735I019160n53641q47318r85305p38670k36895J53490J31535k67991o01640
35726E072725m35393K7177J14676k80409m10044J15046M99256k5853p84239o13917
35716C279025J80536K67171m62759p09028l3938M05007j1397k17631N42632J153362
35706D392980M38695p54327r00805k31811o2569m03424j50705O70587P78591j68558
$$ y = [26476924, 26565800, 26361015, 26670544, 27629515, 28414210, 28524298, 28555241, 29154117, 29876840, 29852974, 29180476, 28790504, 29029013, 29202641, 28692530, 27814190, 27195893, 26795898, 26041517, 24725134, 23266690, 22062548, 20965516, 19624299, 18124470, 16963047, 16350073, 15818900, 14754103, 13166388, 11667115, 10717784, 10208670, 9814241, 9420029, 9019160, 8465519, 7618201, 6632896, 5894226, 5657331, 5810821, 5942356, 5674365, 5072725, 4637332, 4664509, 4779185, 4498776, 4088732, 4203778, 4703034, 4677181, 3892942, 3279025, 3459561, 3726732, 3263973, 2554945, 2521007, 2926014, 2914617, 2696986, 3239618, 4392980, 4831675, 4077348, 3176543, 2944732, 2882163, 2478739, 2328034, 2998621, 3777212, 3608654]
35696C608654r57228p18739j883M19518N23424M40967N9774l81806l65572o2054
35686B565055j66406n60482l60900M29217O98808J17812k05149L45327P39687
35677C602969N6813r04085r41585l08076R299l8390Q1453K07641p0618k91598
35667A403823J69856P34486L86423n03984o00335K62350Q34001M72496O802K12434
35657C378352O84871Q22393R05719J429156K007247J709891K58891j549554k530373
35648G116593k125261r32020j72962l82165q33093o45506p0945J3678m34436o24838
35638I09045k99880o1120j98182k18491J31397L38620R4873p0707K70206O13265
35628A509026L21533l21023n77763l50050r4813K2421J85405L33601J90140j59775
$$ y = [3608654, 2651426, 1932687, 1930804, 2350322, 2873746, 3314713, 3374487, 2992681, 2627109, 2565055, 2398649, 1838167, 1477267, 1906484, 2605292, 2723104, 2517955, 2863282, 3602969, 3659782, 2755697, 1814112, 1506036, 1515335, 1476945, 1558398, 1766039, 1695421, 1403823, 1573679, 2308165, 2694588, 2190604, 1590269, 1852619, 2686620, 3159116, 3165918, 3378352, 4063223, 4885616, 5791335, 7220491, 9227738, 10937629, 11196520, 9646966, 7116593, 4991332, 4059312, 3886350, 3504185, 2671092, 2025586, 1954641, 1968319, 1533883, 909045, 609165, 548045, 349863, 131372, 262769, 601389, 696262, 625555, 895761, 1509026, 1830559, 1509536, 931773, 581723, 486910, 509331, 694736, 1028337, 1218477, 1058702]
35618A058702k89350p2897J42046Q2371q7848o4010J82832L97432L22847n9404
35608A612721m99491o73149m37178Q5904N98609P58721L94511k32693n64653m02417
35598F40885k07773l86712n51372r4382O80918Q07770R8136n03638k96747K33929
35588D21014L10020qj38398k6575p836j58742k65748k69678k36925r2802J92593
35577b73085L79325K98705J59626J73003K04153J41100J70752K76510l572p53231
35567G73286j170357o22693K75581N00297J12007n6838J41607J58842m418J95142
35557C02456N74736K95212n48030p57671L0059N68575l4755p90238l83353O90568
35547e2441R05710M7981o42810m71483o8378m8916j05741J53084M10988K54579
$$ y = [1058702, 769352, 696455, 838501, 920872, 833024, 769014, 951846, 1349278, 1672125, 1612721, 1113230, 440081, 2903, 88807, 687416, 1446137, 1840648, 1607955, 1043302, 640885, 433112, 46400, -504972, -599354, 81564, 889334, 987470, 483832, 187085, 421014, 731034, 731026, 592628, 566053, 558217, 399475, 133727, -135951, -372876, -465678, -273085, 106240, 404945, 564571, 737574, 941727, 1082827, 1253579, 1530089, 1526517, 773286, -397071, -1019764, -744183, -243886, -131879, -188717, -47110, 111732, 107314, 302456, 877192, 1172404, 624374, -133297, -103238, 465337, 430582, -359656, -743009, -52441, 853269, 901250, 258440, -213043, -281421, -330337, -436078, -282994, 127994, 382573]
35537C82573o4698m9971K46397L23724p3699o72706r47126n51540L14775R24461
35527a67810O97035q5449n74702m06682k2872J32616J69840K57953J63747k51520
35517h7844n38968k42769L33531N33457L07436J53940K36415K23671J0034p4118
35507H54785Q6637J40848r6043l03252k45459j89761l58305m36234j04841L14633
35497c36992L05156k2857j41989J8957L4786k12693l11016j7579L50733M32202
35487I8708K89539J45954L6699m1499J3577J43115L9441l81269o98561n00157
35477h54453M8847M56390N12524L36119L8735k74937l48303n2726K63742J45447
35467B71385k85548m50952j35360K70316M12240L74235K71878m4592n55418p73611
$$ y = [382573, 317875, 267904, 514301, 838025, 764326, 91620, -855506, -1407046, -1092271, -167810, 529225, 443776, -130926, -537608, -560480, -427864, -258024, -71, 163676, -87844, -626812, -869581, -536050, -2593, 304843, 458783, 695198, 918869, 928903, 854785, 941422, 1082270, 986227, 682975, 437516, 247755, -110550, -546784, -651625, -336992, -31836, -54693, -196682, -177725, -142939, -355632, -666648, -684227, -333494, 98708, 388247, 534201, 570900, 529401, 542978, 686093, 725534, 344265, -354296, -854453, -805606, -349216, 163308, 499427, 538162, 263225, -85078, -137804, 125938, 271385, -14163, -465115, -600475, -330159, 82081, 456316, 728194, 683602, 128184, -645427]
35457f45427l48820L06311M98603K11517N0405K65498M02664R1967l33705l59174
35447A39839n9306J05023O2479J80837N37635O54740J92829m59135o43627k91689
35437D19625N3897J2972k07530k38791p5998K0071m8593j16887j7189K21755M08130
35426D31462L32021m2997m33440m01473J49650P15043O59140j5940n84292m08661
35416D00513K88666O49908J76664o57508r17615k87786N44775O96758J17273m51903
35406E59745m80924k19232j11984p5426K24246O26210N92423P4222l09547j67282
35396G12451Q7113r2922n27943o11344k27396J76624L44901M59241N70097L80237
35386A271059j43747m70831k37427J26043K3818l52191l40973P2109K18132j06537
$$ y = [-645427, -994247, -687936, -189333, 22184, 72589, 338087, 740751, 832718, 499013, 139839, 80533, 185556, 248035, 428872, 966507, 1621247, 1814076, 1354941, 711314, 419625, 473522, 486494, 278964, 40173, -35825, -15754, -64347, -181234, -198423, 23332, 431462, 763483, 720486, 287046, -114427, 35223, 750266, 1409406, 1393466, 809174, 400513, 689179, 1339087, 1515751, 858243, -59372, -347158, 197617, 894375, 1011648, 559745, 78821, -140411, -252395, -327821, -103575, 522635, 1115058, 1189280, 879733, 712451, 799564, 706642, 178699, -432645, -660041, -483417, -138516, 320725, 890822, 1271059, 1127312, 656481, 419054, 545097, 568915, 216724, -124249, -52140, 165992, 59455]
35376E9455k58971J40262M62769N3127o15461n80200J31087N55585K65939j17952
35366I5640m8574J79431J53157P1678J99318K10384k31103o85462n01147R8788
35356d57890K86685j09450m02260j63571K11004K82000K28161L48697M52457K32102
35346I07935j22645j98170l0185j2449k14818k55619O9053L93758K43920k76132
35336E04648n25061j34450M12546L16474m03746p53500p8021Q74515Q62533q6521
35326I89417p05688l57532J47349N0888p0886N60502J313834R49997l19192r61081
35316A597608l71834L39413J96473k75667k41856j8956l09681p56545m89463K91098
35306c9410N36819O2634j89236K21910N09508M6526n35905l95480J31163J30601
$$ y = [59455, -199516, -59254, 403515, 456642, -158819, -739019, -607932, -52347, 213592, 95640, 47066, 226497, 379654, 451332, 650650, 861034, 629931, -55531, -556678, -457890, -171205, -280655, -682915, -846486, -635482, -353482, -125321, 223376, 675833, 907935, 785290, 587120, 556935, 544486, 329668, 74049, 143102, 536860, 780780, 504648, -20413, -154863, 257683, 574157, 170411, -583089, -661110, 213405, 1075938, 989417, 283729, -73803, 73546, 124434, 53548, 614050, 1927884, 2877881, 2558689, 1597608, 1225774, 1565187, 1761660, 1485993, 1244137, 1225181, 915500, 158955, -330508, -39410, 497409, 560043, 370807, 592717, 1102225, 1148751, 612846, 217366, 348529, 479130]
35296D79130l33631l09472M62748J031554N85474m14486r31052o94624k89110
35287d13469j49324q7018J49965L75780L01666N7481Q032J65137J64650j24057
35277D48843l27522j15526K52094K51486j61538m89286l70278R370K64493K87445
35267D9581K32320K28576K59803K04977o1080m63617o39293l12061K29481L83782
35257A12469N2279k11378m4358K04883J13869j33012j67738j16604k52423l16139
35247g58152P4618N53474L92496k63531m44242J84712P75103N79418j1097k39297
35237H43502j11300q9095j83917j10416R9j91545m95695l94504R1406M05974L14215
35226G8724J15691j7655k41203m58647k44172L77203P06986L38553j92415k21612
$$ y = [479130, 145499, -163973, 298775, 1330329, 1915803, 1501317, 570265, -124359, -413469, -562793, -649811, -499846, -124066, 177600, 235081, 243113, 408250, 572900, 448843, 121321, 5795, 257889, 509375, 347837, -141449, -511727, -502357, -237864, 49581, 281901, 510477, 770280, 975257, 914177, 450560, -188733, -500794, -271313, 112469, 164748, -46630, -90988, 113895, 227764, 94752, -72986, -189590, -442013, -758152, -683534, -130060, 262436, -1095, -445337, -260625, 514478, 1093896, 1082799, 843502, 732202, 643107, 459190, 348774, 348873, 157328, -338367, -732871, -641465, -235491, 78724, 194415, 176760, -64443, -523090, -767262, -390059, 316927, 655480, 463065, 241453]
35216B41453L4650q7039n52312o55958j53516L44677L04926R386J0398K74283
35206b29052L28996L2039k78803l27393j75938M2828K77139L70574J12397l68335
35196b15548o00387l63314L0473K55329M02143N82245N14475K25n13292m55632
35186c63283p252K14106J73532L24159N54059K13007o00943q23985j9679P56210
35176D19931M57352l71792m86588J59506N21724J68331k72419l37653l09501l80264
35166d31373k19324K58799N11111K17974j29788L389L58913L39255o5540l34064
35156E09352k02098N1549O1845j61325k47507J23541P59357R85344L86094n57736
35146A708416r44978n53494l0917N3825j46219k02204j0651K76498N04094M77583
$$ y = [241453, 276103, 189064, -363248, -1019206, -1172722, -828045, -523119, -513733, -503335, -229052, 99944, 131983, -146820, -474213, -650151, -607323, -330184, 40390, 152787, -215548, -815935, -1179249, -1148776, -893447, -491304, 90941, 605416, 605641, 92349, -363283, -370535, -156429, 17103, 341262, 895321, 1108328, 507385, -316600, -336279, 419931, 877283, 505491, 18903, 178409, 700133, 868464, 596045, 258392, -51109, -431373, -650697, -391898, 119213, 337187, 207399, 210788, 569701, 908956, 843416, 509352, 307254, 358803, 420648, 259323, 11816, 135357, 894714, 1880058, 2266152, 1708416, 763438, 209944, 179027, 232852, 86633, -115571, -126222, 150276, 654370, 1131953]
35136A131953P3019m21239m96733j52333M3093j65312l15035k3079L72972M01467
35126D48773J78656N3540j1043j71358k43039q6750n9743m43652p64807l92476
35116a491899M30363Q68398O27633J08552l91847q44965r65027m03389M52141
35107a610040P25424L05267M0701L83414O59047K05542m78192m54121K23714N94145
35097E94901J72148m50850m92359M3903N08145M35398j8109l80182l97755j93436
35087a78196J2673J51433K14489J16878j40752k98627j04121K88168M57324K55284
35077G74553o5125k64814l50176l35684j15827K65269M96176L67022O7083r3508
35067G44969j16768k46704n23403o25068k43062M59082Q92864O53804K9273l01789
$$ y = [1131953, 1204972, 783733, 287000, 134667, 177760, 12448, -302587, -325666, 47306, 448773, 627429, 680969, 669926, 498568, 255529, 168779, 109036, -334616, -1099423, -1491899, -1061536, -193138, 434495, 543047, 151200, -693765, -1658792, -2062181, -1610040, -884616, -579349, -538648, -155234, 503813, 709355, 231163, -222958, 756, 594901, 767049, 316199, -176160, -132257, 375888, 811286, 793177, 412995, 15240, -178196, -165523, -14090, 200399, 317277, 176525, -122102, -226223, 61945, 519269, 774553, 709428, 444614, 94438, -241246, -357073, -91804, 404372, 771394, 838477, 744969, 628201, 381497, -141906, -766974, -1010036, -550954, 341910, 995714, 1024987, 723198]
35057G23198j05945J47287O564l21690l71751j59667n6918r9419K4866L20460
35047A06985L73741K5409l18976k58713P9191K90822J92664r7230l46199l57632
35037c09938j29935R0280J01002K7367O1342P8987r0583j99155O0512L64321J37273
35026A91473m03152m22951J74042M88740O0742l82098j68079K13977L8001l77190
35016e86495k58288K89209N50933M46768M65680N62418J90849n54569q48323l84988
35006a26806J47515J32738j74178k40631k5976J93499K66889J30023k39271n80983
34996e17181m97774n5347K08101P7121l5206J63515L31984J34949q0013K07459
34986f2392P82403Q66325J57721p22642r24810l06834M17745M64920j06661m45593
$$ y = [723198, 617253, 764540, 771104, 449414, 77663, -82004, -138922, -238341, -213475, 106985, 480726, 506135, 187159, -71554, 7637, 298459, 491123, 393893, 47694, -309938, -439873, -349593, -248591, -221224, -159882, -80895, -171478, -370633, -310121, 54200, 191473, -211679, -634630, -460588, 28152, 88894, -293204, -461283, -247306, -209305, -586495, -844783, -555574, -4641, 442127, 907807, 1470225, 1661074, 1106505, 258182, -126806, 20709, 153447, -20731, -261362, -287338, -93839, 173050, 303073, 63802, -517181, -1014955, -1070302, -862201, -785080, -820286, -656771, -324787, -189838, -269851, -62392, 720011, 1586336, 1744057, 1021415, 96605, -210229, 207516, 672436, 565775, 120182]
34976A20182l3095N39769L83028l34991n85020m6617L98758P2615m54402l37792
34966b77565K05450L45710k0055k49288o3963J47345J04189q209j6364L575L2027
34955B02852J33515J59166o4964k75992p8152L08874K79268j26629j88074K96135
34945F45999N85531J72502l87034l88276n6220K68j31844K3111L11935J68035
34935I44007l03367l70721J45592N72214M21602k0378l57879n90907o58572k38111
34925d56520N32587Q25803K35525m59113l63737J77231J64140m28336o18105j8005
34915d08530N24234K25604m75602n92792O4910P58615P94706K16578l83466m82171
34905B42086r4671K84423K79358Q4722Q5266J90135J6272l39802l47617M8622
$$ y = [120182, 87087, 626856, 1009884, 674893, 89873, 43256, 442014, 514629, 60227, -277565, -72115, 273595, 253540, 4252, -59711, 87634, 191823, 183614, 167250, 170825, 202852, 336367, 495533, 430569, 154577, 76425, 385299, 664567, 537938, 349864, 645999, 1231530, 1404032, 1016998, 628722, 572502, 572770, 440926, 464037, 775972, 944007, 640640, 269919, 415511, 987725, 1409327, 1388949, 1031070, 440163, -218409, -456520, 76067, 901870, 1137395, 678282, 314545, 491776, 655916, 227580, -390525, -408530, 115704, 341308, -134294, -727086, -662176, 96439, 891145, 1107723, 724257, 242086, 147415, 431838, 711196, 795918, 881184, 1071319, 1087591, 747789, 400172, 448794]
34895D48794K59234K4885j56783M2141J69428j38471l94306j06741K40262l5935
34885C52508n49829m01346L06218O16085K77010K0257K03183K87111p4858m53747
34875E82592n12908n22195n93540l23955L02579N65051J65561j34112K37014O14880
34865C80967K12962m55664l66451L10472M79747j37200o80092n52358r7549K42061
34855f63105M81379N79988K54067l51205n49107q4481L92912K50067k54997m52345
34845c96827j70014K77048O28087P34994L84354m08632j075799r75036k08808
34836a210633M31430M16271M6796p2735J47355K75695O2158k07983j89759k0157
34826c21562p0806l02069k79018J39367N44626N55453K62883q5005m19338o06878
$$ y = [448794, 708028, 732913, 576130, 618271, 787699, 649228, 254922, 148181, 388443, 352508, -197321, -598667, -292449, 323636, 600646, 620903, 824086, 1111197, 1036339, 582592, 69684, -452511, -1046051, -1370006, -1067427, -502376, -336815, -470927, -233913, 380967, 593929, 138265, -228186, 82286, 562033, 424833, -255259, -807617, -905166, -663105, -181726, 398262, 652329, 301124, -247983, -332464, 60448, 310515, 55518, -396827, -566841, -289793, 338294, 1073288, 1457642, 1049010, -26789, -1001825, -1210633, -779203, -362932, -316136, -388871, -241516, 34179, 96337, -111646, -301405, -321562, -392368, -694437, -973455, -834088, -289462, 265991, 528874, 443869, 24531, -582347]
34816e82347l39800L15689O86124L32992k26832k36718J74888K73609j06891m37754
34806a47040m25299k71833l9919M00835P23548L38678n31038q48767k11436N20943
34796d91328N22796J42210J12555L25969K00496k10921l36152n4367K24913L12823
34786G48994L63498L28062j2475m46091m31553N4818L63849R7445l18501l05164
34776D42882K8676J31630j39698l64841k19545R7968K19866J03650l4853r3773
34766A71962j15697n2183J61449L10899Q6976l38791l75675J23462N36187L64583
34756H73172k9451q6127L0431j48120m52440l80598o0482Q877l2997L05717O97502
34745G25484L20322n79797p78589k7482M61102K0749l87568O8147O11820K83762
$$ y = [-582347, -922147, -606458, 79666, 412658, 185826, -50892, 123996, 397605, 290714, -147040, -572339, -844172, -884091, -483256, 240292, 578970, 47932, -800835, -1012271, -491328, 31468, 173678, 286233, 612202, 812698, 601777, 265625, 211258, 436171, 748994, 1112492, 1440554, 1428079, 981988, 550435, 605253, 969102, 1066547, 748046, 442882, 471558, 603188, 463490, 98649, -120896, -22928, 196938, 300588, 265735, 171962, 56265, 4082, 165531, 476430, 563406, 224615, -151060, -27598, 508589, 873172, 843721, 757594, 788025, 639905, 187465, -193133, -253615, -244738, -277735, 27982, 725484, 1045806, 466009, -312580, -340062, 121040, 141789, -245779, -177632, 434188, 717950]
34735G17950l30405j82572L51793K12596l73063k88502M50905O82974L9482n76661
34725G04497n64799l43773k84565j35364J91798L12905J46072P9182J68184O8670
34715C42807j19216P8635M73985L17760l67823o66250k49157J47699P5515K7660
34705F1615K86534L08335j33207l40520M5354K80005j53445n14983r2086M62644
34695B10246K15386m35479m56895J20878M40914K99576J74963J13707k05148n12119
34685c3971k36994L44444L89153j07867k98786O0076K44092j38657n22536l98060
34675f99106l7780J78945L46391N12285L33026k50165o24282l18994K94284N85753
34665C20357M82857K52302n8739m39170n74734k73163O0732m6403l48375k23873
$$ y = [717950, 387545, 204973, 556766, 769362, 396299, 107797, 558702, 1241676, 1281158, 704497, 139698, -204075, -488640, -624004, -432206, -119301, 26771, 105953, 274137, 342807, 223591, 302226, 776211, 1093971, 726148, 59898, -189259, -41560, 33955, 61615, 348149, 656484, 523277, 182757, 228111, 508116, 354671, -160312, -252398, 210246, 425632, -9847, -466742, -345864, 95050, 394626, 569589, 683296, 478148, -33971, -270965, 73479, 462632, 354765, 55979, 116055, 360147, 221490, -301046, -699106, -736886, -557941, -211550, 300735, 633761, 383596, -240686, -559680, -265396, 320357, 803214, 1055516, 996777, 557607, -17127, -290290, -229558, -275961, -624336, -848209]
34655h48209L10953N73599K37029k26684l12208j54029j08759j05194J11112L46936
34645a75454J50422l89129n87517j11250M76164M71200K2026j07275L53041P98064
34635I00292N78487j60886o88174n41688J1153L25841J02917k88072k99114J9007
34625d0237M8055m39791p91354l71169M16807O51985K32298q0717Q1159K25107
34615f7857l6576l49270k93520k7372J48378K80271M13438L07283p9597l40981
34605d5803k64001j77137k53322r1465M85372Q46709M32164l14423n83325l17175
34595b82406o441J79997L30876K85298m1016k09776Q2281L08528p8121n64175
34585E045k98391M36395N84548k1724n03008m03901j85003j40822N4460M56816
$$ y = [-848209, -537256, 36343, 273372, 46688, -265520, -419549, -528308, -633502, -522390, -175454, -25032, -414161, -1001678, -1112928, -636764, -165564, -143538, -250813, 102228, 900292, 1478779, 1317893, 629719, 88031, 99184, 425025, 527942, 239870, -59244, -40237, 7818, -431973, -1223327, -1594496, -1177689, -525704, -293406, -374123, -292964, -67857, -104433, -453703, -747223, -774595, -626217, -345946, 67492, 374775, 295178, -45803, -309804, -486941, -740263, -831728, -346356, 500353, 932517, 618094, 34769, -282406, -288847, -108850, 222026, 507324, 466308, 256532, 338813, 647341, 569220, 5045, -293346, 143049, 727597, 705873, 202865, -201036, -386039, -526861, -472401, -15585]
34575a5585N25063N4844m05141m11864j60785Q1920L15882L78858J2632m34401
34565e8577k63878L73830N21520k6176l10193J35344L77896l42932j180537r06226
34555a679929J80775P56238M31470M0752J56059L93617K73408p4812k52356q6699
34545A38523K98166N06449P6013q69232j355179n82889Q37693J382733M92743
34536I25020o85635p77761R8206O30097J29612n88402l98711N11534Q58253J06187
34526H08400o69210l00747O84069P50152l73518j253473q40180J03361L20839
34517g70307q1623p4837N20152Q07605K99309l49909l58426J08857L05708k1218
34507C85311l67028k27361K05149L13967n4812l21377p112M74257L50917l27979
$$ y = [-15585, 509478, 564322, 159181, -252683, -413468, -331548, -15666, 363192, 375824, -58577, -322455, 51375, 572895, 546719, 236526, 371870, 749766, 406834, -773703, -1679929, -1499154, -742916, -311446, -270694, -114635, 278982, 552390, 477578, 225222, 138523, 436689, 943138, 1019151, 149919, -1205260, -1788149, -950456, 432277, 925020, 239385, -538376, -440170, 189927, 319539, -268863, -667574, -156040, 702213, 808400, 139190, -161557, 522512, 1272664, 899146, -354327, -1194507, -1091146, -770307, -851930, -926767, -406615, 400990, 700299, 350390, -8036, 100821, 406529, 385311, 18283, -209078, -3929, 310038, 255226, -66151, -73263, 400994, 751911, 423932]
34497D23932o91510k99434K70507L49801Q3969P259K04434L62475L06854O3783
34487A082070l28908p14837p93853n08591j79064j7862J28983L31522L31587O0667
34477f08286q5156J27276L38173K12755J2983Q2371K28023J40344o929P0577J98687
34466G10818J06229l6620L017K0184j68279k19370J25111L90111Q3790l76022
34456F38969l03696O6251j5340m90342n92593j41740K65676L33995L59808M02850
34446E23838J45533k78488k72457J69811L05891j47451n13884k65072J72222K05236
34436D5179l1984j27260j36740k75141l18510M2352N27078N38098L659n15419
34426b48688n46170j90180J43471K47691K46187K94988L02597Q6243k40082l13510
$$ y = [423932, -267578, -567012, -296505, 53296, 137265, 144524, 348958, 711433, 1018287, 1082070, 753162, 38325, -755528, -1264119, -1443183, -1461045, -1332062, -1000540, -668953, -608286, -693442, -566166, -227993, -15238, -2255, 80116, 308139, 448483, 441554, 512131, 710818, 817047, 780427, 783444, 803628, 635349, 415979, 541090, 931201, 1014991, 638969, 335273, 401524, 386184, -104158, -696751, -838491, -572815, -238820, 120988, 523838, 669371, 390883, 118426, 288237, 594128, 446677, -67207, -332279, -160057, 45179, 13195, -114065, -250805, -525946, -844456, -802104, -275026, 263072, 266731, -248688, -794858, -985038, -841567, -593876, -347689, -52701, 249896, 336139, 96057, -217453]
34416b17453n5158J68120J03170l2038q211K8518j8721J10284M33019L84312k57719
34405F38123o93362k32491M46626K92474l18414j77906N76726N34882n55869j154392
34395f43603l52763O57421N33123j87387k72984R6444n3074n04652j69839Q54886
34385d2428J178260K61317p14850o32602J8075J05625m11404n99197m5286N96766
34375b85724N99700Q5130l06484k92816j20869j2754J21977L25596L36396q953
34365D41199l69879k83698J59398M04373J72657k22572l27183m8130L04683K99344
34355E30192j91334o79909m54188M45952J031424O05249k22625m18563k0372J25003
34345G50829j75621l28260j83575k28465m31779j21464O45083Q00631o8454q86894
$$ y = [-217453, -272611, -104491, -1321, -33359, -41570, -13052, -31773, 78511, 511530, 895842, 638123, -55239, -287730, 158896, 451370, 132956, -44950, 531776, 1066658, 510789, -643603, -996366, -338945, 194178, 6791, -266193, -169749, -222823, -727475, -897314, -42428, 1135832, 1397149, 682299, 49697, 67772, 173397, -238007, -837204, -882490, -285724, 313976, 399106, 92622, -200194, -321063, -333817, -211840, 113756, 450152, 441199, 71320, -212378, -52980, 351393, 524050, 301478, -25705, -73835, 230848, 530192, 338858, -341051, -795239, -349287, 682137, 1287386, 1064761, 646198, 625826, 750829, 575208, 246948, 63373, -165092, -596871, -718335, -73252, 727379, 658925, -227969]
34335b27969o58728J07629L96184K39274K88866N13413L93813m305j52934l878
34325H91365M8526n5826p0187n7543k56054m80846l36877Q3544L17941K37401
34315C21444R7117J9038p4933j59486j86095k81785m62142m12640K0256M43863
34305f75363M82076L49243L52131K50889k38102o84918m52025K65016O26844K70044
34295E45835l57542o52176l43134M47372J132524R62015n1200q62335o55346M4903
34285B10916K16609j69400l76484k23088j59451k48090r9784K56798L99845L42071
34275A49942L99546L40194k96289j064828r42300P2138P93775N42335o3002l08661
34265c77150l15603l25584r9419L70029M54091j04841n39452j44088O02478P50434
$$ y = [-227969, -886697, -779068, -382884, -143610, 145256, 658669, 1052482, 1048177, 895243, 891365, 939891, 884065, 813878, 756335, 500281, 19435, -317442, -233898, 84043, 321444, 418561, 437599, 362666, 203180, 17085, -264700, -726842, -1139482, -1119226, -675363, -193287, 155956, 508087, 758976, 520874, -164044, -616069, -351053, 275791, 545835, 188293, -463883, -807017, -359645, 772879, 1734894, 1683694, 821359, 166013, 210916, 427525, 258125, -118359, -341447, -500898, -748988, -848772, -591974, -192129, 149942, 549488, 889682, 593393, -471435, -1413735, -1341597, -547822, -5487, -68489, -377150, -692753, -1018337, -1117756, -747727, -293636, -398477, -937929, -1082017, -479539, 270895]
34255B70895K42329j78381j13265J19845J30021o4502j97024j10781M1577o3806
34245G6908m21599m86595J07662P82036O52134j03340l91798J13689M40946r0307
34235F79736p29836n06407K19102L78684j24944l99718l6259L67574K50873j13908
34225a5103j59005J41975L31393J50188j40957j62200K8396J3521k99402m22679
34215e33873k5859M21645K92772j85555k99606n4165q6280l89981k27614M48343
34205f40173O71859Q4281l05001K07896O97582Q9259r37616r13716J16147P44097
34195a85385M27335P0885K80828M48977K1136m95222m38564m0686J15415M2274
34185B46993Q1877J66405O747k76922l17381j33525p2572j85514j45954J52622
$$ y = [270895, 513224, 334843, 221578, 341423, 471444, 406942, 209918, 99137, 140714, 76908, -344691, -831286, -723624, 58412, 710546, 607206, 215408, 329097, 770043, 679736, -50100, -556507, -337405, 41279, -83665, -483383, -519642, -152068, 98805, -15103, -174108, -32133, 299260, 449448, 308491, 146291, 174687, 188208, -111194, -533873, -559732, -138087, 154685, -30870, -330476, -384641, -470921, -860902, -1088516, -640173, 31686, 115967, -189034, 18862, 716444, 805703, -131913, -1045629, -929482, -185385, 241950, 312835, 593663, 1042640, 1063776, 568554, 129990, 89304, 204719, 246993, 328870, 495275, 502022, 225100, -92281, -225806, -298378, -483892, -629846, -477224]
34175d77224L42730J30457j92605j12631L22507M70738K296n08545l00000M53792
34165A31515Q02843L46223k30048k12022J47566J79745j48922l75672l94919m50856
34155b04547m60008j02783M25496M99678L4561l00251o8001L17027K60111k08815
34145A92468o23867o85621l79374J54407N86786N68066J93605k0700J41467K90185
34135D17422J12323j02164k2339Q7953j50022m73396l56490Q7100K82228J43138
34125B5753J00575K02696M482m94589o26898j13896M01124L48634Q0213J34529
34115F2623K85484O7205k62350j56990J72942J03172k24365r1328M52941N09192
34105I18526k06747q23469o13929M1325M18113L68826M2355m91833q45347l97812
$$ y = [-477224, -134494, -4037, -196642, -309273, 13234, 483972, 486268, -22277, -322277, 131515, 934358, 1280581, 1050533, 838511, 986077, 1165822, 1016900, 641228, 246309, -204547, -664555, -767338, -341842, 157836, 192397, -107854, -175855, 141172, 401283, 192468, -431399, -1117020, -1496394, -1341987, -755201, -187135, 6470, -14230, 127237, 417422, 529745, 427581, 405242, 493195, 343173, -130223, -486713, -399613, -117385, 25753, 126328, 329024, 333506, -161083, -787981, -901877, -500753, -152119, -71906, 62623, 348107, 415312, 152962, -4028, 168914, 272086, 47721, -43607, 409334, 918526, 711779, -111690, -725619, -684294, -266181, 102645, 145000, -346833, -1192180, -1589992]
34095a589992O18701J002831K66517m80988k12913M00138K08836m41425m00052
34086f28347K39588L92560m9652j73655J34791L4792m79241l74042M48751O99933
34076B45478j10981o76966k3530Q37688N75145l60253o41853j56968J91409J27314
34066F483J09568K09039R5320j18117p9559j0786l19643o43339l02900M38960
34056f14974O06944l298n25325l29316J92455L59370Q1761k25992j93523J70300
34046d81598M47217K11527l27978m23173J51215O18167K96220l51156m70906j43707
34036d74172p2690k96469k00705L21342O62666M70018K6722l25810m37369j22306
34026d48773N47551Q58913K43725o33527n52608M55673J005727K87927q60116
$$ y = [-1589992, -971291, 31540, 298057, -182931, -395844, 4294, 213130, -228295, -628347, -388759, 3801, -45851, -219506, -84715, -49923, -529164, -903206, -454455, 245478, 134497, -542469, -565999, 271689, 846834, 486581, -155272, -312240, -120831, 6483, 116051, 325090, 420410, 302293, 222734, 211948, -107695, -751034, -1053934, -614974, -8030, -11328, -536653, -865969, -673514, -314144, -232383, -458375, -651898, -481598, -34381, 177146, -150832, -574005, -422790, 195377, 491597, 140441, -330465, -474172, -546862, -843331, -1044036, -722694, -60028, 409990, 436712, 110902, -326467, -448773, 98778, 957691, 1201416, 567889, 15281, 470954, 1476681, 1764608, 904492]
34017I04492j196864n82711K04325N23268L10972p5940j62651J57046L82675Q2072
34007E46684l32889j69375L54923L78537j64309m09337k7896K74696P2676q4058
33997D39652J68158K23389l58411q69876n22381K45375M90264K20850J36107L30999
33987E04126K89754m0893j42093J30336L03718P4182l07546n15612m88696k52780
33977d45504J13492L14564J02414k58167k29562K22187M96311J36186n66611q98423
33967a013113m82173L65315R27885P50943R6980l26252j56607K56562L60786M0387
33957H20713m07300o74255n92296j34409M38885O37149K67740k33765k97214Q8891
33947h5861M66101N41153L92612J43826j87782n01102o00585m67885l24411l32420
$$ y = [904492, -292372, -875083, -670758, -147490, 163482, 87542, -75109, 81937, 464612, 546684, 213795, 44420, 399343, 777880, 613571, 204234, 176338, 451034, 523710, 439652, 607810, 831199, 472788, -397088, -919469, -674094, -183830, 37020, 173127, 504126, 793880, 752987, 610894, 741230, 1044948, 1119130, 811584, 295972, -192724, -445504, -332012, -17448, 84966, -173201, -402763, -180576, 315735, 451921, -114690, -1013113, -1495286, -1129971, -202086, 548857, 645837, 319585, 162978, 419540, 780326, 820713, 413413, -260842, -853138, -987547, -548662, 88487, 356227, 122462, -174752, -85861, 380240, 921393, 1314005, 1457831, 1270049, 768947, 168362, -299523, -623934, -956354]
33937i56354l74636k02281K59677P67044R10739N13058r5259l53273j11378J92055
33927E49392J25847j82632l13496j77669n7444j12413j82293j09166L1845J15428
33917c12601J46498J30207l7996l60660n51570l14411K12352N42808M39063J66556
33907F0246K2666q7404l13495l93851l2318M12627K80581k94384l82413L51081
33897c76664R85675O18016l21010p33125l84710L5439J02939M4292L8290m9515
33887d0373j84614j09985J46315K95802L23641M05948L64258r2082o11187m87634
33877A0089K11581O17878L23487j18808j75366j5745O8049J44491J93332p4809
33867A184179n44212n56462R3710O79559N32825q4820n41730o57601n17049r8685
$$ y = [-956354, -1330990, -1533271, -1273594, -506550, 404189, 917247, 821988, 468715, 357337, 549392, 675239, 492607, 179111, 1442, -56002, -168415, -350708, -459874, -428029, -312601, -166103, -35896, -73892, -434552, -986122, -1300533, -1088181, -545373, -106310, 60246, 82912, -4492, -317987, -711838, -744156, -331529, -50948, -345332, -727745, -376664, 609011, 1227027, 906017, 172892, -211818, -176379, -73440, -29148, 9142, -40373, -224987, -334972, -188657, 107145, 430786, 836734, 1200992, 1108910, 497723, 10089, 221670, 839548, 1163035, 1044227, 868861, 853116, 921165, 1065656, 1258988, 1184179, 639967, 83505, 177215, 856774, 1389599, 1304779, 763049, 105448, -411601, -510286]
33857e10286L98533M55704r117l42683j11223K45335K26339P0949J34289J43765
33847G01605j78361l73090J6797M76976K16875n30314q29334m25440P9571K78464
33837e66251L30271L38570J56126j40629k42704j33326p9504j05654K002J89997
33827b51102J59328r5115k38739j25039L1467M4514j1473N468J05771J75502J00783
33816i8635k7119J05525N51711P31374J16152p59303p84151Q6934O32797J64563
33806G19848m98350m36348N138O2319j55492j53261k5061Q939K49729P26465O29219
33795A133145l41990r88508l28589O01903K91576o92752o23490M38060P66881
33786B56236p7541o41509j85128K26986j52833m91400r0381L40648J23886j48711
$$ y = [-510286, -111753, 343951, 334834, -7849, -119072, 126263, 352602, 423551, 557840, 701605, 523244, 150154, 166951, 643927, 860802, 330488, -498846, -924286, -844715, -566251, -235980, 102590, 258716, 118087, -124617, -257943, -337447, -443101, -441099, -251102, -91774, -186889, -425628, -550667, -519200, -474686, -486159, -480691, -374920, -199418, -98635, -125754, -20229, 531482, 1262856, 1379008, 619705, -164446, -77512, 555285, 719848, 221498, -214850, -209712, -147393, -302885, -456146, -481207, -472268, -222539, 503926, 1133145, 791155, -197353, -525942, 75961, 367537, -325215, -948705, -510645, 256236, 178695, -462814, -647942, -420956, -573789, -1065189, -1155570, -814922, -691036, -839747]
33776h39747J31965M00809O7090k95973l1569L37597P9209l66457j45999N22600
33766a40475P44899L53223p6057k36413k67729k29843j05707l8740m6611J06684
33756F3231L52412K18202k84938m17041J02342M64186Q126p09121q64220o00355
33746a667176m31715j88371M19712Q62609N46104k7425o020L55815J91668l80782
33736c25581m38848J40596N15799L07647J1776q4707k55329m52764k03013L47816
33726d36608L67159k77764n85151O6711Q61041P24059r8784m59177P1400P58200
33716I91086P88013K05143l35534m05938k15644k42147n52618o72862k54825L56532
33706c38794N50368K82327L3297M755j00891m00708m89326p6701M48753M96161
$$ y = [-839747, -707782, -306973, -239883, -535856, -567425, -229828, -150619, -517076, -663075, -140475, 604424, 957647, 881590, 645177, 377448, 147605, 41898, 3158, -43453, 63231, 415643, 633845, 348907, -68134, 34208, 498394, 506520, -202601, -1066821, -1667176, -2098891, -2287262, -1867550, -1004941, -458837, -486262, -492282, -136467, 55201, -325581, -764429, -623833, -108034, 199613, 211389, 126682, -128647, -581411, -784424, -436608, -69449, -347213, -932364, -865653, -4612, 719447, 620663, 161486, 232886, 991086, 1779099, 1984242, 1648708, 1242770, 1027126, 784979, 232361, -440501, -695326, -338794, 211574, 493901, 527198, 531953, 431062, 30354, -458972, -535673, -86920, 409241]
33696D09241P8833k52387j94652l8036j45142l70285k58874K24750M79980J6859
33686d9713p44571q35521K3306R66474J043547L89880q5439L4743K58219L7416
33676A038341m70215p21264n32389j97888n179O2979J17975J06604m9439j70632
33666h21107K6772M21668M56310j10567o74419m56348L94244Q91420M84269k68024
33656C44218n08021j33388K77256K81148k7828k69256j69886K00102M64725L41113
33646H00183J3744j15003j6699k5820k30423l21336j48996K7316N454p4080o3476
33635a49136o008J09625L22319L71860n240m05477j59027M68784M39700l77515
33625F09885p97969j87104M29192O1222n31706j36229P52159O66671l68514q28331
$$ y = [409241, 488074, 235687, 41035, 2999, -142143, -512428, -771302, -546552, -66572, -49713, -794284, -1629805, -1606499, -640025, 403522, 793402, 707963, 742706, 1000925, 1038341, 568126, -153138, -685527, -883415, -888594, -825615, -707640, -601036, -650475, -821107, -794335, -372667, 83643, -26924, -701343, -1157691, -763447, 127973, 612242, 344218, -163803, -297191, -19935, 261213, 233385, -35871, -205757, -5655, 459070, 800183, 813927, 698924, 682225, 656405, 425982, 104646, -44350, -17034, -11580, -85660, -149136, -155144, -45519, 276800, 648660, 643420, 237943, 78916, 547700, 987400, 609885, -188084, -375188, 54004, 115226, -416480, -552709, 199450, 866121, 497607, -330724]
33615c30724j47007M49092k4413q44001q38905o4260N77508O65382M57680K31181
33605A31533P1132M4193J01084N201l12763n39193l84600o205K13295J56250M7351
33594d72722J22981L28451L39451m6109n14031m83595R1861N16031K47876l47554
33584b17360n68062l35222m8180J84701M92930O62197L54298j99674m36759l11710
33574d22841k13953j61707J19706M00416J51106m05926m24157J96323N46210J50626
33564f4197k89722j02653K98730K24651j60351k69121j04907p5881j81985j17323
33554h42759O8375P5858l7258M6295K89699L18148K7406k69839l21024j92480
33544h37579k7614J33024K24539J10730k01719m32007k60817K69249O79252N45136
$$ y = [-330724, -477731, -28639, -53052, -897053, -1735958, -1800218, -1222710, -557328, -99648, 131533, 202665, 246858, 347942, 353143, 40380, -498813, -883413, -889618, -676323, -520073, -472722, -349741, -21290, 318161, 272052, -241979, -725574, -633713, -117682, 130194, -217360, -785422, -1120644, -1168824, -984123, -491193, 171004, 525302, 325628, -111131, -422841, -636794, -798501, -678795, -278379, -127273, -533199, -957356, -761033, -214823, -64197, -353919, -456572, -157842, 66809, -93542, -362663, -467570, -543451, -725436, -842759, -774384, -698526, -735784, -689489, -399790, -81642, -54236, -324075, -645099, -837579, -865193, -732169, -507630, -396900, -598619, -1030626, -1291443, -1022194, -342942, 202194]
33534B02194P4053q0711K71758M89981k852p75549r02373k42732M39867O01196
33524G4832M68917L62736J58659k59612n62469l84863J47347N79338N80855J30697
33514A296437m46099n92527p7657N29395M35112k70080o55094k40135L76951M47719
33504H04022L5438l11807l53038k17080n1097L4549l8220j21656O3005M69388
33494C13504P01225N60805K41819q1827l86805m86360j75092K34840J82369k27289
33484H77189l12359L7682J57113k07765m46660k14418l7365k46506k77701K54046
33474d16744O90476L77932k20275l40745j06786J2917J76884N76742O02105k10874
33464A141632j008019o97867K60033N16623n0430l29593P5453L87641K08472O9096
$$ y = [202194, 276247, 195536, 467294, 957275, 954423, 178874, -723499, -966231, -526364, 74832, 543749, 906485, 1065144, 805532, 243063, -141800, 5547, 584885, 1165740, 1296437, 850338, 257811, 180154, 709549, 1144661, 874581, 219487, -20648, 356303, 804022, 839460, 527653, 174615, -42465, -93562, -59013, -97233, -218889, -155884, 313504, 1014729, 1575534, 1817353, 1735526, 1348721, 862361, 687269, 922109, 1104478, 877189, 564830, 602512, 759625, 551860, 105200, -109218, -146583, -393089, -670790, -416744, 273732, 651664, 431389, 90644, -16142, -3225, 173659, 750401, 1352506, 1141632, 133613, -564254, -304221, 212402, 161972, -167621, -92168, 295473, 503945, 573041]
33454E73041J80221M004n33122o69668j38725K99752J81920N7335K92763L20377
33444E67898j58665l45421K94931Q25126J92244r39101j053450p3817N90972K12172
33434A12889l52916j76195M33732O53667L58980o011k32161l88222l70730j5980
33424A7053M40031N25794J93593r4369l9409J04289Q556j96080k02768j11550
33414F45140k71336o00873n74598j3516N63103O16305K36043j65384m27286n47829
33404e40231l82364Q6171M40422L11427j8555j8792K49992K76582l5284k84784
33394H4584l28311m24917n44412k54736M45311Q42924M57691k44426n08585k46154
33384g21031R5851K60561L05323K49047N8524j39652j96129j78568j88228j05985
$$ y = [573041, 753262, 757266, 224144, -445524, -584249, -284497, -102577, -45242, 247521, 567898, 409233, 63812, 358743, 1183869, 1376113, 437012, -616438, -690255, -99283, 112889, -240027, -416222, 17510, 671177, 1030157, 1024146, 791985, 403763, 33033, 17053, 457084, 982878, 1176471, 1082102, 1042693, 1146982, 1155538, 959458, 756690, 645140, 373804, -227069, -801667, -815183, -252080, 364225, 600268, 434884, 7598, -540231, -922595, -836424, -396002, -84575, -103130, -121922, 128070, 404652, 369368, 84584, -243727, -668644, -1213056, -1467792, -1022481, -179557, 278134, 33708, -474877, -721031, -625180, -364619, -59296, 189751, 248275, 108623, -87506, -266074, -454302, -560287]
33374e60287J59446L49955J80892j26209p8633L19138M82919P7892m58004m95404
33364a48295o0574K51681J09845j92450k73933j98059k09376k05719R6782N40044
33354b90054N59963L878n19832m22158O0294K42211l2922k50823j7059M23090
33344b43412N44001J61027l88722n64337j56458M05942M53744q0831n06390l07206
33334f82642J22394J07557k77581m12442j46006R3362J30929K44239M63672M18431
33324F1913P2241r9160M9285P277m66783p50041k53527N78930Q22636L27651k03070
33313A47352k46125L614J25750M1071m0920J7835J04803j1063l55854n99188m04700
33302a217425P8927L48250J99190o7111j45955o1119R0143K93418L89813J70695
$$ y = [-560287, -400841, -50886, 130006, 3797, -74836, 244302, 727221, 805113, 347109, -148295, -208869, 42812, 152657, -39793, -313726, -511785, -721161, -926880, -830098, -290054, 269909, 273787, -246045, -668203, -607909, -365698, -398620, -649443, -666502, -243412, 300589, 461616, 72894, -491443, -647901, -241959, 211785, 130954, -375436, -682642, -560248, -452691, -730272, -1142714, -1288720, -1195358, -1064429, -820190, -356518, 61913, 134154, 34994, 84279, 91556, -375227, -1125268, -1378795, -799865, 22771, 350422, 147352, -98773, -95159, 30591, 71662, 30742, 48577, 153380, 142317, -213537, -812725, -1217425, -1138498, -790248, -591058, -658169, -804124, -865243, -775100, -481682, -91869, 78826]
33292G8826j36153l0163L81992L32981l88605q90371m70516K09345J17170m75616
33282a271110l85767N88236J266746P66556l27498q45379m47349K41200M86538
33273G2173J07586m65238o19542k30387J50811N5521j73319N9855N22768M25034
33263i4738k39587n48795j04994L07351K9495l79054j27188M24856L52386k73943
33253f54211m81466M9779N41608L88484j3068o1956J30272J04836j50317k75709
33243d21748j19258J73914M41476N45871L55159k739j04339J96135M00267J4216
33233A478954o32371p62584k68084J62218J01198o4911R8409L43202K13954j81358
33223D88627l90344l10128j48209O4010L53731L96931j09365p26507o42883J38326
$$ y = [78826, -57327, -87490, 294502, 627483, 238878, -651493, -1122009, -912664, -795494, -1271110, -1656877, -1068641, 198105, 964661, 637163, -208216, -655565, -414365, 72173, 179759, -285479, -905021, -1135408, -984597, -929076, -1102395, -1042540, -519772, -94738, -334325, -883120, -988114, -680763, -651268, -1030322, -1157510, -732654, -380268, -654211, -1135677, -1085898, -544290, -155806, -168874, -230830, -100558, 4278, -146039, -421748, -541006, -367092, 74384, 620255, 975414, 972675, 868336, 1064471, 1464738, 1478954, 846583, 83999, -184085, -21867, 79331, 14420, 112829, 456031, 669985, 488627, 98283, -211845, -360054, -296044, 57687, 454618, 345253, -381254, -1024137, -885811]
33213h85811O82383M17467j36380k73654p4098K1807J1787Q0849L2010l18820
33203d42460n42560j64389M27416M68191N2938k0250L80618N00084M1919k58086
33193D43421J35340O20427M05596k73278o10955m25766j60590l8839N3702O6738
33183B15796j50896m09576l88675j65512j1760J33277M06637M96908R5363l42467
33173a20905j39443M18280M17402j46657k90112K50147M36635l32777j031517
33164e38947n03238O89404J061619L43078l58996l11579N4728J45520J7306k8129
33154E70766O2099K20199L42796J70215l98402q93491p67176k35948M0103L0241
33144h58598K48302O11646M10598l61268p18381j94952L61405J67858k48201m2448
$$ y = [-885811, -203428, 214039, 77659, -195995, -270093, -248286, -236499, -155650, -123640, -442460, -985020, -1149409, -721993, -253802, -200864, -221114, 159504, 659588, 701507, 443421, 578761, 1199188, 1604784, 1331506, 720551, 294785, 134195, 95356, 149058, 215796, 64900, -344676, -733351, -898863, -910623, -777346, -370709, 126199, 221562, -120905, -260348, 157932, 575334, 428677, 138565, 388712, 825347, 492570, -538947, -1042185, -352781, 708838, 1051916, 692920, 381341, 436069, 581589, 598895, 570766, 632865, 853064, 1195860, 1366075, 967673, 74182, -692994, -928942, -888839, -858598, -610296, 1350, 411948, 50680, -667701, -862653, -501248, -333390, -581591, -624039]
33134f24039M82963M48383r5522l23831k5765K13157J31521J25704L91226N64007
33124A287804L76256m040m11714q43256j078920p70269n7086M58651M97766L53264
33114a91544K70314J42995m3652n0370J41241K10882M2239j11554j39474j94820
33104G6257j78781K25621P80047P16885m8784m96777Q1021Q96350P12445l73732
33094B390552j112915q66476k71659j00829k89568l74911k57052j13755M1823
33085i54790K94303N06619M16077J2625m01346n44891m13601j60783J58324N66975
33075e20488Q86232P18458m2108q23324q86892k44772L46148M08474K81561L81537
33065E04826M54242Q4089m32610m11103J51970N12653K43681k47110m37566l71185
$$ y = [-624039, -141076, 307307, 211785, -112046, -137811, 75346, 206867, 332571, 723797, 1287804, 1664060, 1660020, 1248306, 405050, -673870, -1444139, -1501225, -1042574, -544808, -191544, 78770, 221765, 178113, 127743, 268984, 479866, 522105, 410551, 271077, 76257, -102524, 123097, 903144, 1620029, 1571245, 1074468, 1155489, 2051839, 2764284, 2390552, 1277637, 411161, 139502, 38673, -250895, -625806, -882858, -996613, -954790, -660487, -153868, 262209, 274834, -126512, -671403, -1085004, -1245787, -1087463, -520488, 365744, 1084202, 1042094, 218770, -668122, -912894, -566746, -158272, 123289, 504826, 959068, 1043157, 610547, 199444, 351414, 864067, 1107748, 860638, 423072, 51887]
33055E1887l15185k11204J01885M15463L66989J0041k29405j45168L0849L8123
33045A14275o6983p9062L8535J36688R2488n0169j24732k2038J35854P0322k87794
33034d2616n84490m12220J15086M28441K30214j33399k04556k4897Q7724J18946
33024d21767K68944M15593K07525k56471l82098O8768N43366M34304j13125m89439
33014B75600m27814j43025J09875K29902J83770O5383Q9337K44226J96972j38763
33004F85463k89803M7844L34806q6057q53758r98682l90834J19137Q4633L9881
32994a307370L94672O77728M22450K9187N3968K43982N7596k96551j84502L26112
32984D17272N04283R4507l33644l04711p2426p8797k53143j98367J71925M99499
$$ y = [51887, -263298, -474502, -372617, 42846, 409835, 419876, 190471, 45303, 76152, 114275, 47292, -31770, 6765, 143453, 235941, 185772, 61040, 39002, 174856, 245178, -42616, -627106, -1039326, -924240, -495799, -265585, -398984, -603540, -628437, -540713, -421767, -152823, 262770, 470295, 213824, -168274, -99506, 443860, 878164, 765039, 275600, -152214, -295239, -185364, 44538, 228308, 293691, 383028, 627254, 824226, 685463, 395660, 443504, 778310, 692253, -161505, -1160187, -1551021, -1431884, -1347251, -1307370, -912698, -234970, 187480, 216667, 270635, 514617, 572213, 275662, 91160, 417272, 921555, 1016062, 682418, 377707, 305281, 226484, -26659, -225026, -53101, 446398]
32974D46398M38753P0110j99369j25651O8365O475k81212l82662j38350R0807
32964f336k1279k68515k59461Q906K63893M17955N30755M81811J17292l44100
32954I20921m74996k30325p364n1399j38754N664K33479J41311l52555p74183
32944g28201n57445K29839P84737M41633m22665p48716j39972O20262O62850J74793
32934C17115l0629K51648M38906J23202l79081n47587k96483P2880K75336K49635
32924D74942J24654O1659O8492K3292o7982l5340J05606N2250k90877n25732l32181
32913c41217l4742j20601m21456l56930J19081M44076L39887J62429K13116K62936
32903B66579K2021l55292n25269m04762j37479J24704K31499R0844j29027j15619
$$ y = [446398, 885151, 955261, 755892, 630241, 698606, 705081, 423869, 41207, -97143, -6336, -27615, -296130, -555591, -546685, -282792, 135163, 665918, 1147729, 1265021, 920921, 445925, 215600, 208236, 156837, 18083, 23747, 257226, 398537, 45982, -728201, -1285646, -1055807, -271070, 170563, -252102, -1000818, -1140790, -520528, 142322, 317115, 286486, 538134, 977040, 1100242, 721161, 173574, -122909, -50029, 225307, 474942, 599596, 661255, 729747, 753039, 685057, 649717, 755323, 807573, 516696, -9036, -341217, -375959, -496560, -918016, -1274946, -1155865, -711789, -371902, -209473, 3643, 266579, 288600, -66692, -591961, -996723, -1134202, -1009498, -777999, -687155, -816182, -931801]
32893i31801J40928L00850J93909N4359P9193J15445K3520l748J89082L32197
32883D93934J19548k12755j55294K80993M86797P3663n80877q16240m91608m3636
32873h45475J56371J92422K74051L02455N1770l33426m02256m6161K67711J40111
32863b42427j72088j47264K22470M64021L61261K09374K53514K79676j1987m84747
$$ y = [-931801, -790873, -490023, -296114, -241755, -162562, -47117, -23597, -27345, 161737, 493934, 613482, 400727, 245433, 526426, 1013223, 1086886, 506009, -310231, -801839, -845475, -689104, -496682, -222631, 79824, 131594, -201832, -604088, -650249, -382538, -242427, -414515, -561779, -339309, 124712, 485973, 695347, 948861, 1228537, 1216550, 731803]
$$ [...]
##END NTUPLES=NMR SPECTRUM
##END=
