##TITLE=31Pdec_PhEDiP0606
 CDCl3, 24 sc
 7.6.2023
##JCAMPDX= 6.0         $$ Bruker NMR JCAMP-DX V2.0
##DATA TYPE= NMR SPECTRUM
##DATA CLASS= NTUPLES
##ORIGIN= UXNMR, Bruker Analytische Messtechnik GmbH
##OWNER= root
$$ XWIN-NMR		Version 3.5
$$ Wed Jun  7 15:36:21 2023 Russian Standard Time (UT+4h)  she@DPX200
##.OBSERVE FREQUENCY= 81.013821
##.OBSERVE NUCLEUS= ^31P
##.ACQUISITION MODE= SIMULTANEOUS
##.ACQUISITION SCHEME= undefined
##.AVERAGES= 24
##.DIGITISER RES= 16
##SPECTROMETER/DATA SYSTEM= spect
##.PULSE SEQUENCE= zgpg30
##.SOLVENT NAME= CDCl3
##.SHIFT REFERENCE= (INTERNAL, CDCl3, 0, 248.564)
##AUDIT TRAIL= $$ (NUMBER, WHEN, WHO, WHERE, WHAT)
$$ ##TITLE= Audit trail, XWIN-NMR		Version 3.5
$$ ##JCAMPDX= 5.01
$$ ##ORIGIN= Bruker BioSpin GmbH
$$ ##OWNER= she
$$ F:/spectra/data/she/nmr/P31/1/pdata/1/auditp.txt
$$ ##AUDIT TRAIL=  $$ (NUMBER, WHEN, WHO, WHERE, WHAT)
(   1,<2023-06-07 15:35:11.50 +0400>,<she>,<DPX200>,
      <created by zg, POWCHK disabled, PULCHK disabled
       configuration hash MD5:
       00 E9 B6 7A A2 85 ED C7 34 08 36 98 17 FE 4E 26
       data hash MD5: 32K
       60 8B A9 4F 1B 82 DC 1F 95 01 43 D1 7E 88 F4 11>)
(   2,<2023-06-07 15:35:16.18 +0400>,<she>,<DPX200>,
      <Start of raw data processing
       efp BC_mod = 2 LB = 1 FT_mod = 6 PKNL = 1 PHC0 = -10656.8 PHC1 = 2.68486 SI = 64K 
       data hash MD5: 64K
       ED CC 02 05 24 4A F7 36 51 72 A1 99 1A 9B 46 A5>)
(   3,<2023-06-07 15:35:30.96 +0400>,<she>,<DPX200>,
      <pk PHC0 = 12.57329 PHC1 = 0 
       data hash MD5: 64K
       13 D0 5C 95 5D FF 1A 9B C5 9A 89 2D 7C 0F 7B 11>)
(   4,<2023-06-07 15:35:35.00 +0400>,<she>,<DPX200>,
      <abs ABSG = 5 
       data hash MD5: 64K
       6F DC 16 DC A6 93 98 E7 F6 2E 21 2F 53 E7 20 B3>)
(   5,<2023-06-07 15:35:53.60 +0400>,<she>,<DPX200>,
      <pk PHC0 = 5.197402 PHC1 = 0 
       data hash MD5: 64K
       C5 17 7A D7 1A 46 84 58 36 78 C4 D5 28 92 59 4F>)
$$ ##END=
$$ 
$$ hash MD5
$$ 81 0F 46 02 96 1C E9 7E E1 16 82 16 AB 61 A4 2C
##$RELAX= 
##$RELAX= 
##$RELAX= 
##$RELAX= 
##$RELAX= 
##$RELAX= 
##$RELAX= 
##$RELAX= 
##$RELAX= 
$$ Bruker specific parameters
$$ --------------------------
##$DU= <F:/spectra>
##$EXPNO= 1
##$NAME= <P31>
##$PROCNO= 1
##$TYPE= <nmr>
##$USER= <she>
##$AMP= (0..31)
100 100 100 100 100 100 100 100 100 100 100 100 100 100 100 100 100 100 
100 100 100 100 100 100 100 100 100 100 100 100 100 100 
##$AQSEQ= 0
##$AQ_mod= 1
##$AUNM= <au_zg>
##$AUTOPOS= <>
##$BF1= 81.014009
##$BF2= 200.13
##$BF3= 200.13
##$BF4= 200.13
##$BF5= 200.13
##$BF6= 200.13
##$BF7= 200.13
##$BF8= 200.13
##$BYTORDA= 1
##$CFDGTYP= 0
##$CFRGTYP= 5
##$CHEMSTR= <none>
##$CNST= (0..31)
1 1 145 1 1 1 1 1 1 1 1 1 1 1 1 1 1 1 1 1 1 1 1 1 1 1 1 1 1 1 1 1 
##$CPDPRG= <waltz16>
##$CPDPRG1= <>
##$CPDPRG2= <waltz16>
##$CPDPRG3= <>
##$CPDPRG4= <mlev>
##$CPDPRG5= <mlev>
##$CPDPRG6= <mlev>
##$CPDPRG7= <mlev>
##$CPDPRG8= <mlev>
##$CPDPRGB= <>
##$CPDPRGT= <>
##$D= (0..31)
0 1 0 0 0 0 0 0 0 0 0 0.03 2e-05 3e-06 0 0 0 0 0 0 0 0 0 0 0 0 0 0 0 0 
$$ [...]
##$SUBNAM3= <"">
##$SUBNAM4= <"">
##$SUBNAM5= <"">
##$SUBNAM6= <"">
##$SUBNAM7= <"">
##$SUBNAM8= <"">
##$SUBNAM9= <"">
##$SW= 501.771253377433
##$SWIBOX= (0..15)
0 1 3 0 0 0 0 0 0 0 0 0 0 0 0 0 
##$SW_h= 40650.406504065
##$TD= 32768
##$TD0= 1
##$TE= 0
##$TE2= 300
##$TE3= 300
##$TEG= 300
##$TL= (0..7)
0 120 53 12 22 120 120 120 
##$TP= (0..7)
150 150 150 150 150 150 150 150 
##$TP07= 0
##$TPNAME0= <>
##$TPNAME1= <>
##$TPNAME2= <>
##$TPNAME3= <>
##$TPNAME4= <>
##$TPNAME5= <>
##$TPNAME6= <>
##$TPNAME7= <>
##$TPOAL= (0..7)
0.5 0.5 0.5 0.5 0.5 0.5 0.5 0.5 
##$TPOFFS= (0..7)
0 0 0 0 0 0 0 0 
##$TUNHIN= 0
##$TUNHOUT= 0
##$TUNXOUT= 0
##$USERA1= <user>
##$USERA2= <user>
##$USERA3= <user>
##$USERA4= <user>
##$USERA5= <user>
##$V9= 5
##$VALIST= <valist>
##$VCLIST= <CCCCCCCCCCCCCCC>
##$VD= 0
##$VDLIST= <DDDDDDDDDDDDDDD>
##$VPLIST= <PPPPPPPPPPPPPPP>
##$VTLIST= <TTTTTTTTTTTTTTT>
##$WBST= 1024
##$WBSW= 4
##$XGAIN= (0..3)
0 0 0 0 
##$XL= 0
##$YL= 0
##$YMAX_a= 7880
##$YMIN_a= -7907
##$ZGOPTNS= <>
##$ZL1= 120
##$ZL2= 120
##$ZL3= 120
##$ZL4= 120
##$ABSF1= 248.5645
##$ABSF2= -253.2056
##$ABSG= 5
##$ABSL= 3
##$ALPHA= 0
##$AQORDER= 0
##$ASSFAC= 0
##$ASSFACI= 0
##$ASSFACX= 0
##$ASSWID= 0
##$AUNMP= <proc_1d>
##$AZFE= 0.1
##$AZFW= 0.5
##$BCFW= 0
##$BC_mod= 2
##$BYTORDP= 0
##$COROFFS= 0
##$CY= -3
##$DATMOD= 1
##$DC= 0
##$DFILT= <>
##$DTYPP= 0
##$F1P= 0
##$F2P= 0
##$FCOR= 1
##$FTSIZE= 65536
##$FT_mod= 6
##$GAMMA= 0
##$GB= 0
##$INTBC= 1
##$INTSCL= 6.047779e-11
##$ISEN= 30
##$LB= 1
##$LEV0= 0
##$LPBIN= 0
##$MAXI= 10000
##$MC2= 0
##$MEAN= 0
##$ME_mod= 0
##$MI= 50
##$NCOEF= 0
##$NC_proc= -6
##$NLEV= 6
##$NOISF1= 182.463
##$NOISF2= 159.3651
##$NSP= 0
##$NTH_PI= 0
##$NZP= 0
##$OFFSET= 248.5645
##$PC= 4
##$PHC0= -10639.03
##$PHC1= 2.68486
##$PH_mod= 1
##$PKNL= yes
##$PPARMOD= 0
##$PSCAL= 0
##$PSIGN= 0
##$REVERSE= no
##$SF= 81.0140089999694
##$SI= 65536
##$SIGF1= 159.3651
##$SIGF2= -187.1042
##$SINO= 113.3802
##$SIOLD= 16384
##$SREGLST= <1H.CDCl3>
##$SSB= 0
##$STSI= 65536
##$STSR= 0
##$SW_p= 40650.406504065
##$SYMM= 0
##$S_DEV= 0
##$TDeff= 32768
##$TDoff= 0
##$TI= <>
##$TILT= no
##$TM1= 0
##$TM2= 0
##$TOPLEV= 0
##$USERP1= <user>
##$USERP2= <user>
##$USERP3= <user>
##$USERP4= <user>
##$USERP5= <user>
##$WDW= 1
##$XDIM= 65536
##$YMAX_p= 545298075
##$YMIN_p= -415415358
$$ End of Bruker specific parameters
$$ ---------------------------------
##NTUPLES= NMR SPECTRUM
##VAR_NAME=  FREQUENCY,     SPECTRUM/REAL,   SPECTRUM/IMAG
##SYMBOL=    X,             R,               I
##VAR_TYPE=  INDEPENDENT,   DEPENDENT,       DEPENDENT
##VAR_FORM=  AFFN,          ASDF,            ASDF
##VAR_DIM=   65536,         65536,           65536
##UNITS=     HZ,            ARBITRARY UNITS, ARBITRARY UNITS
##FACTOR=    0.620285442955139, 1,           1
##FIRST=     20137.2065510682, 0,            0
##LAST=      -20513.1999529968, 0,           0
##MIN=       -20513.1999529968, -415415358,  0
##MAX=       20137.2065510682, 545298075,    0
$$ Real data points
##PAGE= N=1
##DATA TABLE= (X++(R..R)), XYDATA
$$ [...]
38600F76049O05682R1552K28226L87396l9932n19506m75035j62651J60638N96261
$$ 676049 1281731 1373283 1601509 1988905 1948973 1429467 954432 791781 952419 1548680
38590A548680P11156j90086j452352j382775K34176J572998J359855L63502l82381
$$ 1548680 2259836 2069750 617398 -765377 -531201 1041797 2401652 2765154 2382773
38581B382773j019187j587218j165203L89808J421219O90910o43626p64988J61287
$$ 2382773 1363586 -223632 -1388835 -999027 422192 1113102 469476 -295512 -134225
38572a34225O13453J49690l29539k63349j7778j9274k91416o53996p50627k78953
$$ -134225 479228 628918 299379 36030 18252 -1022 -292438 -946434 -1697061 -1976014
38562a976014L73805M29879O5820M05566J534147J810688K51555j603497j672971
$$ -1976014 -1602209 -1172330 -1106510 -700944 833203 2643891 2895446 1291949 -381022
38553c81022k82376N18319Q145n94947l91780P7632K22672L70826P45387O98150
$$ -381022 -663398 -145079 -136934 -731881 -1123661 -1046029 -823357 -452531 292856 991006
38543I91006j78692j007619p05323K88238M33437o64034j470783o61787P64671
$$ 991006 812314 -195305 -900628 -612390 -178953 -842987 -2313770 -2975557 -2210886
38534b210886P99055m25897n95112J093695K182327N47769j889193j624350J087767
$$ -2210886 -1411831 -1837728 -2432840 -1339145 843182 1390951 -498242 -2122592 -1034825
38525a034825K430495O98355j398608j165042K80143N07087l12423m25095K12370
$$ -1034825 1395670 2094025 695417 -469625 -189482 317605 5182 -419913 -207543
38516b07543K65169k89760k76770L09021K80324m92620p89937j35244N22092M89370
$$ -207543 57626 -232134 -508904 -199883 80441 -412179 -1202116 -1337360 -815268 -325898
38506c25898K58218M00699O80877N98041K664r06300j516405r98529N85092J778545
$$ -325898 -67680 333019 1013896 1611937 1614601 708301 -808104 -1806633 -1221541 557004
38496E57004J396955K66361K5277N68732K94141j122534j938487q80870R38352
$$ 557004 1953959 2220320 2245597 2814329 3108470 1985936 47449 -833421 104931
38487A04931J514911M72495p55773q16033J42663Q36709L65130p37140j187918
$$ 104931 1619842 2092337 1336564 520531 663194 1499903 1865033 1127893 -60025
38478f0025o79469k21914m68438o86493j63902M01653J34304k95602K66477J319554
$$ -60025 -739494 -961408 -1429846 -2116339 -2280241 -1878588 -1744284 -2039886 -1773409 -453855
38468d53855J392387M88121k6538J82994J06076m56086m86097J31917J81123n46174
$$ -453855 938532 1426653 1400115 1583109 1689185 1233099 747002 878919 1060042 513868
38458E13868n74126N80197J094777l18911j986938j515820P22031K223922J760039
$$ 513868 -60258 519939 1614716 1295805 -691133 -2206953 -1484922 739000 2499039
38449B499039M02511m58636n76463m17527m59703q94311j261943p26160N91087
$$ 2499039 2901550 2442914 1866451 1448924 989221 94910 -1167033 -1893193 -1302106
38440a302106J239129L77212p08180l60687Q37487R03414m07096j201429m28694
$$ -1302106 -62977 314235 -393945 -754632 82855 986269 579173 -622256 -1050950
38431a050950N80880L40523n21598m13174P13005J310740M39561j017232j487848
$$ -1050950 -470070 -129547 -651145 -1064319 -351314 959426 1398987 381755 -1106093
38422a106093n08068Q48855J178692K72316o79099n41256L29387N82301k54587
$$ -1106093 -1614161 -765306 413386 685702 6603 -534653 -205266 377035 122448
38413A22448j059353n66192R76887K077569J701095K87372q72276r62678k86785
$$ 122448 -936905 -1503097 -526210 1551359 3252454 3539826 2667550 1704872 1418087
38404A418087K64192K35084k9220n0803N9682j29587n95815q67473p86312o99453
$$ 1418087 1682279 1917363 1888143 1837340 1897022 1767435 1171620 304147 -482165 -1181618
38394a181618p40983m90802K96988J067079J036728J74061p78172j101573o58668
$$ -1181618 -1922601 -2413403 -2116415 -1049336 -12608 161453 -616719 -1718292 -2376960
38385b376960J16596N23562K00550k97016M486J004176J226409j28418j500839
$$ -2376960 -2260364 -1736802 -1536252 -1833268 -1828782 -824606 401803 273385 -1227454
38376a227454p82107J425504K198867M04045j506676j028743P57598J033207m04710
$$ -1227454 -2009561 -584057 1614810 2018855 512179 -516564 241034 1274241 869531
38367H69531j102919J6846J159813P41993l18067n20311j20886q0474j52012K98457
$$ 869531 -233388 -216542 943271 1685264 1367197 846886 726000 645526 493514 791971
38357G91971O56963M6742q05116n36727M67238N50308n12541j175114o45008P4029
$$ 791971 1448934 1495676 690560 153833 621071 1171379 658838 -516276 -1161284 -1087255
38347a087255J12363r012K31640K78944k14048l74632M34025J225738P66466m55621
$$ -1087255 -974892 -983904 -752264 -473320 -687368 -1062000 -627975 597763 1364229 908608
38337I08608r81109n48124j27136r5256J75350Q21106R23521m4991j161596j137969
$$ 908608 -72501 -620625 -747761 -843017 -667667 153439 1076960 1031969 -129627 -1267596
38327a267596J1163R76295O85670n20377j268420o53581O47874J013973j43929
$$ -1267596 -1256433 -280138 405532 -114845 -1383265 -2036846 -1388972 -374999 -518928
38318e18928j410556r90302Q79883K024734J070045p88665j403398m11778O03505
$$ -518928 -1929484 -2919786 -2039903 -15169 1054876 266211 -1137187 -1548965 -945460
38309i45460M41732l16503m57406K53991J128941J528234J182030J32057r72333
$$ -945460 -503728 -820231 -1277637 -1023646 105295 1633529 2815559 2947616 1975283
38300A975283j101873j75583M50897j60348q92814k66367Q69388M67206j053608
$$ 1975283 873410 697827 1148724 988376 95562 -170805 698583 1165789 112181
38291A12181r82668J163756K254582L55878j879736j285814P15501O07631j233580
$$ 112181 -870487 293269 2547851 2903729 1023993 -261821 453680 1061311 -172269
38282a72269j276047R63869J963476J21318j649524r16644M97316J34341r17601
$$ -172269 -1448316 -484447 1479029 1600347 -49177 -965821 -468505 -334164 -1251765
38273a251765m11535R67412J098284K28831P9701M38498j47901j154130p79741
$$ -1251765 -1663300 -695888 402396 631227 710928 1149426 1001525 -152605 -932346
38264i32346N42714N22249j039612j674917j40510J778719K138245J210847J35563
$$ -932346 -389632 132617 -906995 -2581912 -2722422 -943703 1194542 2405389 2540952
38255B540952p50338j267759q82266J58525O45724J72992l03085k41572k69365
$$ 2540952 1790614 522855 -359411 -200886 444838 617830 314745 73173 -196192
38246a96192n41242j50364R31353J164293q6086j105361l71729R61465Q90438
$$ -196192 -737434 -887798 43555 1207848 1121762 16401 -355328 606137 1496575
38237A496575l31444q77400l49409m1231m86074o84631k826P26282N24552l47324
$$ 1496575 1165131 287731 -61678 -102909 -588983 -1273614 -1276440 -550158 -25606 -372930
38227c72930q35606l09956R20931J851525J516010j9110j449200j540710n60184
$$ -372930 -1208536 -1518492 -597561 1253964 2769974 2750864 1301664 -239046 -799230
38218g99230J71597N3183j88503K20242R33432J062204M92455j5172l4490j34786
$$ -799230 -627633 -574450 -762953 -542711 390721 1452925 1945380 1930208 1895718 1760932
38208A760932q58691j479577p41309J065649J920797O78027j165357j450413k82714
$$ 1760932 902241 -577336 -1318645 -252996 1667801 2345828 1180471 -269942 -552656
38199e52656N30343L62559J78236K50652l25508j432961j432758J84626J572060
$$ -552656 -22313 340246 518482 769134 443626 -989335 -2422093 -2237467 -665407
38190f65407J176021o8939n38627k99014j36251K42019J152603J403472k4761
$$ -665407 510614 441675 -96952 -395966 -532217 -290198 862405 2265877 2241116
38181B241116j722637j540098J21848J008789N58134K86327P21970N45916p07833
$$ 2241116 518479 -1021619 -899771 109018 667152 953479 1675449 2221365 1513532
38172A513532j475733o67205N66338O89776q6601o17571n27263j10171M06040
$$ 1513532 37799 -629406 -63068 626708 540107 -77464 -604727 -714898 -308858
38163c08858O31981P4245q09217p33693M01228Q79677l25338j618634q89108J274866
$$ -308858 323123 397368 -411849 -1145542 -744314 135363 -189975 -1808609 -2697717 -1422851
38153a422851K236373R01101j022527j543140p15383J22251L37827L56074N57306
$$ -1422851 813522 1714623 692096 -851044 -1566427 -1444176 -1106349 -750275 -192969
38144a92969O86740L41647m61339j300510j646160j120868J69873J395869J510677
$$ -192969 493771 835418 374079 -926431 -2572591 -3693459 -3523586 -2127717 -617040
38135f17040M55412m66892j14330Q08458O12382p74575j446193l60686R40173
$$ -617040 -161628 -628520 -742850 65608 677990 -96585 -1542778 -1903464 -963291
38126i63291O92218l31301k36497P62629Q18914k27083n51390L55494O84379m69025
$$ -963291 -271073 -602374 -838871 -76242 742672 515589 -35801 319693 1004072 535047
38116E35047j305419l00956J064263O08233j006313j353565k8142J012194O50603
$$ 535047 -770372 -1071328 -7065 601168 -405145 -1758710 -1786852 -774658 -124055
38107a24055l5466P9880N03950K73456n31151j141570j131666n65799K49655Q21079
$$ -124055 -159521 -79641 424309 697765 166614 -974956 -2106622 -2672421 -2422766 -1601687
38097a601687Q21599N76774O55424R31591P26949m5801o58408o84810n72131p49373
$$ -1601687 -780088 -203314 452110 1383701 2110650 2064849 1406441 721631 149500 -599873
38087e99873q52690l36016O04246J201852R93265K30178l93838l13454L43561
$$ -599873 -1452563 -1788579 -1184333 17519 1010784 1240962 847124 533670 877231
38078H77231P21648J43544r24321j329740p67086j99986m17604q32801l76297
$$ 877231 1598879 1742423 818102 -511638 -1278724 -1478710 -1896314 -2729115 -3105412
38069c105412Q28526J506683Q96952l46304j080801r08759j88624O50318J280764
$$ -3105412 -2276886 -770203 126749 -219555 -1300356 -2209115 -2397739 -1747421 -466657
38060d66657J276069M06250q14509j404174r49129k3922N72998O21885L38919
$$ -466657 809412 1215662 401153 -1003021 -1952150 -1976072 -1403074 -781189 -442270
38051d42270q0010l87728k00609M56490Q25951K67227p56456j178133o73783J49564
$$ -442270 -522280 -910008 -1110617 -654127 171824 439051 -317405 -1495538 -2169321 -2019757
38041b019757P49164J027464Q27304M9082o35140l01148O60391O75187o96810
$$ -2019757 -1270593 -243129 584175 633257 -1883 -303031 357360 1032547 335737
38032C35737j768795j060613M15148O07878n03487r92427r380J028401P72335
$$ 335737 -1433058 -2493671 -2078523 -1470645 -1974132 -2966559 -2975939 -1947538 -1175203
38023a175203m2869M6242Q76990R99599n155q78582n69429K89566L94718m17028
$$ -1175203 -1218072 -1171830 -294840 704759 699604 -178978 -748407 -458841 -64123 -481151
38013d81151j149436j099171m94023K20599Q36849R89282K76624p72748q13910
$$ -481151 -1630587 -2729758 -3223781 -3003182 -2166333 -1177051 -900427 -1673175 -2487085
38004b487085M72427J508980Q38480p04977j162427k80446M10336J57031j48048
$$ -2487085 -2014658 -505678 332802 -372175 -1534602 -1815048 -1404712 -1247681 -1395729
37995a395729J09535K62447r3114k07227K52048K47539q22545j664458q42684
$$ -1395729 -1286194 -1023747 -1116861 -1324088 -1072040 -824501 -1647046 -3311504 -4154188
37986d154188R64185J895757J407758M95629l649k4426L42600Q08070O00830n83206
$$ -4154188 -3190003 -1294246 113512 609141 605492 581066 923666 1731736 2332566 1749360
37976A749360j699596j540554l93628N84007J075401J379803J110266j80575j401595
$$ 1749360 49764 -1490790 -1884418 -1300411 -225010 1154793 2265059 2084484 682889
37967F82889q56276J101234K140237J101551n50045j024872m84162j86551n46831
$$ 682889 -173387 927847 3068084 4169635 3619590 2594718 2110556 1924005 1377174
37958A377174j000676j037584n90654Q8519M84305K67324j02931Q7532N86076
$$ 1377174 376498 -661086 -1251740 -1163221 -678916 -411592 -514523 -426991 159085
37949A59085M37610l64436o69038m1686L89121k77039j168376r23383K64205J013685
$$ 159085 596695 232259 -436779 -478465 -89344 -366383 -1534759 -2458142 -2193937 -1180252
37939a180252P27905J24521m1654J56512L36664M79063P51484R82516O72846l42915
$$ -1180252 -452347 -327826 -369480 -212968 123696 602759 1354243 2336759 3009605 2666690
37929B666690j369898j382961l14686O17320L74165n05300o99382L660N52390
$$ 2666690 1296792 -86169 -400855 216465 590630 85330 -614052 -610392 -58002
37920e8002K80204l16832n75326m68398j72474K75348N99362L97826q8267j33120
$$ -58002 222202 -94630 -669956 -1138354 -1310828 -1035480 -436118 -38292 -126559 -259679
37910b59679L11844M93974J37527j41491k4685k1609l37426l17498L19419P55437
$$ -259679 52165 546139 683666 542175 517490 495881 158455 -159043 160376 915813
37900I15813M03742n231L61088R70636P79923p4483o06453o00674p16277j099341
$$ 915813 1319555 1314324 1675412 2646048 3425971 3351488 2745035 2144361 1428084 328743
37890C28743j018421j09719Q39461P86548k55607j166107r76283l5466L60844
$$ 328743 -689678 -799397 40064 826612 571005 -595102 -1571385 -1606851 -1246007
37881a246007l14959r34861k04367J293684J640729K60672j148545r02021M68932
$$ -1246007 -1560966 -2495827 -2700194 -1406510 234219 494891 -653654 -1555675 -1086743
37872a086743J115363L02505r04000j087928k5173J135710J092116j7611n37543
$$ -1086743 28620 331125 -572875 -1660803 -1685976 -550266 541850 524239 -13304
37863a3304N38897J816288J203637q94116j892515p50327O70914O98832J45275
$$ -13304 525593 2341881 3545518 2651402 758887 8560 679474 1378306 1523581
37854A523581J95484R3756j079122j998728r39111J018045J232171m73934j579046
$$ 1523581 1719065 1812821 733699 -1265029 -2204140 -1186095 46076 -427858 -2006904
37845b006904p03793O72672Q09962l8963p45141r94101r32109m04329N25462J189566
$$ -2006904 -2710697 -2038025 -1228063 -1267026 -2012167 -3006268 -3938377 -4342706 -3817244 -2627678
37835b627678J167741Q12216M72349m272n71318o41904p17O52940O37875K08648
$$ -2627678 -1459937 -647721 -175372 -179644 -750962 -1392866 -1393583 -740643 -102768 105880
37825A05880L8400K37721L53306O2921m44955o50246k34751L99016M12211k99945
$$ 105880 144280 382001 735307 798228 353273 -296973 -531724 -132708 279503 -20442
37815b0442o90422n459Q59064N21417o88417j066366r7659Q00048N13039k20988
$$ -20442 -710864 -716323 142741 664158 -24259 -1090625 -1188284 -388236 124803 -96185
37805i6185k84610M6305r4541m92246k65422N13369Q44376L42713k79009l56026
$$ -96185 -380795 -334490 -429031 -921277 -1186699 -673330 171046 513759 234750 -121276
37795a21276n3228J83184K33165P7545m14030j049672j138745k96127Q20345J148258
$$ -121276 -174504 8680 241845 319390 -94640 -1144312 -2283057 -2579184 -1758839 -610581
37785f10581N35841j48502k81758k05577l78562m92296p4948N31373O46001L83975
$$ -610581 -74740 -223242 -505000 -710577 -1089139 -1581435 -1656383 -1125010 -479009 -95034
37775i5034L35403L07215l94788j346966j102019N30015J659551Q01224q90121
$$ -95034 240369 547584 152796 -1194170 -2296189 -1766174 -106623 694601 -195520
37766a95520j177648J50776J181699O49789n60379q97203r4582P99012P72430
$$ -195520 -1373168 -1222392 -40693 609096 48717 -848486 -943068 -144056 628374
37757F28374j46822j037955j080264l83082L10777O14959P06880O30575J91872
$$ 628374 481552 -556403 -1636667 -2019749 -1708972 -1094013 -387133 243442 435314
37748D35314l37018l53600j7665j43120o77586o00019J57322K72754o17421r12059
$$ 435314 98296 -255304 -272969 -416089 -1093675 -1693694 -1536372 -1263618 -1881039 -2793098
37738b793098K69664J213933L24310r57150l93779J186557J181348m15649j106008
$$ -2793098 -2523434 -1309501 -985191 -1942341 -2336120 -1149563 31785 -383864 -1489872
37729a489872j55735M98328j1295j14578Q38681J011836m85006j411322J04436
$$ -1489872 -1645607 -1147279 -1158574 -1273152 -434471 577365 92359 -1318963 -1214527
37720a214527K121266J627469p60557j719028j96781J301742O26878j144918j640110
$$ -1214527 906739 2534208 1773651 54623 -142158 1159584 1786462 641544 -998566
37711i98566m17795R31713J157707O31939K81418J60147l01842j007620j097106
$$ -998566 -1416361 -484648 673059 1304998 1586416 1746563 1444721 437101 -660005
37702f60005l58805K39861R6334P9447R86892J768137Q86738j053881j909990
$$ -660005 -1018810 -778949 -682615 -603168 383724 2151861 3038599 1984718 74728
37693G4728j097246j39844K6505J95058P81602P32094l82834j075235j86296J063142
$$ 74728 -1022518 -1162362 -1135857 -940799 -159197 572897 190063 -885172 -1071468 -8326
37683h326Q51204n10998j192927m59686P17936J180709O11426n04525j127378
$$ -8326 842878 331880 -861047 -1320733 -602797 577912 1189338 684813 -442565
37674d42565m58774Q44222J084005j61475j235202q25370P1684n8778o66251j31458
$$ -442565 -901339 -57117 1026888 865413 -369789 -1195159 -1123475 -1182253 -1848504 -1979962
37664a979962J341632J777017L16867j569405k053255r42694O03751J470628J351125
$$ -1979962 -638330 1138687 1455554 -113851 -2167106 -3109800 -2506049 -1035421 315704
37655C15704O51445j05007q24931j554856j734244o41758J093921J599981J97223
$$ 315704 967149 862142 37211 -1517645 -3251889 -3893647 -2799726 -1199745 -1002522
37646a002522j350005j149319K13341P96202K80280R8900Q47650J336226N86982
$$ -1002522 -2352527 -3501846 -3288505 -2492303 -2212023 -2113123 -1265473 70753 657735
37637F57735n82526o79944M75324J490071R46341r55456k342458j597102N97476
$$ 657735 75209 -604735 -129411 1360660 2307001 1351545 -990913 -2588015 -1990539
37628a990539J841310R50707o25923r52648j23366M24391K27679K4634J47419
$$ -1990539 -149229 801478 175555 -777093 -900459 -476068 -248389 -223755 -76336
37619g6336J35398j56481k98848j73023j12813j60940o2854P9274k515n3145L11488
$$ -76336 59062 -97419 -396267 -569290 -682103 -843043 -905897 -826623 -829138 -882283 -570795
37608e70795P05969M47115k10818l55264R9940K77855j93259n93925k77394M28299
$$ -570795 135174 582289 371471 16207 116147 394002 200743 -393182 -670576 -242277
37598b42277Q08589N83609j01936q76101j107960l44097Q73358J202676M3201
$$ -242277 566312 1149921 1047985 171884 -936076 -1280173 -406815 795861 839062
37589H39062j433458j406916L56916J926877J397821n65581j337547J58314J739088
$$ 839062 -594396 -2001312 -1644396 282481 1680302 1114721 -222826 -64512 1674576
37580A674576R44907j270099j803313K3152J589289J072623j30133k30186R7032
$$ 1674576 2619483 1349384 -453929 -430777 1158512 2231135 2101002 1870816 1967848
37571A967848m81446j250524q14565K29969L54104j81001m1145M99019P7368r68377
$$ 1967848 1486402 235878 -578687 -348718 5386 -175615 -216760 282259 359627 -608750
37561f08750q60674N66420J438519P67546l05530o30132m77857l25005J3932M05773
$$ -608750 -1469424 -903004 535515 1303061 997531 367399 -110458 -435463 -421531 -15758
37551a5758J57377n71176n69825M88855J232377M97953r90215j606410p45228
$$ -15758 141619 -429557 -999382 -510527 721850 1219803 229588 -1376822 -2122050
37542b122050P40738J440409N66531j133381j791603n50929J092501J188557R7047
$$ -2122050 -1381312 59097 625628 -507753 -2299356 -2850285 -1757784 -569227 -472180
37533d72180j92424P93594J439475P55708k44673m27632j13718m2215j75349k96908
$$ -472180 -664604 128990 1568465 2324173 2079500 1651868 1538150 1495935 1320586 1023678
37523A023678o17135j085631j105677m78631K51820O85165Q53159N83567k38568
$$ 1023678 406543 -679088 -1784765 -2263396 -2011576 -1326411 -473252 110315 -128253
37514a28253q04914k37974O62516K45589j223035j575883o4140J362933J039048
$$ -128253 -933167 -1171141 -508625 -263036 -1486071 -3061954 -3126094 -1763161 -724113
37505g24113n0429j70313M89009N84090m2439l46037J44865P17534M45776p67442
$$ -724113 -774542 -944855 -455846 128244 85805 -260232 -115367 602167 1047943 280501
37495B80501j855716j352126Q04044K557897K070778L71452r3661P26986N32940
$$ 280501 -1575215 -2927341 -2123297 434600 2505378 2876830 2783169 3510155 4043095
37486D043095j252071k245176r52489Q11178R19154L1253j60720K07543R9733
$$ 4043095 2791024 545848 -406641 404537 1323691 1354944 1194224 1401767 1501500
37477A501500k68106k13496j46111m82931l82948N98299J046950j20115j434720
$$ 1501500 1233394 1019898 873787 390856 7908 606207 1653157 1533042 98322
37468I8322j042569K26540L49564m54273l76059O75123J054265K79204m83941
$$ 98322 -944247 -717707 -368143 -822416 -1198475 -523352 530913 810117 326176
37459C26176o23379n67393k91756N29778J112031M17549p71001p60299K59948
$$ 326176 -297203 -864596 -1156352 -626574 485457 903006 132005 -628294 -368346
37450c68346N24975l13787p76329j89289N08434P60970R99299J050699J88113
$$ -368346 156629 -157158 -933487 -1122776 -614342 146628 1145927 2196626 2384739
37441B384739r45774p70634M65759P25732m55576j133995l23840L49810l60427
$$ 2384739 1438965 668331 1134090 1859822 1404246 270251 -53589 296221 -64206
37432f4206j087993l14123R48637R01006j28793n03064M6689M06464Q4943l20146
$$ -64206 -1152199 -1466322 -517685 383321 254528 -248536 -201847 204617 289560 -30586
37422c0586k75362J58476N65778L35725o96352j406237m30124J461295J746211
$$ -30586 -305948 -147472 418306 754031 57679 -1348558 -1778682 -317387 1428824
37413A428824k08718j838548j096552N17066N93694l66332l22056N37796L83554
$$ 1428824 1220106 -618442 -1714994 -1197928 -604234 -970566 -1292622 -754826 -371272
37404c71272o69452p09527L76085N51837p09526j359022k51520R87640Q38747
$$ -371272 -1040724 -1750251 -1374166 -822329 -1531855 -2890877 -3142397 -2154757 -1316010
37395a316010K23015L90896O19440p8783p36906j08693P87914J74140j295707
$$ -1316010 -1092995 -702099 -82659 -161442 -898348 -1007041 -219127 -44987 -1340694
37386a340694j303148M48993J658276P89946r63034j659706r59252K04422J033479
$$ -1340694 -2643842 -2194849 -536573 253373 -709661 -2369367 -3328619 -3124197 -2090718
37377b090718J202297O91322p0512m88837n18099m99522l27362L24088J006687
$$ -2090718 -888421 -197099 -267611 -756448 -1274547 -1774069 -2101431 -1777343 -770656
37368g70656Q96193K45501J30659N87324N07099k70679m83681K82950O70539r0654
$$ -770656 125537 371038 501697 1089021 1596120 1325441 841760 1124710 1795249 1704595
37358A704595p20675j90582K83125o14673j695920j058348O41882J136142O3954
$$ 1704595 983920 793338 1076463 461790 -1234130 -2292478 -1650596 -514454 -450500
37349d50500q88082r35368q02838n65636N41893J957098J930411L76559o88348
$$ -450500 -1338582 -2273950 -3076788 -3642424 -3100531 -1143433 786978 1163537 475189
37340D75189k22576M77141K31398l18270l74692l56506n92079n10691j36589n04782
$$ 475189 252613 729754 961152 642882 268190 -88316 -680395 -1191086 -1327675 -1832457
37330a832457j540653j504441K10722J701048J397902L75799K46316O41388N70289
$$ -1832457 -3373110 -4877551 -4666829 -2965781 -1567879 -1192080 -945764 -304376 265913
37321B65913M53615Q08519O15819q11785j890559j038001N28057P34347N9627
$$ 265913 719528 1528047 2143866 1332081 -558478 -1596479 -1068422 -334075 -274448
37312b74448K72452R48845L49635r88721q57482O56471J114775j04837p97411
$$ -274448 -1996 946849 1296484 307763 -549719 106752 1221527 1116690 319279
37303C19279J79112J006239J11415j302507j441145n78683J5453J78775L91051
$$ 319279 498391 1504630 1616045 313538 -1127607 -1706290 -1690837 -1512062 -1121011
37294a121011M82324J65206j12772N1490K39355P4957k5007K62667M52349J66412
$$ -1121011 -638687 -473481 -586253 -534763 -295408 -220451 -245458 17209 469558 635970
37284F35970j53076j78737l82126r62546j034873R0834J519577J754573O99476
$$ 635970 482894 304157 -77969 -1040515 -2075388 -1984554 -464977 1289596 1989072
37275A989072l09738l74464r2576n15976j550047j892545o72719J227965K065834
$$ 1989072 1679334 1304870 1212294 696318 -853729 -2746274 -3418993 -2191028 -125194
37266a25194J365202L15521j45183m97267j238568j551807n75588R18419J495699
$$ -125194 1240008 1555529 1410346 913079 -325489 -1877296 -2452884 -1534465 -38766
37257c8766J031411M05635m9989m05254k21523O26358R93900N5971r82005o98526
$$ -38766 992645 1398280 1348291 943037 721514 1347872 2341772 2397743 1415738 717212
37247G17212k6857o19269j525297m95478J814441K304951L21212j316309r09753
$$ 717212 690355 71086 -1454211 -1949689 -135248 2169703 2490915 1174606 264853
37238B64853j65605o49113j170666m69340L27296m645m19864L24637J275419J078994
$$ 264853 99248 -549865 -1720531 -2189871 -1862575 -1867220 -2287084 -1962447 -687028 391966
37228C91966L56993K21307J25569p04103j292242n41771N71410N81256R365J22596
$$ 391966 748959 970266 1095835 391732 -900510 -1442281 -870871 -289615 -280250 -157654
37218a57654M75729m8802q47225n75391L43913M83896k2935P1163O89933O58346
$$ -157654 318075 269273 -577952 -1153343 -809430 -325534 -348469 -277306 412627 1070973
37208A070973n693j35939M38763O87573J80568n36994j117372j459265j049225
$$ 1070973 1065280 929341 1368104 2055677 2236245 1699251 581879 -877386 -1926611
37199a926611J98058J030278M38090n22259k74662O45120N59877l81462n29042
$$ -1926611 -1728553 -698275 -260185 -782444 -1057106 -411986 147891 -233571 -762613
37190g62613L11591O54264M4428l37274J0459K15476J2491K67949R75385P65346
$$ -762613 -451022 203242 247670 -89604 -79145 136331 148822 416771 1392156 2157502
37180B157502p79535k061363j628901m6425J163252J300936O26220k47520o05418
$$ 2157502 1377967 -683396 -2312297 -2358722 -1195470 105466 731686 484166 -121252
37171a21252j36677N67331P49950N35089L38247j93857j292519j773834n10544
$$ -121252 -257929 309402 1059352 1594441 1932688 1738831 446312 -1327522 -1838066
37162a838066J241276J198621l93014r96230J87683J024150M6361j262167j079591
$$ -1838066 -596790 601831 208817 -787413 -599730 424420 470781 -791386 -1870977
37153a870977p260L74459O1509Q0982N73663R20719R44300P86848L25735l46015
$$ -1870977 -1878237 -1503778 -1442269 -1361287 -787624 133095 1077395 1864243 2189978 1843963
37143A843963n88075j34870L88100M36695J85459k18237r53983j636444j353540
$$ 1843963 1255888 1121018 1509118 1945813 2131272 1913035 959052 -677392 -2030932
37134b030932j50792P47143P16010M24843L04841j01297o76972m05421O38729
$$ -2030932 -2181724 -1434581 -718571 -293728 11113 -90184 -767156 -1172577 -533848
37125e33848Q22185m13945j313509n52178O20748O21466J32008M91908J065070
$$ -533848 288337 -125608 -1439117 -1991295 -1370547 -749081 -617073 -125165 939905
37116I39905M85726o70668q34043j71728j1057k26947L40344J295113J063113
$$ 939905 1425631 754963 -79080 -250808 -261865 -488812 -148468 1146645 2209758
37107B209758k08138o43471J68036M08154q28732j845662r59291R22966J726008
$$ 2209758 2001620 1358149 1526185 1934339 1105607 -740055 -1699346 -776380 949628
37098I49628J041186J69494L476J18006j64776o95932p63065j67463K93565k29392
$$ 949628 1990814 2160308 2163784 2281790 2117014 1421082 658017 490554 784119 554727
37088E54727j266031j334155K8659J410980J409270M75288j13249k47696o18321
$$ 554727 -711304 -2045459 -2016800 -605820 803450 1278738 1165489 917793 299472
37079B99472j067185q98703l78960k76809k47490N57505J510113J139852k36320
$$ 299472 -767713 -1666416 -2045376 -2322185 -2569675 -2012170 -502057 637795 401475
37070D01475o91541J54842M48474o55974j375652k64108J262580J173002j1703
$$ 401475 -290066 -135224 313250 -342724 -1718376 -1982484 -719904 453098 441395
37061D41395l68515K36650L30063l91913o82238j03355K27676l37550q51822l75622
$$ 441395 72880 309530 639593 247680 -434558 -537913 -310237 -647787 -1499609 -1875231
37051a875231N08403O27602j08460p67830p05514j51559L35830N08168M97842
$$ -1875231 -1366828 -739226 -847686 -1615516 -2321030 -2472589 -2136759 -1628591 -1130749
37042a130749N25363O31223O30189K81850m63324j272004j474903o34751O59765
$$ -1130749 -605386 25837 656026 937876 474552 -797452 -2272355 -2907106 -2247341
37033b247341R95791j97416j481473r38409J118233K235734J085493p07496r64245
$$ -2247341 -1251550 -1448966 -2930439 -3868848 -2750615 -514881 570612 -136884 -1101129
37024a101129L3152M16990j94627l95266L92138R24564K90666n49048l25287N79132
$$ -1101129 -1067977 -650987 -845614 -1240880 -848742 75822 366488 -182560 -507847 71285
37014G1285Q50815K16611m21247m50600j27406J97357N32581Q29102Q03200L81962
$$ 71285 922100 1138711 717464 266864 139458 336815 869396 1698498 2501698 2883660
37004B883660j47132n65513q83444r85416o12180Q5471M37359O0176n56053o81718
$$ 2883660 2736528 2171015 1287571 302155 -310025 -224554 212805 272981 -283072 -964790
36994i64790l33549j45226l63760n23620k07823L69960P64956Q43565O28669N2459
$$ -964790 -1298339 -1443565 -1807325 -2330945 -2538768 -2168808 -1403852 -560287 68382 120841
36984A20841o65920p91026Q1161J129221J083777k5708p52984j89368Q00014R06902
$$ 120841 -545079 -1336105 -1254944 -125723 958054 932346 179362 -10006 790008 1696910
36974A696910K11907k48372k71735o31916j429753j571534m51604Q34495Q79460
$$ 1696910 1908817 1660445 1388710 756794 -672959 -2244493 -2696097 -1861602 -982142
36965i82142k1392l36189M04026R49384K97390p36071p33447J93328O11501k2470
$$ -982142 -1003534 -1339723 -935697 13687 311077 -424994 -1158441 -965113 -353612 -376082
36955c76082n44234J07305J239437J417167N42905j34598M6715K93329k73522
$$ -376082 -920316 -813011 426426 1843593 2386498 2251900 2298615 2591944 2318422
36946B318422j231444j444652n70034O29655J281830J213402P91137L31423j71723
$$ 2318422 1086978 -357674 -927708 -298053 983777 2197179 2988316 3319739 3148016
36937C148016p94320j273947j106848k62001M83374M01703j63613k68521K17120
$$ 3148016 2353696 1079749 -27099 -289100 194274 595977 432364 163843 380963
36928C80963M67295O6248l94202l91550k18669j77137L5476M84382M81363k52635
$$ 380963 848258 914506 520304 128754 -89915 -267052 -231576 252806 734169 481534
36918D81534p96762m03648J79675n6645o31410m79716M4811k23474j006468p80068
$$ 481534 -315228 -718876 -539201 -595846 -1227256 -1706972 -1662161 -1885635 -2892103 -3672171
36908c672171P22942J948477J763215P29163j83521o85660o59917o8180L07587
$$ -3672171 -2949229 -1000752 762463 1491626 1308105 622445 -37472 -105652 201935
36899B01935l89915j316577p40266R45557J243819n18294j689984k86986J758366
$$ 201935 -187980 -1504557 -2244823 -1299266 -55447 -573741 -2263725 -2550711 -792345
36890g92345J517385n28574j548432o59699M57674O18307L11642M5719k76251
$$ -792345 725040 196466 -1351966 -2011665 -1553991 -935684 -624042 -578323 -854574
36881h54574l48352K57460Q68155N20659k39115k07394J79277m56075j636845
$$ -854574 -1202926 -945466 -77311 443348 204233 -3161 176116 -279959 -1916804
36872a916804j376925M84209J758136J271127L74444K81535K19369n86877j169559
$$ -1916804 -3293729 -2809520 -1051384 219743 594187 875722 1095091 508214 -661345
36863f61345n29558N49913Q36364M59970J48516p1728k65930K3781O70032N85826
$$ -661345 -1190903 -640990 195374 655344 803860 732132 466202 489983 1160015 1745841
36853A745841m13587q45051O1819P81375j08942j414507j142283L27910R96115
$$ 1745841 1332254 487203 549022 1330397 1221455 -193052 -1335335 -1007425 -11310
36844a1310L77700k17603q6463J72317J67889J64220J06008k71517n11257n5296
$$ -11310 366390 148787 62324 234641 402530 566750 672758 401241 -110016 -165312
36834a65312M61477N4253p51378n72094M63866P84255q5976q20900m91015J82560
$$ -165312 296165 350418 -400960 -973054 -509188 275067 189091 -631809 -1122824 -940264
36824i40264L39762K83688N24718P06396L10209l87871p41334n34296M3909O64583
$$ -940264 -600502 -316814 207904 914300 1224509 836638 95304 -438992 -395083 269500
36814B69500Q68314M01640l13508o25190n50003n70596o85460m99432j24600l0898
$$ 269500 1137814 1539454 1225946 600756 50753 -519843 -1205303 -1704735 -1829335 -1860233
36804a860233r1163J92490N88514M07065j46453j39342M76132P32296L16259k2834
$$ -1860233 -1951396 -1758906 -1170392 -763327 -909780 -1049122 -572990 159306 475565 452731
36794D52731m4461m67780j273683j126859N09283J997754J535400l63970j644595
$$ 452731 408270 -59510 -1333193 -2460052 -1950769 46985 1582385 1218415 -426180
36785d26180j354444l35002L37371M56820L07009Q1329j38212k79055k58345L3970
$$ -426180 -1780624 -2115626 -1778255 -1321435 -1014426 -933097 -1071309 -1350364 -1608709 -1574739
36775a574739N34252P78366L50059l41211l44964N22237J272327R84790j04769
$$ -1574739 -1040487 -262121 87938 -253273 -598237 -76000 1196327 2181117 2076348
36766B076348j072678j312718p82074J56472P94792N50916k78136p43665m38036
$$ 2076348 1003670 -309048 -1091122 -934650 -139858 411058 132922 -610743 -1048779
36757a048779J36091N05142P14455O82103O5311q21964j000749l19188Q3037m69908
$$ -1048779 -912688 -407546 306909 989012 1054323 232359 -768390 -1087578 -1004541 -1474449
36747a474449j027692n59993L37649N10849K14582N55131J419652J500418L60316
$$ -1474449 -2502141 -3062134 -2724485 -2213636 -1999054 -1443923 -24271 1476147 1836463
36738A836463q69198j068270l36556N88349J125073Q14568m84544j908537k009121
$$ 1836463 967265 -101005 -437561 150788 1275861 2090429 1605885 -302652 -2311773
36729b311773n21232R86757R82480n9924m77838J28556M53200l25387j139274
$$ -2311773 -2833005 -1846248 -863768 -923692 -1401530 -1272974 -819774 -1145161 -2284435
36720b284435o61923N28665P31956k55023q24220r7139P81028O57224K18823N48404
$$ -2284435 -2946358 -2417693 -1685737 -1940760 -2764980 -2862119 -2081091 -1423867 -1205044 -656640
36710f56640J052182N51524m05283l48659M29314K31610r93175j330573j58874
$$ -656640 395542 947066 541783 193124 622438 854048 -139127 -1469700 -1628574
36701a628574O51316j25945r58511j87278J119627R94478j33866k78637P67108
$$ -1628574 -977258 -1103203 -2061714 -2248992 -1129365 -134887 -268753 -547390 219718
36692B19718J267957M84006l97278m70411l58278p20200j061710p65079j64624
$$ 219718 1487675 1971681 1574403 1103992 745714 25514 -1036196 -1801275 -1965899
36683a965899J38739J95191K91892K92293L520k90427k28271K2692M9991j09536
$$ -1965899 -1827160 -1631969 -1340077 -1047784 -1044264 -1334691 -1562962 -1540270 -1490279 -1599815
36673a599815m254N09911R22852O53442j28381n81580k57418K48785J23736m65493
$$ -1599815 -1604069 -1094158 -171306 482136 353755 -227825 -485243 -236458 -112722 -578215
36663e78215o56810k30165J85285K71658M14110O93183N26542k13410p16040m66295
$$ -578215 -1235025 -1465190 -1279905 -1008247 -594137 99046 625588 412178 -303862 -770157
36653g70157j3467J43652M01258R42687Q82258k99913j363576p67192J008345
$$ -770157 -783624 -639972 -238714 703973 1586231 1286318 -77258 -844450 163895
36644A63895J962084J114363o34960j917464k036363r63858O32821J488061R02436
$$ 163895 2125979 3240342 2605382 687918 -1348445 -2312303 -1679482 -191421 711015
36635G11015k83782p32800l15140J43288L50229O17635Q13084N12389l1609k89125
$$ 711015 427233 -305567 -620707 -477419 -127190 490445 1303529 1815918 1784309 1495184
36625A495184n26151j169814j476232m39320J170185J499837M44820j35648N57612
$$ 1495184 969033 -200781 -1677013 -2116333 -946148 553689 998509 862861 1420473
36616A420473R93178p7932j533191j673714p18083m1638J03186N57499J418600
$$ 1420473 2413651 2335719 802528 -871186 -1589269 -1630907 -1527721 -970222 448378
36607D48378J658456O26464j009119k009174j758526o52512M05081Q36888P57957
$$ 448378 2106834 2733298 1724179 -284995 -2043521 -2696033 -2290952 -1454064 -696107
36598f96107M76204m2964p76044j086875m04463P03946J091065O38367K77708
$$ -696107 -219903 -262867 -1038911 -2125786 -2530249 -1826303 -735238 -96871 180837
36589A80837L58238J97729m59068p97466k98481L86915N83495N49082N64561J56096
$$ 180837 539075 736804 277736 -519730 -818211 -431296 152199 701281 1265842 1421938
36579A421938q31366j357724n41531Q06813J188299M74504j81424j63741K8673
$$ 1421938 590572 -767152 -1308683 -501870 686429 1160933 979509 815768 844441
36570H44441q1527l02095l72588l65939l07481o0193K29964J41378l50347o48677
$$ 844441 762914 460819 88231 -277708 -585189 -645382 -415418 -274040 -624387 -1273064
36560a273064k47425N93253J103724Q35069R8557m25963m53615l24540l97441
$$ -1273064 -1520489 -927236 176488 1011557 1110114 684151 230536 -94004 -491445
36551d91445m75035j75734K99041K89960l89709j114174j167410m74269M47325
$$ -491445 -966480 -1142214 -843173 -553213 -942922 -2057096 -3224506 -3698775 -3251450
36542c251450R81343R03968O26189P19698R41408L15761j210551j996983p73381
$$ -3251450 -2270107 -1366139 -739950 -20252 921156 1236917 26366 -1970617 -2743998
36533b743998J155433J415587J697p58358J34594R03806N1346j193147r08656
$$ -2743998 -1588565 -172978 -171281 -929639 -795045 108761 160107 -1033040 -1941696
36524a941696O23284J706353J720509J164976J93953j125538j790896q98654O48106
$$ -1941696 -1318412 387941 2108450 3273426 3467379 2341841 550945 -347709 300397
36515C00397J069564J29090p94825q10637l00557J64458L37740m0983p80350q03230
$$ 300397 1369961 1499051 704226 -106411 -406968 -242510 95230 54247 -726103 -1529333
36505a529333L82402J292169L45390j315419j142867P72983J593735J53354j249135
$$ -1529333 -1146931 145238 490628 -824791 -1967658 -1194675 399060 552414 -696721
36496f96721o46583O10782M90739l35265j10415O77247L03315q53613q11022N10006
$$ -696721 -1343304 -732522 -241783 -577048 -687463 -10216 293099 -560514 -1371536 -861530
36486h61530R94812k09311j394303j085547j3519N71644O84007O59073J13117
$$ -861530 133282 -76029 -1470332 -2555879 -2569398 -1997754 -1313747 -654674 -541557
36477e41557q89974j062328K78143J721510J575525K38571p08829q97718r67980
$$ -541557 -1431531 -2493859 -2215716 -494206 1081319 1319890 611061 -286657 -1254637
36468a254637p28888M22348J562263R80558q75978j412469L41266J980287J096168
$$ -1254637 -1983525 -1561177 1086 981644 105666 -1306803 -965537 1014750 2110918
36459B110918j220220k020328o05470R76700J164046O81006P90604J268969R56817
$$ 2110918 890698 -1129630 -1735100 -758400 405646 1086652 1877256 3146225 4103042
36450D103042m31826j829219j972280p03926Q32513J260183L17659r47327j377846
$$ 4103042 3671216 1841997 -130283 -834209 -1696 1258487 1576146 628819 -749027
36441g49027q02270J70244R23583J077681N26808k36438l34687L47033P19443
$$ -749027 -1551297 -1381053 -457470 620211 1147019 910581 575894 922927 1642370
36432A642370p6875j260759j337430j34728J055051J242626P03467J49482j77031
$$ 1642370 1565495 304736 -1032694 -1167422 -112371 1130255 1833722 1983204 1806173
36423A806173l79199n11168n09004j98706N09457J178952J090943L66733Q3203
$$ 1806173 1426974 915806 406802 208096 717553 1896505 2987448 3354181 3437384
36414C437384N46327M49153j036227k352673j550988N15000J195133j9300j002825
$$ 3437384 3983711 4432864 3396637 1043964 -507024 7976 1203109 1183809 180984
36405A80984o15196j76642n73504n57744O43252J430017M91238o57883j17489
$$ 180984 -434212 -610854 -1184358 -1742102 -1098850 331167 822405 164522 47033
36396D7033J037603N30759j074702j107832P67025J855772O39437j050661j147728
$$ 47033 1084636 1615395 540693 -567139 199886 2055658 2695095 1644434 496706
36387D96706l38688l15982p64090j59423J292809J659749K27021j328800j287189
$$ 496706 158018 -157964 -922054 -1081477 211332 1871081 2098102 769302 -517887
36378e17887r4870O48494M79913J91391J74764J6468k65037J9625P92625Q70468
$$ -517887 -612757 35737 515650 707041 881805 898273 633236 652861 1445486 2315954
36368B315954j29237q15188j35292P24967J74695j025872r04783M01424Q49289
$$ 2315954 2186717 1371529 1236237 1961204 2135899 1110027 205244 606668 1455957
36359A455957n7231n34265L04164J017213M91546k90403l36269l23063p63576
$$ 1455957 1398726 864461 1168625 2185838 2677384 2386981 2050712 1727649 964073
36350I64073n99152O53014J326453K07947j061276m79492R46339Q54285o49878
$$ 964073 364921 1017935 2344388 2552335 1491059 1011567 1957906 2812191 2162313
36341B162313j491319j088559o18832m07278K29025Q47115K98230p82423n49954
$$ 2162313 670994 -417565 -1036397 -1443675 -1214650 -367535 -69305 -851728 -1401682
36332a401682Q64290J340807K26204p95743p39380n91935q53566m56658P90205
$$ -1401682 -537392 803415 1029619 233876 -505504 -1097439 -1951005 -2407663 -1617458
36323a617458J190352j3756j042774l93242P48043O35839k46761m23321N111j928
$$ -1617458 -427106 -440862 -1483636 -1876878 -1128835 -492996 -739757 -1163078 -1157967 -1159895
36313a159895l11437o7316N30925O57237M43512N23996N73472r2093r13791p26551
$$ -1159895 -1471332 -1538648 -1007723 -350486 93026 617022 1190494 1098401 184610 -541941
36303e41941K31258N14539l07176j034783o76062K70146P53079N49490K63779
$$ -541941 -310683 203856 -103320 -1138103 -1814165 -1544019 -790940 -241450 22329
36294B2329M07852Q02600Q05218J41162n75367n61008n3088k6720o06468p89205
$$ 22329 430181 1232781 2037999 2179161 1603794 1042786 989698 962978 356510 -432695
36284d32695j59944K91274j63884o58092j71491O58969N31613l95681q15182l07036
$$ -432695 -592639 -301365 -465249 -1123341 -1294832 -635863 -104250 -499931 -1315113 -1622149
36274a622149L24872N40553N62827M75155Q4299k91691r0563L39128k121j149167
$$ -1622149 -1297277 -756724 -193897 281258 365557 73866 -16697 322431 320310 -828857
36264h28857j887846j383710j64684Q08513J183257J047762N76380J70968J97999
$$ -828857 -2716703 -4100413 -4265097 -3456584 -2273327 -1225565 -649185 -478217 -280218
36255b80218L25511q7465p34706m88724P99001J674926J000105l88877q83161
$$ -280218 45293 -42172 -776878 -1265602 -466601 1208325 2208430 1819553 936392
36246I36392l21863Q6709k67418o59427l42672L60379O54735L57885k5207j2896
$$ 936392 614529 701238 433820 -225607 -568279 -207900 446835 804720 779513 766617
36236G66617L44805N27272N1351q91228j379390p22429N41055J107613M95691
$$ 766617 1111422 1638694 1690045 798817 -580573 -1303002 -761947 345666 841357
36227H41357l93241n69960j86113N5565J22902M32955P54781L90908n29818r90940
$$ 841357 448116 -121844 -307957 -252392 -129490 303465 1058246 1449154 919336 -71604
36217g1604o00155j75494l50546n53125r0337N92721O72191L22656K99295N99641
$$ -71604 -671759 -847253 -1197799 -1750924 -1841261 -1248540 -576349 -253693 45602 645243
36207F45243O21375L38055K09206J39787l04178p75183n10621J77492J70521m90256
$$ 645243 1266618 1604673 1813879 1953666 1649488 874305 363684 541176 711697 221441
36197B21441m23043P53540J428425L60947j238138j349960k9118Q45412K92849
$$ 221441 -201602 551938 1980363 2341310 1103172 -246788 -275906 569506 862355
36188H62355p56524j160432r47331o30641j98627N26511J131452R94800K89018
$$ 862355 105831 -1054601 -2001932 -2632573 -2831200 -2304689 -1173237 -178437 110581
36179A10581n3309M18860R31306M81806o18531r60368j6628R25726N08123p12574
$$ 110581 57272 476132 1407438 1889244 1270713 310345 293717 1219443 1727566 1014992
36169A014992j090307k99454L98175K41590j05608l8806l487l27084l38766L70512
$$ 1014992 -75315 -374769 23406 264996 159388 120582 117095 -209989 -548755 -178243
36159a78243Q56139J74374r18549r13990K15006J001067O05214k05381l82358
$$ -178243 677896 852270 -66279 -980269 -765263 235804 841018 635637 253279
36150B53279M9077L64822K38430m3345j92245k83350m32036l95670J38420Q63720
$$ 253279 302356 667178 905608 862263 670018 386668 -45368 -441038 -302618 561102
36140E61102R73109K95237k43069Q9246O17951K71717o63827j022855o95383o04158
$$ 561102 1534211 1829448 1586379 1675625 2293576 2565293 1901466 878611 183228 -420930
36130d20930q09052l55316O90761Q76139k74293j245455q37026J01199L26370
$$ -420930 -1229982 -1585298 -894537 -18398 -292691 -1538146 -2375172 -2273973 -1947603
36121a947603O7467o239j91632p00857o19807M76059J181286L09676r21685o93257
$$ -1947603 -1880136 -1886375 -2078007 -2778864 -3398671 -2922612 -1741326 -1431650 -2353335 -3046592
36111c046592N19365R60346N60596N60939Q67501K97238q46508r42709J78759
$$ -3046592 -2527227 -1566881 -1006285 -445346 422155 719393 -127115 -1069824 -891065
36102h91065R56809P33491M35642M20867o4411q82951p71494K55434M98451n76226
$$ -891065 65744 799235 1234877 1655744 1591333 708382 -63112 192322 690773 114547
36092A14547j211586j76752J239400J346413M82219p4590k07094m95257p09585
$$ 114547 -1097039 -1273791 -34391 1312022 1794241 1719651 1512557 1017300 307715
36083C07715k05853P91808J369816R84277j88768j373142j474751j85395J109256
$$ 307715 101862 893670 2263486 3247763 3058995 1685853 211102 25707 1134963
36074A134963P83309o07077r76255O3680O83705N8648k55100P34338J465094M44313
$$ 1134963 1918272 1311195 334940 398620 1082325 1140973 885873 1620211 3085305 3529618
36064C529618j139456j378666n78110j85233k01142K08943O85471M11295o6543
$$ 3529618 2390162 1011496 433386 248153 47011 255954 941425 1352720 1286177
36055A286177J68208M73331j70547r10721k53403J110198J122630l53753j436248
$$ 1286177 1454385 1927716 1757169 846448 593045 1703243 2825873 2472120 1035872
36046A035872j249594p51218n41878j24284M81113N35652K38314N15859R79455
$$ 1035872 -213722 -964940 -1506818 -1631102 -1149989 -614337 -376023 139836 1119291
36037A119291L12941j010561q57092J042512K156651Q64306j132314j535953o53434
$$ 1119291 1432232 421671 -435421 607091 2763742 3628048 2495734 959781 306347
36028C06347k01074m67208m56556J74285R07081J372848J391082P37078k15565
$$ 306347 105273 -361935 -818491 -644206 262875 1635723 3026805 3763883 3548318
36019C548318n37197k07595l23243j010899p61635Q77129J746385J58866k002317
$$ 3548318 3011121 2803526 2480283 1469384 707749 1584878 3331263 3490129 1487812
36010A487812j754555M43908J439449K56838p52520K2988J098282P14270l41637
$$ 1487812 -266743 177165 1616614 1873452 1120932 1143920 2242202 2956472 2614835
36001B614835l74094M12595N41219k72751r29394p36809n2049O10764J008809
$$ 2614835 2240741 2653336 3194555 2921804 1992410 1255601 1203552 1814316 2823125
35992B823125Q69526J34640n44113l89453L95317Q15921M29577j70545l29166
$$ 2823125 3692651 3827291 3283178 2893725 3289042 4104963 4534540 4363995 4034829
35983D034829j43392m1491q7851j13715j77820l94512m43486J96786J360303J978040
$$ 4034829 3891437 3849946 3762095 3648380 3470560 3076048 2632562 2829348 4189651 6167691
35973F167691J190433m75367j533829j209789j89681M95405P49852J043768J255356
$$ 6167691 7358124 6882757 5348928 4139139 3949458 4444863 5194715 6238483 7493839
35964G493839P90963k09085p36293k90248L95699M87038K35767L69042P96276
$$ 7493839 8284802 8075717 7339424 7049176 7444875 7931913 8167680 8536722 9332998
35955I332998P70033J25073m88712o31632n56899m95429k03825L81785O55950
$$ 9332998 10103031 10228104 9739392 9107760 8550861 8055432 7851607 8233392 8889342
35946H889342J02428p94255r96661j62987J028549J737141J689972J083018K58120
$$ 8889342 8991770 8197515 7200854 7037867 8066416 9803557 11493529 12576547 12834667
35937A2834667l70898m74262j36597J91831K17236N0527j39670l77154o18289
$$ 12834667 12463769 11989507 11852910 12044741 12261977 12312504 12172834 11795680 11177391
35928A1177391o21926l44966j06580m1813J96992P51109J023702N14576j85823
$$ 11177391 10555465 10210499 10103919 10062106 10259098 11010207 12033909 12548485 12362662
35919A2362662j44904L72774K51893n00473m58050R62628K194558J550186l23515
$$ 12362662 12217758 12590532 12842425 12341952 11883902 12846530 15041088 16591274 16267759
35910A6267759j310722o23976O04671J242278J230739P45006k25786j065102o65490
$$ 16267759 14957037 14333061 14937732 16180010 17410749 18155755 17929969 16864867 16199377
35901A6199377R15704K028120J456651j8476q82224q19240m54226J116O43553
$$ 16199377 17115081 19143201 20599852 20581376 19699152 18879912 18425686 18426802 19070355
35892A9070355R87301M73457l81166n26745O8941N38249O48336R58859J410778
$$ 19070355 20057656 20531113 20149947 19623202 19692143 20230392 20878728 21837587 23248365
35883B3248365J142118Q7707n45360o7490N50308J94601o36540o53858K40574
$$ 23248365 24390483 24478190 23932830 23865340 24415648 24610249 23973709 23319851 23560425
35874B3560425R17554P40816K86583K47277M35765K37869l83255p32548k00622
$$ 23560425 24477979 25218795 25505378 25752655 26188420 26426289 26043034 25310486 25109864
35865B5109864R21864J598792J148894P4099m91077p6957P64183J349240J573414
$$ 25109864 26031728 27630520 28779414 28853513 28362436 28285479 29049662 30398902 31972316
35856C1972316J614941J483329J156642Q18406P36740J131409K138044L554204
$$ 31972316 33587257 35070586 36227228 37045634 37782374 38913783 41051827 44606031
35848D4606031M757969N385238N916568P004044Q537255J0171882J2299690J5311851
$$ 44606031 49364000 54749238 60665806 67669850 76207105 86378987 98678677 113990528
35840A13990528J8421652K0884189K3990223K9710660L7583552M5590724N3764398
$$ 113990528 132412180 153296369 177286592 206997252 244580804 290171528 343935926
35833C43935926O2497092O5979693N3054208J9831156k1356960n1280727o1468090
$$ 343935926 406433018 472412711 525466919 545298075 523941115 472660388 411192298
35826D11192298n8338506n1446051m4082621l6139344k9232158k4872943k1513523
$$ 411192298 352853792 301407741 257325120 221185776 191953618 167080675 145567152
35819A45567152j7308291j3369189j1310860j0032469p974036o290482o531502
$$ 145567152 128258861 114889672 103578812 93546343 85572307 79281825 72750323
35812G2750323p125307n648893l088758k273271l151070l235505k047787j469143
$$ 72750323 65625016 59976123 56887365 54614094 51463024 48227519 46179732 44710589
35804D4710589j928942j834325r53385r19694j882632j953489p46300k90176j374154
$$ 44710589 42781647 40947322 39993937 39074243 37191611 35238122 34491822 34201646 32827492
35795C2827492k040004j060009k9899l62955q77760k90131L22292k91388j015974
$$ 32827492 30787488 29727479 29697580 29334625 28456865 28166734 28489026 28197638 27181664
35786B7181664l54474Q16067Q66542K78093M22628Q03993J42823q17621l70596
$$ 27181664 26827190 27643257 28509799 28787892 29210520 30014513 30157336 29339715 28969119
35777B8969119R39310R89645k90145p65208L18613J330599J295248J268390J813237
$$ 28969119 29908429 30898074 30607929 29842721 30161334 31491933 32787181 34055571 35868808
35768C5868808J638715J02649j117172n46634O49151O18501k08750j89746N02529
$$ 35868808 37507523 37610172 36493000 35946366 36595517 37214018 37005268 36815522 37318051
35759C7318051K30933j107425j721341q13905J70929j18047j016736j266027j045699
$$ 37318051 37548984 36441559 34720218 33906313 34077242 33959195 32942459 31676432 30630733
35750C0630733j298480j890566j898407j355585j273215j854181k003769j056784
$$ 30630733 29332253 27441687 25543280 24187695 22914480 21060299 19056530 17999746
35742A7999746J03412L34841k22369p33076j077212j597766j899359j199392J30094
$$ 17999746 18103158 18437999 18215630 17482554 16405342 14807576 12908217 11708825 11838919
35733A1838919O39606k00327j139247q74293K19574Q09505M00362l85934q85655
$$ 11838919 12478525 12278198 11138951 10264658 10484232 11293737 11694099 11308165 10422510
35724A0422510r60390p30641m07878k43656j67017K54091J022771J317796N47532
$$ 10422510 9462120 8731479 8323601 8079945 7912928 8167019 9189790 10507586 11055118
35715A1055118o05985j011914o45761l85970m75182k99121K68699M95966J22814
$$ 11055118 10449133 9437219 8791458 8405488 7930306 7631185 7899884 8395850 8518664
35706H518664l2785N74763J162140P10399n22800j405333j385770p52331J47899
$$ 8518664 8485879 9060642 10222782 10933181 10410381 9005048 7619278 6866947 7014846
35697G014846J013966J152824K9139j587156k010079o62941J001470J233375J41533
$$ 7014846 8028812 9181636 9210775 7623619 5613540 4950599 5952069 7185444 7326977
35688G326977o34038j59958P42959Q48631J74867k43922J50005P92126Q16195
$$ 7326977 6692939 6532981 7275940 8124571 8299438 8055516 8205521 8997647 9813842
35679I813842M3173r78265j591447j518046r43809l01042J20417L87753O35677
$$ 9813842 9857015 8878750 7287303 5769257 4825448 4524406 4644823 5032576 5668253
35670E668253O56914J28564p19819j111249o26550K59344Q18947Q89588P30430
$$ 5668253 6325167 6453731 5733912 4622663 3996113 4255457 5074404 5963992 6694422
35661F694422M85354K72065M11612R10358J031197K47791n24367K30912K286512
$$ 6694422 7179776 7451841 7863453 8773811 9805008 10052799 9528432 9759344 12045856
35652A2045856L305291J589045j615147l544737l142313j737155q05737m30922
$$ 12045856 15351147 16940192 15325045 11780308 8637995 6900840 6095103 5664181
35644E664181k18141l37338p86027o51854O38452J890007J369404o30607j888000
$$ 5664181 5446040 5108702 4322675 3670821 4309273 6199280 7568684 6938077 5050077
35635E050077j226161J2433J85032l12970j85325L50557N5829q81189q68624M04769
$$ 5050077 3823916 3836349 4021381 3708411 3523086 3873643 3929472 3048283 2179659 2584428
35625B584428J191311L43345q76622p83975K54083P55246N26541M65963N72561
$$ 2584428 3775739 4119084 3242462 2458487 2712570 3467816 3994357 4460320 5032881
35616E032881j5404j102808j334592l54452M71929J13818o34876n32245K87183
$$ 5032881 5017477 3914669 2580077 2225625 2697554 2811372 2176496 1644251 1931434
35607A931434Q11809P17554M43104J96641j42810l77807j21133M64316P46661
$$ 1931434 2743243 3460797 3903901 4100542 3957732 3579925 3458792 3923108 4669769
35598D669769M93752J15525l3912j15714l89042o71036n00378J99131Q08042N75023
$$ 4669769 5163521 5279046 5245134 5129420 4740378 4069342 3568964 3768095 4576137 5151160
35588E151160m32533j206778r35525k4342N09492M59351M85525P53471M88322
$$ 5151160 4718627 3511849 2576324 2551982 3061474 3520825 4006350 4759821 5248143
35579E248143o97923j875864j857130o28410Q51541J757985J749473Q33238m04823
$$ 5248143 4550220 2674356 817226 188816 1040357 2798342 4547815 5381053 4976230
35570D976230r79304o53231l49199o67699p87546N2696Q20381R1665j311528j137943
$$ 4976230 3996926 3343695 2994496 2326797 1539251 1591947 2412328 2503993 1192465 54522
35560E4522P72474J960589J000856m16870k83427P02188O44926l97288q59479
$$ 54522 826996 2787585 3788441 3371571 3088144 3790332 4435258 4037970 3178491
35551C178491m58217l72151r01802j001238k98040K57767J71309J88336P21797
$$ 3178491 2720274 2348123 1446321 445083 147043 404810 576119 764455 1486252
35542A486252R71551L59152m33743o59165n94990o36517m11881K81655P04122
$$ 1486252 2457803 2816955 2383212 1724047 1129057 492540 80659 362314 1066436
35533A066436L44466r6693N7216K28910k14364n42078R7698R08509O22958k57299
$$ 1066436 1410902 1314209 1371425 1600335 1385971 843893 941591 1850100 2473058 2215759
35523B215759l11823K27558o1188r64692p24154P42365J252784r1422j166114
$$ 2215759 1903936 2131494 2070306 1105614 381460 1123825 2376609 2285187 1119073
35514A119073j03114J725844J877466M45849n53682l49992J01635J59841P6332
$$ 1119073 1015959 2741803 4619269 5065118 4511436 4161444 4263079 4422920 4499252
35505D499252j24622o19562q75954l40904K37249k15618j078444p82478N11420
$$ 4499252 4374630 3755068 2879114 2538210 2775459 2559841 1481397 698919 1210339
35496A210339R37983j11089j010855n34062L53512L32884j55891O3724Q34780
$$ 1210339 2148322 2037233 1026378 492316 845828 1178712 1022821 1086545 1921325
35487A921325R97398K41885n47860o22548j98851L5392k20895n54919l14256M50457
$$ 1921325 2918723 3160608 2612748 1990200 1791349 1826741 1605846 1050927 736671 1187128
35477A187128P93117J40353o38303l75107M71777L82393p11282j073311J51437
$$ 1187128 1980245 2120598 1482295 1107188 1578965 1961358 1250076 176765 328202
35468C28202J443083J073245m34039j163602l26321J140304J909684J342012k42821
$$ 328202 1771285 2844530 2410491 1246889 920568 2060872 3970556 5312568 5069747
35459E069747j638344j632185m09303N30554L13331k92603l07784N8060J51472
$$ 5069747 3431403 1799218 1389915 1920469 2233800 1941197 1633413 1691473 1842945
35450A842945m2343l72095r69585j376769n30951J292498J974816M56620j277173
$$ 1842945 1800602 1428507 458922 -917847 -1448798 -156300 1818516 2275136 997963
35441I97963r50367N79775Q91049q2773l70197L77870M64130n52313r74447o772
$$ 997963 47596 627371 1518420 1435647 1065450 1443320 1907450 1355137 380690 373918
35431C73918Q79841N65634O543K21769N84096L69326J68338L90734Q2914j212103
$$ 373918 1253759 1819393 1825936 2047705 2631801 3001127 3169465 3560199 3643113 2431010
35421B431010j974318q71961Q42341J024152j69651p51279l4530O58136L23022
$$ 2431010 456692 -415269 427072 1451224 1281573 530294 495764 1153900 1476922
35412A476922m34368o91838m30152o8393K37618M68043N60393N39143L86356q5749
$$ 1476922 1042554 350716 -79436 -147829 89789 557832 1118225 1657368 2043724 1957975
35402A957975p51825r19114k35931N40855N35159J24756K76431Q00684N80238
$$ 1957975 1206150 287036 51105 591960 1127119 1251875 1528306 2328990 2909228
35393B909228m36544r02390j90822M78412q8237j101036r26104L86960J103605
$$ 2909228 2472684 1570294 1379472 1857884 1769647 668611 -257493 129467 1233072
35384A233072L41560o83444n04347M77829O94633k34071r95097n32001N46482
$$ 1233072 1574632 891188 386841 864670 1559303 1325232 330135 -201866 344616
35375C44616J027182P33615L11496k3135m88921p93668l58231M48349M47714n88515
$$ 344616 1371798 2105413 2416909 2393774 1904853 1111185 752954 1201303 1649017 1060502
35365A060502j326975o38712Q14430J488648Q82080j80707p65411o09853K3946
$$ 1060502 -266473 -905185 -90755 1397893 2279973 2099266 1333855 724002 747948
35356G47948O00745N71229n7863n43005k73486L47624M07166k51268q16328o07303
$$ 747948 1348693 1919922 1862059 1319054 1045568 1393192 1800358 1549090 732762 125459
35346A25459P7864M03716M1063m63058l89439K03784N15810J21211l49907j11190
$$ 125459 203323 607039 648102 185044 -204395 -611 515199 636410 286503 175313
35336A75313N56958P21157K26185j98118k02752j43550o8860L83564Q04859J64911
$$ 175313 732271 1453428 1679613 1481495 1278743 1135193 1066333 1449897 2254756 2419667
35326B419667j232814j475753K05140J849240J439064o2336k72277Q43890J054679
$$ 2419667 1186853 -288900 -83760 1765480 3204544 3142208 2869931 3713821 4768500
35317D768500m54434j799286j337638O5580O75264K88668j60416l37791n95160
$$ 4768500 4314066 2514780 1177142 1242722 1917986 2206654 2046238 1708447 1113287
35308A113287q84190p09000l9024M85704L15354l97971r40168o99528J58017P55662
$$ 1113287 229097 -479903 -518927 -33223 282131 -115840 -1056008 -1755536 -1597519 -841857
35298h41857N53847J16943K92175Q84330R84755M73909J24551J54107q4047o57993
$$ -841857 -288010 -171067 121108 1005438 1990193 2464102 2588653 2742760 2658713 2000720
35288B000720o70094N5123K96245n36640j030756J19241J709304J570784j44592
$$ 2000720 1330626 1385749 1681994 1145354 114598 233839 1943143 3513927 3369335
35279C369335j279149j023375p07703r74368n58424J079162K085880R02594j035021
$$ 3369335 2090186 1066811 359108 -615260 -1173684 -94522 1991358 2893952 1858931
35270A858931j352882l22344m1764p62371p17738M24899P81656l18007q02079
$$ 1858931 506049 183705 141941 -620430 -1338168 -913269 -131613 -449620 -1251699
35261a251699P16167K244032J290568j161123k021712n34202J119135J284827
$$ -1251699 -535532 1708500 2999068 1837945 -183767 -717969 401166 1685993
35253A685993N43037j35355p21318j124342p40860K93917R01363P04783N15064
$$ 1685993 2229030 2093675 1372357 248015 -492845 -198928 702435 1407218 1922282
35244A922282P11830O07625n3169m96139m34966o02876j056717o69232P23421
$$ 1922282 2634112 3241737 3188568 2692429 2257463 1654587 597870 -71362 652059
35235F52059J426012M14179q77588p90419O4568K52888M3036M85779J092675O22800
$$ 652059 2078071 2492250 1614662 824243 888811 1141699 1184735 1670514 2763189 3385989
35225C385989n32188q79547k87932O8700j25040j37300J26022J26667J10504O25147
$$ 3385989 2853801 1974254 1686322 1755022 1629982 1492682 1618704 1745371 1855875 2481022
35215B481022R27428p0705j495879j419622m6244M37701n47193j117180l16636
$$ 2481022 3408450 3337745 1841866 422244 376000 813701 266508 -850672 -1167308
35206a167308K71216m84797j091196J1997J650660J693564L04059n85632k20926
$$ -1167308 -896092 -1380889 -2472085 -2460088 -809428 884136 1188195 602563 381637
35197C81637L96559M38423J50168p1635k50368l85753k64659J71058O71477Q50803
$$ 381637 778196 1216619 1366787 1295152 1044784 659031 394372 565430 1236907 2087710
35187B087710M35773l50450p74962n37673m05085r45317j108156L26980K147602
$$ 2087710 2523483 2173033 1398071 860398 455313 -490004 -1598160 -1271180 876422
35178H76422J786406o43035j916946l85205J454832Q81010q52548p71506J046337
$$ 876422 2662828 2019793 102847 -282358 1172474 2053484 1200936 429430 1475767
35169A475767J928009R51656j59115k80645k35821o05447o93678l15225m41008
$$ 1475767 3403776 4355432 4196317 3915672 3679851 3074404 2380726 2065501 1624493
35160A624493j233046j359947k53128O83595K85737m58101q3915R47180J077065
$$ 1624493 391447 -968500 -1221628 -538033 -252296 -710397 -794312 152868 1229933
35151A229933J18908o63792o07281l40456m14658m71919r5355M06864M92685R8107
$$ 1229933 1348841 685049 77768 -262688 -677346 -1149265 -1244620 -837756 -345071 -246964
35141b46964m55959q16567o40487K00735J157990J292371M81285j96702O1261
$$ -246964 -702923 -1519490 -2159977 -1959242 -801252 491119 972404 775702 836963
35132H36963M45066k96112j640407j692806n6301J268378P40670m03263j49694
$$ 836963 1282029 985917 -654490 -2347296 -2403597 -1135219 -394549 -797812 -947506
35123i47506J102664J315799J95597m49344J84278O83907K6339o47414j02065
$$ -947506 155158 1470957 1666554 1217210 1401488 2085395 2111734 1464320 1362255
35114A362255P66243L65538r68722j429179l52246J004017J200215J68141r79252
$$ 1362255 2128498 2494036 1525314 96135 -256111 747906 1948121 2116262 1137010
35105A137010j135783k97525L47166j52748j028810p01436P25821J322859K50531
$$ 1137010 1227 -296298 50868 -101880 -1130690 -1832126 -1106305 216554 467085
35096D67085q22292l43098O61241M07964o22534n80585N60678R47528j22305j169037
$$ 467085 -355207 -698305 -37064 370900 -251634 -832219 -271541 675987 553682 -615355
35086f15355q84591J84283Q74688R64115Q17896N26905J00541j73593j34600o6356
$$ -615355 -1499946 -1315663 -440975 523140 1341036 1867941 1968482 1794889 1660289 1593933
35076A593933k46144n17710n47776k79967k2160j32312m88740l72557N97048J485193
$$ 1593933 1347789 830079 282303 2336 -19824 -152136 -640876 -1013433 -416385 1068808
35066A068808R74352n43834j138335j82863N39531k98243j229756l32420J426521
$$ 1068808 2043160 1499326 360991 178128 717659 419416 -810340 -1142760 283761
35057B83761J553647J1954p74878J62293R99416K62947r76229j114982m37650
$$ 283761 1837408 1849362 1074484 1236777 2236193 2499140 1522911 407929 -29721
35048b9721k10294n64454o08314k2517N22005L68935k80822n51041J19405J118325
$$ -29721 -240015 -804469 -1412783 -1435300 -913295 -544360 -825182 -1376223 -1256818 -138493
35038a38493J225491L10114l54039q1959O9477p12366j174520j0394J440180R69669
$$ -138493 1086998 1397112 1043073 961114 1030591 318225 -856295 -866689 573491 1543160
35028A543160p15179q85159O93032J316788p2503j159249l39953O04984j28709
$$ 1543160 827981 -57178 635854 1952642 1880139 720890 380937 985921 857212
35019H57212j103341l03273J078142N19213j461932j899153Q2679K063918J891099
$$ 857212 -246129 -549402 528740 1047953 -413979 -2313132 -2230453 -166535 1724564
35010A724564K57471q43448o45787J08378M34106O1383m60317m55567n0450k4722
$$ 1724564 1982035 1138587 492800 601178 1035284 1096667 636350 180783 130333 105611
35000A05611n29394p18992j30745M91474M49179J88427K66275K49125k33842l54214
$$ 105611 -423783 -1142775 -1273520 -782046 -332867 -144440 121835 370960 137118 -217096
34990b17096N69706J431347P37104q41311j120860M32474J866919J402240m00330
$$ -217096 352610 1783957 2521061 1679750 558890 991364 2858283 4260523 3860193
34981C860193j632982j282421O435Q42836M57115n67863r53697k84399N03334
$$ 3860193 2227211 944790 951225 1794061 2251176 1683313 729616 445217 948551
34972I48551M84668q1685m84252o55605p46847m14442M68160J115635R27967N40016
$$ 948551 1433219 1351534 867282 211677 -535170 -949612 -481452 634183 1562150 2102166
34962B102166N99925L79023q73250k003483j325167N46955J363102O34062J26303
$$ 2102166 2702091 3081114 2207864 204381 -1120786 -573831 789271 1423333 1549636
34953A549636O93389R35139j47522j272463r66247J14046M59075R2835J00965
$$ 1549636 2243025 3178164 3030642 1758179 791932 905978 1365053 1457888 1558853
34944A558853N69383N50309k33667r26333p55751J21311R40686R54357k9479j250970
$$ 1558853 2128236 2678545 2444878 1518545 762794 884105 1824791 2779148 2749669 1498699
34934A498699j493065m59075P39550R58289M05101N8460J69382J17990m46468
$$ 1498699 5634 -453441 286109 1244398 1649499 1707959 1877341 1995331 1548863
34925A548863j039441r69278j63883O44943N37065m83160j079542n2766J695632
$$ 1548863 509422 -459856 -623739 21204 558269 75109 -1004433 -1057199 638433
34916F38433J838848j71868j925444j276051M57040L96350j468673k157278k27202
$$ 638433 2477281 2305413 379969 -896082 -439042 -42692 -1511365 -3668643 -3895845
34907c895845J977945J771657j16704j011894k59369M08271k3561n51665k26609
$$ -3895845 -1917900 -146243 -262947 -1274841 -1534210 -1125939 -1149500 -1701165 -1927774
34898a927774L47623L67628K30970N20327O67885r8639j147576j127824L465R13505
$$ -1927774 -1580151 -1212523 -981553 -461226 206659 108020 -1039556 -2167380 -2163915 -1250410
34888a250410Q76693O14404Q37254J046199M53358o51259j243615r00996j21163
$$ -1250410 -373717 240687 1077941 2124140 2577498 1926239 682624 -218372 -339535
34879c39535M90629P58835P19879L86633j36857n87962p41203o05256m01934l44882
$$ -339535 151094 909929 1629808 2016441 1879584 1291622 550419 -54837 -456771 -801653
34869h01653l83023k36855J52264L47005n7917o85059o46151K94001J293358J433125
$$ -801653 -1184676 -1421531 -1269267 -922262 -980179 -1665238 -2311389 -2017388 -724030 709095
34859G09095P49494l3001m25696m45979k56084m531P2415k00731o34426p51173
$$ 709095 1458589 1425588 999892 553913 297829 293298 365713 164982 -469444 -1220617
34849a220617k58927N90580J129180Q52098q723o33694n52553k15064k65770n35847
$$ -1220617 -1479544 -888964 240216 1092314 1083591 449897 -102656 -317720 -583490 -1119337
34839a119337l84946J36921L16060J785j22389K49092M92300J63577k27606j67607
$$ -1119337 -1504283 -1367362 -1051302 -1049517 -1171906 -922814 -430514 -266937 -494543 -662150
34829f62150l4893k70572l78992K70353J126928J004036k06225j267036j113858
$$ -662150 -697043 -967615 -1346607 -1076254 50674 1054710 848485 -418551 -1532409
34820a532409n683R30840R07185J89424k22680K25421Q30201N20238m76754q22732
$$ -1532409 -1538092 -607252 299933 489357 266677 492098 1322299 1842537 1365783 543051
34810E43051j83957J14222p01467j313198k95655J417192J735265M50702p30644
$$ 543051 359094 473316 -228151 -1541349 -1837004 -419812 1315453 1766155 1035511
34801A035511r05506q40392j022562o97669N52992J731446J682685M55284j090381
$$ 1035511 130005 -710387 -1732949 -2430618 -1877626 -146180 1536505 1991789 901408
34792I01408k116026j952122n01167J119268J432264N15313o1451M05019Q01138
$$ 901408 -1214618 -3166740 -3667907 -2548639 -1116375 -601062 -662513 -257494 543644
34783E43644K27391m91957l49065J35077O6603p1401N76299J282224O11132j050861
$$ 543644 771035 279078 -69987 65090 131693 60292 636591 1918815 2529947 1479086
34773A479086j656624l94964J124548J122025j25911j025661p78509L7199N30294
$$ 1479086 -177538 -572502 552046 1674071 1548160 522499 -256010 -218811 311483
34764C11483M39980J18056k8636j7737k15974o89133q52151j89603Q09144J048224
$$ 311483 751463 869519 840883 823146 607172 -81961 -934112 -1123715 -314571 733653
34754G33653K53383n91457m91430L70640J028119R13855K62479l81569o49203
$$ 733653 987036 395579 -95851 274789 1302908 2216763 2479242 2097673 1448470
34745A448470m86579j41490N4402O3655J42022L33068L04808l0344j46254L23091
$$ 1448470 961891 820401 874803 938458 1080480 1413548 1718356 1688012 1541758 1864849
34735A864849P62466K69654r20084j537609r74724o0929K25052L1133J2692J34113
$$ 1864849 2627315 2896969 1976885 439276 -535448 -596377 -371325 -340192 -327500 -193387
34725a93387m4245l30847j41476M05197N88002K55231l8565j29599m65945r81369
$$ -193387 -237632 -568479 -709955 -304758 283244 538475 499910 370311 -95634 -1077003
34715a077003q09789L15615J288579J030106P359m69562q501O26618P35211L36148
$$ -1077003 -1886792 -1571177 -282598 747508 754867 285305 276804 903422 1638633 1974781
34705A974781k54233p65576q84170m17046L41853P92564O45553J33721l22330
$$ 1974781 1720548 954972 70802 -346244 -4391 788173 1433726 1567447 1245117
34696A245117m48335k31427J06157L44580N12390O71446N53063r2077q19628q87085
$$ 1245117 796782 565355 671512 1016092 1528482 2199928 2752991 2660914 1841286 954201
34686I54201m28464l69552r08702j077940l06325O15982Q37814O92813P66047
$$ 954201 525737 156185 -752517 -1830457 -2136782 -1520800 -682986 9827 775874
34677G75874P14033J07332m42247k30349K34963J56243q7684K06591N30959R5266
$$ 775874 1489907 1597239 1154992 924643 1159606 1315849 1228165 1434756 1965715 2060981
34667B060981m33787L198O51619l2497j493406j640893l37159K82724n40625r06477
$$ 2060981 1627194 1630392 2282011 2249514 756108 -884785 -1221944 -939220 -1479845 -2386322
34657b386322L42783J505675R17833k45616p7481Q87549Q45772j59709o00381
$$ -2386322 -2043539 -537864 379969 134353 56872 944421 1790193 1630484 1030103
34648A030103j95788o5668m78952m83113K15257P37230N57246R6175l42063q88419
$$ 1030103 834315 768647 289695 -193418 21839 759069 1316315 1412490 1070427 182008
34638A82008j223432o95542L97795Q50141K45368m29593k79319L29946N51130
$$ 182008 -1041424 -1736966 -1339171 -489030 -243662 -673255 -952574 -622628 -71498
34629g1498K02055l49387p81051q34019k80704O77915J372158J345592P63368
$$ -71498 130557 -218830 -999881 -1833900 -2114604 -1436689 -64531 1281061 2044429
34620B044429k463p51352j251754j168162m89692L30605Q79415J070198Q12723
$$ 2044429 2041966 1290614 38860 -1129302 -1618994 -1288389 -408974 661224 1473947
34611A473947n0209j162461j569271p77553M29284Q48417L54376j16396l7382
$$ 1473947 1423738 261277 -1307994 -2085547 -1656263 -807846 -453470 -569866 -607248
34602f07248N5976k95791m80788K41313J267257J248148J83869l21842N46914
$$ -607248 -551272 -847063 -1327851 -1086538 180719 1428867 1612736 1290894 1837808
34593A837808J363440N23230j126647j348235J26549J162197M68730n69622k98102
$$ 1837808 3201248 3724478 2597831 1249596 1376145 2538342 3007072 2437450 2139348
34584B139348N51283J77885j287454j935182r52950L62197O92128L45860K47560
$$ 2139348 2690631 2868516 1581062 -354120 -1307070 -944873 -252745 93115 340675
34575C40675M12998K62691k47011o40330p03003n42175r5563P19273J403893J133953
$$ 340675 753673 1016364 769353 129023 -573980 -1116155 -1211718 -492445 911448 2045401
34565B045401j01854j123108q24459L72520Q97084l8869j395332j555586k81458
$$ 2045401 1943547 820439 -4020 368500 1265584 1226715 -168617 -1724203 -2005661
34556b005661J113196J420639P72747R6722j11569j06432k98021p47409j184787
$$ -2005661 -892465 528174 1300921 1397643 1286074 1179642 881621 134212 -1050575
34547a050575j273846q72855j86565L54986M80830L70235N08341J152282J862507
$$ -1050575 -2324421 -3197276 -3383841 -3028855 -2548025 -2177790 -1669449 -517167 1345340
34538A345340J720010L41857j340575j821987p51650N95935R22605L95931j4872
$$ 1345340 3065350 3407207 2066632 244645 -507005 88930 1011535 1407466 1392594
34529A392594q2895l15675p61702q46250l66803K12036N01194M98601K09566k81927
$$ 1392594 1309699 994024 232322 -613928 -980731 -768695 -267501 231100 440666 158739
34519A58739m50633J17863Q74117Q83909J87325l61792m87688o02198o10298L4302
$$ 158739 -291894 -174031 700086 1583995 1771320 1409528 921840 319642 -290656 -256354
34509b56354R39911Q99867j86884r07675m10883M24304N44854J74928n2737k15842
$$ -256354 683557 1583424 1396540 488865 77982 502286 1047140 1222068 1169331 953489
34499I53489m99254n37818j87601L0906l8593J97539P70736P25627j79651p13432
$$ 953489 454235 -83583 -271184 -240278 -278871 -81332 689404 1415031 1235380 521948
34489E21948j09303O01337L39120l03009l78492k70619n88025o70961J48086R37945
$$ 521948 412645 1013982 1353102 1050093 671601 400982 -187043 -858004 -709918 228027
34479B28027N51946m00176o69587m14370l59830n1779J034833J730396P85548
$$ 228027 779973 379797 -289790 -704160 -1063990 -1115769 -80936 1649460 2435008
34470B435008o72538p24821J15122q6183j092115q72990O67658J388385N14658
$$ 2435008 1762470 1037649 1152771 1066588 -25527 -898517 -230859 1157526 1672184
34461A672184l72523l59258l65075p20923m26766M03633J96564j018489j072998
$$ 1672184 1299661 940403 575328 -145595 -572361 -168728 27836 -990653 -2063651
34452b063651N86797J517725K59870j118976m79886R65194J056937K71053K66103
$$ -2063651 -1476854 40871 300741 -818235 -1298121 -332927 724010 995063 1261166
34443A261166O84918J81491p48468p09741j24255l58457r96524o21611L43473
$$ 1261166 1946084 2127575 1379107 669366 545111 186654 -809870 -1431481 -1088008
34434a088008K54205o94523p04413M19464R19113J72785l57011J89931P24419
$$ -1088008 -833803 -1528326 -2232739 -1813275 -894162 -721377 -1078388 -888457 -164038
34425a64038L85643O6251O61936J370593R50325l84617j378599j361044o99320
$$ -164038 221605 287856 949792 2320385 3270710 2886093 1507494 146450 -552870
34416e52870j18373m2312k40703j0709Q53915J483156J028070K3082l36014j3127
$$ -552870 -671243 -713555 -954258 -964967 -111052 1372104 2400174 2423256 2087242 2074115
34406B074115l4954o93008j150022r10871m14426q658M36039P46309N24501J22574
$$ 2074115 2039161 1346153 196131 -714740 -1129166 -1137824 -701785 44524 569025 691599
34396F91599K23430M13985k52506j177538o66055J066333J529265l22054k105409
$$ 691599 915029 1329014 1076508 -101030 -767085 299248 1828513 1506459 -598950
34387e98950j390993O97438J310467K8383j088452q93020k98839j71459j36868
$$ -598950 -1989943 -1292505 17962 46345 -1042107 -1935127 -2233966 -2405425 -2542293
34378b542293J94623M32114K82021M0518r8510k52639k62354J33299N36598L40974
$$ -2542293 -2347670 -1915556 -1633535 -1593017 -1691527 -1944166 -2206520 -2073221 -1536623 -1195649
34368a195649j16111J6276N88953O52736J65735M9922L95205K05436o72538j031969
$$ -1195649 -1311760 -1295484 -706531 -53795 111940 161862 557067 762503 89965 -942004
34358i42004l73635J71512j19084k74479M21168Q56909P3169o95671J8751J124229
$$ -942004 -1315639 -1144127 -1263211 -1537690 -1116522 -259613 -186444 -882115 -863364 260865
34348B60865N57510j079183j215012M58853J312982k3241j471828q46535Q63874
$$ 260865 818375 -260808 -1475820 -1016967 296015 272774 -1199054 -2045589 -1181715
34339a181715J382772O36083K29797M97908L20852m84825p00346J45287Q55275
$$ -1181715 201057 837140 1066937 1564845 1885697 1400872 700526 845813 1701088
34330A701088L67033p41014j199904o79650J31675N09665K30997m97773j192018
$$ 1701088 2068121 1327107 127203 -552447 -420772 88893 319890 -177883 -1369901
34321a369901j317137o57127M94522J463249J505019L28427j381355k255252j531081
$$ -1369901 -2687038 -3344165 -2849643 -1386394 118625 447052 -934303 -3189555 -4720636
34312d720636Q2518J217718J314760Q49035L88906P5991p5287l3217M4457k6545
$$ -4720636 -4638118 -3420400 -2105640 -1256605 -867699 -791708 -866995 -900212 -855755 -882300
34302h82300r5970L9850J18897k08348n80358k69478O12738J057235N47878k22887
$$ -882300 -978270 -938420 -819523 -1027871 -1608229 -1877707 -1264969 -207734 340144 117257
34292A17257l91411l2284K26454J68454L1619o7641k27132m30593n12075l79382
$$ 117257 -274154 -306438 -79984 88470 120089 52448 -174684 -605277 -1117352 -1496734
34282a496734o7146L10265N41316M56252J90865P5078J78781K62793K45172L05312
$$ -1496734 -1563880 -1253615 -712299 -256047 -65182 9896 188677 451470 696642 1001954
34272A001954L72594J0173q31520j361894p90535N45725J412812J069295L6269
$$ 1001954 1374548 1384721 553201 -808693 -1599228 -1053503 359309 1428604 1464873
34263A464873o38216n73232k72211k93474n31220m65765N0476N50140N45017J29548
$$ 1464873 826657 253425 -18786 -312260 -843480 -1309245 -1258769 -708629 -163612 -34064
34253c4064j67265n775M33256O72414M10240j65508n28267l68607P5877L89785
$$ -34064 -201329 -207104 226152 898566 1308806 1143298 615031 246424 322301 712086
34243G12086M67262L38051j46144q65146j029830j64473P43838L57253p56829
$$ 712086 1179348 1517399 1371255 506109 -523721 -688194 55644 412897 -343932
34234c43932o32730R07738J526478o8329j771974j128745Q60191J347371j0675
$$ -343932 -976662 -68924 1457554 1389225 -382749 -1511494 -651303 696068 685393
34225F85393j010335o98677l40999n00591l7495J256675J674723M38642p44275
$$ 685393 -324942 -1023619 -1364618 -1865209 -1902704 -646029 1028694 1467336 723061
34216G23061l99743M12749J23125p44346p95341k25178j53205m83186k79256L70284
$$ 723061 323318 736067 859192 114846 -680495 -905673 -1058878 -1542064 -1821320 -1451036
34206a451036N37760O8935m04150o42395p48237m53741L13387P40602K87072j18944
$$ -1451036 -913276 -844341 -1248491 -1890886 -2639123 -3092864 -2779477 -2038875 -1751803 -1870747
34196a870747N31327J391340R15656m83296q58334K17288R49610J08275j199466
$$ -1870747 -1339420 51920 967576 484280 -374054 -156766 792844 901119 -298347
34187b98347j334352l91997L18071K24655m2792K01305Q02458J028623M72724
$$ -298347 -1632699 -2024696 -1706625 -1481970 -1524762 -1323457 -520999 507624 980348
34178I80348l89600o94959k75323J86994K66929L56291O62337N32325l64297j027056
$$ 980348 590748 -104211 -379534 -192540 74389 430680 1093017 1625342 1261045 233989
34168B33989n12193L43394P3831r66444j030466J80537R18294Q2955j108920r81714
$$ 233989 -278204 65190 139021 -827423 -1857889 -1677352 -759058 -676103 -1785023 -2766737
34158b766737L19193J350720J276209L58452p42470j311806p76752N93401J538465
$$ -2766737 -2447544 -1096824 179385 537837 -204633 -1516439 -2293191 -1699790 -161325
34149a61325J110821r5276o76307k27502K58630j40089j030163j313622p30423
$$ -161325 949496 854220 177913 -49589 209041 68952 -961211 -2274833 -3005256
34140c005256j85048l67898o38238L4868J300653J643862N93254m03907o647J098442
$$ -3005256 -3190304 -3558202 -4196440 -4161572 -2860919 -1217057 -623803 -1027710 -1034357 64085
34130F4085J340264N79458k0875k2164j68166q08096j190845o93745K31837P60387
$$ 64085 1404349 1983807 1962932 1940768 1772602 964506 -226339 -920084 -688247 72140
34120G2140O31445Q4299n47173r17439q10447l61822J53157O40393R62959P53475
$$ 72140 703585 787884 240711 -676728 -1487175 -1848997 -1695840 -1055447 -92488 660987
34110F60987o535o15406n23441j64181j85825l48205o6268M45701N69679L42241
$$ 660987 654452 39046 -484395 -648576 -834401 -1182606 -1248874 -803173 -233494 108747
34100A08747Q2588m45740j299343j464105j98382J333610J476608O01132K93264
$$ 108747 191335 -254405 -1553748 -3017853 -3216235 -1882625 -406017 195115 488379
34091D88379N43290N6188q99364o49159O61669Q50724n61193j234193J28654J505558
$$ 488379 1031669 1087857 188493 -460666 201003 1051727 490534 -743659 -615005 890553
34081H90553Q67826o12660p50398K01617N35952L5976k89718k99402m83265n36674
$$ 890553 1758379 1145719 395321 596938 1132890 1168866 879148 579746 96481 -440193
34071d40193j7970M13284R4830k29109K69101Q21120M32419j95391K615L54585
$$ -440193 -458163 -44879 49951 -179158 89943 911063 1343482 1148091 1150706 1505291
34061A505291k14107q76819l24560M96331k38608j793887j723992Q7782J182344
$$ 1505291 1291184 414365 89805 586136 347528 -1446359 -3170351 -3082569 -1900225
34052a900225M73802l92241j01739N94258R28463J376336J938078J487732q2566
$$ -1900225 -1426423 -1818664 -1920403 -1326145 -397682 978654 2916732 4404464 4321898
34043D321898j164197r54806o62758j098583j167082j27220O80252P2773p58508
$$ 4321898 3157701 2202895 1540137 441554 -725528 -852748 -172496 -99723 -858231
34034h58231k04564R79164R04666l75409j034506k21683J072300J644521J193047
$$ -858231 -1062795 -83631 821035 445626 -588880 -810563 261737 1906258 3099305
34025C099305K3296j188908j544075p88716K01771N38628M51505N77828P52492
$$ 3099305 3122601 1933693 389618 -399098 -197327 341301 792806 1370634 2123126
34016B123126L93052m41351j207199j587683j395382m88282N57699O57666r6831
$$ 2123126 2516178 2074827 867628 -720055 -2115437 -2603719 -2046020 -1388354 -1485185
34007a485185j46456J069389J743166L81734j469928j346037K55894O99786m82918
$$ -1485185 -1631641 -562252 1180914 1562648 92720 -1253317 -997423 -297637 -780555
33998g80555r85603K32737J176765K62343r55941l62714J226272J392474q1229
$$ -780555 -1766158 -1533421 -356656 -94313 -1050254 -1412968 -186696 1205778 1124549
33989A124549j045678l82683N50232L05132n37986n98492P8918K76157l60256
$$ 1124549 78871 -303812 246420 551552 13566 -584926 -506008 -229851 -590107
33980e90107p91830k85776M01326K19247m73414m20836N38860J171915P86865
$$ -590107 -1381937 -1667713 -1266387 -1047140 -1520554 -1941390 -1402530 -230615 556250
33971E56250K85854N59409Q82895J08150j215440j396892j43086R24895N93145
$$ 556250 842104 1401513 2284408 2392558 1177118 -219774 -362860 562035 1155180
33962A155180m00580p47382m10509k10549l14954j76342L21076N89445K63798
$$ 1155180 754600 7218 -403291 -613840 -928794 -1105136 -784060 -194615 69183
33953F9183k56603l73766J1363N40032Q61236Q74975O55844L06835j11973n76021
$$ 69183 -187420 -561186 -549823 -9791 851445 1726420 2382264 2689099 2577126 2001105
33943B001105j032846j329816j237626o55654J49804O62858O59186N08610O54555
$$ 2001105 968259 -361557 -1599183 -2254837 -2105033 -1442175 -782989 -274379 380176
33934C80176Q93593O10254k39067q85333o95915O5613O64621O76782J24430p00765
$$ 380176 1273769 1884023 1644956 759623 63708 129321 793942 1470724 1595154 894389
33924H94389j259523j074032l45023J74762J83847J58132M07511N39778K98164
$$ 894389 -365134 -1439166 -1784189 -1609427 -1425580 -1267448 -859937 -320159 -21995
33915b1995J32265L36955M22744L8278l20327l04464m57339r93341r24089K75981
$$ -21995 110270 447225 869969 908247 587920 283456 -173883 -1167224 -2091313 -1815332
33905a815332J211739M92360p98113o26516O41235Q19957m05352r94503n1005
$$ -1815332 -603593 -111233 -909346 -1535862 -894627 -74670 -480022 -1474525 -1525530
33896a525530Q18504M27667j78353L923J28377n48966r30867l2688J026479Q35237
$$ -1525530 -707026 -279359 -457712 -453789 -325412 -874378 -1805245 -1837933 -811454 23783
33886B3783L6770l7832K39953j67243o76231j10158Q01950L56612j110520j544401
$$ 23783 60553 22721 262674 95431 -580800 -690958 110992 467604 -642916 -2187317
33876b187317m60377M20320J48677o5170P79681J627651J065697m48571j301875
$$ -2187317 -2647694 -2227374 -2078697 -2143867 -1364186 263465 1329162 880591 -421284
33867d21284r17435j77425O004k27697l4702R87997K074399J949465M32390j102891
$$ -421284 -1338719 -1516144 -1510140 -1737837 -1772539 -784542 1289857 3239322 3671712 2568821
33857B568821j398759q85744p59648j035172p13076L51113J066364P37015n2162
$$ 2568821 1170062 284318 -475330 -1510502 -2223578 -1872465 -806101 -69086 -121248
33848a21248m65001l98650j50979Q9403J35564j44222m52619l14465K06131N71985
$$ -121248 -586249 -984899 -1135878 -1046475 -910911 -1055133 -1507752 -1822217 -1616086 -1044101
33838a044101N10289J35916m61081j074669j087778j45416J055838J472551J031928
$$ -1044101 -533812 -397896 -858977 -1933646 -3021424 -3166840 -2111002 -638451 393477
33829C93477M79466K30546K16273M31855O56634J64754j125899j842425r06191
$$ 393477 872943 1103489 1319762 1751617 2408251 2573005 1447106 -395319 -1301510
33820a301510N63247P99628J85336L65828J078023N18140j124184j445933K01796
$$ -1301510 -738263 61365 246701 612529 1690552 2208692 1084508 -361425 -159629
33811a59629J424556O19134o69010p77531o32981j361895j652391j31212J551013
$$ -159629 1264927 1884061 1215051 437520 -195461 -1557356 -3209747 -3340959 -1789946
33802a789946R78627r69048j337999L53786J734837J468687P05206M87810L06536
$$ -1789946 -811319 -1780367 -3118366 -2764580 -1029743 438944 1144150 1631960 1938496
33793A938496k11857l94096m7806n9547p19275j046816n01810J14541J84423K77638
$$ 1938496 1726639 1332543 1284737 1225190 505915 -540901 -1042711 -928170 -743747 -466109
33783d66109Q15144J059196M20283l42495k94328J79745J30537l84229n87594
$$ -466109 349035 1408231 1828514 1486019 1191691 1371436 1501973 1117744 530150
33774E30150l87633l79299o09262l90865M76653J135098P51293k99793q55240
$$ 530150 142517 -236782 -846044 -1236909 -760256 374842 1126135 826342 -28898
33765b8898m21985K78551L47870j33611l81767r2340K26896J26204j50390j07626
$$ -28898 -450883 -172332 175538 41927 -339840 -432180 -205284 -79080 -229470 -337096
33755c37096L39212Q25056Q28483K7103j150697j489088l33729J100940R45511
$$ -337096 2116 827172 1655655 1682758 532061 -957027 -1290756 -189816 755695
33746G55695o37283j428262l60781Q73942N06441o13096o39160K23706L84834
$$ 755695 118412 -1309850 -1670631 -796689 -290248 -903344 -1542504 -1318798 -933964
33737i33964j96811n6158R72172J268106J28114j029343q76793K8036N06044M56633
$$ -933964 -1130775 -1186933 -214761 1053345 1181459 152116 -724677 -696641 -190597 266036
33727B66036L49739J16038m32687q35789n80589J6476K67147Q1360j00801k8553
$$ 266036 615775 731813 299126 -536663 -1117252 -1100776 -833629 -752269 -853070 -881623
33717h81623J89609L94804N02418M87648M14811L05760J4941m62673p11463l98656
$$ -881623 -692014 -297210 205208 692856 1107667 1413427 1428368 965695 254232 -144424
33707a44424Q9081R9717l05854m80517k03862J54313M33997Q48283J278114J188527
$$ -144424 -55343 44374 -261480 -741997 -945859 -791546 -357549 490734 1768848 2957375
33697B957375M40617m42164r55370j022989p32713k57199O862j71221m31343l74195
$$ 2957375 3397992 2955828 2000458 977469 244756 -12443 -5581 -176802 -608145 -982340
33687i82340k48999l71012l00499L91630R78986M87741n51356p33860j1191L52159
$$ -982340 -1231339 -1602351 -1902850 -1511220 -532234 -44493 -595849 -1329709 -1340900 -988741
33677i88741M7292Q1409O02337M29174n46757o21036Q41877J766802L65355j801287
$$ -988741 -941449 -860040 -257703 171471 -375286 -996322 -154445 1612357 1977712 176425
33667A76425j900084L5347J346280P45639k06550Q1649R26479Q09169j86754o16526
$$ 176425 -1723659 -1688312 -342032 403607 197057 278706 1205185 2014354 1827600 1211074
33657A211074J11644Q42046K50288j240324j793685n55062R86919Q32897p28340
$$ 1211074 1322718 2164764 2415052 1174728 -618957 -1174019 -187100 645797 -82543
33648h2543j424233k24171J211627J053985o7872k65034O79569J180931L77916
$$ -82543 -1506776 -1730947 -519320 534665 466793 201759 881328 2062259 2440175
33639B440175p24050q65843j30838N29690N80021K06101j93809l90730m03546
$$ 2440175 1716125 850282 719444 1249134 1829155 2035256 1841447 1450717 1047171
33630A047171m36425o16285p10044k87431O87770J522737J284187j73593j726674
$$ 1047171 610746 -5539 -715583 -1003014 -315244 1207493 2491680 2318087 591413
33621E91413j908568n23239J042151J431680P83180R6111k47518m69537m39381
$$ 591413 -1317155 -1840394 -798243 633437 1416617 1512728 1265210 795673 356292
33612C56292O2506M13146j51461j002700q11054J61986K32049q59131j228865
$$ 356292 418798 831944 680483 -322217 -1133271 -971285 -739236 -1598367 -2827232
33603b827232J19052J485011J089066j94468m86603R3363J46945k68069Q0560
$$ -2827232 -2708180 -1223169 -134103 -328571 -815174 -721811 -574866 -842935 -762375
33594g62375J038553J078149q5902r68586p40091k98309l59074k30710O16216
$$ -762375 276178 1354327 1268425 299839 -440252 -738561 -1097635 -1328345 -712129
33585g12129J229062N98169n94963q60921K4461Q85612Q15600R7966m86959n88422
$$ -712129 516933 1115102 520139 -340782 -316321 569291 1384891 1482857 995898 407476
33575D07476l88259k12847k56715n22024q35216q80850l60992O30256J389056
$$ 407476 19217 -193630 -450345 -972369 -1807585 -2688435 -3049427 -2419171 -1030115
33566a030115J137774j5353j011710j043061m66915j40076k10706j21195M28033
$$ -1030115 107659 92306 -919404 -1962465 -2429380 -2569456 -2780162 -2901357 -2473324
33557b473324J106138J438573J177196L18410p51060j271644q26230M1649M42610
$$ -2473324 -1367186 71387 1248583 1566993 815933 -455711 -1281941 -1240292 -797682
33548g97682K56329M6691J269k43077o22742l85385P20004J675891J348225O8501
$$ -797682 -541353 -494662 -493393 -736470 -1359212 -1744597 -1024593 651298 1999523 2068024
33538B068024p12941l15446L94276L64017k11208m14340o8724J91306J23005J34048
$$ 2068024 1355083 1039637 1433913 1797930 1586722 1172382 1103658 1294964 1417969 1552017
33528A552017K36366j30170q09163o82716M69983J079081K052j418027j158328
$$ 1552017 1788383 1658213 849050 166334 636317 1715398 1717450 299423 -858905
33519h58905M10003J211019P35766L70218N40481M1879j258106j532150O6520
$$ -858905 -448902 762117 1497883 1868101 2408582 2450461 1192355 -339795 -273275
33510b73275J705773J530397K37174m83126m61823m18044k66396K25691L25434
$$ -273275 1432498 2962895 3200069 2716943 2255120 1837076 1570680 1796371 2121805
33501B121805m11553q99064k25548N33021K8429r23733o58351M91110Q35331J75664
$$ 2121805 1710252 811188 585640 1118661 1147090 223357 -434994 56116 891447 1067111
33491A067111j93342R0576J93205J220K01516N59353J50888p24724q58689l40111
$$ 1067111 873769 964345 1157550 1158770 1360286 1919639 2070527 1345803 487114 147003
33481A47003l99065r78777o46368P42516J460275O17638n12919o55565k18097
$$ 147003 -252062 -1230839 -1877207 -1134691 325584 943222 430303 -225262 -443359
33472d43359M2333L74633J020369J230732M07441p47934j126263n47311L27459
$$ -443359 -401026 -26393 993976 2224708 2632149 1884215 757952 210641 538100
33463E38100P32238K33923p68659j035742k856R56131K03617j478257j721459
$$ 538100 1270338 1504261 735602 -300140 -302996 653135 856752 -621505 -2342964
33454b342964r1525J324391J178483M87963L27082J60494m48354o01749Q7284
$$ -2342964 -2434489 -1110098 68385 556348 883430 1043924 595570 -6179 81105
33445H1105L50142m84072q97763L52272J795873J369021k69298q08179J07007
$$ 81105 431247 -52825 -950588 -598316 1197557 2566578 2297280 1489101 1596108
33436A596108O37691j34193r88644p21608J76496N54530J89937k35707j69069
$$ 1596108 2233799 2099606 1110962 389354 565850 1120380 1310317 1074610 905541
33427I05541J84538J34571n39201j007836l85706O96606O07705q10466j603892
$$ 905541 1090079 1224650 685449 -322387 -708093 -11487 596218 -214248 -1818140
33418a818140m16244J406496J691278M37994n62928m78055j80515m37107q08358
$$ -1818140 -2234384 -827888 863390 1301384 738456 260401 79886 -357221 -1165579
33409a165579n71261K64280J096155J288083O20132l30457n35558K08212P75494
$$ -1165579 -1736840 -1472560 -376405 911678 1531810 1201353 665795 874007 1649501
33400A649501J87775q57924q64467K91140J053235K00957j545379k274350j008041
$$ 1649501 1837276 979352 114885 406025 1459260 1660217 114838 -2159512 -3167553
33391c167553J131334K040868J045381k37775m5941J025968R16231o91865j761661
$$ -3167553 -2036219 4649 1050030 812255 766314 1792282 2708513 2016648 254987
33382B54987r47739N02230Q57276L53168J98928M00752J48234m72530o71850l25901
$$ 254987 -692752 -190522 666754 1019922 1218850 1619602 1767836 1295306 623456 297555
33372B97555J04487M93400P86360M84578m69368j027215m72095K60905K1839o31300
$$ 297555 402042 895442 1681802 2166380 1697012 669797 197702 458607 480446 -150854
33362a50854m80889J55807N7505o29374o47652J25301N64565L39433K49958M84583
$$ -150854 -631743 -475936 -418431 -1047805 -1695457 -1570156 -1005591 -666158 -416200 68383
33352F8383L36484j54907l6371P39714R98819L24318k18001O5419L78058q6823
$$ 68383 404867 249960 213589 953303 1952122 2276440 2058439 2123858 2501916 2415093
33342B415093q08191q97307m06729M8610J77559k9231m73115o84428j82003O08563
$$ 2415093 1606902 709595 302866 351476 529035 499804 26689 -657739 -839742 -231179
33332b31179O93125M1154k44204L44032R10013O07330j57301o33274q51278j030239
$$ -231179 461946 503100 258896 602928 1512941 2120271 1962970 1329696 478418 -551821
33322e51821p22594M40008J670210J707418M55823q05321r35565k08622J35926
$$ -551821 -1274415 -834407 835803 2543221 2999044 2193723 1258158 1049536 1185462
33313A185462m91959j151899n25282J083378J749709M69354j209084j157124M00123
$$ 1185462 693503 -458396 -983678 99700 1849409 2318763 1109679 -47445 352678
33304C52678J317694N51633p82739j339827j011101k55255O16901J126928Q43330
$$ 352678 1670372 2222005 1439266 99439 -911662 -1166917 -550016 576912 1420242
33295A420242K30713J30067K79940k68955j189770j057591J82375Q40896K16912
$$ 1420242 1650955 1781022 2060962 1792007 602237 -455354 -272979 567917 784829
33286G84829l06472J36804K90529p78892j590174n42142J243312J548952M05344
$$ 784829 478357 615161 905690 126798 -1463376 -2005518 -762206 786746 1192090
33277A192090m23824m50299o07420q88143k73886R82199J267437J66440q49453
$$ 1192090 768266 317967 -289453 -1177596 -1451482 -469283 798154 964594 115141
33268A15141p65992k73907j06212J36840O93410P40221j50311q93581l98076P06344
$$ 115141 -650851 -924758 -1030970 -894130 -200720 539501 389190 -504391 -902467 -196123
33258a96123R78005J94146n74955n81066j99373k00173p81269j332530j027936
$$ -196123 781882 976028 401073 -179993 -379366 -579539 -1360808 -2693338 -3721274
33249c721274J39847J048675P61302k5780J31653J088682J101273l74269j517974
$$ -3721274 -3581427 -2532752 -1771450 -1797230 -1665577 -576895 524378 150109 -1367865
33240a367865q89102K14383j31352j197379p20700J242421K150961R10936n20495
$$ -1367865 -2256967 -2042584 -2173936 -3371315 -4092015 -2849594 -698633 212303 -308192
33231c08192l63005M23325K66029k78834Q4384P09652J12987j062919p74194Q98598
$$ -308192 -671197 -247872 18157 -260677 -176293 533359 646346 -416573 -1190767 -292169
33221b92169J537961J60507j224663q16979L88524O63629L42868O61252J155659
$$ -292169 1245792 1406299 181636 -635343 -246819 416810 759678 1420930 2576589
33212B576589M34552j142893j723633p58164L53368N30722K22513M8556j78300
$$ 2576589 3011141 1868248 144615 -613549 -260181 270541 493054 541610 363310
33203C63310n52048n71255j72581q9768n25370n60332L58754J325774J233754
$$ 363310 -188738 -759993 -932574 -1022342 -1547712 -2108044 -1749290 -423516 810238
33194H10238L36231l45891n48491p53854j049527r08084n3529J019099J413857
$$ 810238 1146469 800578 252087 -501767 -1551294 -2459378 -2512907 -1493808 -79951
33185g9951N82302j021792k006411j336682L14412J239514Q73287L09134L14529
$$ -79951 502351 -519441 -2525852 -3862534 -3548122 -2308608 -1435321 -1126187 -811658
33176h11658J38668q25063j445314l83723J536182K140305Q47588p26047j151013
$$ -811658 -672990 -1498053 -2943367 -3327090 -1790908 349397 1196985 470938 -680075
33167f80075p16211k51727K08471Q56826J215484P61240o0335k95154K16957O54249
$$ -680075 -1396286 -1648013 -1439542 -582716 632768 1394008 1333673 1038519 1255476 1909725
33157A909725L40924m29892q84217p82449o12335p68403r06058m60029L80664
$$ 1909725 2250649 1820757 936540 154091 -458244 -1226647 -2132705 -2592734 -2212070
33148b212070P61676K94216m49654p66353n94535j90700L58281Q81450R66851
$$ -2212070 -1450394 -1156178 -1605832 -2372185 -2966720 -3157420 -2799139 -1917689 -950838
33139i50838N75695K86503M01678L86449k02343q50830q68251m19710p330L97009
$$ -950838 -375143 -88640 313038 699487 497144 -353686 -1221937 -1641647 -1648977 -1251968
33129a251968Q15751O67711j58511m82992M57925J302460M24418j139285r39763
$$ -1251968 -436217 231494 72983 -410009 47916 1350376 1774794 635509 -304254
33120c04254R24943J742904M39948q62192n20701J03544n68743j436872q04388
$$ -304254 620689 2363593 2803541 1941349 1420648 1524192 955449 -481423 -1285811
33111a285811N10525O13720k42358l54405M55349R61082Q94497Q19797L26658
$$ -1285811 -775286 -161566 -403924 -758329 -302980 658102 1552599 2372396 2699054
33102B699054j134731k172007j001736J175904J378739m58624j227795K82296
$$ 2699054 1564323 -607684 -1609420 -433516 945223 486599 -741196 -458900
33094d58900J462437L85559j054887o06623N93409L64229p08876p30841j8306
$$ -458900 1003537 1389096 334209 -272414 320995 685224 -23652 -754493 -772799
33085g72799j05182n35728J61032J184683M88841j297193j373022O39514J925680
$$ -772799 -877981 -1413709 -1252677 -67994 420847 -876346 -2249368 -1609854 315826
33076C15826R77820k94339j11611M53698m0920p53305m17128J84775j87256p55409
$$ 315826 1293646 999307 887696 1341394 1300474 547169 130041 314816 127560 -627849
33066f27849j27312J009051R09565k68126p58982l1264P29657P97341O47229N21760
$$ -627849 -755161 253890 1163455 895329 136347 105083 834740 1632081 2279310 2801070
33056B801070L6093o13137o51226j66971o9484l99660k11356N70484P93348J09979
$$ 2801070 2837163 2224026 1572800 1405829 1336345 936685 725329 1295813 2089161 2199140
33046B199140k36174N24297J295448Q42668l16895r18515q07994n60236j67103
$$ 2199140 1962966 2487263 3782711 4625379 4308484 3389969 2581975 2021739 1854636
$$ [...]
##END NTUPLES=NMR SPECTRUM
##END=
