##TITLE=31Pdec_PhDiP0609
 CDCl3 24 sc
 7.9.2023
##JCAMPDX= 6.0         $$ Bruker NMR JCAMP-DX V2.0
##DATA TYPE= NMR SPECTRUM
##DATA CLASS= NTUPLES
##ORIGIN= UXNMR, Bruker Analytische Messtechnik GmbH
##OWNER= root
$$ XWIN-NMR		Version 3.5
$$ Thu Sep  7 13:55:38 2023 Russian Standard Time (UT+4h)  she@DPX200
##.OBSERVE FREQUENCY= 81.013821
##.OBSERVE NUCLEUS= ^31P
##.ACQUISITION MODE= SIMULTANEOUS
##.ACQUISITION SCHEME= undefined
##.AVERAGES= 24
##.DIGITISER RES= 16
##SPECTROMETER/DATA SYSTEM= spect
##.PULSE SEQUENCE= zgpg30
##.SOLVENT NAME= DMSO
##.SHIFT REFERENCE= (INTERNAL, DMSO, 0, 248.564)
##AUDIT TRAIL= $$ (NUMBER, WHEN, WHO, WHERE, WHAT)
$$ ##TITLE= Audit trail, XWIN-NMR		Version 3.5
$$ ##JCAMPDX= 5.01
$$ ##ORIGIN= Bruker BioSpin GmbH
$$ ##OWNER= she
$$ F:/spectra/data/she/nmr/P31/1/pdata/1/auditp.txt
$$ ##AUDIT TRAIL=  $$ (NUMBER, WHEN, WHO, WHERE, WHAT)
(   1,<2023-09-07 13:54:43.15 +0400>,<she>,<DPX200>,
      <created by zg, POWCHK disabled, PULCHK disabled
       configuration hash MD5:
       00 E9 B6 7A A2 85 ED C7 34 08 36 98 17 FE 4E 26
       data hash MD5: 32K
       A5 2C 11 A1 0C 21 21 FB C8 C7 0B 87 F7 1B 5A 31>)
(   2,<2023-09-07 13:54:46.57 +0400>,<she>,<DPX200>,
      <Start of raw data processing
       efp BC_mod = 2 LB = 5 FT_mod = 6 PKNL = 1 PHC0 = -10610.67 PHC1 = -13.31499 SI = 64K 
       data hash MD5: 64K
       6D 63 DD 74 C7 E1 42 43 27 72 A9 5F 20 69 D5 31>)
(   3,<2023-09-07 13:55:02.07 +0400>,<she>,<DPX200>,
      <pk PHC0 = 13.25021 PHC1 = 0 
       data hash MD5: 64K
       A5 B8 0E 22 BD 4D E1 16 21 08 39 DE 8A 13 7C EC>)
(   4,<2023-09-07 13:55:06.31 +0400>,<she>,<DPX200>,
      <abs ABSG = 5 
       data hash MD5: 64K
       1A B1 F0 4A 19 1D 92 ED 5D 55 A8 80 AD 20 AD F3>)
$$ ##END=
$$ 
$$ hash MD5
$$ AD DD 97 55 F5 2A F6 CB F1 F3 80 C5 58 19 A8 D0
##$RELAX= 
##$RELAX= 
##$RELAX= 
##$RELAX= 
##$RELAX= 
##$RELAX= 
##$RELAX= 
##$RELAX= 
##$RELAX= 
$$ Bruker specific parameters
$$ --------------------------
##$DU= <F:/spectra>
##$EXPNO= 1
##$NAME= <P31>
##$PROCNO= 1
##$TYPE= <nmr>
##$USER= <she>
##$AMP= (0..31)
100 100 100 100 100 100 100 100 100 100 100 100 100 100 100 100 100 100 
100 100 100 100 100 100 100 100 100 100 100 100 100 100 
##$AQSEQ= 0
##$AQ_mod= 1
##$AUNM= <au_zg>
##$AUTOPOS= <>
##$BF1= 81.014009
##$BF2= 200.13
##$BF3= 200.13
##$BF4= 200.13
##$BF5= 200.13
##$BF6= 200.13
##$BF7= 200.13
##$BF8= 200.13
##$BYTORDA= 1
##$CFDGTYP= 0
##$CFRGTYP= 5
##$CHEMSTR= <none>
##$CNST= (0..31)
1 1 145 1 1 1 1 1 1 1 1 1 1 1 1 1 1 1 1 1 1 1 1 1 1 1 1 1 1 1 1 1 
##$CPDPRG= <waltz16>
##$CPDPRG1= <>
##$CPDPRG2= <waltz16>
##$CPDPRG3= <>
##$CPDPRG4= <mlev>
##$CPDPRG5= <mlev>
##$CPDPRG6= <mlev>
##$CPDPRG7= <mlev>
##$CPDPRG8= <mlev>
##$CPDPRGB= <>
##$CPDPRGT= <>
##$D= (0..31)
0 1 0 0 0 0 0 0 0 0 0 0.03 2e-05 3e-06 0 0 0 0 0 0 0 0 0 0 0 0 0 0 0 0 
0 0 
##$DATE= 1694080482
##$DBL= (0..7)
120 120 120 11 120 120 24 19 
##$DBP= (0..7)
150 150 150 150 150 150 150 150 
##$DBP07= 0
##$DBPNAM0= <>
##$DBPNAM1= <>
$$ [...]
##$SUBNAM3= <"">
##$SUBNAM4= <"">
##$SUBNAM5= <"">
##$SUBNAM6= <"">
##$SUBNAM7= <"">
##$SUBNAM8= <"">
##$SUBNAM9= <"">
##$SW= 501.771253377433
##$SWIBOX= (0..15)
0 1 3 0 0 0 0 0 0 0 0 0 0 0 0 0 
##$SW_h= 40650.406504065
##$TD= 32768
##$TD0= 1
##$TE= 0
##$TE2= 300
##$TE3= 300
##$TEG= 300
##$TL= (0..7)
0 120 53 12 22 120 120 120 
##$TP= (0..7)
150 150 150 150 150 150 150 150 
##$TP07= 0
##$TPNAME0= <>
##$TPNAME1= <>
##$TPNAME2= <>
##$TPNAME3= <>
##$TPNAME4= <>
##$TPNAME5= <>
##$TPNAME6= <>
##$TPNAME7= <>
##$TPOAL= (0..7)
0.5 0.5 0.5 0.5 0.5 0.5 0.5 0.5 
##$TPOFFS= (0..7)
0 0 0 0 0 0 0 0 
##$TUNHIN= 0
##$TUNHOUT= 0
##$TUNXOUT= 0
##$USERA1= <user>
##$USERA2= <user>
##$USERA3= <user>
##$USERA4= <user>
##$USERA5= <user>
##$V9= 5
##$VALIST= <valist>
##$VCLIST= <CCCCCCCCCCCCCCC>
##$VD= 0
##$VDLIST= <DDDDDDDDDDDDDDD>
##$VPLIST= <PPPPPPPPPPPPPPP>
##$VTLIST= <TTTTTTTTTTTTTTT>
##$WBST= 1024
##$WBSW= 4
##$XGAIN= (0..3)
0 0 0 0 
##$XL= 0
##$YL= 0
##$YMAX_a= 12409
##$YMIN_a= -12206
##$ZGOPTNS= <>
##$ZL1= 120
##$ZL2= 120
##$ZL3= 120
##$ZL4= 120
##$ABSF1= 248.5645
##$ABSF2= -253.2056
##$ABSG= 5
##$ABSL= 3
##$ALPHA= 0
##$AQORDER= 0
##$ASSFAC= 0
##$ASSFACI= 0
##$ASSFACX= 0
##$ASSWID= 0
##$AUNMP= <proc_1d>
##$AZFE= 0.1
##$AZFW= 0.5
##$BCFW= 0
##$BC_mod= 2
##$BYTORDP= 0
##$COROFFS= 0
##$CY= -3
##$DATMOD= 1
##$DC= 0
##$DFILT= <>
##$DTYPP= 0
##$F1P= 0
##$F2P= 0
##$FCOR= 1
##$FTSIZE= 65536
##$FT_mod= 6
##$GAMMA= 0
##$GB= 0
##$INTBC= 1
##$INTSCL= 6.047779e-11
##$ISEN= 30
##$LB= 5
##$LEV0= 0
##$LPBIN= 0
##$MAXI= 10000
##$MC2= 0
##$MEAN= 0
##$ME_mod= 0
##$MI= 50
##$NCOEF= 0
##$NC_proc= -5
##$NLEV= 6
##$NOISF1= 182.463
##$NOISF2= 159.3651
##$NSP= 0
##$NTH_PI= 0
##$NZP= 0
##$OFFSET= 248.5645
##$PC= 4
##$PHC0= -10597.42
##$PHC1= -13.31499
##$PH_mod= 1
##$PKNL= yes
##$PPARMOD= 0
##$PSCAL= 0
##$PSIGN= 0
##$REVERSE= no
##$SF= 81.0140089999694
##$SI= 65536
##$SIGF1= 159.3651
##$SIGF2= -187.1042
##$SINO= 113.3802
##$SIOLD= 16384
##$SREGLST= <1H.CDCl3>
##$SSB= 0
##$STSI= 65536
##$STSR= 0
##$SW_p= 40650.406504065
##$SYMM= 0
##$S_DEV= 0
##$TDeff= 32768
##$TDoff= 0
##$TI= <>
##$TILT= no
##$TM1= 0
##$TM2= 0
##$TOPLEV= 0
##$USERP1= <user>
##$USERP2= <user>
##$USERP3= <user>
##$USERP4= <user>
##$USERP5= <user>
##$WDW= 1
##$XDIM= 65536
##$YMAX_p= 466943285
##$YMIN_p= -6370292
$$ End of Bruker specific parameters
$$ ---------------------------------
##NTUPLES= NMR SPECTRUM
##VAR_NAME=  FREQUENCY,     SPECTRUM/REAL,   SPECTRUM/IMAG
##SYMBOL=    X,             R,               I
##VAR_TYPE=  INDEPENDENT,   DEPENDENT,       DEPENDENT
##VAR_FORM=  AFFN,          ASDF,            ASDF
##VAR_DIM=   65536,         65536,           65536
##UNITS=     HZ,            ARBITRARY UNITS, ARBITRARY UNITS
##FACTOR=    0.620285442955139, 1,           1
##FIRST=     20137.2065510682, 0,            0
##LAST=      -20513.1999529968, 0,           0
##MIN=       -20513.1999529968, -6370292,    0
##MAX=       20137.2065510682, 466943285,    0
$$ Real data points
##PAGE= N=1
##DATA TABLE= (X++(R..R)), XYDATA
$$ [...]
39113C786J1949M792J720J644M261M216m792j8898k5879k0039q174M6j06r997
39099e5471k6157l5151k2192Q584L2437L0529J0220q661j8973k6749l3514l2399
39087a77497k0842m591J2973L5309O2842Q6537R5818Q8105O7961M2197J8614L624
39075C11050l409r595j8364k3889k0355j2964j2881k2369l1420l0332k0398j0122
39063I4952n847r533k1741m0710n8482o2933m6591j3055K4908N1999N6741L6877
39051F585K216l0052m7192m9683m8004n1406o0553o9109o9833n9498m0330j7934
39039e34793K673J9086L0568L7737M4228N5092O9661P7863O8398M0820N959k5266
39027a07974m8585o1246n6843l1030R582M9311P5260Q5417Q5288P9650O9406N5074
$$ y = [3786, 15735, 20527, 22247, 23891, 28152, 32368, 27576, 8678, -17201, -37240, -45414, -45368, -45474, -55471, -81628, -116779, -138971, -130387, -97950, -67421, -57201, -65862, -84835, -111584, -145098, -177497, -198339, -202930, -189957, -154648, -91806, -5269, 90549, 178654, 246615, 288812, 307426, 311050, 307641, 298046, 279682, 255793, 235438, 222474, 209593, 187224, 155804, 125472, 105074, 94952, 89105, 79572, 57831, 17121, -41361, -104294, -150885, -163940, -139032, -87033, -30292, 6585, 8801, -21251, -68443, -118126, -166130, -217536, -278089, -347198, -417031, -476529, -516859, -534793, -532120, -513034, -482466, -444729, -400501, -345409, -275748, -197885, -129487, -88667, -82708, -107974, -156559, -217805, -274648, -305678, -296096, -246785, -171525, -86108, -820, 78830, 148236, 203310]
39015B03310L9933K7386J6304K372j4647k8054l1303k5409j6111o127M649J3048
39003A85351J3804P753J761k702j4366l9596o9004q3635p4420n1250l2660k9403
38991a88367l7531m4320m0538k8765j9549j9147k3225k3988j9596j2755l593R608
38979d51766K3458L0530L0361L4121N2567P9448R0831O4793M170o0396r3102q1223
38967b76208m0892L987M2891P6063R8607R8782P3339L5416K149k0429l6186m7910
38955I609n4031n4082n0901m6313l8475k4976o559J3353L1804M8239O3217P4779
38943c4336P6897O4198L9039J1193j1672l1188n3467p8790r8787j02744q4810
38932c04467m7432k001L4778N0244M4182K7181J1753O994J8182M3464O8950P4912
$$ y = [203310, 243243, 270629, 286933, 289305, 274658, 246604, 215301, 189892, 173781, 167654, 172303, 185351, 199155, 206908, 208669, 205967, 191601, 152005, 83001, -634, -75054, -126304, -158964, -188367, -225898, -270218, -310756, -339521, -359070, -378217, -401442, -425430, -445026, -457781, -461374, -451766, -428308, -397778, -367417, -333296, -280729, -201281, -110450, -45657, -41487, -101883, -194985, -276208, -317100, -313113, -270222, -194159, -95552, 3230, 76569, 111985, 114134, 93705, 57519, 9609, -44422, -98504, -149405, -195718, -234193, -259169, -265728, -252375, -220571, -172332, -109115, -34336, 42561, 106759, 145798, 156991, 145319, 114131, 60664, -18126, -116913, -219657, -304467, -351899, -353900, -319122, -268878, -224696, -197515, -185762, -178768, -160586, -117122, -48172, 26740]
38920B6740N3880K0387k197l487Q662K1197K6672K1399K427k6721n1201n3985
38908D3773l2388k383J5243J1864n105k1178k4987j2423J3608M4613O9203P7697
38896A77537O6884M2052J4726l603q853p220r417k0379l4473m0896l2660j0495
38884A33203J8429M2269M7950K9887j721k5372k5731o418J6001K9095L3464L6921
38872C27977M4159N2120N1883L4576m97m1124o8486p2240n9377m6052m0951l8597
38860A43391k8327o583K0352M1954M8765L5832P745j8725k3795k663K7558M3572
38848B89076L7652J9994K656j0711j9248j9947j4497j2888k0835k7814j7819Q864
38836B14483L4078M3183L9127L2528K6132J4936l415k4105l8568l9530k6567r722
$$ y = [26740, 80620, 101007, 98810, 95323, 103985, 125182, 151854, 173253, 175680, 148959, 97758, 43773, 11385, 9002, 24245, 36109, 31004, 9826, -15161, -27584, -13976, 30637, 99840, 177537, 244421, 286473, 301199, 297596, 288743, 281523, 272106, 251727, 217254, 176358, 143698, 133203, 151632, 193901, 241851, 271738, 270017, 244645, 218914, 212496, 228497, 257592, 291056, 327977, 372136, 424256, 476139, 510715, 510218, 469094, 400608, 328368, 268991, 222939, 181988, 143391, 115064, 108481, 128833, 170787, 219552, 255384, 263129, 244404, 220609, 217946, 245504, 289076, 326728, 346722, 349378, 338667, 319419, 299472, 284975, 272087, 251252, 223438, 205619, 214483, 248561, 291744, 330871, 363399, 389531, 404467, 401052, 376947, 338379, 298849, 272282, 262560]
38824B62560k687p574j1010j170J5006J9197M790j5090k3441j6638l606O694J2946
38811B39977J9261K8925M0271M7808M7733M1572L2874K1568M702j7679m0979o1011
38799D05022p7124q9229r5385r5133r2605r2406r2623q5235o4822l4977m120K3973
38787c94664N2584Q3981J12024J26255J22135J03010P2338L0307j8504n9024p3945
38776A56497n8325k3538J1677L1698K9840J1213r438j8369j4307p217n596q681
38764I5454j2041j5847k3693l5326m4884m7326m4414m2209m2531l9238k5748n622
38752b83425Q488Q239j229p174o81J9302M6880O8543O7460L8174l745l4703m5828
38739a19699m6265m5266m0977k8651r706J2513L7438O0822P0339N6780K7671K627
$$ y = [262560, 259873, 252299, 241289, 240119, 255125, 274322, 279112, 264022, 240581, 223943, 220337, 227031, 239977, 259238, 288163, 328434, 376242, 423975, 465547, 498421, 519989, 524691, 507012, 466033, 405022, 327898, 238669, 143284, 48151, -44454, -136860, -229483, -314718, -379540, -414517, -418637, -394664, -342080, -258099, -146075, -19820, 102315, 205325, 277663, 307970, 289466, 230442, 156497, 98172, 74634, 86311, 118009, 147849, 159062, 149624, 131255, 116948, 109731, 104135, 95454, 83413, 67566, 43873, 8547, -36337, -83663, -128077, -170286, -212817, -252055, -277803, -283425, -274937, -266698, -267927, -275101, -275782, -256480, -209600, -141057, -73597, -35423, -39168, -73871, -119699, -165964, -211230, -252207, -280858, -290564, -278051, -240613, -179791, -109452, -52672, -25001, -22374]
38727b2374n220K56M852j895j7354k7183j7812R202L6001M3019K3377j6097o1510
38714e2738r6207j05216q3781m1400O016M6334P1865P5712N4699J4931l0158o6249
38702b06192q0575o4378k1552K7151N7533O1843N1251M0085L4062L2964L5731
38691c2077L9574M0121L6085K9570J9974L362j8813l5642l6288k0759K221K4549
38679E1877M1637M9320M4654L0690J6024P230L227j803j0769k0003k3292j8878
38667A69914j1202n508k806k232o090j8021l6234n3293o4336p1451p7368p8746
38655b57373o9852n0800k7806o594R547J5428L862k5474n9167p7213o9672m5645
38643f60759k4527j8389k3203k6059j8609k933J3051K2989K5716K4904K6275L2861
$$ y = [-22374, -27594, -27338, -22486, -24381, -41735, -68918, -86730, -77528, -41527, 1492, 24869, 8772, -52738, -148945, -254161, -337942, -379342, -373326, -326992, -255127, -179415, -124716, -109785, -139943, -206192, -286767, -351145, -372697, -345546, -288013, -226170, -174919, -134834, -100772, -67808, -32077, 7497, 47618, 83703, 113273, 133247, 136609, 117796, 82154, 45866, 25107, 27328, 51877, 93514, 142834, 187488, 218178, 234202, 241432, 244659, 242856, 232087, 212084, 188792, 169914, 158712, 153204, 150398, 148166, 142076, 124055, 87821, 34528, -29808, -101259, -178627, -257373, -327225, -378025, -405831, -412425, -402878, -387450, -383588, -409062, -468229, -545442, -615114, -660759, -685286, -703675, -726878, -752937, -771546, -774479, -761428, -738439, -712723, -687819, -661544, -628683]
38631f28683M1340M4375L8697L0550L0741M2721N6290N5806L6714J2594K426J0260
38619b26169K1564K2139J6063J8706L4203M8462M7009L2589J9552J5580J6618
38608F6316J8346K4061L7383N1588N1917K9503q340m2569n7766n3538m0726k7368
38596D8807j1893Q091K5410K8990J8982P867L311k823k2187n1845p6290q4793
38584a08373p8496o1496l5115l893K1590L3652L4091K7818J6119J703o255m76
38572a59131J4678K9550M1624N2809N8073M9194L0000J5210J0137L050j5771l7130
38560I2293m3822l1828j1820N442J6024J8231J0926k902j7149k7458l1417k6509
38548d9989j3418R94J0042J4136J4906N903k0692n8115q6197r1626p9118n9583
$$ y = [-628683, -587343, -542968, -504271, -473721, -442980, -400259, -343969, -288163, -251449, -238855, -236429, -226169, -204605, -182466, -166403, -147697, -113494, -65032, -18023, 14566, 34118, 49698, 66316, 84662, 108723, 146106, 197694, 249611, 279114, 270774, 228205, 170439, 116901, 76175, 48807, 36914, 45005, 70415, 99405, 118387, 126254, 129565, 126742, 104555, 52710, -23580, -108373, -186869, -248365, -283480, -287373, -265783, -232131, -198040, -170222, -154103, -152400, -158655, -159131, -144453, -114903, -73279, -20470, 37603, 86797, 116797, 132007, 142144, 145194, 129423, 92293, 48471, 16643, 4823, 10265, 26289, 44520, 55446, 52544, 35395, 7937, -23480, -49989, -63407, -62413, -52371, -38235, -23329, -17426, -38118, -96233, -182430, -274056, -353174, -412757]
38536d12757l6362r168J6153L0946L4026L1243K5891J6049K228p665l787J6940
38524b96263M8953Q3691J15297J39882J50334J36196R3543L4533j8019m8358n8043
38513C81746n8125n5699n0988m3568l5316k6738j4296O039L2343N4096N7349L5717
38501B82560j906l6371n3492n4721n2836n8679p2516q5297q5651o7218l2876O470
38489c12533L7975N3076M9994L3053J0592q535j8772j8757r100Q835L1579N3596
38477h8997P0927Q3576R2502R5238Q7177O7744M3709K4592J4161O892n446k2625
38465D69450l3081k5650m968Q042n435m2324p7355q3887n6851j6573R962J2103
38453A53433K90r904j3551j3936r953N421L2745N8918O7299N3364K8001P112q51
$$ y = [-412757, -449119, -458287, -442134, -411188, -377162, -345919, -320028, -303979, -301751, -309416, -313203, -296263, -247310, -163619, -48322, 91560, 241894, 378090, 471633, 506166, 488147, 439789, 381746, 323621, 267922, 216934, 173366, 138050, 111312, 97016, 103055, 135398, 189494, 246843, 282560, 280654, 244283, 190791, 136070, 83234, 24555, -47961, -133258, -218909, -286127, -319003, -312533, -274558, -221482, -171488, -138435, -127843, -136378, -155150, -173907, -183007, -174172, -142593, -88997, -18070, 65506, 158008, 253246, 340423, 408167, 451876, 476468, 490629, 497521, 492075, 469450, 436369, 410719, 405751, 413793, 408358, 366034, 288679, 204792, 147941, 131368, 141330, 153433, 153723, 143819, 130268, 116332, 106379, 111800, 144545, 203463, 270762, 324126, 352127, 359239, 358388]
38440C58388Q5k078j6176l8511n5200n5661m3436l2997l6540n3655p1484p4460
38428a21725n7118k9677q791q70L043J3692K8167L2378J7419j1313m1044o2184
38416b38023o9643n9023k8832J2041M4204N0993L3263Q800m024n57J1768K4450
38404b14583L3269L5946L1411K2623J5217J1051O880J757J754J2913L1219M4100
38392C3557M2537K9332J4479L832o631k5135n2990q0074r2782q6640o9880n4497
38380c44892m4556l3070r335K9753P4205J07346J18737J09042Q1762L6956j9582
38369A06366o5152p1448l3012K1858N4914N0829K4858L437K015J7958L8229N2739
38357B03591O2127P2367Q2530Q1874O0554J9700k9682p2288r1769p7793l7402
$$ y = [358388, 358473, 356395, 340219, 301708, 246508, 190847, 147411, 114414, 77874, 24219, -47265, -121725, -178843, -208520, -217311, -218181, -215138, -201446, -173279, -140901, -123482, -134795, -175839, -238023, -307666, -366689, -395521, -383480, -339276, -288283, -255020, -246220, -250244, -250801, -239033, -214583, -181314, -145368, -113957, -91334, -76117, -65066, -58186, -56429, -54675, -41762, -10543, 33557, 76094, 105426, 119905, 123737, 117106, 91971, 38981, -41093, -133875, -220515, -290395, -344892, -389448, -422518, -431853, -402100, -327895, -220549, -101812, 7230, 88992, 125948, 106366, 41214, -30234, -63246, -41388, 13526, 64355, 89213, 92650, 94665, 112623, 150852, 203591, 265718, 338085, 420615, 502489, 563043, 582743, 553061, 480773, 389004, 311211, 273809]
38346B73809N883L2591M4556N5291O7176O8085M9945J9929j0549l9528p0074r6312
38334D00802j02411p8934l7681o287n251l0055n7149o7082n9627m8036m3815m7938
38322a83464n0860l8848o834L0961M9865L9989J6625l65r361j8960k4909j1766
38310b07927K1926N5347O7651N8004L8391J6899m315k2571l5652m5706n4729n8481
38298a71163n0711l1859q892J1895K8113L9505M7453N4706O0933N8831L9142J761
38286G9714l9277o3570n9204l2574l742J0408R421M950N404R038J0891R461M304
38273e4776o416k1236l2667l4640l0653l0667m1122n9851p6736p6282m5438J2563
38261d97921P2681J03918R4337N8773K2708K492O27J2614L1666M7795M9158L0116
$$ y = [273809, 279692, 312283, 356839, 412130, 479306, 547391, 597336, 617265, 606716, 567188, 497114, 400802, 298391, 219457, 181776, 175489, 170238, 140183, 83034, 15952, -43675, -91711, -135526, -183464, -234324, -273172, -280006, -249045, -199180, -159191, -142566, -142931, -152292, -171252, -196161, -207927, -186001, -130654, -63003, -4999, 33392, 50291, 45976, 23405, -12247, -57953, -112682, -171163, -221874, -253733, -262625, -250730, -222617, -183112, -135659, -80953, -20020, 38811, 77953, 79714, 40437, -23133, -82337, -114911, -118653, -108245, -98824, -93874, -88470, -79432, -68541, -59080, -54776, -61192, -82428, -115095, -149735, -180388, -211055, -252177, -312028, -388764, -465046, -510484, -497921, -425240, -321322, -226985, -168212, -145504, -143012, -142385, -129771, -98105, -50310, -1152, 28964]
38249B8964j155k6769l4271k7491k0394k1806k9338l6485l9396l5984k5254j1160
38237b80539j697O46L497J4907L2557M7590N5647N7748N3155L9834K2955J5779
38225F2079K7891N4034P5582P3035M0957n024l8725m6788m0554m0045m9689n8207
38213E4546n9750o2155p0991p7818p2383n7808m4578l5987k9378k5917k6251j9059
38201e27529J0710N8103R5609J02703Q9640Q2264Q8790R3088P9962N5647L8440
38190B67427L6031L8572L1953J2811r306k1296j7643n013K897l719k3187m4390
38178B65137n5239m9736l0095n516J1683J3277J796j1095j5356j1658q070q559
38166I6569q113n53J2202K2390K6862L0696L8587M6108M3321K6210J586j9050
$$ y = [28964, 27809, 1040, -33231, -60722, -81116, -102922, -132260, -168745, -208141, -244125, -269379, -280539, -282236, -281590, -278093, -263186, -230629, -183039, -127392, -69644, -16489, 23345, 46300, 62079, 89970, 144004, 219586, 292621, 333578, 328554, 289829, 243041, 202487, 162442, 112753, 54546, -5204, -67359, -138350, -216168, -288551, -346359, -390937, -426924, -456302, -482219, -508470, -527529, -516819, -458716, -363107, -260404, -170764, -88500, 290, 93378, 173340, 228987, 267427, 303458, 342030, 373983, 386794, 377488, 356192, 338549, 333536, 336433, 332714, 309527, 265137, 209898, 160162, 130067, 124551, 136234, 149511, 151307, 140212, 124856, 113198, 105128, 96569, 88456, 87903, 100105, 122495, 149357, 180053, 218640, 264748, 308069, 334279, 335865, 316815]
38154C16815k7418k0527p2K6330M5865M8004L3044J1186p734k1957l5083m8806
38142C19647o0712o7708o8899o5569o0787n8515n9317n5694l6046J905M2835O4357
38130a04503N7686L4695J2989j974j6924l6936n7653p0818p2489o4607n2173l9831
38118d12538k7817j0670J5542M3062N4839M1738J5036k542K551K4987M8652O0421
38106a46739N7572M6459L5313K6853J8274Q538J767L30j185r033j9699k3463j8501
38093b3514j3827j6077k0561j9777j5033j3574j7533k2190k3972k4267k4766k4102
38081b59193k0880j6253j1283n093J297J989q035k4341l5191l3911k4491j1427
38069d46812J0538M8263R2832J20274J14541Q3637M7475J4830k0229o2342j04398
$$ y = [316815, 289397, 268870, 268798, 295128, 340993, 388997, 422041, 433227, 425493, 403536, 368453, 319647, 258935, 191227, 122328, 56759, -4028, -62543, -121860, -177554, -213600, -211695, -168860, -104503, -46817, -12122, 867, -1107, -18031, -54967, -112620, -183438, -255927, -320534, -372707, -412538, -440355, -451025, -435483, -392421, -337582, -295844, -280808, -283350, -280799, -255812, -207160, -146739, -89167, -42708, -7395, 19458, 37732, 46270, 48037, 48367, 47182, 38149, 18450, -5013, -23514, -37341, -53418, -73979, -93756, -108789, -122363, -139896, -162086, -186058, -210325, -235091, -259193, -280073, -296326, -307609, -312702, -311405, -309416, -317451, -341792, -376983, -410894, -435385, -446812, -436274, -388011, -295179, -174905, -60364, 23273, 70748, 85578, 65349, 3007, -101391]
38058a01391j34078j44057j33566j05258o4556k0306J6448L5858L5106K3557J8141
38047e74102K7759M4021N2916N2322M9565M4371K7220k486k9210l9583l8264l6620
38035d22091l3968k1890k256J2639J8185K3806L7837N5514O7762P4963Q4109R4805
38023a0585R5601P6637M2349Q379j3617k5288l4366m1169l7440j9771R07Q002
38011D9639l778k3976l9005m5907n2008o2831p3354p2906n7221l2027m147K5046
37999c92475N2718O7248N8361L3583J3395P524P041M126O524K2013L9018L7490
37987d3434J5048j0636k3127j8590J194L1351N7204O0367L8699R958j0196k3763
37975H4075l8242n0743n4506n1865m8085l7939j2337K3050M8254M9934L2795R193
$$ y = [-101391, -235469, -379526, -513092, -618350, -682906, -703212, -686764, -650906, -615800, -592243, -574102, -546343, -502322, -449406, -397084, -347519, -303148, -275928, -278414, -307624, -347207, -385471, -422091, -456059, -477949, -480205, -467566, -449381, -425575, -387738, -332224, -264462, -189499, -105390, -10585, 85016, 161653, 204002, 212381, 198764, 173476, 139110, 97941, 60501, 40730, 41637, 49639, 45861, 21885, -17120, -63027, -115035, -177866, -251220, -324126, -381347, -413374, -417521, -392475, -339757, -272509, -214148, -180565, -167170, -159646, -152605, -148479, -141955, -119942, -80924, -43434, -28386, -39022, -62149, -80739, -79545, -48194, 9010, 69377, 108076, 118034, 107838, 84075, 45833, -4910, -59416, -111281, -159366, -197305, -209642, -186592, -138338, -88404, -55609, -46416]
37963d6416j3022l0018l9058m1283m0820l7063k4792o691K731n703k0549k2039
37951c24723o709J1535K3958L6985N5188O7128N8881L4502J1455q83o794r521
37939d8998m140J0549K3047J9449k197l2391n9558p3812o7955m3324j2475J1027
37927b80778K4569L3139L7598L5058L0175L5764N7290Q2622R2297P7520M5567
37916B70821J0825j5658k9693l1788k4155j0757J140M187l69p20J2076K9549L2028
37903B47486J0773k3134n4030p7225r3893r8717q3446n0592j4063J4838L4680
37892a87323M6128M5945L4429K3232K7377M9049P3999Q5233P7391N7245L4147
37881C66852J2988n650k2526l7803n0061n6330n4223m4380l0025j4557j137O761
$$ y = [-46416, -59438, -89456, -128514, -169797, -210617, -247680, -272472, -279163, -276432, -282135, -302684, -324723, -331432, -319897, -295939, -258954, -203766, -136638, -77757, -43255, -31800, -32683, -39477, -48998, -53138, -42589, -19542, -93, -2290, -34681, -94239, -168051, -236006, -279330, -291805, -280778, -256209, -223070, -185472, -150414, -120239, -84475, -27185, 55437, 147734, 225254, 270821, 281646, 265988, 236295, 204507, 180352, 169595, 170735, 174922, 174553, 173833, 185909, 215458, 247486, 258259, 235125, 181095, 103870, 9977, -88740, -172186, -222778, -236841, -222003, -187323, -141195, -95250, -60821, -37589, -10212, 38837, 112836, 198069, 275460, 332705, 366852, 379840, 374190, 351664, 313861, 263800, 207470, 153247, 108867, 78842, 64285, 63148, 69909]
37869F9909Q429J0097K0907M1128N7998N8048M1844K1556N072j1610l5131o3577
37857B24670q7702j00119r9827q9381p1215m7443k1619J021J6467K5138L0490
37846b19520L3318L0129K0126J1468J5272L2769N2247O0102N2525L6468K2734
37835A47638J8384K1548K1997J0208j2538l5851n1842n9833n8661m2679j2188
37824e3817J7480K7413J6685M902R374K4804L1242K0094M825K467R862O289j9864
37811A01756n5038p5472p2118n3913l1993j1569J868J238j2120k5428k7020j6377
37799b76186J358K2210L9560M3272L2481K2598K8137M2249M4878K9428R206l067
37787C6124r486j6581k1400j5543K795K6765M7221N7266N4766M3945L0802J4736
$$ y = [69909, 78338, 88435, 109342, 150470, 208468, 266516, 308360, 329916, 334988, 323378, 288247, 224670, 136968, 36849, -62978, -152359, -223574, -271017, -292636, -291615, -275148, -250010, -219520, -186202, -156073, -135947, -124479, -109207, -76438, -24191, 35911, 88436, 124904, 147638, 166022, 187570, 209567, 219775, 207237, 171386, 119544, 59711, 1050, -41629, -53817, -36337, -8924, 7761, 12663, 22037, 46841, 78083, 98177, 103002, 105469, 115331, 121620, 101756, 46718, -28754, -100872, -154785, -186778, -198347, -196479, -195241, -207361, -232789, -259809, -276186, -274828, -252618, -213058, -169786, -137305, -114707, -86570, -44321, 557, 29985, 39191, 36124, 26638, 10057, -11343, -26886, -24091, 2674, 49895, 107161, 161927, 205872, 236674, 251410]
37775B51410r417l7771n3605m5141k2099n309j744J053J5385L7448N4129N8265
37763B42604N1255L5219J0279j9628m3601n0503l9244k1129j0714j3300k1231
37752A20007k2385j1547O612K2965K9784K3488P217p644p423J1366L6105M8241
37740B56786L9947J9150j111j4838k3993l1417l6935l9640m0110l8176l0054j0465
37728D9144K0963N5264P6720P1401L6233j7177o6914r1932q3377m7766K39M7495
37716E0293Q4911J04086R8341P0331L4400N477j3978l2001n3430p3973q8092r5513
37704I0852r6633q8210o9416m7345k9287j2881P657K7014L0810J4790o532j5864
37692a95045j1951o610p544j1135j0321k505J1262K8934M6135N5350N0453L2530
$$ y = [251410, 241993, 204222, 150617, 105476, 83377, 78068, 76324, 77377, 92762, 130210, 184339, 242604, 293859, 329078, 339357, 319729, 276128, 225625, 186381, 165252, 154538, 141238, 120007, 97622, 86075, 92687, 115652, 145436, 168924, 176141, 168497, 161074, 172440, 208545, 256786, 296733, 315883, 314772, 299934, 275941, 244524, 207589, 167949, 127839, 89663, 59609, 49144, 70107, 125371, 202091, 273492, 309725, 292548, 225634, 133702, 50325, 2559, 2798, 50293, 135204, 239290, 337631, 407962, 442362, 447839, 433861, 401860, 348430, 274457, 186365, 90852, -5781, -93991, -163407, -210752, -240039, -252920, -245263, -218249, -187439, -172649, -179181, -195045, -206996, -213606, -221150, -232285, -242606, -245111, -233849, -204915, -158780, -103430, -52977, -20447]
37680b0447R722r651k3638l5563m6391n0490m1908k4190j0037r612k1507l6372
37668c20084m6351m8880m4146l2828j5987M701K6550M5376N7222O1090N7238M2620
37656b13479J3352k4635n2601n3785l0786k954J3340J7152J6100J3947Q942J009
37644b94398m778l437L014O272J180o700o126O765K4809M0475N3700O4108O2507
37631e2609M1125J0504o056J252J7381K2804J7153J4368J9631K2103J1404o900
37619A12160j6931j0875J570K561j5350m0367n2380m2846k1508l483N451P512
37607g4486K193j4949m2209o6893p4763o2990m2194k6745k3445k7870l0105k3964
37595e08420j0788M427J7138K2318J4636m201k0266j7267O545L6676N8751O9573
$$ y = [-20447, -10725, -20376, -44014, -79577, -125968, -176458, -218366, -242556, -252593, -262205, -283712, -320084, -366435, -415315, -459461, -492289, -508276, -503575, -477025, -431649, -374427, -313337, -256099, -213479, -200127, -224762, -277363, -331148, -361934, -364888, -351548, -334396, -318296, -304349, -295407, -294398, -299176, -302613, -299599, -293327, -292147, -298847, -304973, -298208, -273399, -232924, -179224, -115116, -52609, -11484, -980, -7036, -5784, 11597, 34401, 51554, 65922, 85553, 107656, 119060, 112160, 95229, 84354, 85924, 88485, 73135, 32768, -19612, -62458, -83966, -87449, -81998, -74486, -72293, -87242, -129451, -196344, -271107, -334097, -376291, -403036, -426481, -454351, -484456, -508420, -519208, -514781, -497643, -475325, -460689, -464890, -485156, -502423, -495878, -459202, -400451, -330878]
37583c30878O9407N3133J8651k0915m5044m6467l5582k3877j2840j889M199M154
37571c67948Q558K7968N5331P0484O2298L8264J2155p969j7189j0127J1807L5150
37559h1218M4913L9310K8925K3373K4000K7516K9847K6106J3014o415k4757l8267
37547A06347m9221n8904o3091n7808m6082l4709k6051j6867m243J1040K6684M0387
37535a72518M8524M7600L9923L4903M0005N0100M9623K7898q685m0955n2524m0779
37523B3115j5737Q091J9269J3912l590k4629m2681n6263o6678p4771p9853p9428
37511c79243o9631m9165k4817r606j0779j9632j7127Q036M7237P7819Q1076N6177
37499c09655J9412q892j8033j0300N969K4597M4116O5619Q9099J09413J15034
$$ y = [-330878, -261471, -208338, -189687, -210602, -255646, -302113, -337695, -361572, -374412, -376301, -372102, -367948, -359390, -331422, -276091, -205607, -143309, -105045, -92890, -100859, -118048, -128175, -116368, -81218, -36305, 3005, 31930, 55303, 79303, 106819, 136666, 162772, 175786, 169371, 144614, 106347, 57126, -1778, -64869, -122677, -168759, -203468, -229519, -246386, -250629, -239589, -212905, -172518, -123994, -76394, -36471, -1568, 38437, 88537, 138160, 166058, 157373, 116418, 63894, 23115, 7378, 15469, 34738, 48650, 45060, 20431, -22250, -78513, -145191, -219962, -299815, -379243, -448874, -498039, -522856, -532462, -543241, -562873, -580000, -571964, -524727, -446908, -365832, -309655, -290243, -299135, -317168, -327468, -321499, -296902, -252786, -187167, -98068, 11345, 126379]
37488A26379R5020N1030P77l4096m3600l2278j0417J2937L0488L7690L6514L4601
37476C05045L6964L9312L1591Q237k5633n7851p8819q7816r0033q8454q1113o6644
37464a55214m8996l3912k3255j5827j1383r697p432j229O288Q304J942r728k3989
37451c24128m1164n9067o9780o5661m5725j3764K6542P0948J11469J38159J44738
37440a27433J31688J05120P3592M3991J8656k147j4449j0760J0802L9624N8839
37429C27523N8921M3393K1860M94j9748l8474n3281o3244p2866q8357j07818j17709
37417a09306j03445o4413j6497K0779L8277L9758L4076K6184J4273n048k8900
37406a54262m7475n2568m3402k1686J2464N1351P1405M9220r321o6764q8475p2849
$$ y = [126379, 221399, 272429, 273206, 239110, 195510, 163232, 152815, 165752, 196240, 233930, 270444, 305045, 342009, 381321, 412912, 421149, 395516, 337665, 258846, 171030, 80997, -7457, -88570, -155214, -204210, -238122, -261377, -277204, -288587, -298284, -305716, -306945, -300657, -292353, -290411, -300139, -324128, -365292, -424359, -494139, -559800, -605525, -619289, -592747, -521799, -410330, -272171, -127433, 4255, 109375, 182967, 226958, 245614, 243467, 229018, 218258, 229060, 268684, 327523, 386444, 429837, 451697, 452191, 432443, 393969, 340688, 277444, 204578, 116221, 8403, -109306, -212751, -277164, -293661, -272882, -234605, -194847, -160771, -134587, -120314, -125362, -154262, -201737, -254305, -297707, -319393, -306929, -255578, -184173, -134953, -144274, -211038, -299513, -372362]
37394c72362m2395j4887O478K1993L0030L3000L6817M0942L7051K0601k765k4496
37382b29993m0005m5705l7005j5353P639J9771K0476J9244K3528L2247L9815M1835
37370a63506L6580K5092J1804K838J294M533P636R880J6182K9913M4028M2565
37358F8839J4948l0608p0435q3726o7676l6249p570O921N492o419k1330l5131
37346b62944m8676o2980p2918o7904m1030K663M8225Q1449R7625J01456J00956
37335a24078J01321J01187R2766O8607L2185J78j1043k318Q907P867k378p427
37323B65774J85J2929J6936N138j8010m1733n6949n9389m7276k0942J1193L0132
37311I7988J9294j6496n1446o3293n3498l9382l2033k8839k3926j6738r809m284
$$ y = [-372362, -414757, -429644, -423166, -401173, -371143, -338143, -301326, -260384, -223333, -202732, -205497, -229993, -269998, -315703, -352708, -368061, -360422, -340651, -320175, -300931, -277403, -245156, -205341, -163506, -126926, -101834, -90030, -87192, -85898, -81365, -73729, -63849, -47667, -17754, 26274, 68839, 83787, 53179, -17256, -100982, -168658, -204907, -212477, -205556, -200064, -206483, -227813, -262944, -311620, -374600, -447518, -515422, -556452, -553789, -505564, -424115, -326490, -225034, -124078, -22757, 78430, 171196, 239803, 271988, 272166, 261123, 258805, 267712, 275579, 273201, 265774, 265959, 278888, 295824, 300962, 282952, 241219, 184270, 124881, 77605, 56663, 67856, 97988, 117282, 100786, 49340, -13953, -67451, -106833, -138866, -167705, -191631, -208369, -218178, -222462]
37299b22462J173J0576K8354N2520P2659Q0834Q1689Q3271P9859N5836R553l7733
37287B96129o3509o6905o3557o4683o9648p3824p3378o3650m2418j6537J838Q780
37275b91362J3569K7000M7896O4494O7521N8808M6647L5014K0233k97j8428j9327
37263E1768K280L2862N0942M7243L2111K3383K8811M0054M1992K7184J689k2542
37251C57777l9273n0528n9809o7691p4499q1403q5270p7674n5322k9017j5407
37240b78116j9184k8552k9135j7563oJ7162L1270M1473M8120N3289N7623N5741
37228f7878L8784N128l2018n1264m0182o495K7994M4117L6753J3921j0299k2345
37216f3784j5441N212K4906L1417K5082J5064O845k567j6406k9663l2914k3755
$$ y = [-222462, -221289, -210713, -182359, -129839, -57180, 23654, 105343, 188614, 268473, 324309, 333862, 296129, 232620, 165715, 102158, 37475, -32173, -105997, -179375, -243025, -285443, -301980, -300142, -291362, -277793, -250793, -202897, -138403, -70882, -12074, 34573, 69587, 89820, 89523, 71095, 51768, 54048, 86910, 137852, 185095, 217206, 240589, 269400, 309454, 351446, 378630, 380319, 357777, 318504, 267976, 208167, 140476, 65977, -15426, -100696, -178370, -233692, -262709, -278116, -297300, -325852, -354987, -372550, -372556, -355394, -324124, -282651, -234531, -181242, -123619, -67878, -29094, -23966, -55984, -107248, -147430, -153925, -125931, -81814, -45061, -31140, -41439, -63784, -79225, -74013, -49107, -17690, 7392, 22456, 29301, 26734, 10328, -19335, -52249, -76004]
37204g6004j0514k600P12Q439K4529L9932M0757K2192q742m1762o8866q2142p4488
37191b28557m7165j1795K0231M6735O8329P7627O3984K9374q145l0335l4029k8355
37179h2101k1536j4634o172J868M391j229j0704j5123q739O288K3959M1027N6376
37166b6329O5378O0586M0455J4267m726j0512p882o110j0091j7293k3334k9881
37154D4528m3488o3835p7342p0021m6785l0149l6080n6407o8938o0014l2727J398
37142e39860L0709M5680M2368K7103J3182R569J4295J9258J8605J1604Q82r536
37130c16141j5827j5945r480L814K3388M5210O2017O8050O2926N0284L4601K0881
37118A3778J5551K3701M3770O6097P8264P2542M9081J3852k5094o0154q5266r6075
$$ y = [-76004, -86518, -89118, -88406, -79967, -55438, -15506, 25251, 47443, 38701, -3061, -71927, -154069, -228557, -275722, -287517, -267286, -220551, -152222, -74595, -10611, 18763, 10618, -19717, -53746, -82101, -103637, -118271, -124443, -122575, -118184, -119413, -130117, -145240, -153979, -147691, -123732, -82705, -26329, 39049, 99635, 140090, 154357, 149631, 139119, 131237, 125127, 115036, 97743, 74409, 44528, 1040, -62795, -140137, -210158, -256943, -287092, -323172, -379579, -448517, -508531, -541258, -539860, -509151, -463471, -421103, -394000, -380818, -371249, -356954, -337696, -319091, -307487, -306605, -316141, -331968, -347913, -357393, -353579, -330191, -284981, -222964, -154914, -91988, -41704, -7103, 13778, 29329, 53030, 96800, 162897, 241161, 313703, 362784, 376636, 351542, 291388, 206122, 110047]
37106A10047q9957o7613l6329r792N21l223n497O716K9694M8640N6357O0383P0175
37093A70122Q2858Q5777P0411M0618R438r195q629N616J9465K2501J6867J2205
37081E18054J3275J5965J4437P747j585j2335k6261m5991p0805r2590r7591p6701
37069A45619l5966N135K7206K2774k335l4743o0455p1198o7381n4219l5514j3954
37057a75031L803Q989J049q417o770O549K1479K9618L0462K6800J9954J1976Q837
37044b0702J7045L6457N8020P0301O9155O0707N3522M7233L0379q186o4494j16451
37032B32986j37927j19642p8355m3633l2740l8668m3565l9970l3648k8560j9017
37021c82739n54J8695K4092R330j8751m6568o0720n3249k7702R45J8457K3402
$$ y = [110047, 20090, -47523, -83852, -93644, -93123, -96346, -101843, -95127, -65433, -16793, 39564, 99947, 170122, 252980, 338757, 409168, 449786, 459224, 450029, 441400, 447016, 466481, 488982, 505849, 518054, 531329, 547294, 561731, 569478, 567893, 555558, 529297, 483306, 412501, 319911, 222320, 145619, 109653, 114788, 141994, 164768, 162433, 127690, 67235, -3963, -71344, -125563, -161077, -175031, -171228, -162239, -161190, -169607, -176377, -169828, -148349, -118731, -88269, -61469, -41515, -29539, -20702, -3657, 32800, 90820, 161121, 230276, 290983, 344505, 391738, 422117, 413931, 349437, 232986, 95059, -24583, -102938, -146571, -179311, -217979, -261544, -301514, -335162, -363722, -382739, -383293, -364598, -340506, -331176, -349927, -396495, -457215, -510464, -538166, -537221, -518764, -495362]
37009d95362K2764J8428O040j2314k2900j2179K0027O0732R2115R9000P6832L8593
36997a08224Q583J729J0208J4921P459m688j1414r850p40J5396L2866L7648J8615
36984A2509j7386m7915n6107m7001l9002m0088l7564j4090K9372P1151Q8638P6611
36972b0872M6671J4830p690j7152j7424j6367j7410j5046k332J7708L2306L0802
36960B8024J3045j3223l7858n0518m4305k2668K34J0601N411j0277l1842n4352
36948b07728o5714n1001r432L7578O2033N3456K5429N30p100L482K4278M2665
36936i1524M5967K9755M362j0512k483K0581L5767K5635m779l1290l1955o633
36924a7109K3287L3493J5533j9730n2997o9227o2775l5815M084M4716P1397P3608
$$ y = [-495362, -472598, -454170, -448130, -460444, -483344, -495523, -475496, -414764, -322649, -223649, -146817, -108224, -99641, -97912, -87704, -72783, -65324, -70012, -81426, -91276, -92016, -76620, -43754, -6106, 12509, -4877, -52792, -108899, -155900, -194902, -234990, -272554, -286644, -257272, -186121, -97483, -20872, 25799, 40629, 32939, 15787, -1637, -18004, -35414, -50460, -52792, -35084, -2778, 28024, 41069, 27846, -10012, -60530, -104835, -127503, -127269, -116668, -111257, -121534, -153376, -207728, -273442, -324443, -333875, -296297, -234264, -180808, -155379, -154849, -161949, -158467, -134189, -91524, -45557, -15802, -11440, -21952, -24435, -3854, 31913, 57548, 52769, 21479, -10476, -17109, 6178, 39671, 55204, 35474, -17523, -86750, -149525, -185340, -181256, -136540, -65143, 8465]
36912H465N2310J9351j2610l9126o1571p8158q2222p0115m6191j7771J0556L4351
36900b82731M5486L7607J5267p390j8130j4175N72K0182L7008M2499L2510J1333
36888g9962j1326k6776l0669k2877o864J1228K4481K7277J7444j415k0690l3174
36876a53323l8923m2029m2572l7259k8538k5324k9248k5949J408N0551R8537J22205
36864a50464J15621Q8383N4732K7095J2839R871P390l031j6826k0740p965J4485
36852A31390L3591M1316L6675K2351M170q977j1397p906r759k0830l1932l2401
36840A46291k3877j7632k0027k6313k9106k7403k4605k1469j4617r65J8392L7907
36828c424N0455N2110M5100L5004K5415J7643J4441J8242K3675J7763o669m0259
$$ y = [8465, 60775, 80126, 67516, 28390, -33181, -111339, -193561, -263676, -309867, -327638, -317082, -282731, -237245, -199638, -184371, -191761, -209891, -224066, -223494, -203312, -166304, -123805, -91295, -79962, -91288, -118064, -148733, -171610, -178474, -167246, -142765, -115488, -98044, -99459, -120149, -153323, -192246, -234275, -276847, -314106, -342644, -367968, -397216, -423165, -421757, -371206, -272669, -150464, -34843, 53540, 108272, 135367, 148206, 158077, 165467, 162436, 145610, 124870, 116905, 131390, 164981, 206297, 242972, 265323, 269493, 260516, 249119, 241213, 231454, 210624, 178692, 146291, 122414, 104782, 84755, 58442, 29336, 1933, -22672, -44141, -58758, -59723, -41331, -3424, 47031, 99141, 144241, 179245, 204660, 222303, 236744, 254986, 278661, 296424, 289755, 249496]
36816B49496o4975p1211o2217m3346j4918K1604N6853P9164Q4905P8264O2281
36805C75900L6620O011j5976j8505p080J158l392j4068j9819j8480j3559n071
36793C03739P357J6000J0579o899k1640k2459j1343M352J9780K9369K6050J1062
36781C65947k642m672J60K94o840j5327k1878k7075k8528k2529j1730k748L539
36768B25971J1738K2203K9090K8774K3769J7798J2508Q486L845o420k2837l5854
36756C19071l6909l3475m1749o3272q0159p6699n5470k8459l363J5016J9883Q480
36744e7105j2116l1651m4779m8750m0828k4166q830R32J3984L8218O4513P5011
36732g5567O4651M4972K7454J1730q866l6563o5343q4415q6480p5723o4723n9628
$$ y = [249496, 184521, 113310, 51093, 7747, -7171, 14433, 71286, 150450, 235355, 313619, 375900, 412520, 418531, 402555, 384050, 376970, 378128, 374736, 360668, 340849, 322369, 308810, 303739, 311096, 327096, 337675, 330776, 309136, 286677, 275334, 279686, 299466, 328835, 354885, 365947, 363305, 358633, 358793, 359087, 352247, 336920, 315042, 287967, 259439, 236910, 225180, 222432, 225971, 237709, 259912, 289002, 317776, 341545, 359343, 371851, 380337, 384182, 377762, 354925, 319071, 282162, 248687, 206938, 143666, 63507, -13192, -68662, -97121, -100484, -85468, -65585, -57105, -69221, -100872, -145651, -194401, -235229, -259395, -268225, -267293, -253309, -215091, -150578, -75567, -10916, 34056, 61510, 73240, 64374, 27811, -37532, -121947, -208427, -284150, -348873, -408501]
36720d08501n2266l2391l601J9826K9377K9088K8297L3353M2753M3663J8482l4706
36708b86626r0412j15123r8218n5208m111M7244R0794J13334J11388R9772R5407
36697i1759R9164J00633R2926P4384M3203J913l6345n7219o0797n9574o0847n9317
36685a3635m8711l3126k2852k3190l1075m0151m5927m6969m3867l8237l2360k8757
36673d48857k8750l1188l3289l2123k3907m102K6464N4916O2544M3469J4569J330
36661c98924J3102L4513M0361J7517k4867o2220p2457n1803j5269J8449M1178
36650d60420N4881O3088O8173P3853Q2480Q9099Q4392O5921M1877K1821Q242K8
36638A93435l77J1553L5322O3469Q6299R6619R2010P6141N7499M3250L3072K0617
$$ y = [-408501, -460767, -493158, -496759, -476933, -447556, -418468, -390171, -356818, -314065, -270402, -251920, -286626, -377038, -492161, -590379, -645587, -649698, -602454, -511660, -398326, -286938, -187166, -91759, 7405, 108038, 200964, 275348, 318551, 320464, 284119, 226900, 166103, 106529, 45682, -13635, -62346, -95472, -118324, -141514, -172589, -212740, -258667, -305636, -349503, -387740, -420100, -448857, -477607, -508795, -542084, -574207, -598114, -602216, -575752, -520836, -458292, -414823, -400254, -398924, -385822, -351309, -310948, -293431, -318298, -380518, -452975, -504778, -520047, -501598, -460420, -405539, -342451, -274278, -200425, -117945, -28846, 55546, 121467, 163344, 185165, 193407, 193435, 193058, 204611, 239933, 303402, 389701, 486320, 578330, 654471, 711970, 755220, 788292, 808909]
36626H08909J340k2368m3984n9363p0054q0712r3061j02097r9461q1766n4189
36615A03194k4166O715M0776P4222R3300Q3633M3340j3002o1749q2676p0014l6426
36603A57147n429M270r937l6435n9464o7294n6437l4231j6617j6933l3561n0740
36591b25661n3252l9143j8090p37Q315R682N367l113j3378j9947j5922m1J8496
36578c47424K6746K1723J4694J9507L8685O2827Q0767Q6797P9949O1755L6888
36567A82914J3251k286j0266k0413m3808p9838j11721j19684j00234o9025m3460
36556d04570k6778j1453P664K9424N2052P5427R7649J14380J22357J20562J08613
36545B85327Q7329N9781K8590n693l9257o1538o4723n5980n1795n8498o6112o3801
$$ y = [808909, 810249, 787881, 743897, 684534, 614480, 533768, 440707, 338610, 239149, 157383, 103194, 79028, 85743, 126519, 200741, 294041, 377674, 421014, 408012, 346263, 263587, 193573, 157147, 151718, 155988, 146051, 109616, 50152, -17142, -73579, -107810, -124427, -141360, -174921, -225661, -278913, -318056, -336146, -336883, -328568, -318886, -313519, -316632, -330010, -349957, -365879, -365920, -347424, -320678, -298955, -284261, -264754, -226069, -163242, -82475, 4322, 84271, 146026, 182914, 196165, 193879, 183613, 163200, 119392, 39554, -72167, -191851, -292085, -361110, -404570, -431348, -442801, -435137, -405713, -353661, -278234, -180585, -66205, 56152, 176714, 285327, 372656, 432437, 461027, 455334, 416077, 354539, 289816, 233836, 182041, 123543, 57431, -6370]
36533f370n3073m0879k7860j1705K976Q286N856P093J7933K9744L0008J8870R979
36520i142J4386K7189L3020K3624N784r804k2608l9089n7476o4574n1168k4535
36508a74393n02J2572J6634J4815P464k884r969j0766j0664j8714l8311o3083
36496b77801q0622q0506o1141l0404M54K3322L3862K8865P515k3321m7588m7451
36484e54816j5593L6905Q4525J03088Q6543N0018J6062k280o573o333j0497k2074
36472b41025l6160m3840m2212l9880m7522o2150o5918m3941j088M1132O2417N7154
36460d63033L4164Q167q463j0180J184J8806L4834M4891N1390O2093Q2153J06224
36448c7770J20696J15998R5549P1439N3268M3477M0895M3194M4808L7260J5873
$$ y = [-6370, -59443, -100322, -128182, -139887, -136911, -128625, -122769, -115676, -97743, -67999, -37991, -19121, -9142, 5244, 32433, 65453, 89077, 94861, 85057, 62449, 23360, -34116, -98690, -149858, -174393, -174895, -162323, -145689, -130874, -123410, -126294, -136263, -147029, -157693, -176407, -214718, -277801, -358423, -438929, -500070, -530474, -530020, -506698, -472836, -443971, -436456, -459777, -507365, -554816, -570409, -533504, -448979, -345891, -259348, -209330, -193268, -195548, -202121, -208454, -218951, -241025, -277185, -321025, -363237, -403117, -450639, -512789, -578707, -622648, -623736, -582604, -520187, -463033, -428869, -420702, -429165, -439345, -438161, -419355, -384521, -339630, -288240, -226147, -143994, -37770, 82926, 198924, 294473, 365912, 419180, 462657, 503552, 546746, 591554, 628814, 644687]
36437F44687j4767m4317o4693p3056o9446n6073l9168k7072k4117k8587l7772
36426A65619n1368o7257p7558p4075n7128l5239j6343k468P756J5793K3188L1240
36414a37840L9534M6955N3375N6945N1339L2122O292j1513j4584q745J274K0074
36402A35228M7871O6458N2487M964m9985q2990q2786n5065j2572K7903M8637M2201
36390A42351J8971k378j1783j2405j1334j1584j3900k1388l7671n9432p2839o1585
36378a54977k1988L1002P6153J03534J15931J14894R4521N3105L779l3945n0303
36367C31706m7428k9665r15K9050M5681M2073K5205N989j2665l3538n4663o7603
36355B33227o6002n1492l0705j0660J759Q45j1976k4199k0100L663L1775M2572
$$ y = [644687, 629920, 585603, 520910, 447854, 378408, 322335, 283167, 256095, 231978, 203391, 165619, 114251, 46994, -30564, -104639, -161767, -197006, -213349, -215817, -208061, -192268, -169080, -137840, -98306, -51351, 2024, 58969, 110308, 142430, 148722, 137209, 122625, 113880, 115154, 135228, 183099, 249557, 302044, 307008, 257023, 174033, 91247, 36182, 23610, 51513, 100150, 142351, 161322, 158944, 147161, 134756, 123422, 111838, 97938, 76550, 38879, -20553, -93392, -154977, -176965, -145963, -69810, 33724, 149655, 264549, 359070, 412175, 415954, 382009, 331706, 284278, 254613, 253698, 282748, 328429, 370502, 395707, 401696, 389031, 355493, 300830, 233227, 167225, 115733, 85028, 74368, 76127, 76972, 64996, 40797, 20697, 24360, 56135, 98707]
36343I8707K6660p880m6308p8169r7346r8429p9550m6961j1306K0786M7248O3937
36331b08611O4693N1104L6298L2890L9278M2945L6204K3619J3690Q512L963l500
36319A41085j3355k2602k8322k9272k6127j9550p779J1596L6107N6928O5504O0740
36307B24953M7972L2310J5156m599k9051n9200q9422j04526q9660m7846l899J5429
36295i2383N753j3418k0671j1952K295J2990J9750K4087K2229R214j1523k6951
36283h0580k4758l654K6947N5041P1983P3230N8984L6417J7498R929R756N755
36271B56548p688k3414k8303j6571M568K1653K6200J9901J1288Q863J5627K6829
36259C15501L2625K6105J0526l979j2591k0885l4012m5392m4381l4128l1319m4114
$$ y = [98707, 125367, 117487, 71179, -6990, -104336, -202765, -282315, -329276, -340582, -319796, -272548, -208611, -143918, -92814, -56516, -23626, 15652, 58597, 94801, 118420, 132110, 140622, 144585, 141085, 127730, 105128, 76806, 47534, 21407, 1857, -5922, 5674, 41781, 98709, 164213, 224953, 272925, 305235, 320391, 315792, 286741, 227541, 138119, 33593, -56067, -103913, -107812, -92383, -86630, -100048, -120719, -132671, -130376, -117386, -97636, -73549, -51320, -42106, -53629, -80580, -105338, -108992, -82045, -27004, 44979, 118209, 177193, 213610, 231108, 241037, 250793, 256548, 248860, 225446, 197143, 180572, 185140, 206793, 232993, 252894, 264182, 273045, 288672, 315501, 348126, 374231, 384757, 380778, 368187, 347302, 313290, 267898, 223517, 189389, 158070, 113956]
36247A13956n9185n7981l9430j7280J28J5265K7278K6374Q826j1596j5984nK5506
36234A5872M9690O9272Q2677Q5737P6599N9852M2294K7056J4326N891O367J9596
36222E55229M3657O8634Q0400O9710L9066Ql5792o1302p2308o6400m6071j9488
36210E55343M486K0503K5656J9003N565l728k777J91r218l2827n5657o3288n7633
36197D05619n0541m6618m0131k7534j4452p366n156m421q936k6260n4664p9896
36185C9644q8059p7992n7449l0693L926M3947P7356R2301Q9954Q2538P8328P2981
36173C26782N7426L0780K222j7862k5348k2740j6456j3833j7907k2774j7841o05
36161B61844J6740J8206J732j8085k6367k2899j7442j3679m744J3970L3632L9286
$$ y = [113956, 54771, -3210, -42640, -59920, -59792, -44527, -17249, 9125, 17951, 6355, -9629, -9634, 15872, 65562, 134834, 217511, 303248, 379847, 439699, 481993, 509049, 523375, 529266, 535633, 555229, 598886, 667520, 747920, 817630, 856696, 856704, 820912, 759610, 687302, 620902, 574831, 555343, 559829, 580332, 605988, 624991, 630556, 626828, 624051, 624242, 615024, 582197, 526540, 463252, 405619, 355078, 308460, 268329, 240795, 226343, 218977, 213821, 209400, 200464, 174204, 119540, 39644, -48415, -126407, -183856, -214549, -210623, -166676, -89320, 2981, 92935, 175473, 253801, 326782, 384208, 414988, 417210, 399348, 374000, 351260, 334804, 320971, 303064, 280290, 262449, 261844, 278584, 296790, 298522, 280437, 254070, 231171, 213729, 200050, 195306, 209276, 242908, 282194]
36149B82194K7051R114P87O296J8858L0616L7881L8088K7536N497k1329m2109
36137D20480n0788n0929n1175n6548o4755p0012o8387n8710m0846j6584P830K4177
36125g6247L0063L2285L8848M7713M6887K7811k758k6492l0000j7024l872l249
36113F3965j3639k4131k6750k1305r677R825M0020P8283J13797J31150J19028
36102D60566Q0643L6651J1741J3327K5635K7835J4656m205j9524k9682l5313l6483
36090E45847l6277l8788m0452l0727o000K2766M1509M7687M7910M5130L6180K1537
36078F56322R525O992R619N486j2784m1548p0113q7607q6097o2853k5506O782
36066C08218J5512O66j8033k2091j2564k687K026O724J2842J3450O279Q15N677
$$ y = [282194, 309245, 318359, 319146, 325442, 344300, 374916, 412797, 450885, 478421, 483918, 462589, 420480, 369692, 318763, 267588, 211040, 146285, 76273, 7886, -50824, -91670, -108254, -100424, -76247, -46184, -13899, 24949, 72662, 119549, 147360, 144602, 118110, 88110, 71086, 67214, 63965, 50326, 26195, -555, -21860, -31537, -21712, 18308, 96591, 210388, 341538, 460566, 541209, 577860, 589601, 602928, 628563, 656398, 671054, 666849, 647325, 617643, 582330, 545847, 509570, 470782, 430330, 399603, 393603, 416369, 457878, 505565, 553475, 598605, 634785, 656322, 665847, 672839, 682458, 687944, 675160, 633612, 563499, 475892, 389795, 326942, 301436, 308218, 323730, 324396, 306363, 284272, 271708, 269021, 271047, 277771, 290613, 304063, 310342, 311157, 316834]
36053C16834J6107K1203J8601J4983J5867K1872L2063M3204M6563L3050L543k9783
36041E54107n3294o0316n0957k8542J723L2643N5424O1937M9967K7595R010L136
36029F02433Q659K1076L8552N6315O1725M4673J2322j4261j9900p069J2055K8975
36017H45555M2232N2484N8556N7878M9660L7425K6629J8154O838j0652k9090l9871
36005A115798m0155l1574j2620J9090N5567P6935O6337K4968k8350o9298q0760
35994A095938o1207k6093J718Q540q92j0475q256M940K0074L0755L8416M6585
35982A140043N2318M7535K9561N459j6871l6482n2954n7231l8329Q67M2401O9949
35970A186266Q1195Q2354P7746O9772O4826P2235R5410J25624J45992J43867J21740
$$ y = [316834, 332941, 354144, 372745, 387728, 403595, 425467, 457530, 500734, 547297, 580347, 583890, 554107, 500813, 440497, 389540, 360998, 362721, 395364, 450788, 512725, 562692, 590287, 599297, 602433, 611092, 632168, 670720, 727035, 788760, 833433, 845755, 831494, 811594, 804525, 816580, 845555, 887787, 940271, 998827, 1056705, 1106365, 1143790, 1170419, 1188573, 1195411, 1184759, 1155669, 1115798, 1075643, 1044069, 1031449, 1050539, 1106106, 1183041, 1249378, 1274346, 1245996, 1176698, 1095938, 1034731, 1008638, 1010356, 1018896, 1018004, 1007529, 999273, 1004213, 1024287, 1055042, 1093458, 1140043, 1192361, 1239896, 1269457, 1274916, 1258045, 1221563, 1168609, 1111378, 1073049, 1073916, 1116317, 1186266, 1267461, 1349815, 1427561, 1497333, 1562159, 1634394, 1729804, 1855428, 2001420, 2145287, 2267027]
35959B267027R5964Q2872Q5848R6235J04648J09606J17945J40302J83687K42861
35949C526995K98158L25384L10323K55188J74825Q8778J2576m8758r8470j37915
35939D707084j61800j65522j51907j26628r2516n3888k0503M08J1398J6693J2916
35928C975735j991j6066j3210N292K1523K2967J1748q043l7614p3269j00900j07560
35916C678612r1291n6422q569M1202P6832Q9527Q5335P7298P5074Q2943R9042
35905D149583J12974J12147R5112P2938N5472M3666L7233M0013N2716O7556P4949
35894D914359P0901N7099M1112L6680N3460Q3504J06884J12947J07384R8653Q9826
35883E772809Q5118Q9775R9816J06473J14867J41316J85110K20882K30296K25848
$$ y = [2267027, 2362991, 2445863, 2531711, 2627946, 2732594, 2842200, 2960145, 3100447, 3284134, 3526995, 3825153, 4150537, 4460860, 4716048, 4890873, 4979651, 4992227, 4943469, 4844999, 4707084, 4545284, 4379762, 4227855, 4101227, 4008711, 3954823, 3934320, 3934728, 3946126, 3962819, 3975735, 3973744, 3957678, 3944468, 3949760, 3971283, 3994250, 4005998, 3997955, 3960341, 3887072, 3786172, 3678612, 3587321, 3530899, 3522330, 3563532, 3640364, 3729891, 3815226, 3892524, 3967598, 4050541, 4149583, 4262557, 4374704, 4469816, 4542754, 4598226, 4641892, 4679125, 4719138, 4771854, 4839410, 4914359, 4985260, 5042359, 5083471, 5120151, 5173611, 5257115, 5363999, 5476946, 5584330, 5682983, 5772809, 5857927, 5947702, 6047518, 6153991, 6268858, 6410174, 6595284, 6816166, 7046462, 7272310]
35873G272310K30613K48855K71468K97695L33925L78035M19617M50802M66964
35864A0370284M65615M55895M59355M87618N27001N58419N85030O26604O92708
35855A5228529P74337Q57127R32327J001461J080712J193513J348205J529509
35847B3945720J719816J919741K140906K392666K686090L036283L448969L919815
35839D5210006M459085N099995N870245O775165P823578R048397J0485983J2160820
35831A06933274J4108430J6381954J9011032K1982650K5276833K8860150L2580949
35824B65135272L6069454L8699416L9502264L7095275L0060114J7979349K402141
35817D66943285j3410231k6098491l3890689l7003440l6770020l4586761l1460941
$$ y = [7272310, 7502923, 7751778, 8023246, 8320941, 8654866, 9032901, 9452518, 9903320, 10370284, 10835899, 11291794, 11751149, 12238767, 12765768, 13324187, 13909217, 14535821, 15228529, 16002866, 16859993, 17792320, 18793781, 19874493, 21068006, 22416211, 23945720, 25665536, 27585277, 29726183, 32118849, 34804939, 37841222, 41290191, 45210006, 49669091, 54769086, 60639331, 67414496, 75238074, 84286471, 94772454, 106933274, 121041704, 137423658, 156434690, 178417340, 203694173, 232554323, 265135272, 301204726, 339904142, 379406406, 416501681, 446561795, 464541144, 466943285, 453533054, 427434563, 393543874, 356540434, 319770414, 285183653, 253722712]
35810B53722712k8037399k4689805k1577386j8746031j6225948j4038491j2163133
35803A18244519j0552373r168880p984941o967369o089258n340998m710423m168542
35795F3261735l691710l280142k936522k641623k369136k112913j883700j687973
35787D2658016j521880j376400j237930j093265r43642q05276o89276n91187n05342
35778C3893818m34650l76037l09484k15662r8952J5220J00273J41888J43038J24535
35768C2983987J12845J19591J37495J57251J77005J91596J86869J53660R7303
35759C4317602K5423o3677j72949k97237m29921n68460p05259q24748r20535j004639
35749B9355600j086895j154433j187019j187389j180760j184931j192975j185673
$$ y = [253722712, 225685313, 200995508, 179418122, 160672091, 144446143, 130407652, 118244519, 107692146, 98523266, 90538325, 83570956, 77481698, 72140700, 67430277, 63261735, 59570025, 56289883, 53353361, 50711738, 48342602, 46229689, 44345989, 42658016, 41136136, 39759736, 38521806, 37428541, 36484899, 35679623, 34990347, 34399160, 33893818, 33459168, 33083131, 32773647, 32557985, 32459033, 32474253, 32574526, 32716414, 32859452, 32983987, 33096832, 33216423, 33353918, 33511169, 33688174, 33879770, 34066639, 34220299, 34317602, 34343025, 34279348, 34106399, 33809162, 33379241, 32810781, 32105522, 31280774, 30360239, 29355600, 28268705, 27114272, 25927253, 24739864, 23559104, 22374173, 21181198, 19995525]
35741A9995525j150809j089351j011629r30485q54094p84908p26839o88582o74171
35732A2084657o73522o67805o42656n94503n30615m67841m23469l98320l73518
35723G312408l32283k80629k37778k10795j90085j68074j50055j44397j51559
35714E446753j65831j80340j87214j80031j61094j42102j33098j32269j28662
35705D036112j13181q5710n3616k4694m56K4313N5065R1252J26464J51548J55316
35694D362413J26853O4312j7615r4284j48338j79288j95990k03228j98572j81138
35684C335125j59620j48293j53968j68367j75590j67181j48334j30112j18638
35675A965022j11982j03923q8830o5505l8294j3126Q071K6854M2554N1427N2994
$$ y = [19995525, 18844716, 17755365, 16743736, 15813251, 14959157, 14174249, 13447410, 12758828, 12084657, 11411135, 10743330, 10100674, 9506171, 8975556, 8507715, 8084246, 7685926, 7312408, 6980125, 6699496, 6461718, 6250923, 6060838, 5892764, 5742709, 5598312, 5446753, 5280922, 5100582, 4913368, 4733337, 4572243, 4430141, 4297043, 4164774, 4036112, 3922931, 3837221, 3783605, 3758911, 3758455, 3782768, 3837833, 3929085, 4055549, 4207097, 4362413, 4489266, 4553578, 4535963, 4441679, 4293341, 4114053, 3918063, 3714835, 3516263, 3335125, 3175505, 3027212, 2873244, 2704877, 2529287, 2362106, 2213772, 2083660, 1965022, 1853040, 1749117, 1660287, 1594782, 1556488, 1543362, 1551433, 1578287, 1620841, 1672268, 1725262]
35664A725262N2757N5311N7997N5347M8077M4254N2311P5334J11160J54532J96763
35653B629105K23097K13431J53311N0964n8951j37636j72062j79676j83913j91612
35643B346058j95119j86722j64515j30322q9788n2400k6004j2602j1523k1795
35633A455268l7327m5629l8457k0951m844L949N537o77j4134k7444l2315l0507
35621A212469k9745k8603j6021J0364L4253L5650J1613k2353m7956n7207n3727
35610A048737m6679m2777m0791l3718j7902R90J2446J0741p57j3092j8051j2559
35598H46588L02J3463J9521J3635m360k8264m7059n2251m5625l8323m0934n5485
35586E81208p6608r6769j07856j01323p3232l0889R534L5480M7184N2578N5520
$$ y = [1725262, 1778019, 1833330, 1891327, 1946674, 1994751, 2039005, 2091316, 2166650, 2277810, 2432342, 2629105, 2852202, 3065633, 3218944, 3269908, 3210957, 3073321, 2901259, 2721583, 2537670, 2346058, 2150939, 1964217, 1799702, 1669380, 1579592, 1527192, 1501188, 1488586, 1477063, 1455268, 1417941, 1372312, 1333855, 1312904, 1308060, 1312009, 1317546, 1316869, 1302735, 1275291, 1242976, 1212469, 1182724, 1154121, 1138100, 1148464, 1182717, 1218367, 1229980, 1207627, 1159671, 1102464, 1048737, 1002058, 959281, 918490, 884772, 866870, 867860, 880306, 891047, 890290, 877198, 859147, 846588, 846890, 860353, 879874, 893509, 889149, 860885, 813826, 761575, 715950, 677627, 636693, 581208, 504600, 407831, 299975, 198652, 125420, 94531, 104065, 139545, 186729, 239307, 294827]
35575B94827N3010M2756K7672J1227n767j9347j8307O326M7999Q6972J07190J06732
35563G41290R1774O6829L4175j915l5451o2380q1814r4848j03253j08014j08677
35552C37716j05556j01107r5536q2666n6399k1952O235K0267K6186L2206L6325
35541d281L1330J6889m1j3265j9189j3580N370L0218M6625M4881K6758J714k0206
35528A33223l2195l1848k0791k954J6289L0019L2733K5666J6035Q947L910J909
35516A80943R927L1793N7446O8569N5321K3487j3846m7172p3592r3102j03062
35505I6712r6102o6640k1163K2625N0510O1650O1163N0832L4158K2752K5609L5177
35493B77283L6314K8093K3907K8105K6012M295k7787m5884l5152k074L4128N6639
$$ y = [294827, 347837, 390593, 418265, 429492, 423725, 404378, 386071, 392397, 440396, 527368, 634558, 741290, 833064, 899893, 934068, 932153, 896702, 834322, 752508, 657660, 554407, 446393, 337716, 232160, 131053, 35517, -47149, -103548, -125500, -119265, -98998, -72812, -40606, -4281, 27049, 43938, 43897, 30632, 11443, -2137, 3233, 33451, 80076, 124957, 151715, 153429, 133223, 101028, 69180, 48389, 45435, 61724, 91743, 124476, 150142, 166177, 175124, 179034, 180943, 190870, 222663, 280109, 348678, 403999, 427486, 413640, 366468, 292876, 199774, 96712, 610, -66030, -87193, -64568, -14058, 47592, 108755, 159587, 193745, 216497, 242106, 277283, 313597, 341690, 365597, 393702, 419714, 424009, 396222, 350338, 315186, 313112, 347240, 403879]
35481D03879O0573N2901M3515L5401K4355O737j5891l8056n0955m4373j7215J3183
35469D74054K3002Q712n732N294M1317P8419R3104P7388L7496j1612n2111p3197
35457F96134p7433p3355o3446m5208k2325n839j338j446L984J3617J5596K377
35445D41318j8994l2792k9535j4157O6M438J250j695j013q31n997j3469j3219
35432C15370J10J8232K6708K2384J7597K3111L2386L0175J3631m651j4841k1295
35420D58917l1785m3661m7571m0469k8212j7692j2559j5128k5688l7892l9366
35409A18894k1070J3742N0843P5722Q3110P6372N9365L2223l466l9055o2576o6631
35397C17473m9875j4551L0635O7561P8790O4164M1162K6051K0643J9751K2592
$$ y = [403879, 464452, 517353, 560868, 596269, 620624, 627361, 611470, 573414, 522459, 478086, 460871, 474054, 497056, 505768, 500036, 505330, 546647, 625066, 718170, 795558, 833054, 821442, 769331, 696134, 618701, 545346, 481900, 436692, 414367, 408528, 407190, 405744, 409728, 423345, 438941, 441318, 422324, 389532, 359997, 345840, 345906, 350344, 351594, 349899, 348886, 348055, 342058, 328589, 315370, 315480, 333712, 360420, 382804, 400401, 423512, 455898, 486073, 499704, 495053, 480212, 458917, 427132, 383471, 335900, 295431, 267219, 249527, 236968, 221840, 196152, 158260, 118894, 97824, 111566, 162409, 238131, 321241, 397613, 456978, 489201, 485735, 446680, 384104, 317473, 267598, 253047, 283682, 351243, 430033, 494197, 535359, 561410, 582053, 601804, 624396]
35386F24396K9916L6160L3302K0713M811r399k0597k6404k2755r440P041J6896
35374F84640J2584n929k8391l9680l2692j4794J598J2358K1652L1679L8639L8508
35362G20172L1443K0048P318l676j2251k2511l8659n6327o2398m6679j3713J7727
35350E40494K7823J1823j4050k4747q697K1370M0946L5544Q755k6123n5643o9221
35338D88274o1931l9470j6876p542j2656k1653k2039q939J2699L3589M7576N3922
35326D44954N4073M9901M6120M9179N8928O4333N3587K7875m00k2865m2386o3424
35314G19875q1472q6986p6947n8146l9811k6325j7273j1660r828j1574j4338j5216
35302B70299j4607j5926k1151k8787l7144m6689n6655o1575n4707l4871q412J4690
$$ y = [624396, 654312, 690472, 723774, 744487, 749298, 739899, 719302, 692898, 670143, 660703, 667744, 684640, 697224, 691295, 662904, 623224, 590532, 575738, 577336, 589694, 611346, 643025, 681664, 720172, 751615, 771663, 778981, 775305, 763054, 740543, 701884, 645557, 583159, 536480, 522767, 540494, 568317, 580140, 566090, 541343, 532646, 554016, 594962, 630506, 639261, 613138, 557495, 488274, 426343, 386873, 369997, 362455, 349799, 328146, 306107, 297168, 309867, 343456, 391032, 444954, 499027, 548928, 595048, 644227, 703155, 767488, 821075, 848950, 848550, 825685, 783299, 719875, 638403, 551417, 474470, 416324, 376513, 350188, 332915, 321255, 311427, 299853, 285515, 270299, 255692, 239766, 218615, 189828, 152684, 105995, 49340, -12235, -66942, -101813, -110225, -95535]
35290i5535K6271K5070J9134J9964L0448M0733L9639K7678J5057J0647J8405M0323
35278B17834P2953J00951J04286P6767L2305r773l9666n4834n1259k6323J1337
35267D34578M3150N5462N0775M1850L5458K4876Q39l1977n5360n7219m5343l5627
35255D61462l0991k0961q58J8896K5371J6812N01j5198k2316j4894L528J9301
35243D40653K2680J8779J7947J9076J0773j2219m1332o2863o7997n4632k6977
35232B63888L900K4752K9260K0043R08k7752o2216q8503q9473o1114j8675J6459
35220A1477L5782M7577O1877P5222P4416N4326K6537Q040N162J1669J9212K4335
35208D55632K5866K0439L566k4968n7261q0162q5076p6071o5387n9629n4114m2728
$$ y = [-95535, -69264, -44194, -25060, -5096, 25352, 66085, 105724, 133402, 148459, 159106, 177511, 217834, 290787, 391738, 496024, 572791, 605096, 595323, 555657, 500823, 449564, 423241, 434578, 477728, 533190, 583965, 625815, 661273, 686149, 686988, 655011, 599651, 542432, 497089, 461462, 430471, 409510, 408652, 427548, 452919, 469731, 470232, 455034, 432718, 417824, 421352, 440653, 463333, 482112, 500059, 519135, 529908, 517689, 476357, 413494, 345497, 290865, 263888, 267788, 292540, 321800, 341843, 342751, 314999, 252783, 164280, 74807, 13693, -4982, 11477, 47259, 94836, 156713, 231935, 306351, 360677, 387214, 395254, 400416, 412085, 431297, 455632, 481498, 501937, 505503, 480535, 423274, 343112, 258036, 181965, 116578, 56949, 2835, -39893]
35196c9893k7782j4944l484J0192K1127J7524l618k9409m3168l9140k2865k642
35184a78102J4443K1574J3752q252l6867o0451o7646n3221k3160P458K4601K4060
35172c21811J0695q067k6072l8501m1580l2941j2049J8067M9067P0386P6541P0284
35160a85981N7795M3794L2729K9890L6288M4850M7115M2921L8877L8396L8974
35149B65648L9132M0599M0914L1000P013j8508k5114o090K2047L3863J7421j7940
35137D29985n3439p7269q9168r2552q7588p4278n8148m6484l8952k7716r053J0593
35125b14069K3868L2469M1522M7499M0318J7899q849k8290l9367m7114n1974m8564
35113b34652l2563m935K8170N6024O6985N7738L8607K4927K2844K7673L4909M5319
$$ y = [-39893, -67675, -82619, -86103, -75911, -54784, -37260, -40878, -70287, -113455, -152595, -175460, -178102, -163659, -142085, -128333, -136585, -173452, -233903, -301549, -354770, -377930, -370472, -345871, -321811, -311116, -319183, -345255, -383756, -425336, -458277, -470326, -452259, -403192, -332806, -256265, -185981, -128186, -84392, -51663, -21773, 14515, 59365, 106480, 149401, 188278, 226674, 265648, 304780, 345379, 386293, 417293, 424306, 405798, 380684, 374594, 396641, 430504, 447925, 429985, 376546, 299277, 210109, 117557, 29969, -44309, -102457, -148941, -187893, -215609, -224662, -214069, -190201, -157732, -116210, -68711, -28393, -10494, -19343, -47633, -87000, -134114, -186088, -234652, -267215, -272150, -243980, -187956, -120971, -63233, -24626, 301, 23145, 50818, 85727, 131046]
35101A31046N6809N9052M3466J5370j0988k8300l9875m6900m1258j7356J4226
35090A35292L3548L1089J3877q281l3928o2674q3656q0385m7336L231N0912P9840
35078C1529Q3599O4652L2095l487l5480o0578p4170p1382n3501k7851O41L1861
35066h2072O1080P4329O1094K8633m410k8154m7807o9308q7235r1888q3085p0067
35054c38890n9022m6636k7705n060J1824J7257J4842J1407Q507L248m054q026
35042d22308n523q99j041o905j2420j1120k836N363N444j771m180R232L3289N0544
35028c65131N2100M6445M2871L5103J0952k7008o0792p4545o4207l3651O748L8816
35016c92299M7517L7486K9431L6689N3381O6970P1353O3914M2269J2121j1580
$$ y = [131046, 187855, 246907, 290373, 305743, 294755, 266455, 226580, 179680, 138422, 121066, 135292, 168840, 199929, 213806, 205525, 171597, 108923, 25267, -55118, -102454, -99223, -48311, 31529, 115128, 179780, 211875, 208388, 172908, 112330, 38160, -33222, -86723, -114574, -113933, -82072, -20992, 53337, 114431, 143064, 138654, 110500, 62693, -6615, -93850, -185738, -268823, -338890, -397912, -444548, -472253, -477313, -465489, -448232, -433390, -421983, -413476, -410228, -414282, -422308, -427831, -428730, -429771, -436676, -449096, -460216, -463052, -457689, -452245, -454016, -458196, -448964, -415675, -365131, -313031, -266586, -223715, -188612, -177660, -204668, -265460, -340005, -404212, -437863, -431115, -392299, -344782, -307296, -277865, -241176, -187795, -120825, -49472, 14442, 56711, 68832, 57252]
35005E7252k0586k2644k5823k2292m20L2062N1415M4505K1374R55n708K781K1780
34992A34651M0855M7964L9289K1749L754j1703k3006k5903j9237j0796j0592j8048
34980A68977k0700q225J4010K8422K3180M496j1925j9976k7793m1766n3001m6222
34968I477j8860J5277L9733M6806L7347J7641j960j2327j3249j2387j5291k0738
34956G1469k6794l5641m9258o4734p6906q1846p5458n3932k0149J4651M0906N9449
34944b98243P4602Q1970P1909M5643J8943M640k584j6934l9824n5804n1692l2740
34932b00114j4768m473N588K2885M2144M9303L4906J919l6372o3631o8464m9374
34920b80451j3171L0363P0457R4906R5463P6971N5178M0564K8486R679j5079l8072
$$ y = [57252, 36666, 14022, -11801, -34093, -34513, -2451, 48964, 93469, 114843, 115798, 110090, 112871, 134651, 175506, 223470, 262759, 284508, 288262, 276559, 253553, 227650, 208413, 197617, 187025, 168977, 148277, 140052, 154062, 182484, 205664, 210160, 198235, 178259, 150466, 108700, 55699, 9477, -9383, 5894, 45627, 92433, 129780, 147421, 145461, 133134, 119885, 107498, 92207, 71469, 44675, 9034, -40224, -104958, -181864, -263710, -339168, -393100, -413249, -398598, -357692, -298243, -223641, -141671, -69762, -24119, -5176, -536, -3120, -20054, -59878, -115682, -167374, -200114, -214882, -219355, -213767, -190882, -148738, -99435, -64529, -62610, -98982, -162613, -231077, -280451, -293622, -263259, -192802, -97896, -2433, 74538, 129716, 170280, 198766, 208445, 193366, 155294]
34908A55294n7834p9199j00561j10283r8021o3601j4576L7007P4347Q2702O3346
34897a11379L5326J7464J1958R576N382K478L510O557R774J3907J8219J8374J1350
34884E2496N08p128q473p018o267k066J4325M3338P0783P9118O3917L5483O383
34871C35399j6198k7460k4634j4184j1260k4169m2913n0052m1217k9063k7733
34860B6516l8664n1244n2376l5214l721K8868M8861N1626M1982K6629R440n866
34848D6837j3455r142N496K5401M7001O7366P9417P3674M8975J8403j332o830
34836C81811r044j6366k3712k3155j8592k0775l0495l6625l1273j7485J75K2698
34824A77162M8367O5140N9685L1298q264m5295o9268p2213n2203j8792J0466K1649
$$ y = [155294, 97460, 18261, -82300, -192583, -290604, -354205, -368781, -331774, -257427, -174725, -111379, -76053, -58589, -46631, -37055, -31673, -29195, -25685, -19128, -9354, 4553, 22772, 41146, 52496, 53004, 45876, 37403, 30385, 24118, 22052, 36377, 79715, 150498, 229616, 293533, 329016, 335399, 319201, 291741, 267107, 252923, 241663, 217494, 174581, 124529, 83312, 54249, 26516, -12148, -63392, -115768, -150982, -154703, -125835, -76974, -25348, 16634, 43263, 52703, 46837, 33382, 24240, 29736, 55137, 102138, 169504, 248921, 322595, 371570, 389973, 388641, 381811, 372767, 356401, 332689, 309534, 290942, 270167, 239672, 203047, 171774, 154289, 154464, 177162, 225529, 290669, 350354, 381652, 373388, 328093, 258825, 186612, 134409, 115617, 126083, 147732]
34812A47732J2768p017k3986k8730k2645j4909j1074p399J280J2564J9977K2237
34800A00798K3901K9153L9201N2323O1192N4362K8850q97j5754j4203j3514k7013
34788C18399m8186o0906n9109n1674n1628o3270p6388p1754l7980J3426N4078
34777a34992O3958M8357K8052J7645J7244K0135K1027J7546J0001J596l822n328
34765A01419n110o044j0526j9739l1001l7366l4064k5400k1106k4475k7952k3249
34753a64613j2984p941j3486k3233k7683k5547k3430k6525l3600m0308m3060l8907
34741d81317k5828n855J4929L1991M5645N6124N8262M6123K3237M195K946J8968
34729b10580L5391L2687P325k2392l1536j0817K7865O6115R2593J01007Q5129
$$ y = [147732, 160500, 153483, 129497, 100767, 78122, 63213, 52139, 44740, 46020, 58584, 78561, 100798, 124699, 153852, 193053, 245376, 306568, 360930, 389780, 388883, 373129, 358926, 345412, 318399, 270213, 209307, 150198, 98524, 46896, -16374, -92762, -164516, -202496, -189070, -134992, -71034, -22677, 5375, 23020, 40264, 60399, 81426, 98972, 108973, 110569, 106747, 101419, 96309, 90265, 79739, 60000, 28999, -8367, -42431, -67831, -88937, -113412, -141364, -164613, -177597, -185538, -199024, -222257, -249940, -275487, -298917, -325442, -359042, -399350, -442410, -481317, -507145, -513000, -498071, -466080, -420435, -364311, -306049, -259926, -236689, -232494, -229548, -210580, -175189, -142502, -135177, -157569, -189105, -199922, -172057, -105942, -13349, 87658, 172787]
34718A72787M5527k720l9300n6324o0613n9522n2534l7513j7166L954K2977L6631
34706d3816M1064L7018L0585K5875K1267J5370J1463J1672J1293M995l379l373
34694A60034Q682K2867K5248J3950L546J0660L4717N6366N7676M0233J8178l055
34682D49102l2175p4937j19468j43007j30398q5720l0794P809J8438J4446J8532
34671a08172L4744M4082L1743Q760k337L648J0934N175j0783k3536k3472j1362
34659d0576L085P975p15j4832k3016k2906k0630k0017j8121j0987J856J9002L7748
34646a02134N2200N6197N0334M2032L6778L2763K6074J7796J3027J4141J6857
34635B56065J2857l431k9363n5500p3076p9050p3516n6314k9914k751J5724K2396
$$ y = [172787, 218314, 215594, 176294, 119970, 59357, -165, -52699, -90212, -107378, -103424, -80447, -43816, -2752, 34266, 64851, 90726, 111993, 127363, 138826, 150498, 161791, 166786, 163407, 160034, 168716, 191583, 216831, 230781, 234327, 244987, 279704, 336070, 393746, 433979, 452157, 449102, 416927, 341990, 222522, 79515, -50883, -136603, -167397, -159588, -141150, -126704, -108172, -73428, -29346, 2397, 11157, 8820, 12468, 23402, 28577, 17794, -5742, -29214, -40576, -37491, -29516, -30231, -45063, -68079, -90985, -111615, -131632, -149753, -160740, -158884, -139882, -102134, -49934, 6263, 56597, 98629, 135407, 168170, 194244, 212040, 225067, 239208, 256065, 268922, 265491, 236128, 180628, 107552, 28502, -45014, -101328, -131242, -133993, -118269, -95873]
34623i5873J9174P319r603j8579l606L5057P4217Q7518P0518M1770K0453P771
34611B36136r185l9353p5964j01408j01440p4979l3196P617L3152L6952K4327
34600i7341R437M130Q048J1044M880r437k5017l5962l9575l4704k1631m627P223
34587b23532N039j1491l1732m2715m0130k8649j3159N441K6193M6617O6440Q4749
34575a56929R0298O5108P106n7072r2676q8267n9327k5773K719K2238L0669L1920
34563b29986L2895L1555J7429j0761l6167l9172j7137J4873L7767M0174K4141
34552a34389M471l240J493N298J359N37J5506M0690N6885N2152L0418K380k3458
34539E0102m1561m8817m5231l2187j1185J2853L0078L2655K2057O247p855j5625
$$ y = [-95873, -76699, -69380, -78983, -97562, -101168, -66111, 8106, 95624, 166142, 207912, 228365, 236136, 226951, 187598, 111634, 10226, -91214, -166193, -199389, -191772, -158620, -121668, -97341, -87904, -83774, -75726, -64682, -59802, -69239, -94256, -130218, -169793, -204497, -226128, -230755, -223532, -218493, -229984, -261716, -304431, -344561, -373210, -386369, -380928, -354735, -308118, -241678, -156929, -66631, -1523, 5583, -51489, -144165, -232432, -291759, -317532, -314813, -292575, -261906, -229986, -197091, -165536, -148107, -158868, -195035, -234207, -251344, -236471, -198704, -158530, -134389, -129918, -133158, -131665, -126367, -125008, -124471, -108965, -68275, -11390, 40762, 71180, 73560, 50102, 8541, -40276, -85507, -117694, -128879, -116026, -85948, -53293, -31236, -24989, -32844, -48469]
34527d8469j2460L817K9863O0009Q9247J09065J06702P8083L9438J5968J6648
34516D87911K6062K2004m148m3863q0647j00876j01665r1687q1966p5479o8206
34505a12560n7986m6464l3378j6623J92P005j842j9102k9265k0123Q927M5309
34493b75910P0037P1394N3698K9960P529j4274l5153n1097o0697o5417o2358m6090
34481c78378k0712l05P761J1110J7378J9918Q475j1454k1210j0421J1849K7362
34469c38627K4944P928q973j1139K926K0885L1272L4231L2910K1254q565m8397
34457b39351p5119p2223m3553n117K7957M4499L7757J0624k3292m9004n9370n4946
34445e01138m0447k4203j5351j6244k0012j8135p180J2964M0796O8753Q3541P8478
$$ y = [-48469, -60929, -57112, -27249, 32760, 122007, 231072, 337774, 415857, 455295, 471263, 487911, 513973, 535977, 531829, 487966, 407319, 306443, 204778, 113091, 31125, -44354, -112560, -170546, -217010, -250388, -267011, -266819, -259814, -261656, -280758, -310023, -330146, -321219, -275910, -205873, -134479, -80781, -50821, -43292, -57566, -92719, -143816, -204513, -269930, -332288, -378378, -399090, -399395, -391634, -380524, -363146, -343228, -334753, -346207, -367417, -377838, -365989, -338627, -313683, -305755, -314728, -325867, -322941, -302056, -270784, -236553, -203643, -182389, -190954, -239351, -314470, -386693, -430246, -435363, -407406, -362907, -325150, -314526, -337818, -386822, -446192, -501138, -541585, -565788, -581139, -597383, -617395, -635530, -642710, -629746, -588950, -520197, -436656, -358178]
34433c58178O2740N2076N2808O0497P0252P9644Q3002P2919M9744K1864o105l7993
34421B03270p4963j06385j17811j04345p1847k9791J0495L4498L1431N377k5299
34410b45370m2285l9472k2086J108K3042L9991N1352N6744N2823L5901R067j6616
34398i5801l1032l3287k8319j7332L581L4652O6354Q5312Q5627P2616N6040M2012
34386B40423L2057K6988K7236K8415K0754j837l1561m9092l8950l011M0328O8626
34374C60376O8387M1365J814l4461o1943q6617j14584j41549j55784j49390j23424
34363c95810q4391m1261n604J2189J1064J019o356p294l943L543J8212M0138O3189
34350c95305P9849Q7412Q7886Q2581O8436M0807O30m1698p1144p7921o2906l4991
$$ y = [-358178, -295438, -243362, -190554, -130057, -59805, 19839, 102841, 175760, 225504, 247368, 241263, 203270, 128307, 21922, -95889, -200234, -272081, -301872, -291377, -256879, -225448, -220071, -245370, -287655, -327127, -349213, -348105, -325063, -285072, -233720, -176976, -124153, -88252, -79185, -95801, -126833, -160120, -188439, -205771, -202190, -167538, -101184, -15872, 69755, 142371, 198411, 240423, 272480, 299468, 326704, 355119, 375873, 374036, 342475, 293383, 254433, 251422, 291750, 360376, 428763, 470128, 471942, 437481, 375538, 288921, 174337, 32788, -122996, -272386, -395810, -480201, -521462, -527066, -514877, -503813, -502794, -509150, -516444, -520387, -516844, -498632, -458494, -395305, -315456, -228044, -140158, -57577, 10859, 51666, 52296, 10598, -60546, -138467, -201373, -236364]
34338b36364o133J1535J0068o986k3642k4198q345R846J8303J7315J2100K021
34326b24480j5916l5467m1410k4408Q405M0352N9954O6598O4925N8558M9428L9020
34314D5559K7586J3770k411j6490k2094j8175j2549j5756l0782m9877o1597n9293
34302b02109m2725j5476J5488M0184N1660N2861N2941N4661M9675K9533k395l4318
34290D9980n8173p2637p5961o3701l6242k971K5339M5816O2195P6309Q4323Q0990
34278A15267O5494M3199K2620J0022N890O612Q772J0125P457k531j8954l6457
34266B37516n0626o0278o2846n2352k6588O450L4589N2983O5302P4286P5892O3954
34254C58282L7488K919k8197m4265m1245k7325j7379k0683l4703n0013n7866n2890
$$ y = [-236364, -242497, -230962, -220894, -227880, -251522, -275720, -284065, -274219, -255916, -238601, -226501, -224480, -240396, -275863, -317273, -341681, -333276, -292924, -232970, -166372, -101447, -42889, 6539, 45559, 73145, 86915, 84504, 68014, 45920, 27745, 15196, -560, -31342, -81219, -142816, -202109, -244834, -260310, -244822, -204638, -152978, -100117, -47176, 7485, 57160, 86693, 84298, 49980, -8193, -80830, -156791, -220492, -256734, -259705, -234366, -188550, -126355, -50046, 34277, 115267, 180761, 223960, 246580, 256602, 262492, 269104, 277876, 288001, 295458, 292927, 273973, 237516, 186890, 126612, 63766, 11414, -15174, -8724, 25865, 78848, 144150, 218436, 294328, 358282, 395770, 398689, 370492, 326227, 284982, 257657, 240278, 219595, 184892, 134879, 77013, 24123]
34242B4123l3823n748K0242L3206K8737R124k0247n2094p6689q4251o9951l6570
34230b63941P205M9970Q0428R0823Q0535N6057K6102l118k6568l6072k3279Q629
34218D6771L9358M5239K1321j4101l8303m2446k9596l278L2559O5432P7548O1411
34206B61915K7522n641k5607k9543k0679n782P353J5128K1173L2163N0117O8427
34194C96546P4232N6213J4382l6426p5711r1904q7466p1510n2136l6180k9848
34183F0192l4650m4284m8348l8933j4480J8623M7062N8018M9287L0331J2051j564
34171I3305j0823j4802j2337n498J241L258l822k1151m0912m9168m0136k4090
34159a24935j5320j5362j4654q279j322K340Q369K4337M7894O7367P3305O6009
$$ y = [24123, -9700, -15448, 4794, 38000, 66737, 75861, 55614, 3520, -73169, -157420, -227371, -263941, -256736, -206766, -126338, -35515, 45020, 101077, 127179, 124061, 97493, 61421, 38142, 46771, 86129, 131368, 152689, 138588, 100285, 57839, 28243, 24965, 57524, 122956, 200504, 261915, 289437, 283796, 258189, 228646, 207967, 202185, 209538, 224666, 245839, 278002, 328119, 396546, 470778, 526991, 541373, 504947, 429236, 337332, 249866, 178356, 126220, 90040, 60192, 25542, -18742, -67090, -106023, -120503, -101880, -54818, 3200, 52487, 82818, 94869, 93305, 82482, 67680, 55343, 49845, 51086, 54344, 50522, 29371, -11541, -60709, -100845, -124935, -140255, -155617, -170271, -178550, -179872, -177532, -169163, -144826, -96932, -29565, 43740, 109749]
34147A09749N1205L1183L931k8297n4134o2357n4651m2658l1467j3889J4862M4081
34135c2442N6324M5634K1051m426k1568k4820j3522M746J6610J0947j4313m8214
34123c993o7518n0722o92N1408P4810O9242N7885N5120N4179M4737K6945M630
34111C16031k0917m3245m8656l1519n098J0717Q179n828j9100k1273r987L692
34099A32996L820r293j4995Q47K2442K0304j2742n4333p9830q4367p7094o6688
34087b18933n8126n4354n3429m8175l4294j6252j457Q948J9674L2921M4043M6630
34075c32804M0816L5138L8864N2773O9386Q1664Q7452Q5044P1566N0981L7247
34064C18127M0200N0148M5964J9901j3503l5838m5341n4761p3220r4739j02973
$$ y = [109749, 160954, 192137, 196068, 167771, 113637, 51280, -3371, -46029, -77496, -91385, -76523, -32442, 23882, 69516, 90567, 86141, 64573, 39753, 26231, 30977, 47587, 58534, 44221, -3993, -71511, -122233, -122925, -71517, 3293, 72535, 130420, 185540, 239719, 284456, 311401, 316031, 295114, 251869, 203213, 171694, 166596, 177313, 185492, 179664, 160564, 139291, 129304, 132996, 136816, 127523, 112528, 113375, 135817, 156121, 143379, 89046, 9216, -75151, -152245, -218933, -277059, -331413, -384842, -433017, -467311, -483563, -485020, -476072, -456398, -423477, -379434, -332804, -291988, -256850, -217986, -165213, -95827, -14163, 73289, 158333, 229899, 280880, 318127, 358327, 408475, 454439, 474340, 460837, 424999, 379658, 324897, 251677, 156938, 53965]
34053E3965q5926m8964j4118j566q797j2542M906L5341N5229N2904L8177K6040
34041I4649J9483J2699N590P082K2924M5661O0849O1912N5191N0250M8954M6469
34029E31713M0306L4649L5487M3633N2813N3483L9374J2567j7347m0613n4642
34018G31423o4369p6761r5546j18998j40082j49877j44156j26804j04619p9062
34008c68851m6170n608L2728N3334M6707J7064k0200m8665o0048n5178l8392j3748
33996e07027J4039L9717O0906P7658Q5846P6215M6080R179j3457j2462N416L0135
33984h7755N7224Q2366R6341R2098P3584N2729L9140L4701L5116L4177K9523K6631
33972E65875L3569M8743N7781M7197J8763j3982m0725o0310p2917p3848n8564
$$ y = [53965, -31961, -80925, -95043, -96609, -105406, -117948, -113042, -77701, -22472, 30432, 68609, 94649, 114132, 126831, 132421, 139503, 162427, 208088, 268937, 330849, 386040, 436290, 485244, 531713, 572019, 606668, 642155, 685788, 738601, 792084, 831458, 844025, 826678, 786065, 731423, 667054, 590293, 494747, 375749, 235667, 85790, -58366, -185170, -289789, -368851, -415021, -420629, -387901, -334567, -287860, -270796, -290996, -339661, -399709, -454887, -493279, -507027, -492988, -453271, -392365, -314707, -228861, -152646, -106566, -97387, -110844, -123306, -117890, -87755, -30531, 51835, 148176, 240274, 313858, 366587, 405727, 440428, 475544, 509721, 539244, 565875, 599444, 648187, 705968, 753165, 771928, 757946, 717221, 656911, 583994, 510146, 451582]
33961D51582l0789k221J5309J6535L520j7335l8137n1269n1899m1204k6699j7732
33949B09661k0216l4906n6477p1229o1089j9742L4047O8011O6524M3817K3575
33938A81976J2352J21j9353m0015n4148o0785o0707n1292l1148n116J9479L8415
33926g0221M9816N1718M4205L1352J7436K997j1961k2791k3000j3151l508n098
33914D7794j8449l2800l7557l4216l4712m6222n9479n6703l2380k199J2017M592
33902b90314r833j2955m9J8719K9626K6123J2337J40J612J9681M3891N7400N0509
33889e3113K7590Q62k0254l1993l2088j9212R71J3912O199k1327n2665o9776o5962
33876c16856m7606k6109r332J143P087Q757L402j0385k7151l6218l1358j8086
$$ y = [451582, 420793, 418572, 433881, 450416, 453936, 436601, 398464, 347195, 295296, 254092, 227393, 209661, 189445, 154539, 98062, 26833, -34256, -53998, -19951, 48060, 114584, 158401, 181976, 194328, 194449, 175096, 135081, 80933, 20148, -40559, -91851, -122999, -128115, -108636, -70221, -20405, 31313, 75518, 106870, 124306, 127303, 115342, 92551, 69551, 56400, 52892, 47794, 29345, -3455, -41012, -75228, -109940, -156162, -215641, -272344, -304724, -306923, -294906, -290314, -300147, -313102, -313151, -294432, -264806, -238683, -226346, -226206, -224594, -204913, -161022, -103622, -53113, -25523, -24661, -44915, -76908, -108996, -128208, -127237, -113325, -107126, -128453, -181118, -250894, -316856, -364462, -390571, -399903, -398760, -391673, -382916, -379514, -389899, -417050, -453268, -484626, -502712]
33864e02712r007j1606k1821k9248k6226j1868Q816K6772L2781K4810J1659M714
33852e02936M677J057j2686k8512l3526k6753j8662j4880q785O718K7185M2171
33840e64932M8221M9766M9150M3378L2295K4065K7903M2722N6717N9266N1747
33829g9702M4680M4149M4177L5436J9341P738P809J3640J6142J5104J4825J2154
33817A95493j770k7543n2854o3609n4227k6513J3478N3450P7159P6035N5852K7220
33805B72171o878m7840q8780j13433j09494p8362l1485J7276N4933P2537P1134
33794A1779O2230N7692N9534O1606N9479N4938N0924M4965K9211k581m6625q6884
33782C56268j04343r2255o1971l1382q720R413K6437L8720M1535L5946K5816J2176
$$ y = [-502712, -511719, -523325, -545146, -574394, -600620, -612488, -603672, -576900, -544119, -519309, -507650, -502936, -498259, -497202, -509888, -538400, -571926, -598679, -617341, -632221, -641006, -634288, -607103, -564932, -516711, -466945, -417795, -374417, -342122, -318057, -290154, -247432, -190715, -131449, -79702, -35022, 9127, 53304, 88740, 108081, 115819, 123628, 137268, 153410, 168514, 183339, 195493, 193723, 166180, 113326, 49717, -4510, -31023, -17545, 35905, 113064, 189099, 244951, 272171, 265293, 217453, 128673, 15240, -94254, -172616, -204101, -186825, -131892, -59355, 11779, 74009, 131701, 191235, 252841, 312320, 367258, 418182, 463147, 492358, 489777, 443152, 356268, 251925, 159670, 97699, 66317, 57597, 67010, 93447, 132167, 173702, 209648, 235464, 247640]
33770B47640m460j8706k3297j7392p696j150k88n595j7175l2197m4728n1204n3650
33757b9898n5348n5639n1663m3332l3645k4874j6663p789J697J0087J5430J8117
33745b73520K1477K7639L2894L0780K1060J1698R087R375L273j2494l1760m5306
33733a95797m7607l9441k7648k0390j8182j0990J0598M1922O7306P7200P6488
33722h6541P3676O7200M7116Q709l8486p4586q1937n7298j4940K3176M2731M3813
33710d7367L4391K0501M272j1762k2659k4994k1834k2046l2344m9087o0138n6811
33698b89878m2072k4591p795J0806L1992N2728P0445Q2418Q1598O2451L3420J3771
33686G5293J2188J6461J1429o55p601q527j3661k4076k6581j4181k67l477k4334
$$ y = [247640, 243180, 224474, 201177, 183785, 176089, 174939, 174651, 169056, 151881, 119684, 74956, 23752, -29898, -85246, -140885, -192548, -235880, -269525, -294399, -311062, -318851, -317154, -307067, -291637, -273520, -252043, -224404, -191510, -160730, -139670, -127972, -118885, -109510, -106237, -118731, -150491, -195797, -243404, -282845, -310493, -330883, -349065, -360055, -349457, -307535, -240229, -163029, -86541, -12865, 54335, 101451, 110160, 71674, -2912, -84849, -142147, -157087, -133911, -91180, -47367, -12976, 7525, 11797, 35, -22624, -47618, -69452, -91498, -123842, -172929, -233067, -289878, -331950, -356541, -364336, -353530, -321538, -268810, -198365, -115947, -34349, 28102, 61522, 75293, 87481, 103942, 115371, 114716, 107115, 98588, 84927, 60851, 34270, 20089, 19822, 16345, -7989]
33673g989m6007n5535n5860n5636n4279m2029j3457K3069N1527O3253O3714O3342
33661f5887O4248N9583M5262K7424J6212J5589K2202L1645M1155M6195L9039J4981
33649C57648j9933m9975o1053n1085k7723K529L7858P2068Q9386P7698M5837J7556
33637D90811M637n336k7484n2886n4579k0201L0448O3330N9943K7849j0884l6285
33625D69363m0778l1027k0742j8171j9580j5358l64K2885M6969O1086N3458J9960
33613E27701k8053o9543q9903q9440p7390o3301n4943n6607o3457o1453l9419
33602a65808o79M0275P0149Q1971P2017M0775p56l2011l5848j1484K4739M9928
33590A33268M8233K0125j8556m8350n8771n0427k8851j157K3369L6962M0395M1921
$$ y = [-7989, -53996, -109531, -165391, -221027, -275306, -317335, -330792, -307723, -256196, -192943, -129229, -65887, -1639, 57944, 103206, 130630, 146842, 162431, 184633, 216278, 257433, 303628, 342667, 357648, 337715, 287740, 226687, 175602, 147879, 150408, 188266, 260334, 349720, 427418, 473255, 490811, 495448, 490112, 462628, 409742, 355163, 334962, 365410, 428740, 488683, 516532, 505648, 469363, 428585, 397558, 376816, 358645, 339065, 323707, 323343, 346228, 393197, 454283, 507741, 527701, 499648, 430105, 340202, 250762, 173372, 110071, 55128, -1479, -64936, -126389, -165808, -166487, -126212, -56063, 25908, 97925, 138700, 137944, 105933, 70085, 58601, 83340, 133268, 181501, 201626, 183070, 134720, 75949, 25522, -3329, -4486, 18883, 55845, 96240, 138161]
33578A38161M7371N4982O0097N8865M6508K0721q662k2078j0793J0428J9795J3219
33566D28614K723n690j8851l9944n9071o6570o5451o2304n4193l5349j2258m9
33554A1607l483j1579j3882j3624j9662l1443l9256l7274k9648k2496j4241K756
33542b22225L1400O1691P4086N3548L719n1822q4644q0577m6965m839K3852K5903
33530b16873K724k9374m9455m7691l0457r169J1084K8873L9893M2591M6776O4354
33518a46724Q9605J00149Q3386N2480K7940J1071j2551m6338p1952o8316l4189
33507a5439J0835M2328M6779K8375M923o469l657J423j316q463r505j672N510
33494I3652j68k1659m9740o9898p2308n7251l3323j1668j033m780j9181l4502
$$ y = [138161, 185532, 240514, 300611, 359476, 405984, 426705, 418043, 395965, 385172, 395600, 415395, 428614, 431337, 425647, 406796, 366852, 307781, 241211, 175760, 113456, 59263, 23914, 11656, 11607, 8124, -3455, -17337, -30961, -50623, -82066, -121322, -158596, -188244, -210740, -224981, -222225, -190825, -129134, -55048, -1500, 2219, -49603, -134247, -214824, -261789, -266628, -242776, -216873, -214149, -243523, -292978, -340669, -371126, -380295, -369211, -340338, -300445, -257854, -211078, -146724, -57119, 43030, 126416, 178896, 206836, 217907, 205356, 159018, 87066, 18750, -15439, -4604, 37724, 84503, 112878, 117801, 111332, 107675, 109098, 107782, 99319, 89814, 88142, 93652, 93484, 71825, 22085, -47813, -120121, -177372, -210695, -222363, -223396, -228176, -247357, -281859]
33482b81859m0013k9628m332K8313N6557P0189O7338N4191L6203J2723j6509m3840
33470i0667n8795n8928m9760l6073k0729j0676j3275k2970k1131L410L8952O2943
33458b77699O5465N3928L7847J8669m158k5241l6766l6534k8203j5198J127J6962
33446b29801K4226J7443J685j0364j1007m855j898o026j3488k0491k7794l7793
33434c20163n0694o4335p5141p8960p2958n6982l1963Q23L6439O5095P8951P8690
33422d91198O9360N2379K7875K710j2189j3509p798j476M451R307J0780R976J0582
33409c28750J1109O894K433J1241L7499O6474P9328P0093M3727Q546k1852l1284
33397d4542j8704n213j0170k7191l7744m1430n3631p4986q4132o6671l4521p540
$$ y = [-281859, -321872, -351500, -355832, -327519, -270962, -200773, -133435, -79244, -43041, -30318, -46827, -90667, -149462, -208390, -258150, -294223, -314952, -325628, -338903, -361873, -383004, -379594, -340642, -277699, -212234, -158306, -120459, -101790, -105948, -131189, -167955, -204489, -232692, -247890, -246763, -229801, -205575, -188132, -186447, -196811, -207818, -212673, -214571, -220597, -234085, -254576, -282370, -320163, -370857, -435192, -510333, -589293, -662251, -719233, -751196, -750373, -713934, -648839, -569888, -491198, -421838, -369459, -341584, -338874, -351063, -364572, -372370, -373846, -369395, -360088, -349308, -339332, -328750, -317641, -310747, -308314, -297073, -259574, -193100, -113772, -43679, 48, 8594, -13258, -44542, -63246, -68459, -78629, -105820, -143564, -184994, -238625, -313611, -397743, -464414, -498935, -506475]
33385e06475J1335L1630N4871P0602P0157N5990L7847K4593J9119J7904J5628
33374i6799J0820N896K922K810P025J4916K0552J8823J4000J4239J7081J0205
33362D2490j0214l1381l9986l8167l5700l2672k0115M128K9309M3286M4215L8256
33350f551K9293J4716q323l5038n5113o3622o5976o8215o6625n3795l2909j7002
33338d29160j2777j2909p039O522K2780L7116M6987N2335N6918O3110O3529M6449
33326f6139J3720j5559k5948k3034k2696k9489l3998k6893p312J9073M2142N0190
33314a25943L8514J4798q749k5850l5338l6145l0530k7052l1480l7934l7237l0039
33302c72985k2384j2016Q868L7789O0004O4389N3265L6506K4449K5850M1920O0573
$$ y = [-506475, -495140, -463510, -408639, -338037, -267880, -211890, -174043, -149450, -130331, -112427, -96799, -85979, -80083, -77161, -74351, -67326, -52410, -31858, -13035, 965, 15204, 32285, 42490, 32276, 895, -39091, -77258, -112958, -145630, -165745, -161617, -132308, -89022, -44807, -6551, 22742, 37458, 29135, -5903, -61016, -124638, -190614, -258829, -325454, -379249, -412158, -429160, -441937, -454846, -461885, -455363, -432583, -395467, -348480, -296145, -239227, -176117, -112588, -66139, -52419, -67978, -93926, -116960, -139656, -169145, -203143, -230036, -237348, -218275, -176133, -125943, -87429, -72631, -81380, -107230, -142568, -178713, -209243, -236295, -267775, -305709, -342946, -372985, -395369, -407385, -398517, -360728, -300724, -236335, -183070, -146564, -122115, -96265, -54345, 6228]
33290F228O6228N7158M3873L0168R162j7845l3566k5886o289M948N036P592J8656
33277A65463K6781J8625m717l0229m5774m7433l8463k5260j4217j0434j6546k9636
33265e1840l9912l7401k2466n969L471Q029J2851J4674N225j5587l6871m8211
33253b14007m8640m2069k8694o048K1888M1558L9932J8173p654k1182j9073q298
33241b74114N264J9672L0980L3479K7895K1841J8466J1532l060j7152j8995p961
33229a52153O841J9688L1632M1785M3896L3823J4459q691l1589m9985n9507o0632
33217a70433n8372n3178l6611k259M0660P0825P4275N7966M2412M1898N3106O2203
33205A22492O1038N4070M8995M3204K4078j5290o3059r5190r6448p3802m8248
$$ y = [6228, 72456, 129614, 173487, 203655, 212817, 194972, 161406, 135520, 129231, 134179, 139215, 146807, 165463, 192244, 210869, 206152, 175923, 130149, 82716, 44253, 18993, 4776, -5658, -22204, -51840, -91752, -129153, -151619, -157588, -154117, -146088, -133237, -118563, -113338, -128925, -165796, -214007, -262647, -304716, -333410, -339458, -317570, -276012, -236080, -217907, -225561, -246743, -265816, -274114, -268850, -249178, -218198, -184719, -156824, -134983, -116517, -104985, -108045, -125197, -144192, -152153, -145312, -125624, -93992, -52207, -8311, 25512, 39971, 31280, -309, -50294, -109801, -170433, -228805, -281983, -318594, -320853, -280193, -209368, -135093, -77127, -34715, 7183, 60289, 122492, 183530, 237600, 286595, 329799, 353877, 338587, 275528, 180338, 83890, 10088, -38160]
33194c8160l4263k8904k0386m082J3148K3574K9041L7436N0234N7657M8496K3543
33182A57334k643j3660m564J5492L1274L1076J1614k1121n3412o9758o2993m0857
33170b2218k0637j4768k1160k7753k6251k0361j9881k7063l1481k1123K317K3980
33158b26399L3236L6031M5329O2104P1508N8072K0606k7403o7305q4671p5204
33147a54096m5870r646K1874M1404M6153M0982L9076N0344O6371O4579L2788j4725
33135A79234n0358n8754m5945k8464j9688k3481l3727l9681l5965k7124j9842
33124b03795j3660l893Q995J9272K4161K6048K6211K1933J0862o450k8828n3740
33112a72884p2475p2173m7988j1791J4854J7164k893l0555n0634n7707n6161n1219
$$ y = [-38160, -72423, -101327, -121713, -125795, -112647, -89073, -60032, -22596, 27638, 85295, 133791, 157334, 154691, 141031, 136467, 151959, 183233, 214309, 225923, 204802, 151390, 81632, 18639, -22218, -42855, -57623, -78783, -106536, -132787, -153148, -173029, -200092, -231573, -252696, -250379, -226399, -193163, -157132, -111803, -49699, 21809, 79881, 100487, 73084, 5779, -78892, -154096, -199966, -209612, -187738, -146334, -100181, -59199, -20123, 30221, 96592, 161171, 193959, 179234, 128876, 70122, 24177, -4287, -23975, -47456, -81183, -120864, -156829, -183953, -203795, -217455, -221348, -212353, -193081, -168920, -142872, -116661, -94728, -83866, -90316, -119144, -172884, -245359, -317532, -365520, -377311, -362457, -345293, -348186, -378741, -429375, -487082, -543243, -594462]
33100e94462m1502k1689Q874M2567O7574P3553N5748J8985k1593m8298n2924m0565
33088e53732k1663k697J5131L1175M1613L9895K1334j0666m2640n7850m6752j1755
33076e98607L5378P8056R9930R2873O3277K8099K769o841l250O616J4471J5986
33064a71243J5638K1675L3389L7731K2635r015m1852o1264o0823m1510j1289J4752
33052b51176K1613O325j9062l8040m1723l0844j0998J0086K3332K2789J1565M53
33040b95680j347P940K6781N5016Q8553J12593J10088Q0802M5317K4583J9876
33029B74522J8027J1039K138m112o960m492N870J8272J9537N905q170o142R350
33016C34784J8765P533k0692n1517p3684q4497q7062q5342p9963o7682m6518k1515
$$ y = [-594462, -635964, -657653, -648779, -606212, -538638, -465085, -409337, -390352, -411945, -460243, -513167, -553732, -575395, -578092, -562961, -531786, -490173, -450278, -428944, -439610, -482250, -540100, -586852, -598607, -563229, -485173, -385243, -292370, -229093, -200994, -198225, -205066, -208316, -201700, -187229, -171243, -155605, -133930, -100541, -62810, -40175, -49190, -91042, -152306, -213129, -254639, -265928, -251176, -229563, -223238, -242300, -280340, -322063, -352907, -363905, -353819, -330487, -307698, -296133, -295680, -297027, -289087, -262306, -207290, -118737, -6144, 103944, 184746, 230063, 254646, 274522, 292549, 303588, 305726, 301614, 294654, 290162, 296032, 314304, 333841, 339746, 331576, 325434, 334784, 353549, 361082, 340390, 288873, 215189, 130692, 43630, -41712, -121675, -189357, -235875, -257390]
33004b57390l345m45j3179l4296n2891n9087m8971k6402J840L3172O8911J05711
32992b86372J30704J29692J01141N9212K0776r270l7174o5853q6210q6302o6677
32981a96333m1949k6853k3319k0951p005K3188O0466Q5113Q1101N1100J4784j0252
32969a0910k2622k9175k8009q006L3130P7093R7760Q6162N9768M5095N2108O7018
32957D19412O8791M9015J5202j9691m6037n9461o1559n9540n9974o1740n8790
32946A25628m8975l4434j4731J1200L4503L8626J9200n516j2297K742K3687L3663
32934A73296K7126Q527j1208j8960j0186L487M707j0575l0502m3128m7371m7389
32922b176m4041l5320k0103J150K5246M4097M8378L5434J0573j9171m7406o4495
$$ y = [-257390, -260735, -261180, -274359, -308655, -361546, -420633, -469604, -496006, -494166, -460994, -392083, -286372, -155668, -25976, 75165, 134377, 155153, 145883, 108709, 42856, -43354, -129656, -196333, -238282, -265135, -288454, -309405, -316410, -293222, -232756, -147643, -66542, -15442, -658, -10910, -33532, -62707, -90716, -98722, -65592, 11501, 109261, 195423, 255191, 300286, 352394, 419412, 488203, 537218, 552420, 532729, 486692, 427231, 365672, 306132, 246158, 184418, 125628, 76653, 42219, 27488, 38688, 73191, 111817, 131017, 125501, 113204, 115946, 139633, 173296, 200422, 208949, 197741, 178781, 168595, 172082, 176789, 166214, 135712, 92584, 45213, -2176, -46217, -81537, -101640, -100490, -75244, -31147, 17231, 52665, 63238, 44067, -3339, -67834]
32910f7834n9447l0782P467L4055L4265P901k9629n3280m3531j860N0948R3962
32898e7765J20118J30925J25612J03035P1238M7485M5820O5391R0771J04090R8745
32887I45465Q1288N8940K9143j2576n7310q5534q7306p1307n1260l3125k0180
32876F96238j9424l3313n2822o8772q3519j00650j09544r5276o2290l3378k2485
32865A4765k0904j4671m008J182l410j3226k0695j7892R73L2009N9527O8332N7102
32852A39084L5523J1139j5206m2470o4704p5020p1102n5917l4946j3185O305K0863
32840a59636K6457K1206J2165J3464L2022N6721O7080N3192K3700n296k4407l3193
32828H3475l3695k6896j5419o178o657j6551k4731j9317k606Q650K344j3427k0523
$$ y = [-67834, -127281, -158063, -150596, -116541, -82276, -74375, -104004, -157284, -200815, -202675, -151727, -57765, 62353, 193278, 318890, 421925, 493163, 540648, 586468, 651859, 742630, 846720, 945465, 1026753, 1085693, 1114836, 1102260, 1044950, 959416, 872110, 800803, 749543, 716418, 696238, 676814, 643501, 590679, 521907, 438388, 337738, 228194, 132918, 70628, 37250, 14765, -6139, -20810, -24818, -23636, -27046, -40272, -60967, -78859, -77886, -45877, 13650, 81982, 139084, 174607, 185746, 170540, 128070, 63366, -11654, -82756, -138673, -173619, -186804, -180499, -159636, -133179, -111973, -99808, -86344, -54322, 2399, 69479, 122671, 146371, 141075, 116668, 83475, 49780, 22884, 7465, 1287, -5370, -21921, -46652, -65969, -68575, -59925, -57581, -71008, -91531]
32815i1531j4332q063j2252j9816j7711o376J606m13m973o41J6392M1438O4838
32802e1834P3747N7521J8484k4021m5816l6803q510J6056K0584P086q172j1462
32790F860m617N14q37j164N288J0965N015r135j5747o786Q012J3784O962m856
32776A4258j4241j9764k3088k5707k8664l1800l2281k5603r191J4673L8759N4004
32764h8645N5022M3866K7725J2506l68j1972k3762l7322n1957o0959n4399k9026
32752b19291O559L8780N8874O4527N6328L7330J3884p628k4644l6983m3971m5741
32740a01976m3931l7219k0644M459K4078K4980J3600J0892K5962M4983N1344M7114
32728D3642M5972N1681N4630M7393L3268J8436M311r058j8279j9449j2017K920
$$ y = [-91531, -105863, -113926, -126178, -145994, -163705, -170081, -168475, -168888, -173861, -174502, -158110, -116672, -51834, 21913, 79434, 97918, 73897, 28081, -8722, -17232, -1176, 19408, 26494, 18322, 6860, 2243, 2757, 1920, 756, 6044, 17009, 22024, 12889, -2858, -9644, -1632, 12152, 19114, 14258, 17, -19747, -42835, -68542, -97206, -129006, -161287, -186890, -196081, -181408, -142649, -88645, -33623, 10243, 37968, 50474, 50106, 38134, 14372, -22950, -74907, -135866, -190265, -219291, -212732, -173952, -115078, -50551, 5777, 43107, 56991, 49363, 24719, -12264, -56235, -101976, -145907, -183126, -203770, -199311, -175233, -150253, -136653, -125761, -99799, -54816, -3472, 43642, 89614, 141295, 195925, 243318, 276586, 295022, 299333, 290275, 271996, 252547, 240530, 243450]
32716B43450K4531M9145O8325P4482O7324N1724L0474L493k5261m4804m5490l0045
32704D67348j3131q016j4867k3831k8295l1439l8596m7423n0422m6174m2272m4617
32692G8265m8109m2884k8425j5912j4312j7724j0502J5388N1089P9415R0053Q4672
32680B21014O9729M9106K5580N695k525J479P563M773n602j0644k214R399K914
32667C76267l0748p4944j00264r1462n9960k9720j3402m802O862K0355K4279J4628
32655C7089M475J0567L1082M3543K9312l656k8407k7754q611J2300K7031L5031
32643A62002L2207J3960j2218k9693l2318l1569l7903m3206l1362j356L1295N4434
32631G4273O8398P2824N7412J6114l5553o8763o7825m2007j1244J2844K9710M0882
$$ y = [243450, 267981, 317126, 385451, 459933, 527257, 578981, 609455, 612948, 587687, 542883, 497393, 467348, 454217, 446201, 431334, 407503, 379208, 347769, 309173, 261750, 211328, 165154, 122882, 78265, 30156, -12728, -41153, -57065, -71377, -89101, -99603, -84215, -33126, 46289, 136342, 221014, 290743, 339849, 365429, 371124, 368599, 370078, 377641, 382414, 376812, 366168, 363954, 373353, 376267, 345519, 270575, 170311, 78849, 18889, -10831, -24233, -29035, -22173, -1818, 22461, 37089, 41564, 52131, 83213, 126756, 156068, 152412, 124005, 96251, 87640, 99940, 126971, 162002, 194209, 208169, 195951, 166258, 133940, 102371, 64468, 21262, -10100, -11456, 19839, 74273, 142671, 215495, 272907, 289021, 253468, 184705, 116880, 74873, 63629, 76473, 106183, 147065]
32619A47065M5001M0767K9741J4247n405k8812n0334n9424n0196l0512j6574j5694
32607A9870j8434j1744M207J8531K5699K9388K9672J7529j0995m2457n7328n1023
32595d7085l5394k0753o017J0813K1299J3590j1338l6504m3384k7998l214J2543
32583a73442R093r926l2474m8156n3801n1330m3076l0496j6001l264N756J3566
32571d33551K5108M1420N5511N6613M0545J5335n101j3037j1405o591J22J1421
32559b23610K5925L5424L2468J9110N611N68M375J2171J9574K3031J7713O44k2726
32546d9722l9090l8010k1867m047K594l720j1677m391K7340P4632J13146J19276
$$ y = [147065, 192066, 232833, 262574, 276821, 271416, 242604, 192270, 132846, 82650, 52138, 35564, 19870, 1436, -10308, -6101, 12430, 38129, 67517, 97189, 114718, 103723, 61266, 3938, -47085, -82479, -103232, -109249, -98436, -77137, -63547, -74885, -111389, -154773, -182771, -185985, -173442, -164349, -174275, -206749, -254905, -308706, -360036, -403112, -433608, -449609, -452873, -447117, -433551, -408443, -367023, -311512, -254899, -214354, -199019, -204120, -217157, -228562, -235153, -235031, -223610, -197685, -162261, -129793, -110683, -105072, -104504, -100129, -87958, -68384, -45353, -27640, -26996, -49722, -88812, -126822, -148689, -152736, -150142, -153862, -165539, -169930, -142590, -67958, 45188, 164464]
$$ [...]
##END NTUPLES=NMR SPECTRUM
##END=
