##TITLE=31Pdec_PhBDP2310
 CDCl3, 24 sc
 26.10.2020
##JCAMPDX= 6.0         $$ Bruker NMR JCAMP-DX V2.0
##DATA TYPE= NMR SPECTRUM
##DATA CLASS= NTUPLES
##ORIGIN= UXNMR, Bruker Analytische Messtechnik GmbH
##OWNER= root
$$ XWIN-NMR		Version 3.5
$$ Mon Oct 26 11:41:57 2020 Russian Standard Time (UT+4h)  she@DPX200
##.OBSERVE FREQUENCY= 81.013821
##.OBSERVE NUCLEUS= ^31P
##.ACQUISITION MODE= SIMULTANEOUS
##.ACQUISITION SCHEME= undefined
##.AVERAGES= 24
##.DIGITISER RES= 17
##SPECTROMETER/DATA SYSTEM= spect
##.PULSE SEQUENCE= zgpg30
##.SOLVENT NAME= CDCl3
##.SHIFT REFERENCE= (INTERNAL, CDCl3, 0, 182.463)
##AUDIT TRAIL= $$ (NUMBER, WHEN, WHO, WHERE, WHAT)
$$ ##TITLE= Audit trail, XWIN-NMR		Version 3.5
$$ ##JCAMPDX= 5.01
$$ ##ORIGIN= Bruker BioSpin GmbH
$$ ##OWNER= she
$$ F:/spectra/data/she/nmr/P31/1/pdata/1/auditp.txt
$$ ##AUDIT TRAIL=  $$ (NUMBER, WHEN, WHO, WHERE, WHAT)
(   1,<2020-10-26 11:40:49.17 +0400>,<she>,<DPX200>,
      <created by zg, POWCHK disabled, PULCHK disabled
       configuration hash MD5:
       00 E9 B6 7A A2 85 ED C7 34 08 36 98 17 FE 4E 26
       data hash MD5: 32K
       B3 28 7A 1F 0F 06 1B 34 2D 3B DB A6 66 F4 E7 EA>)
(   2,<2020-10-26 11:40:52.06 +0400>,<she>,<DPX200>,
      <Start of raw data processing
       efp BC_mod = 2 LB = 1 FT_mod = 6 PKNL = 1 PHC0 = -2382.896 PHC1 = 73.00069 SI = 64K 
       data hash MD5: 64K
       B0 71 D2 14 BF B0 16 0A 74 F3 3E 34 6C B8 DF 80>)
(   3,<2020-10-26 11:41:09.98 +0400>,<she>,<DPX200>,
      <pk PHC0 = 6.014474 PHC1 = 0 
       data hash MD5: 64K
       CF 10 28 CE E4 7A 60 B9 83 AB B2 F8 6C 91 93 AC>)
(   4,<2020-10-26 11:41:13.50 +0400>,<she>,<DPX200>,
      <abs ABSG = 5 
       data hash MD5: 64K
       1C D2 8E 5E B1 8D E5 14 58 47 D1 8F 83 F0 D3 CF>)
$$ ##END=
$$ 
$$ hash MD5
$$ 09 8E BD E9 36 A4 43 AA FE 93 22 37 62 02 98 D6
##$RELAX= 
##$RELAX= 
##$RELAX= 
##$RELAX= 
##$RELAX= 
##$RELAX= 
##$RELAX= 
##$RELAX= 
$$ Bruker specific parameters
$$ --------------------------
##$DU= <F:/spectra>
##$EXPNO= 1
##$NAME= <P31>
##$PROCNO= 1
##$TYPE= <nmr>
##$USER= <she>
##$AMP= (0..31)
100 100 100 100 100 100 100 100 100 100 100 100 100 100 100 100 100 100 
100 100 100 100 100 100 100 100 100 100 100 100 100 100 
##$AQSEQ= 0
##$AQ_mod= 1
##$AUNM= <au_zg>
##$AUTOPOS= <>
##$BF1= 81.014009
##$BF2= 200.13
##$BF3= 200.13
##$BF4= 200.13
##$BF5= 200.13
##$BF6= 200.13
##$BF7= 200.13
##$BF8= 200.13
##$BYTORDA= 1
##$CFDGTYP= 0
##$CFRGTYP= 5
##$CHEMSTR= <none>
##$CNST= (0..31)
1 1 145 1 1 1 1 1 1 1 1 1 1 1 1 1 1 1 1 1 1 1 1 1 1 1 1 1 1 1 1 1 
##$CPDPRG= <waltz16>
##$CPDPRG1= <>
##$CPDPRG2= <waltz16>
##$CPDPRG3= <>
##$CPDPRG4= <mlev>
##$CPDPRG5= <mlev>
##$CPDPRG6= <mlev>
##$CPDPRG7= <mlev>
##$CPDPRG8= <mlev>
##$CPDPRGB= <>
##$CPDPRGT= <>
##$D= (0..31)
0 1 0 0 0 0 0 0 0 0 0 0.03 2e-05 3e-06 0 0 0 0 0 0 0 0 0 0 0 0 0 0 0 0 
0 0 
##$DATE= 1603698048
##$DBL= (0..7)
120 120 120 11 120 120 24 19 
##$DBP= (0..7)
150 150 150 150 150 150 150 150 
##$DBP07= 0
##$DBPNAM0= <>
##$DBPNAM1= <>
##$DBPNAM2= <>
$$ [...]
##$SUBNAM3= <"">
##$SUBNAM4= <"">
##$SUBNAM5= <"">
##$SUBNAM6= <"">
##$SUBNAM7= <"">
##$SUBNAM8= <"">
##$SUBNAM9= <"">
##$SW= 369.568048894756
##$SWIBOX= (0..15)
0 1 3 0 0 0 0 0 0 0 0 0 0 0 0 0 
##$SW_h= 29940.119760479
##$TD= 32768
##$TD0= 1
##$TE= 0
##$TE2= 300
##$TE3= 300
##$TEG= 300
##$TL= (0..7)
0 120 53 12 22 120 120 120 
##$TP= (0..7)
150 150 150 150 150 150 150 150 
##$TP07= 0
##$TPNAME0= <>
##$TPNAME1= <>
##$TPNAME2= <>
##$TPNAME3= <>
##$TPNAME4= <>
##$TPNAME5= <>
##$TPNAME6= <>
##$TPNAME7= <>
##$TPOAL= (0..7)
0.5 0.5 0.5 0.5 0.5 0.5 0.5 0.5 
##$TPOFFS= (0..7)
0 0 0 0 0 0 0 0 
##$TUNHIN= 0
##$TUNHOUT= 0
##$TUNXOUT= 0
##$USERA1= <user>
##$USERA2= <user>
##$USERA3= <user>
##$USERA4= <user>
##$USERA5= <user>
##$V9= 5
##$VALIST= <valist>
##$VCLIST= <CCCCCCCCCCCCCCC>
##$VD= 0
##$VDLIST= <DDDDDDDDDDDDDDD>
##$VPLIST= <PPPPPPPPPPPPPPP>
##$VTLIST= <TTTTTTTTTTTTTTT>
##$WBST= 1024
##$WBSW= 4
##$XGAIN= (0..3)
0 0 0 0 
##$XL= 0
##$YL= 0
##$YMAX_a= 26974
##$YMIN_a= -12200
##$ZGOPTNS= <>
##$ZL1= 120
##$ZL2= 120
##$ZL3= 120
##$ZL4= 120
##$ABSF1= 182.463
##$ABSF2= -187.1042
##$ABSG= 5
##$ABSL= 3
##$ALPHA= 0
##$AQORDER= 0
##$ASSFAC= 0
##$ASSFACI= 0
##$ASSFACX= 0
##$ASSWID= 0
##$AUNMP= <proc_1d>
##$AZFE= 0.1
##$AZFW= 0.5
##$BCFW= 0
##$BC_mod= 2
##$BYTORDP= 0
##$COROFFS= 0
##$CY= -3
##$DATMOD= 1
##$DC= 0
##$DFILT= <>
##$DTYPP= 0
##$F1P= 0
##$F2P= 0
##$FCOR= 1
##$FTSIZE= 65536
##$FT_mod= 6
##$GAMMA= 0
##$GB= 0
##$INTBC= 1
##$INTSCL= 5.30512e-09
##$ISEN= 30
##$LB= 1
##$LEV0= 0
##$LPBIN= 0
##$MAXI= 10000
##$MC2= 0
##$MEAN= 0
##$ME_mod= 0
##$MI= 50
##$NCOEF= 0
##$NC_proc= -7
##$NLEV= 6
##$NOISF1= 182.463
##$NOISF2= 159.3651
##$NSP= 0
##$NTH_PI= 0
##$NZP= 0
##$OFFSET= 182.463
##$PC= 4
##$PHC0= -2376.882
##$PHC1= 73.00069
##$PH_mod= 1
##$PKNL= yes
##$PPARMOD= 0
##$PSCAL= 0
##$PSIGN= 0
##$REVERSE= no
##$SF= 81.014009
##$SI= 65536
##$SIGF1= 159.3651
##$SIGF2= -187.1042
##$SINO= 113.3802
##$SIOLD= 16384
##$SREGLST= <1H.CDCl3>
##$SSB= 0
##$STSI= 65536
##$STSR= 0
##$SW_p= 29940.119760479
##$SYMM= 0
##$S_DEV= 0
##$TDeff= 32768
##$TDoff= 0
##$TI= <>
##$TILT= no
##$TM1= 0
##$TM2= 0
##$TOPLEV= 0
##$USERP1= <user>
##$USERP2= <user>
##$USERP3= <user>
##$USERP4= <user>
##$USERP5= <user>
##$WDW= 1
##$XDIM= 65536
##$YMAX_p= 379480418
##$YMIN_p= -17327491
$$ End of Bruker specific parameters
$$ ---------------------------------
##NTUPLES= NMR SPECTRUM
##VAR_NAME=  FREQUENCY,     SPECTRUM/REAL,   SPECTRUM/IMAG
##SYMBOL=    X,             R,               I
##VAR_TYPE=  INDEPENDENT,   DEPENDENT,       DEPENDENT
##VAR_FORM=  AFFN,          ASDF,            ASDF
##VAR_DIM=   65536,         65536,           65536
##UNITS=     HZ,            ARBITRARY UNITS, ARBITRARY UNITS
##FACTOR=    0.456856943014862, 1,           1
##FIRST=     14782.0589164895, 0,            0
##LAST=      -15158.0608439895, 0,           0
##MIN=       -15158.0608439895, -17327491,   0
##MAX=       14782.0589164895, 379480418,    0
$$ Real data points
##PAGE= N=1
##DATA TABLE= (X++(R..R)), XYDATA
$$ [...]
44340 450000 1555494 1378919 1386106 2828581 4190020 3021173 -16346 -1589674 -406206
44331 -406206 1202394 1122246 292624 473367 1385293 1604548 667554 -1044402 -3000310
44322 -3000310 -3870764 -1850981 2756167 6602939 6663894 3641617 584090 -861888 -1207035
44313 -1207035 -1132432 -777527 -587089 -914674 -813560 1011535 3854144 5255754 4053889
44304 4053889 1736605 192524 -452676 -845104 -554066 1295356 4060938 5667918 4798812
44295 4798812 2206435 -202818 -986909 31393 1885496 3357276 4220201 5298465
44287 5298465 6643212 6360647 2818122 -2193766 -4617578 -3121771 -886702 -1134687
44279 -1134687 -2911953 -3356422 -2375914 -2120355 -2753471 -2193213 -173986 813837 -363420
44270 -363420 -1415105 -231839 1958014 2896889 2578663 2082408 1038030 -1165065 -2974317
44261 -2974317 -2312921 -82608 613575 -1163860 -2831875 -1836379 1020541 2500438 402350
44252 402350 -4121408 -7344586 -6461958 -2743640 -333276 -1258498 -2943927 -1822026 2053527
44243 2053527 5693350 7110256 6406116 4000685 384549 -2773133 -3745401 -2951278 -2025148
44234 -2025148 -1075645 839770 2978618 3465766 2500451 1965380 1555804 -1316750 -6741700
44225 -6741700 -10763238 -10391703 -7351623 -4806889 -2963346 -454594 2065361 2743379
44217 2743379 1719328 730577 244464 -579643 -1590082 -1619608 -567816 418590 658727
44208 658727 243067 -793700 -1809344 -856845 2976142 6997898 7430540 4542093 2344083
44199 2344083 2649667 2702500 221191 -2448499 -2079061 -155895 -972933 -4951209 -7697537
44190 -7697537 -6295545 -3160437 -2011215 -2684208 -2431180 -704785 368498 -54728 4419
44181 4419 2035712 4279395 3840624 531138 -2882668 -3912808 -2684005 -1123829 -777362
44172 -777362 -1634237 -2532238 -2456475 -1659408 -1470328 -2699311 -4317156 -4247364 -1796505
44163 -1796505 974589 943793 -2614927 -6676979 -7438134 -4642595 -1767667 -1468042 -2475561
44154 -2475561 -2368251 -1629477 -2234914 -3232123 -1527221 2466296 3973547 608538 -3494599
44145 -3494599 -3311272 25863 1589454 255977 -484623 1135806 2445072 935396
44137 935396 -1936750 -3247601 -2508496 -1494871 -1886338 -4256141 -7850281 -10349367 -9383260
44128 -9383260 -5410720 -1869201 -1469900 -3325845 -4433382 -2977597 353978 3274766
44120 3274766 3712057 1783353 95216 838276 2780990 2938441 1039668 -157205 657775
44111 657775 1466335 714281 187819 2077725 5274002 6855798 5852613 3495978 958810
44102 958810 -1146999 -1995421 -1249910 -29136 242368 -686941 -2535590 -5304925 -8093475
44093 -8093475 -8592638 -5761083 -2046631 -984603 -3175641 -6234639 -7960265 -7928753 -6752205
44084 -6752205 -5492203 -5176477 -5393915 -4243315 -1243704 867562 -740467 -5025431
44076 -5025431 -8354686 -8861150 -7273193 -4428327 -853830 1647379 1149112 -1318735
44068 -1318735 -2547527 -1580731 -997531 -3125475 -7065133 -10062663 -9975165 -6203653 -444967
44059 -444967 3252881 1869177 -2468949 -4413106 -2268755 42847 -822632 -2888368
44051 -2888368 -2752642 -1167273 -1095181 -2101451 -875477 3036817 5863721 4684225 847238
44042 847238 -2783729 -5381290 -7302241 -7792996 -5924008 -2956447 -1566388 -2657659
44034 -2657659 -4551359 -5555884 -5761533 -5631707 -4427993 -1614354 1125931 1467311 104759
44025 104759 565342 4270061 7728005 6682011 1982219 -1081530 746381 4988414
44017 4988414 6716436 3872181 -1399158 -5392319 -6007332 -4261721 -3300716 -5090281
44009 -5090281 -7835721 -7925666 -4778459 -1970690 -2513946 -4885322 -5696144 -4881644 -5415854
44000 -5415854 -8138534 -9940589 -8252303 -4888553 -3296467 -3498127 -2574321 125876
43992 125876 1373055 -1069205 -4492395 -4683993 -1878288 -70809 -702658 -754549 1604525
43983 1604525 3078185 -70254 -5845024 -8929057 -8122091 -7084646 -7589722 -6630717 -2053989
43974 -2053989 2886891 3799515 1395176 -155909 382874 437525 -1231686 -2403409 -1370574
43965 -1370574 195179 211337 -323706 823412 3141688 3798991 1766802 -660633 -907129
43956 -907129 913490 2765018 3259994 2583800 1612315 1073740 1283696 1910682 2014021
43947 2014021 806737 -1595684 -4372036 -6665420 -7809519 -7377705 -5582507 -3351936
43939 -3351936 -1510640 -181530 636193 616324 17087 232938 2121257 4284666 4542912
43930 4542912 2801671 753541 -1007895 -3345160 -5862495 -6509881 -5020665 -4254081
43922 -4254081 -6217667 -8667801 -7934340 -3859158 321115 2163210 1969634 1153275 668839
43913 668839 794408 868232 -355948 -2751757 -4113025 -3065951 -1593190 -2440407 -4868839
43904 -4868839 -5571688 -3364091 -255865 2024636 3736130 4978679 4589443 2205234
43896 2205234 -543886 -1782617 -942366 1524121 4207755 4708684 1896464 -1730551
43888 -1730551 -2547663 -865928 -499751 -2742665 -4269300 -2484044 465998 1365110 784348
43879 784348 1400674 3521294 5272819 5866178 5765751 4506688 1264733 -2557938 -3859766
43870 -3859766 -1461741 2458347 5036487 5664626 5762334 6300884 6240753 3833493 -481831
43861 -481831 -3501353 -2756982 203064 1879771 1585783 1611000 2755701 2896934 923970
43852 923970 -930540 -278011 2382640 5318155 7798498 9129712 8087664 5233076
43844 5233076 3333170 3566852 3882346 3021353 3017541 5117078 6552705 4815320 2086999
43835 2086999 1391909 1126495 -1815931 -5689063 -6014910 -2697849 483834 2696857 6417095
43826 6417095 10788860 10858194 5311946 -263910 -577918 2914744 5471281 5643765 5468684
43817 5468684 6406141 7797590 8150544 6435220 3303488 1545875 3373272 6877919
43809 6877919 7790757 5325551 3226931 4042818 5752960 5764121 4898294 4960107 5177829
43800 5177829 4010157 2467567 2694661 4560271 6201792 6924479 7283404 7152460 5883603
43791 5883603 3924947 2568610 2375693 2932133 3584280 3619868 2628352 1427014 1577920
43782 1577920 3386944 5604557 7407849 8897388 9323908 7337859 3916170 2306644
43774 2306644 3596848 5064691 4724647 4505499 6297783 7742447 5640455 1617059
43766 1617059 281130 2550828 4708470 4115303 2357563 1956604 2774962 2992168 1957718
43757 1957718 932067 1630120 4247319 6573267 5814921 2106334 -931520 -401909 2275577
43748 2275577 3491070 1876931 -1194576 -4152720 -5916054 -5166076 -1723315 1824828
43740 1824828 2492960 724184 -458940 232009 1412490 2115586 2903742 3561141 2479470
43731 2479470 -739975 -4256111 -6399007 -7227236 -7070715 -5570537 -3088406 -1291313
43723 -1291313 -1261842 -2272936 -3070632 -3086102 -1964114 590763 3863675 6235060 6596532
43714 6596532 4611658 -15632 -6549519 -11712868 -11962891 -8087347 -4964864 -5443593
43706 -5443593 -6807519 -5038940 -451046 3223195 3891836 2754159 1602783 852318
43698 852318 282235 -139159 -634802 -1600576 -2734216 -2979352 -1804232 -133253 410912
43689 410912 -760834 -2387284 -2624015 -1294459 -332205 -1444722 -3928503 -5652551 -5636092
43680 -5636092 -4580012 -3495180 -3215459 -4551636 -6953496 -7528436 -3969891 1425230
43672 1425230 3465933 532219 -3424146 -4480246 -3433221 -3044022 -3416088 -2940796 -1860071
43663 -1860071 -1711590 -2294578 -2061048 -794250 708283 2726365 5401004 6147280 1971341
43654 1971341 -5309583 -9747932 -8351328 -4483739 -2789887 -3643145 -4573341 -4484493 -3747539
43645 -3747539 -2112444 408322 1858091 651839 -1234926 -644045 1605657 1608976 -1208686
43636 -1208686 -2629067 -271196 2192458 532795 -3377643 -4638218 -3283436 -4158638
43628 -4158638 -8845113 -12718058 -11816351 -8456273 -7037929 -7360444 -5910495 -2121795
43620 -2121795 670780 350034 -1258403 -1404014 387681 2990252 5504462 7313072
43612 7313072 7765427 6948942 6014335 6049087 7103023 8410844 8850745 7350404 3939279
43603 3939279 346240 -1659957 -2503927 -4007799 -6303781 -7209257 -5272789 -2030313
43595 -2030313 -354826 -1455526 -4120802 -6128274 -5919047 -3612500 -812402 974875
43587 974875 1617309 1624759 980151 -151043 -589578 54917 -302667 -3344678 -6258770
43578 -6258770 -4142620 2738799 7696080 5492168 -1380310 -6481438 -7037475 -5291776
43570 -5291776 -4253377 -4875324 -6284260 -6476587 -3707869 1017445 4128533 3898116 2963136
43561 2963136 4348449 6914639 7495967 5827732 4129037 3184788 2416647 2775384 5490940
43552 5490940 8323577 7360204 3057633 480091 2440416 6050765 7432673 6274295
43544 6274295 3870312 118647 -4758667 -8060659 -7322237 -3932252 -1624663 -2220912
43536 -2220912 -4615519 -6886416 -7653339 -6352706 -3940288 -2659656 -3732391 -5888858
43528 -5888858 -7036745 -6297252 -3700543 307832 3840565 4206656 1552155 -84103
43520 -84103 2187650 5743649 6119935 3697405 3058534 6047702 9216974 8841580 5314002
43511 5314002 1507253 -502723 58194 2746703 4961637 3429393 -1338045 -4151570
43503 -4151570 -1113040 5048945 8149274 5942421 1606739 -1467840 -3111835 -4134873
43495 -4134873 -3785941 -1336291 1555180 2118602 -449944 -4513024 -8054249 -9935589
43487 -9935589 -9519207 -6650783 -2480361 712864 1273927 -444240 -2622865 -3587987 -2836796
43478 -2836796 -1034716 549242 781360 -731939 -3485624 -6302332 -7724278 -6751135
43470 -6751135 -3862289 -1125246 -442493 -1495372 -2152700 -1169982 392444 967628 704547
43461 704547 761016 974707 -193255 -3165477 -6035889 -6639911 -5069620 -3257996 -2459055
43452 -2459055 -2065574 -982485 602789 1361054 570183 -759607 -893428 428829 1182156
43443 1182156 -950036 -5583064 -9183633 -8345014 -3572230 827843 1059483 -2318280
43435 -2318280 -5359021 -5192684 -2658812 -525453 -280227 -1329904 -2357393 -2345985 -909828
43426 -909828 1071568 1521678 -676046 -3714967 -4593312 -2846141 -878123 -404410 -596766
43417 -596766 -368273 -158335 -97675 1317897 4563394 6863227 5310565 1217633 -1304914
43408 -1304914 -584106 1371369 2564398 3211536 3993696 4660179 5103613 5762278 6233660
43399 6233660 5320531 3106657 1235598 515391 -36913 -1231221 -2593696 -3736550 -4862783
43390 -4862783 -5279131 -3562842 -102074 2707340 3878168 5201837 7854486 9887865
43382 9887865 8888512 5300511 1420117 -1158120 -1628708 264257 2688524 2313459 -1244270
43373 -1244270 -3953393 -3093518 -1862108 -4491960 -8902759 -9062557 -3901806 1061496
43365 1061496 1399462 -1374927 -3668106 -4436527 -4271126 -3299923 -2093325 -2066671 -3096419
43356 -3096419 -2919083 -511903 2051339 2670248 2090234 2183949 3355336 5097111 6982553
43347 6982553 7523249 4413482 -1959361 -7340666 -8359342 -6740197 -6355664 -7774634
43339 -7774634 -8623785 -8115558 -7913884 -8713979 -8821734 -6610856 -2509377 1746259 4548319
43330 4548319 5342344 5263788 6146512 7710366 7080013 2930400 -1407942 -1600925 2046696
43321 2046696 5535668 6841664 7192421 7182983 5691660 3201180 2210854 3062520 3081784
43312 3081784 1571919 1819720 5482921 8488275 6247962 548398 -2858711 -2136328
43304 -2136328 -705575 -1270577 -2612034 -2808445 -2020750 -850553 1150638 3740331 4983835
43295 4983835 3702911 1372190 122602 149420 357663 245367 -276615 -1740773 -4145239
43286 -4145239 -5936835 -5601176 -3748345 -2159103 -1318255 -529801 -2361 -747060 -2267588
43277 -2267588 -2447130 -507136 1660857 2143948 1419882 804238 -9405 -1896577 -3756653
43268 -3756653 -3449593 -1211984 201015 -591461 -1616940 -583007 1819101 3172461
43260 3172461 2665838 1450631 439116 -503104 -1498431 -2312575 -2846979 -2666651 -567254
43251 -567254 3657660 7457257 7777804 5172398 3279401 3720893 4186022 2761539 1366202
43242 1366202 2612021 5422554 6735572 6344886 6923429 9526096 11898316 11617139 8739875
43233 8739875 4966957 2010326 958036 1402560 1121396 -1394045 -4101197 -3464039 446391
43224 446391 3639562 3640088 2272823 1827365 1614554 459864 -216265 1284801 3570632
43215 3570632 4122415 3105829 2232300 1209239 -1298516 -4085720 -4437458 -2541330 -1397494
43206 -1397494 -2126169 -2712816 -1930965 -1179855 -1471365 -1715861 -1269063 -1335400 -2467898
43197 -2467898 -3371672 -3562760 -4398228 -5937958 -5883086 -3671750 -2419081 -4046693 -5553622
43188 -5553622 -3645501 -461370 -511047 -3800399 -6552615 -7521962 -8599673 -9504693 -7254389
43179 -7254389 -2021349 1331923 -268896 -3894667 -5252671 -4338465 -3842463 -4566307 -5286418
43170 -5286418 -5344860 -4835482 -3688470 -2686713 -3701563 -6706217 -8441432 -6753467 -4459821
43161 -4459821 -5485443 -8394568 -7844300 -2381384 3329089 5122836 4498569 5078052 6779472
43152 6779472 6488728 3141001 -781954 -2695310 -2672309 -2322902 -2403817 -2310056 -1292323
43143 -1292323 329325 1018446 -733488 -4447415 -7132643 -5781479 -865725 3479989
43135 3479989 3591094 110478 -3168181 -3759801 -2395067 -696314 925462 2170038
43127 2170038 1753814 -602799 -2546283 -1973129 -645025 -1899795 -5012634 -5446553 -1629478
43118 -1629478 2133027 1592439 -1670640 -3310267 -2691457 -2757933 -4734988 -6596921 -6512482
43109 -6512482 -4704490 -1872055 1425159 3695633 3572202 2228677 2131118 3160766 2894140
43100 2894140 1192362 1116173 3953166 6607299 6063052 3699847 2587285 2765970 2283920
43091 2283920 1356786 2059681 4312689 5248869 3023205 -891999 -3661078 -3753407 -1549676
43082 -1549676 1081402 1628137 -991187 -4737907 -6209393 -4548760 -2281092 -1678834
43074 -1678834 -1737310 -22379 3333565 5204253 3378025 -342948 -2122842 -825145
43066 -825145 765418 78847 -1508524 -967607 1345728 1867214 -632698 -2857257 -2063516
43057 -2063516 -619146 -2614099 -7562068 -10792760 -9634200 -6145887 -3549494 -2748585
43049 -2748585 -3015859 -3531873 -3066852 -282157 4101608 6944455 6040884 2839711 522256
43040 522256 256552 714431 649674 407952 856373 1972871 2923044 3022052 2303302 1323950
43030 1323950 614667 333679 285034 6161 -1058207 -2910085 -4479843 -4585477 -3644509
43021 -3644509 -3261379 -3552013 -2477592 836076 3736310 3176833 102838 -1906980 -1738313
43012 -1738313 -1510977 -2352381 -2678657 -1415181 164078 1046262 2051876 3258025 2704465
43003 2704465 -257615 -2954034 -3261045 -3150022 -5322554 -8185862 -7746299 -3543019 758570
42994 758570 2321106 1536369 -297370 -2422222 -3458296 -1948328 1106594 2864779
42986 2864779 2496306 1806130 1396277 -563700 -4241465 -6038309 -3195228 1760828 4024033
42977 4024033 2371051 -797399 -3823884 -6748571 -8549658 -7320311 -3883737 -1794148
42969 -1794148 -2282382 -2274791 383847 2573102 177484 -5010365 -6930851 -3704826 -138784
42960 -138784 -408712 -2227895 -1205301 2073949 3478400 2225031 1600562 2769362 2598001
42951 2598001 -663284 -3530103 -2042409 2275311 4432439 2374922 -1662571 -5146461
42943 -5146461 -7460851 -8438884 -7611818 -5461377 -3393753 -1989155 -766476 260345
42935 260345 400097 -256087 -726217 -587336 -196671 349786 1013727 961574 -273604 -1140307
42925 -1140307 225226 2723115 3158229 699566 -2028018 -2976889 -3206992 -4123751 -4584154
42916 -4584154 -2774543 469626 2242102 1015022 -1657688 -2620489 40958 4952085
42908 4952085 8232299 7380070 4154670 2110819 1763840 552814 -2549182 -5419757
42900 -5419757 -6354862 -6101250 -5274082 -3070347 -155360 648026 -1118421 -1715164 1106477
42891 1106477 3805308 2289660 -1265225 -1514215 1896297 4332247 3659644 2635596
42883 2635596 3399076 4278310 3464501 2011001 1409788 1223595 878870 1300209 3027108
42874 3027108 4633040 4444086 2331173 -951524 -4430373 -6423472 -5631502 -3481773
42866 -3481773 -3089627 -4971597 -6149161 -4583959 -2010677 -933082 -1261709 -1785783 -2758144
42857 -2758144 -4718426 -6357695 -5904050 -3709639 -1609145 -480007 80524 443786 542885
42848 542885 47119 -1655291 -4341720 -5534293 -2591303 2826688 5334673 2729302
42840 2729302 -770877 -941121 -33869 -2668894 -7590833 -8932266 -5138654 -1215674
42832 -1215674 -1150736 -2927565 -2996101 -1498630 -236532 1307104 4498467 8071732 9369091
42823 9369091 8062299 5984640 4040492 1819987 -209593 -719866 151520 654200 -73700
42814 -73700 -1253329 -2567998 -4981254 -8540321 -11102426 -10642203 -7760465 -4650407 -2486837
42805 -2486837 -1170823 -811009 -1675215 -2894692 -2908028 -1348940 936548 3745189 7502539
42796 7502539 11025128 11667040 9092628 6765573 7454354 8867266 6650289 911638
42788 911638 -3499418 -3375174 -682397 1149801 1575677 2003636 2865213 3556810 3727377
42779 3727377 3020793 1050199 -967373 -474628 2652016 4541557 1984368 -3007176
42771 -3007176 -6066733 -6345503 -6056169 -5279900 -1679124 4216433 7778142 6120461 1890417
42762 1890417 -847329 -1706733 -2554255 -3446587 -3074487 -1762213 -873960 -5127 2109858
42753 2109858 4082981 2588934 -2463624 -6305536 -4748359 526933 4249081 4109039
42745 4109039 2706007 3074103 4616102 4581039 2102478 -835405 -1979002 -994749 867370
42736 867370 2128488 1890229 319277 -1231272 -1350075 -252154 288485 -1009232 -3627837
42727 -3627837 -6157913 -7530822 -7106290 -4912170 -2510231 -2171789 -4005991 -5192657
42719 -5192657 -3535179 -603407 426266 -966836 -2664945 -3437619 -3971967 -4611594 -4668888
42710 -4668888 -4354425 -4986638 -6543613 -7141417 -5866405 -4202246 -3640199 -3695589 -3413700
42701 -3413700 -3085056 -3162962 -3083635 -2570876 -2616808 -3636692 -4062191 -2525602 -282606
42692 -282606 411146 -510127 -1149693 -388386 1290744 3062485 4142884 3583572 1562790
42683 1562790 331356 1780061 4353396 4634658 2080240 -137693 469206 2683426
42675 2683426 3921755 3608236 2791705 1915918 675911 -743745 -1821732 -2663074 -3607104
42666 -3607104 -4253205 -3993106 -3184918 -2648750 -2203593 -950609 929851 1917673 1102510
42657 1102510 -634253 -1938127 -2554274 -2859973 -2728684 -1988945 -1441335 -2009284 -2949931
42648 -2949931 -2328648 347146 3152459 3916247 2326066 -535203 -3320509 -4306585 -1945284
42639 -1945284 2721106 5527773 3390869 -1556886 -4304145 -3044130 -442343 974224
42631 974224 1634410 2496144 2932588 2557056 2488862 2959522 2148798 -410004 -1777174
42622 -1777174 113290 2265405 422253 -4247310 -6381106 -4030979 -895999 -323796
42614 -323796 -966809 65245 2933514 5845723 7506621 6898752 3062073 -2670694 -6294285
42605 -6294285 -5443793 -2454587 -796080 -316606 980579 2122576 253849 -3796856
42597 -3796856 -5342592 -2365028 1353987 1445635 -1644878 -4687389 -6485050 -7713875
42589 -7713875 -7800894 -5503477 -1999123 -84466 -102176 432192 2614022 4379741 3956220
42580 3956220 2397114 1147549 -441358 -3060154 -5048138 -4783118 -3988936 -5574518
42572 -5574518 -8883106 -10238808 -8184190 -5127351 -3291851 -2020412 -253749 1024977
42564 1024977 668362 -276044 -123751 756741 662305 -777599 -2186134 -2278248 -1054649
42555 -1054649 470840 1130424 719441 415369 1130424 1674828 379778 -1584534 -1331702
42546 -1331702 745599 703352 -2495603 -4184578 -899474 3477384 3143502 -608773 -1459739
42537 -1459739 2091247 5171250 5093588 5105744 7636927 9646332 8128576 5516617 5311744
42528 5311744 5942144 3819626 64684 -1007284 1019145 2172042 782567 -48905
42520 -48905 2065252 4729826 4270160 628199 -3392576 -5836870 -6395298 -4950504 -1844390
42511 -1844390 772868 110157 -4051389 -8465511 -9515634 -6872561 -3742494 -3624339
42503 -3624339 -6878091 -10354723 -10474118 -6812319 -2470277 -734730 -1830663 -3483703
42495 -3483703 -4022513 -3512329 -1906801 1734743 6809129 9804812 8010579 3851153
42487 3851153 2440243 4575336 5518331 2057464 -2631493 -3841077 -2258005 -2217751 -4575866
42478 -4575866 -5672461 -3419436 -457180 -83634 -1996431 -3538892 -3078748 -924366
42470 -924366 1473999 2395575 1431082 604577 2218625 5482802 7455295 7383946 7273674
42461 7273674 7685692 6405539 2738205 -152170 538510 3275625 4822027 4692608 4566111
42452 4566111 5133201 5951081 6860771 7355472 6099206 3057749 299880 -1224098 -3290412
42443 -3290412 -6422643 -7278203 -3605506 807085 741631 -2656886 -3843684 -1702829 -713155
42434 -713155 -2920858 -4557810 -2666483 -83121 -632437 -3073079 -3543094 -1672698 -502294
42425 -502294 -1329932 -1919631 -3290 3582330 5854795 4863424 1691470 -426576 734686
42416 734686 3993628 6043162 5062521 2227322 -245942 -1339622 -1337649 -932583 -782894
42407 -782894 -1208471 -1934148 -2460678 -2491844 -1651858 441347 3117176 4723903 4740961
42398 4740961 4499686 4618853 3655168 1234833 223293 2702386 5843506 5828690 4299513
42389 4299513 5880341 9958428 10738984 6269666 1663169 1381125 3608172 4931017
42381 4931017 5500080 6039531 4468785 1330 -3225283 -1617218 1713895 1474026 -1358668
42372 -1358668 -1194677 3212979 7066134 6788277 4012798 1614540 125355 -701268 -403783
42363 -403783 705130 1444175 2188439 4597054 7922524 8535948 4725429 -439097 -2830690
42354 -2830690 -2036050 -672774 -386215 -420335 447731 2093435 3293647 3198519 2399842
42345 2399842 2347552 3507252 4707441 4891436 4626223 4834515 4994723 4094394 2544126
42336 2544126 1353732 85273 -2305546 -5048487 -6305605 -6243985 -6919220 -8749206 -9521216
42327 -9521216 -7766601 -5027803 -3580750 -3550812 -3612483 -3356396 -3567574 -4675788 -5935081
42318 -5935081 -6073929 -4447534 -1700478 760687 2127606 2605906 2320605 895206 -1236639
42309 -1236639 -2522341 -2456287 -2480683 -3150658 -2365032 1046338 3862541 2272948 -1941140
42300 -1941140 -3354726 -914217 717022 -1136311 -2976791 -1270703 1356575 34500
42292 34500 -4771226 -7983983 -7345780 -5981121 -6893905 -8294719 -6596925 -2455291 -959123
42283 -959123 -5027193 -10586684 -10800603 -4812484 764233 307440 -4028909 -6649361 -6612304
42274 -6612304 -6995220 -8114492 -7049414 -3800899 -2139301 -2998489 -2420207 1611359 5185682
42265 5185682 4397940 1093866 -710581 -509739 112362 1170942 2692805 2471447 -494414
42256 -494414 -2904541 -1572618 1502339 2599707 2216371 2869051 3429771 1150337 -2381714
42247 -2381714 -3210509 -2024446 -3201165 -7074069 -9248310 -8151567 -7179590 -8002799 -7691949
42238 -7691949 -4720299 -2316834 -2858299 -3723044 -2180613 -329356 -1393808 -4343352
42230 -4343352 -5933006 -5575107 -4787184 -4029677 -3267177 -3545565 -4879963 -4625328 -1175809
42221 -1175809 2625546 3131683 1177694 108427 57411 -1680903 -5297296 -7699484 -7349968
42212 -7349968 -6223003 -6171752 -6396089 -5555200 -3969600 -2706724 -2360879 -3368480 -5642334
42203 -5642334 -7371531 -6246500 -2695594 -18282 -328925 -2099311 -2858991 -2649868 -3106838
42194 -3106838 -4163582 -3716578 -723637 2753470 3475946 716016 -2765185 -3922382
42186 -3922382 -3088557 -3201564 -5303064 -6677467 -4748714 -1191404 78289 -1849737
42178 -1849737 -4204593 -4855192 -4492558 -4059108 -2999911 -1527469 -1957570 -5379353 -8742077
42169 -8742077 -8002574 -3355183 1182673 2905709 2586713 1753229 807866 505154 2273682
42160 2273682 5422873 6578415 4202912 1616391 2622655 5680515 6040044 2982434
42152 2982434 709111 1450836 2115131 -79179 -2538144 -1384362 2020334 2781226 -520231
42143 -520231 -4430146 -5808907 -4769606 -2337331 1290473 5270582 7717370 7855833
42135 7855833 6671957 5189896 4151255 4899573 7542305 8654893 4842485 -1195093
42127 -1195093 -2899607 755949 3450257 1414265 -589785 2549794 7201562 6143200
42119 6143200 -400875 -5417746 -5271524 -2981574 -1859187 -1839090 -2591598 -4799437 -7109269
42110 -7109269 -6481240 -2994196 -287778 -82604 -266174 499382 633065 -324948 61076
42101 61076 2571510 3970655 1864977 -1503859 -3010144 -3009769 -3214348 -3283563 -2551162 -2374398
42091 -2374398 -3628183 -4340758 -2909103 -1201388 -1237439 -1301882 982558 4002762 4616197
42082 4616197 3372313 3022952 3369426 2145302 -3891 -152209 1754993 3056176 3601852
42073 3601852 6015967 10201094 12390928 10989289 8959328 8675575 8508663 6685007
42065 6685007 4700766 4144169 3351133 370190 -3126850 -3969581 -1814938 1317723 4289896
42056 4289896 7022435 8721706 8510181 7036592 5405786 3422530 776092 -1211690
42048 -1211690 -1176777 -16923 617036 1138999 2865958 4837093 4635099 2246199 381247
42039 381247 590068 1492774 1546643 1345931 2057411 3264628 3669348 2919251 1722491
42030 1722491 838313 628079 939885 902131 -498464 -3079345 -5198110 -5260902 -3150215
42021 -3150215 14303 3033272 5298400 6684594 7023527 5753332 2590791 -1135955
42013 -1135955 -2794082 -1319263 744614 -258228 -4430989 -7779540 -6984302 -3362421
42005 -3362421 -1023762 -1973388 -4287761 -4891410 -3084114 -990481 -927012 -2773273 -4299566
41996 -4299566 -4103618 -3455184 -4450658 -6907364 -8401174 -7316442 -4415414 -1087403 2349584
41987 2349584 5678755 7489447 6359764 2808298 -1092069 -3674445 -4324904 -2810549
41979 -2810549 581522 4265413 6067096 5262081 3311411 2347467 3305281 5316446 6258286
41970 6258286 4240767 -315459 -4144194 -4100566 -1109938 288444 -2655350 -7168984
41962 -7168984 -8170452 -4524263 -171547 1069927 -166906 -711978 483154 1566471
41954 1566471 1208931 619367 1312614 2462900 2152405 653905 523886 2922554 5417323
41945 5417323 4758545 1042810 -2437692 -3363397 -2840321 -3219912 -4898924 -6401965 -6697620
41936 -6697620 -5949128 -4331756 -1734878 1059510 2320502 1294432 -710053 -1934075
41928 -1934075 -2129293 -2172528 -2581797 -3491425 -5352466 -8142511 -10165875 -9319067 -5824877
41919 -5824877 -2267444 -481037 168695 818126 1082758 252767 -817687 -721489 317707
41910 317707 920254 755843 603843 438640 -792209 -3340168 -6146172 -8284274 -9359983
41901 -9359983 -8527617 -5307576 -1835031 -1634134 -4695308 -6281300 -2980858 2143863
41893 2143863 3667765 1714874 1694545 5983683 9995384 8339732 1818498 -4189884
41885 -4189884 -6188863 -4748429 -1783055 1263025 2962169 2484481 1069149 889746
41877 889746 2030685 2344086 722221 -1210590 -1275449 888469 4159634 7084881 8086572
41868 8086572 6242999 2852165 711986 857484 1624745 1971476 3470224 6954834 9318540
41859 9318540 6904054 1079899 -3076360 -3532405 -3152083 -4150169 -4482405 -1795699 2104511
41850 2104511 3773551 3286749 3629199 5673094 6876080 5196758 1686463 -1617788
41842 -1617788 -4262894 -6593580 -7978065 -7550592 -6111954 -5619395 -6520310 -6828885 -4743992
41833 -4743992 -1535836 -421119 -2299346 -4135369 -2896440 47524 661912 -1978064
41825 -1978064 -4460913 -4336588 -3688994 -5397932 -8280394 -8974889 -7181234 -5564686 -4999330
41816 -4999330 -3561234 -713194 992090 -181226 -2327481 -2803553 -1723500 -546445
41808 -546445 837518 3020958 4322315 2083079 -3246130 -7686326 -8128565 -5629542
41800 -5629542 -3498475 -3150987 -2944639 -873318 2569546 4878282 4680041 3384583 3009841
41791 3009841 3234775 2039362 -1096394 -4403705 -6337965 -6973749 -6432874 -4067709 -302571
41782 -302571 2727088 3922788 4835598 6744906 7899933 6084748 2622572 980850
41774 980850 1913896 2709834 1238012 -1715540 -4349356 -5775144 -5616052 -3773544 -1230907
41765 -1230907 584262 1624510 2807501 3775103 3190926 1511636 997994 2220387 3014941
41756 3014941 2080901 1246015 2543286 5092885 6766100 7260206 7579782 7901243 7938196
41747 7938196 8219005 9050901 9302083 8104143 6599195 5951004 4888702 1748718 -2056904
41738 -2056904 -3555474 -2706315 -2311583 -3479766 -4360461 -3866263 -3382842 -3654282 -3152196
41729 -3152196 -1379507 -889849 -3397686 -6147166 -5400021 -2227357 -1331152 -4347204 -7652063
41720 -7652063 -7544744 -4782953 -2551777 -2079302 -2157172 -1677449 -637658 798059 2408486
41711 2408486 3137391 1783423 -1167131 -3573631 -3957616 -2829204 -1330557 237856
41703 237856 1702972 1980644 209295 -2624415 -4728453 -5937485 -7379566 -8611204
41695 -8611204 -7245125 -2581063 2169002 3199722 773251 -1359239 -805968 1121281
41687 1121281 1962873 1096215 -471315 -1753583 -2273729 -1949254 -1425589 -1813280 -3338095
41678 -3338095 -4843543 -5175731 -4330822 -2736058 -468504 1874570 2563287 447932 -3193109
41669 -3193109 -5882933 -6711638 -6500987 -5570630 -3305302 -333230 923377 -752614 -3175320
41660 -3175320 -3265096 -1020695 850560 1039581 1326758 3545921 6619588 7979706 6893387
41651 6893387 4819469 2988830 1333635 -126170 -517810 538509 2030094 2954744
41643 2954744 3814774 5711917 8446206 10418717 10127807 7152614 2275137 -2502025
41635 -2502025 -4773222 -3913026 -2129584 -1982760 -3072505 -2771209 -229705 2282182 2628784
41626 2628784 1510079 748270 518666 -9016 -408792 526501 2364241 3031681 1577355
41617 1577355 -520494 -1392983 -1085258 -1104307 -2274410 -3778142 -4267770 -3549203 -2909618
41608 -2909618 -3578084 -4995536 -5226316 -3323295 -586911 1048926 1246518 1212320 1996573
41599 1996573 3605532 5293176 5984439 4988443 3052873 1919997 1940053 1296541 -946938
41590 -946938 -2391165 -301879 3761016 5353092 3176556 467588 -297766 -554985 -1825207
41581 -1825207 -2224570 149876 2861296 1997197 -1766804 -3746246 -1744897 1416853
41573 1416853 2372869 1252496 275929 743596 2625608 5202852 6903284 6129830 3429089
41564 3429089 1441593 1662849 2695927 2826567 2759076 4184434 6770591 8358372 7579620
41555 7579620 4811597 1037956 -2744396 -5262430 -5637565 -4553639 -3721037 -3875173 -3974002
41546 -3974002 -2650866 -104579 1729524 1118615 -1172375 -2158258 -201736 2312556
41538 2312556 1765399 -1390621 -2834119 -687668 1589403 794155 -631958 1481932
41530 1481932 5799166 6858424 3177596 -792564 -1510042 -582119 -457324 -145200 1819293
41521 1819293 3408857 1776971 -1970328 -4094668 -3261443 -1324197 96787 1047868
41513 1047868 1865238 3012629 5778020 10412895 13918390 12621732 7114985 1845924
41505 1845924 -538905 -1528235 -2756254 -2920982 -485838 3082213 5136924 5352268 5192798
41496 5192798 4952164 3467643 325980 -3369982 -6212335 -7231970 -5953815 -3108410
41488 -3108410 -885953 -952692 -2261734 -2207694 -103939 1754177 934952 -2162766 -4791651
41479 -4791651 -4820483 -2719105 -721082 -296009 -618771 316665 3225822 6615048 8271202
41470 8271202 7061080 3346112 -1310531 -4521576 -4413003 -1508079 1521477 2751539
41462 2751539 2754643 2711151 2168517 219617 -2211753 -3352564 -3297604 -3518100 -3822896 -2339326
41452 -2339326 870444 2616439 492830 -3660203 -5858102 -4523185 -1486326 717005
41444 717005 1020231 -152900 -1400778 -886281 2251982 6609971 9396092 8870870 5564120
41435 5564120 1403406 -1533668 -1674454 1227695 5243034 7084722 4850099 59311
41427 59311 -3473298 -3024283 692863 4352778 5090594 2951316 501742 70155 1454854
41418 1454854 2474086 1560721 -742140 -3040038 -5115208 -7734352 -10513754 -11299243
41410 -11299243 -8684183 -4409497 -1744546 -1545133 -1670462 -911623 -1420498 -5250316 -9809139
41401 -9809139 -9775674 -3888276 2808552 4808001 2276161 -373633 -468485 766811 1390932
41392 1390932 1383150 1465570 1405449 928509 1120502 3188039 6065341 6846446 4271074 857273
41382 857273 444712 3741226 7454459 8362622 7137800 6756656 7727525 7128332 3133279
41373 3133279 -1574510 -2866929 -580620 1439747 524208 -1900443 -3150892 -2938176
41365 -2938176 -2823837 -3522119 -4495276 -5434748 -6295861 -6041728 -3196371 1734959 5668808
41356 5668808 5757756 2356414 -1384835 -2487360 -287719 3749104 7389963 8818626
41348 8818626 7377773 3844308 -13349 -2460020 -2723583 -1290985 500243 1384449
41340 1384449 1087734 410162 245823 662141 1251754 2135669 3849073 6051702 7190426
41331 7190426 6138983 3691525 1595223 338629 -1124217 -3344968 -5099914 -4774338
41323 -4774338 -2439564 215116 1804586 2367393 2522711 2305407 1471934 614913 972784
41314 972784 2657970 3794828 2421397 -943949 -3729107 -4354481 -3525838 -2142998 228142
41305 228142 3443543 5047680 2867884 -1375076 -3617641 -2546023 -630630 107326
41297 107326 442489 1101535 603444 -1987364 -4459431 -4164869 -1837755 -251384 -253776
41288 -253776 -652481 -1082005 -2226685 -3657659 -4178787 -4249626 -5461012 -7429167 -7773426
41279 -7773426 -5698714 -3271300 -2467107 -3067791 -4085027 -5009614 -4809226 -2044645 2626422
41270 2626422 5952472 5583037 2660034 -159837 -1668183 -1966059 -1153949 289058 1225615
41261 1225615 1408150 1997027 3277446 3512597 1689696 -288156 -265501 670758 -252209
41252 -252209 -3330146 -6172631 -7150302 -6758968 -5783619 -4338434 -2872519 -2177428 -2030969
41243 -2030969 -1405282 -374087 -462005 -2647388 -5897099 -7913925 -6909924 -3091136 1030890
41234 1030890 2643711 1738778 1068370 2080683 2730566 1136383 -595217 819812 4485228
41225 4485228 6296906 4825971 2593905 1267072 -651659 -4163166 -7096762 -6955620
41217 -6955620 -4193332 -1162554 257010 -1073618 -5307830 -10208474 -12168889 -10236242
41209 -10236242 -7268958 -5847978 -5328133 -4477422 -4358790 -6100208 -7908502 -7204612 -4450103
41200 -4450103 -2283107 -1915851 -2704311 -4065724 -5292130 -4619581 -1307026 2211460 3117580
41191 3117580 2360618 2858243 4236649 3304635 4271 -1427680 1118848 3831041 2311869
41182 2311869 -2079326 -4515943 -3596504 -2363729 -3002030 -4065409 -3742990 -3031865 -3972686
41173 -3972686 -6446540 -8523743 -9004580 -7934054 -5403871 -1950667 137712 -1461604
41165 -1461604 -5270763 -6425314 -2727333 1873639 2493111 283130 489757 4192454
41157 4192454 6434722 3649373 -1208892 -3303263 -2306311 -1032426 -296556 1040773
41149 1040773 2336097 1435820 -1481774 -3595273 -3333369 -2071871 -1640741 -2342557 -3721525
41140 -3721525 -5254672 -5972620 -5246198 -4181564 -4463624 -5660709 -5505462 -3140021 -407537
41131 -407537 425659 -1065917 -3365814 -3816063 -149993 6717926 11835680 10611025 4260193
41122 4260193 -1261342 -1874405 1165329 4232069 5094613 3478671 651849 -790634
41114 -790634 923408 4163625 5622967 4747272 3736816 3115825 974443 -2537673 -4009518
41105 -4009518 -1952733 514853 648681 304006 2053039 4051463 2648382 -1750997
41097 -1750997 -5280773 -6130089 -6072518 -6873635 -8062788 -8373855 -7369919 -5594297 -4288983
41088 -4288983 -4341913 -4655431 -2967696 684374 3320644 3203059 2197413 2068681 1318449
41079 1318449 -1448003 -3783362 -2756631 96410 1266335 1059897 2528838 5727274
41071 5727274 7552231 6796658 5072310 3131710 716445 -260330 2602305 6914029
41063 6914029 7041687 2146105 -2269297 -2570844 -1760368 -3343356 -5094667 -2916988 2290297
41054 2290297 5869555 5825097 4458727 4513692 6465485 9079004 10583133 9757357 7231826
41045 7231826 5043921 4097729 3249950 1562859 -183918 -966162 -667635 844621 3525324
41036 3525324 5363654 3634712 -920276 -4238195 -4740583 -5526898 -8636816 -10950900
41028 -10950900 -9182970 -5592419 -4385723 -4945729 -3625508 -812731 -758911 -4264244
41020 -4264244 -6571815 -4100404 489264 2072484 -525860 -3955044 -4857219 -3255654
41012 -3255654 -1699425 -1925517 -2920768 -2816310 -2155421 -3283703 -6080247 -7064298 -4456014
41003 -4456014 -1408488 -1512782 -3425151 -3345504 -987365 823334 1248192 1916403 2890316
40994 2890316 2427542 802735 266755 850704 281521 -1306928 -834684 2325353 4525362
40985 4525362 3241295 601980 -556668 -716760 -1357687 -1760599 -873096 291095 884150
40976 884150 2378821 5453904 6928609 3395930 -3297340 -7579552 -6713213 -3128485
40968 -3128485 -582448 -452281 -1704664 -2388324 -1027107 1965482 4411171 5000545 4976866
40959 4976866 5786291 6234678 4181765 402410 -1735306 -585711 1870120 2930110
40951 2930110 2300515 1551829 1566147 1415186 -477550 -4363247 -8412803 -10229749 -9105390
40942 -9105390 -6185446 -2648323 920895 3299415 2862905 86480 -2009932 -1321265
40934 -1321265 963896 2754780 3987052 5400179 6261648 5639417 4468839 3925843 3110946
40925 3110946 910567 -1317492 -1926526 -2364325 -4651233 -6653136 -4546237 131185
40917 131185 1060135 -3906441 -9174030 -9126958 -5126900 -1615414 971061 4977598 9585128
40908 9585128 11036405 8417286 5190749 4465771 5766929 7124689 7699209 7316323 5597226
40899 5597226 3023250 1566355 2822792 5906445 7990151 6897149 3090287 -595284
40891 -595284 -1303745 1309497 4977490 7401896 8216524 7869547 5833528 1665183 -2683738
40882 -2683738 -3846428 -978594 2885607 4355087 3354709 2201987 2047978 1817568
40874 1817568 437942 -1447155 -2549472 -2726176 -2799191 -2996265 -2575335 -1203237 106496
40865 106496 115316 -941488 -1564406 -869043 513610 1585676 2207145 2674114 2765752 2006486
40855 2006486 554443 -926708 -2147780 -3258013 -4077488 -4009773 -2978262 -1945718 -2105773
40846 -2105773 -3671724 -5616927 -6558186 -5902501 -4236182 -2628688 -1648797 -1252214 -1445770
40837 -1445770 -2394329 -3628850 -3869628 -2326387 175800 2002108 2367406 1605265 202933
40828 202933 -1485953 -2697680 -2505132 -948624 750784 1348533 432823 -1768972 -4469166
40819 -4469166 -6065288 -5059142 -1954451 746491 1362497 1000728 1571818 2654938 2099977
40810 2099977 -355010 -1999324 -500696 3011890 5347511 4877225 2601743 285542
40802 285542 -984791 -565427 1736110 4756857 6248083 5041409 2410664 565348
40794 565348 360396 1257674 2782164 4615015 5549639 4154495 1021739 -1202388 -1110392
40785 -1110392 -640413 -2443185 -6020460 -8335756 -7930362 -6328203 -5032508 -3355638
40777 -3355638 -469251 2233329 2844787 2063472 2421341 4538288 6132674 5209328 2651495
40768 2651495 893689 1134211 2589520 3662070 3221095 1437998 -167543 -204608 780962
40759 780962 875559 -588838 -2199028 -2581288 -1781816 70301 3338408 6651822 6402649
40750 6402649 1227208 -4449447 -4752568 83259 3838228 2385577 -1633588 -3339327
40742 -3339327 -1727319 740395 2263746 2863260 2701798 1635700 142356 -707395 -24507
40733 -24507 2402799 5161302 4742470 -1279495 -9402019 -11743974 -5226286 3324941 4814804
40724 4814804 -1252389 -7650347 -9773992 -9866433 -10675008 -10419179 -6601472 -903621 2972338
40715 2972338 4082572 4129830 4286965 4655978 5622425 7305644 8297419 6906433 3366381
40706 3366381 -441725 -2932418 -3586544 -2735601 -1578140 -1414540 -1977617 -1719028 -513439
40697 -513439 -336258 -2121340 -4017641 -4492196 -5009446 -7164463 -9018992 -7452898 -3078390
40688 -3078390 463283 1585380 1864975 2185496 1259235 -1170641 -2669933 -1172165 2285476
40679 2285476 5151137 6207583 5984292 5718333 6540803 8399517 9510950 8364068 6223961
40670 6223961 5600092 6216818 5273277 2379874 1064607 3561905 6816566 6249052 1697252
40661 1697252 -2977053 -4891368 -4150041 -1816339 1249517 3590353 3664865 1766807 -104081
40652 -104081 -637142 -256358 313934 1185873 2625700 4206225 5077988 4645083 2949528
40643 2949528 700619 -1366784 -3366190 -5732582 -7520671 -6608860 -2603448 1854569
40635 1854569 4193847 5018518 6133422 6730435 4481832 126590 -2332948 -988218
40627 -988218 1177966 603471 -1729907 -1726749 2188264 7000377 8715777 6561541 3065359
40618 3065359 746197 -437061 -2093609 -4356070 -5056382 -2734795 578572 1345940
40610 1345940 -920240 -2981527 -2152030 572728 2508745 2705849 2057761 1329088 713313
40601 713313 569656 998906 1103721 127687 -913903 -207108 2161858 3799954 2809311
40592 2809311 207576 -998978 1038404 4911622 7063570 5508226 2568828 2802533
40584 2802533 7391170 11859627 11069008 5653328 1142200 745467 1773883 321437
40576 321437 -3107161 -4996461 -4215176 -2986141 -2786342 -2297919 -342941 1622390 1734113
40567 1734113 856507 1320389 3190846 3962178 2137494 -669888 -1821683 -523287 2052829
40558 2052829 4304871 4977343 3463695 609019 -1272513 -313157 3104645 7114722
40550 7114722 10419513 12667320 13382931 12002643 9086329 6290244 4720242 4023822
40542 4023822 3226416 1692288 -760095 -3716549 -5907062 -5997609 -4037314 -1518460 146783
40533 146783 629637 344505 4523 336321 1167117 1086274 -574894 -1821529 -176484
40524 -176484 3191816 4233444 1742819 -611354 275286 2373468 2208332 688020 1292134
40515 1292134 3651198 3477093 -647947 -4552174 -4278562 -1447862 -442958 -2419256
40507 -2419256 -4860894 -5997245 -6838630 -8549090 -9828044 -8136409 -3055706 2428367
40499 2428367 4429189 1957657 -2133157 -4153052 -2968863 -120252 2367738 3240299
40491 3240299 2077835 -206642 -1411425 -335847 1260749 797771 -1348266 -2382548
40483 -2382548 -1271967 211845 890407 1633263 2464836 1330273 -2404663 -5885983 -6491760
40474 -6491760 -5376545 -4803571 -4102363 -1517105 1377999 874361 -3381191 -7274828 -7198737
40465 -7198737 -3817947 -268821 1472651 1595017 1085376 232476 -1589270 -4412720 -6253391
40456 -6253391 -4919383 -1696320 -614535 -2516454 -2923444 1347681 6468515 6727327
40448 6727327 3014743 859360 1384377 497683 -2850208 -4321981 -1884000 420102
40440 420102 -650259 -2521437 -2413849 -2631270 -5370362 -6877488 -2915090 3081770 3960013
40431 3960013 -581425 -3844791 -2260663 452423 124238 -2297709 -3879041 -4155638
40423 -4155638 -4258486 -4587970 -5165200 -6056677 -6400928 -5191420 -3474170 -3175571 -3490012
40414 -3490012 -1634666 2181042 4085816 2135598 -726502 -890155 1776304 5576589
40406 5576589 9575350 12563642 12608316 10134196 8735705 10348913 12160484 10955034
40398 10955034 7920451 6074682 5372034 3945718 2294762 2428398 4099137 5387700
40390 5387700 5903273 6081225 4750370 1268557 -1222130 787544 5142147 6236355
40382 6236355 3278666 1259848 2808216 4284128 2056168 -1988149 -4142768 -4333876
40374 -4333876 -4564918 -4845427 -4096113 -2975802 -2621617 -2283587 -1118783 -655478 -2409103
40365 -2409103 -4489085 -3869529 -1101372 491143 -232103 -1279384 -1372430 -1534615 -2379922
40356 -2379922 -2681136 -1620574 -257076 308339 528715 1219612 2121650 2463787 1899207
40347 1899207 327518 -2209426 -4993828 -6853703 -7194206 -6097187 -3603970 -73272
40339 -73272 2871312 3272395 1141206 -1255771 -1738035 -13624 2740955 4910563 5061107
40330 5061107 2865128 -328131 -2855468 -4612217 -6422425 -7858215 -7361228 -4611850
40322 -4611850 -1148176 1537492 2943027 2656101 557034 -1801641 -2210546 -798561
40314 -798561 121578 -196839 148485 2023101 3300234 2436280 1411693 2520957 4239244
40305 4239244 3373570 166540 -1907262 -1097396 734139 1435560 1318962 1746187 2626790
40296 2626790 2443031 293957 -2553575 -3382460 -940974 2492854 3486197 2145116 2109226
40287 2109226 4809295 6652891 4361934 488024 34147 3264757 5849934 5265088
40279 5265088 2981742 694975 -1314528 -1792420 1053267 5534270 6923275 3638105
40271 3638105 -467492 -1720095 -1118436 -1207204 -1856330 -1738566 -1105225 -350688 1562578
40262 1562578 4381819 4801325 744475 -4561133 -6159481 -3499749 146715 2821482
40254 2821482 4982486 6732885 7579270 8216532 9209994 8714508 5047253 781036 266365
40245 266365 3279081 5250038 4057373 2324375 2147392 1937815 267847 -1074583 -292066
40236 -292066 1282704 1692725 1329078 1069286 113205 -1704779 -2041018 297281 1944634
40227 1944634 -963225 -6541727 -8980384 -6440461 -3307301 -3697063 -6004633 -5800931
40219 -5800931 -2035939 1962930 2970039 1385952 -59209 104498 881970 992159 841128
40210 841128 1254358 1259262 -755005 -3690667 -4067050 -768673 2822708 3294662 1894532
40201 1894532 2247065 4695291 5950891 4027687 514801 -2455189 -4680802 -6311143
40193 -6311143 -6396418 -4884298 -4195733 -6396757 -9600601 -9564047 -4996579 659271 3383604
40184 3383604 2918961 1877337 1893065 2603019 3938566 6862545 10787068 12357950 9028709
40175 9028709 2963812 -907778 -538936 1672699 2911081 2962366 2630406 1976953 1750809
40166 1750809 4067272 9192333 13355284 12613692 8111088 4845920 5492472 7851557
40158 7851557 8470800 6534714 3691280 1808003 1536599 1985890 1616692 270979 -274569
40149 -274569 977283 2031152 550443 -2062641 -2095961 1002379 3584501 2834119 -38724
40140 -38724 -2602481 -4250019 -4797414 -2784516 2285112 7652627 9715602 7973196 4892010
40131 4892010 2698924 1759204 1241111 62323 -1995406 -3266459 -1718227 1612570
40123 1612570 2825124 388213 -2192035 -1379745 919258 249077 -3506135 -5973645
40115 -5973645 -4533466 -1011652 1881042 3205307 2514260 -361124 -3189798 -2502631
40107 -2502631 1491860 4216184 2828152 173170 395837 3182809 5095418 4607470
40099 4607470 2860552 875727 -908966 -1187175 1082309 4242973 5186466 3179503
40091 3179503 468346 -906871 -1029950 -881072 -967573 -1233009 -949941 899493 3701368
40082 3701368 4626352 2067718 -1350868 -2004700 -679196 -1105007 -3277180 -2792513 1783475
40073 1783475 5374907 3159687 -2495869 -5425902 -3649483 -292676 1752515 2078043
40065 2078043 442048 -3730267 -9007477 -12169668 -11612940 -8561365 -4825419 -1534920
40057 -1534920 51828 -856745 -2869469 -3762705 -3770883 -4847191 -6475740 -5700643 -2366338
40048 -2366338 -585623 -2755702 -5360913 -3807880 1018886 4517205 4890531 4007144
40040 4007144 2696009 -444675 -4957164 -7081335 -4230306 1553770 6429988 9177287
40032 9177287 10853874 11500298 9721449 5464452 1154999 -747422 -247020 869198
40024 869198 1289607 658868 -1477022 -5274642 -8816607 -8902307 -5178765 -1773617 -2501103
40015 -2501103 -5793998 -7518460 -7817511 -10616992 -15819546 -17327491 -11668573 -4031737
40007 -4031737 -1395609 -3083613 -3341524 -810673 749644 147062 462467 2384484 2366802
39998 2366802 -320295 -705288 4017361 8697724 7117636 1186891 -1938220 241796
39990 241796 3786843 5376198 5888123 6600813 6529242 5141940 4277457 5314830 6665431
39981 6665431 5941770 3215994 655359 -133797 697202 1985943 2655043 2478350 2196382
39972 2196382 2567686 3321431 3519390 2687761 948428 -1467502 -3878936 -4927968 -4059667
39963 -4059667 -2816575 -3087572 -4353367 -4513117 -3342289 -2825909 -3531879 -3179031 -350419
39954 -350419 2424493 1636644 -2182400 -4854160 -3850026 -1030445 381325 -357981 -1796780
39945 -1796780 -2890671 -3505115 -2990530 -443668 3146857 4931038 3645083 1598736
39937 1598736 1467773 2247474 903589 -2414102 -3978954 -2023352 518480 584731 -563536
39928 -563536 -106559 1571530 2397825 3118230 5965137 9504246 9596208 6150754 4215686
39919 4215686 6482059 9060185 7724369 4648639 4738294 7669824 8401506 4859516 597249
39910 597249 -692281 446540 1414975 979693 -886758 -3848926 -6124019 -4877398 95809
39901 95809 4735552 5070074 2103912 92477 770132 1892296 1393195 291601 562709
39892 562709 2159627 3483697 3485183 2043662 -606017 -3365878 -4023052 -1260030 3207423
39883 3207423 5943347 5360761 2830597 307159 -1581848 -2678086 -2271187 -220085
39875 -220085 1987499 2863099 3194637 5200216 9269926 12775278 12718121 8944930 4182660
39866 4182660 1136169 10437 -950620 -2695892 -3797996 -2318794 1155852 3742577
39858 3742577 3931849 3514467 4661254 6396737 5912564 2751369 -529431 -1878061 -1699313
39849 -1699313 -773715 1421590 4899645 7520784 7189550 4768681 2970304 2960234 3882907
39840 3882907 5290138 7802613 11036209 12979363 12518121 11113098 10682744 10864874 9833059
39831 9833059 7236997 4801441 4058335 4758432 5700971 6028300 5388676 3850282 2176871
39822 2176871 1374226 1444749 1343032 638222 305409 1219338 2911535 4763864 7230421
39813 7230421 10310871 11807867 9361955 4042702 -327745 -1726167 -1635621 -1673685 -994919
39804 -994919 1538574 4715810 6538583 7051008 7590643 8228746 8017672 7104201 6508878
39795 6508878 6110614 4814315 2706601 1303048 1492956 2655210 3846156 4529724 4245890
39786 4245890 3037756 2191794 3075155 5193900 6814733 7438941 8079240 9115145 9648713
39777 9648713 9150543 7921638 5691383 1869450 -2154016 -3184998 -97383 4101174
39769 4101174 5649126 4355073 3006036 3269543 3935725 3282710 1846434 1964182 4685987
39760 4685987 7905901 8507633 6304011 4334490 4555667 5172097 3991740 2465080 3387563
39751 3387563 5839254 6226395 4153292 3215634 5213958 7484085 7400919 5889812 4650871
39742 4650871 3493829 2742756 4690749 9525489 12914683 11356682 7516137 6350571
39734 6350571 7957054 8552619 7154717 6617426 8375293 10585183 11998618 13824954
39726 13824954 16691094 18852438 18665328 16588734 13954983 11752769 10988824 12118055
39718 12118055 13794908 14263608 14072692 15157924 17314430 18282366 17469088 16558341 15932239
39709 15932239 13822944 10183806 8073779 9183228 10723255 9222671 5421857 2874526
39701 2874526 3050596 4220326 4386495 3259678 1805007 1510218 3700143 8055092 11990310
39692 11990310 12748173 10142764 6557910 4527221 4934847 7115797 9808765 11939963
39684 11939963 12895764 12313891 10121818 7265040 5755467 6797118 8992418 9572675
39676 9572675 7463158 4223365 2232555 2983374 6487940 10708296 12148517 9174873
39668 9174873 4564088 2492887 3131531 2912735 336734 -1711335 -467922 2990998
39660 2990998 6270630 9212442 12707527 15982981 17440797 17008643 15902257 15148030
39652 15148030 15579270 17797721 20852011 22600151 22690297 23391349 26190373 29753235 32893435
39643 32893435 37183904 44406952 53412407 61740647 68597891 74466711 80215981 88544546
39635 88544546 103129588 123927628 147677184 176900637 222286417 286982833 350562380
39628 350562380 379480418 357535200 300220178 236840133 185238892 147212792 119879442
39621 119879442 101809268 90091985 79974157 69679217 61508569 56871536 53273582
39614 53273582 47386167 38851528 30008245 23375985 20081303 19522486 19917058 19728078
39606 19728078 18630754 16842193 14353958 11680056 10350487 11231723 12973901 13525982
39598 13525982 12659669 11613697 10904984 10206312 9894781 10700320 11911422 12035169 11520599
39589 11520599 12620239 15650019 17396683 14838479 9208962 4664971 3515081 4281369
39581 4281369 4254415 2551490 435821 -281499 1343186 4809997 8310182 9694370 8001542
39572 8001542 4390533 1446933 1193516 3449373 6130386 7323733 6994720 6496686 6751627
39563 6751627 7529622 8349391 9146084 9808139 9981319 9766655 9620219 8985099 6395544
39554 6395544 2204705 -189102 1945555 6445665 8398602 6501604 4350329 4710392
39546 4710392 5815469 5285829 4695683 7041499 11512372 14262407 13484839 10485951 6436372
39537 6436372 1671094 -1886486 -1487975 2336390 5714175 6572168 6805307 8237169 9816717
39528 9816717 10573143 12026292 15223315 18219511 19160926 19297459 20161384 20414702 18797225
39519 18797225 17611377 19191312 21045317 19365890 16071460 16910305 22611855 27391549
39511 27391549 27376175 25353100 24950498 24741501 21526423 16133644 12108400 10545941 9727252
39502 9727252 8835085 8890647 10253715 11631576 11721917 10268230 7639345 4735705 3030612
39493 3030612 3264537 4108247 3360111 747928 -1258209 164879 5123098 10375759 12009772
39484 12009772 9195775 5108559 3564185 5177014 7729405 9583872 10964876 12207215
39476 12207215 13051731 14067662 16445507 19496806 20648000 19287236 18485713 20998596
39468 20998596 25212032 27180231 25515534 22191198 19450129 18093042 18188400 19199358
39460 19199358 19554603 18180140 16597439 17562866 21208448 24361596 24523962 22963783
39452 22963783 22576815 23801216 24537015 24059424 24986716 29850824 36619969 39901088 37239091
39443 37239091 32320420 30444513 32365359 34782016 35706403 36217844 37044038 36849542 35032161
39434 35032161 33334731 33035079 32897310 31686343 30527173 30730865 31250939 30568654 29351984
39425 29351984 28793878 27985406 25845045 24333646 26338574 30845586 33587963 32743608
39417 32743608 30999763 31358511 33636756 36105142 38127363 39712873 40309156 39694608
39409 39694608 38949189 39118792 39591837 38943375 37038826 35473738 36015269 38966693 42941908
39400 42941908 46150356 48028988 49439980 51130586 52584786 52873148 51958110 50416115
39392 50416115 48503704 46334816 44281242 42205722 39071051 34579793 30529417 29018987
39384 29018987 29676107 30157734 29232733 27976846 27938173 29289188 30787840 30799698 28883855
39375 28883855 27233315 29488706 36573356 44539374 48298419 46756359 42442025 37162354
39367 37162354 30841117 24322411 20109316 19336530 20150495 20010273 18104265 15211012
39359 15211012 12877811 12832837 15204308 17157734 15508010 10988381 7592452 7292672
39351 7292672 8029477 7632405 6849775 7112538 7895297 8102699 8021031 8171146 8021481 7352638
39341 7352638 7041999 7079975 5979718 3826946 3453955 6251447 9126936 8580779 5910190
39332 5910190 4906618 5733097 5102001 2197741 243188 1223555 2703121 1893926 228889
39323 228889 1248702 5340892 9291882 10878566 11564023 13799059 17252376 19241736
39315 19241736 18269562 15466310 12528724 10118214 9014939 10710388 15029545 19023194
39307 19023194 21008483 24419161 33985169 48351100 60389259 65328276 64525293 60313646
39299 60313646 52217829 41057060 31985509 28764929 28087384 24461347 18502310 15187988
39291 15187988 15401028 15005685 12219934 10227122 11201264 12596828 11403389 8208767
39283 8208767 4887953 1603527 -1554807 -2784883 -998157 1961172 3648314 3844521
39275 3844521 3361377 2067163 166761 -334901 2242364 6801348 10937891 13593711
39267 13593711 14546211 12914280 8640451 4431817 3515786 5564923 6999807 5527697
39259 5527697 2646088 1261255 2159364 3451168 2915669 548839 -1206802 -95509
39251 -95509 3154455 5544368 5404918 3988678 3126589 2970869 2910783 2998102 3204861 2872448
39241 2872448 2303713 3200934 5848279 7712215 6985746 5617124 6060096 6904232 5481225
39232 5481225 3485271 5199398 10038225 11938094 7904871 2734043 2372535 6054143
39224 6054143 8516447 7540329 5411979 4245901 3641322 2693740 1240274 -926536 -3467737
39215 -3467737 -4130160 -638219 5664184 10472661 11399892 10068497 8905518 8298438 7829081
39206 7829081 7819392 8052887 7018733 4392628 2710358 4406067 8200444 10582949 10288904
39197 10288904 9228981 9238076 9970513 10257886 9759642 8615220 6728117 4172532 1682493
39188 1682493 305845 814029 3162441 5938093 6899322 5145263 2377349 839335
39180 839335 483836 -278259 -1456978 -1288656 631994 2369264 2726967 3165029 5103647
39171 5103647 7030840 6308125 2896259 -682688 -2667290 -3550132 -4237502 -4231220 -2215624
39162 -2215624 2132920 7200763 10340701 10256929 8586261 8100608 9040693 8777225 6000544
39153 6000544 3388792 4182373 7391144 8839646 6510531 2614763 538883 1869173
39145 1869173 6286597 11933188 15522319 14647729 11066127 9616027 12574556 16773120
39137 16773120 17606891 14303229 9740577 6593344 5625349 6767105 9587781 12763421
39129 12763421 14851148 15919009 17212086 18899775 19125161 15852280 9410163 3028337
39121 3028337 633724 3395905 8128424 9903688 6872815 1882776 -1063892 -816253
39113 -816253 1219287 3831977 6624768 8733648 9148080 8313481 7557478 6788038 4690721
39104 4690721 1645934 354153 2385743 5718751 7174673 6202350 4832266 4797072 6188636
39095 6188636 8198936 9520830 8559286 5151124 1939738 2030902 4913475 6592451 4510669
39086 4510669 613054 -1481231 -653238 1822832 5008967 8771591 12273924 14265586
39078 14265586 14896661 15385869 15678020 14191867 10410590 6218463 3985359 4454106 6910781
39069 6910781 10102340 12471215 12903739 11987930 11329620 11180032 10360533 9042622 9257692
39060 9257692 11267976 11904141 8944266 5213559 5200732 8726895 11393098 10945660 9662065
39051 9662065 9978650 11160353 11592355 11549210 11975932 12641238 13084352 13515661 13330012
39042 13330012 10784349 5969088 2145805 1928501 3837557 5120114 6303959 9592465
39034 9592465 13644519 14020458 9541629 4706417 4088729 6993698 9729711 10916529
39026 10916529 11691573 11956571 9835420 5199620 1035657 199674 2674451 7099248
39018 7099248 12968892 19351741 23043232 21093394 15209113 10896195 11271870 13860162
39010 13860162 14653105 13106479 11200687 9551052 7403341 5598619 6288685 9373479
39002 9373479 12001692 12587889 13053151 15723415 19846560 22944193 24438684 25953504
38994 25953504 28201366 29185600 26270526 19678149 13174216 10510263 11237876 11428717
38986 11428717 9262103 7982843 11323644 17855773 23325359 27490238 33766151 41355369
38978 41355369 43107685 34483380 20852951 11808529 10641381 13434118 16380632 18945696
38970 18945696 20479781 19082994 15205566 12410593 12609043 13344551 11653530 8300791
38962 8300791 6185135 6256570 7025663 7031818 6039876 4510238 3404827 4030176 6680171
38953 6680171 9629518 10665410 9677104 8790833 9731859 11837679 13141677 12843510 11860355
38944 11860355 11014140 9789473 7617028 5496204 4956252 5729542 6043448 5292101 4734340
38935 4734340 5244444 6285984 7704577 10254458 13083336 13016505 8422444 2093701 -1881710
38926 -1881710 -2709554 -2292958 -1669864 -585573 703218 1901413 3847501 6567241 7526806
38917 7526806 4983577 1732918 1672879 3604184 2939279 -694619 -2541402 -156489 3190804
38908 3190804 4270796 4450843 5991804 7786561 7850780 6871883 6181314 4916363 2310118
38899 2310118 373470 1039020 2673709 2731397 2122047 3451341 6177824 7151698 5526834
38890 5526834 3908783 4461048 6353882 7370874 6277316 3539329 1005671 626213
38882 626213 2556090 5185029 7500080 9746329 11076576 9306618 4833996 1924544
38874 1924544 3307182 6039372 6095475 4628981 5442821 8141824 8978123 7881878 9236506
38865 9236506 14801732 20580320 22410855 20851542 18560846 16089832 12661780 8901022
38857 8901022 6553363 6656868 9111860 12743307 15165258 14284359 10681765 7065669
38849 7065669 5107310 4487099 4908003 6613842 8640121 9125327 7973459 6883869 6389784
38840 6389784 5497945 4567682 5344278 7339147 7570456 5209260 3157935 3393415 4084806
38831 4084806 3314089 2300382 2482095 2633706 1778345 1908029 4409231 6511588 5199774
38822 5199774 2511940 2751067 5918607 8178375 7932034 7186718 7189987 6750250 5160531
38813 5160531 3310848 1647106 312548 1391317 7251967 15895095 21537838 21179214
38805 21179214 17593014 14552929 12233075 9178634 5955482 4225196 3941590 3848074
38797 3848074 3678709 3917725 4190132 3609892 2286796 1262387 1296854 2398469 3882736
38788 3882736 4391894 2884754 262511 -1118890 -325668 941047 879331 49878 96681
38779 96681 1092034 1622002 914685 -371340 -1075784 -335542 1905219 4202037 4234778
38770 4234778 1487790 -1254258 -683421 2866282 5558401 4598530 1233161 -1364092
38762 -1364092 -1919004 -1642313 -1682955 -1407002 518115 4158400 7930439 9837478 8854318
38753 8854318 5617178 2235928 935195 2066357 3620065 3425331 1613349 101989
38745 101989 100201 1420412 3769446 6620971 7822763 5197195 613213 -536407 3838961
38736 3838961 8774396 8330172 3409225 -153235 85098 1102083 371149 -688602 -340313
38727 -340313 284694 -396643 -1581161 -1613500 -411053 1111702 2355965 2764615 2024759
38718 2024759 1385119 2936726 6847999 10984494 13436926 13515177 10885369 6795228 5491584
38709 5491584 10133111 17268459 20219543 18287060 16906108 18060893 17959443 16393351
38701 16393351 19692577 29656686 38239056 40082247 41989745 51462057 64988181 79900559
38693 79900559 108595355 161392250 217418308 234750239 197200511 134766340 88190742
38686 88190742 67263915 55533813 42473055 32905303 30454833 29872428 27261736 24994481
38678 24994481 23798507 19973826 13226593 8730703 8436318 7843469 4551693 2934689
38670 2934689 6270404 10320864 9670205 5962059 4727018 6952208 8623403 7133867
38662 7133867 4101875 2270353 2499005 3802633 4570350 3850363 2449987 2380821 4670188
38653 4670188 8365128 11822442 13868418 13644793 10876455 6738744 3163709 930011
38645 930011 -553254 -1776359 -2749204 -3658042 -4348236 -3739977 -1504671 564312 1007277
38636 1007277 1366418 3570184 5847734 5003656 2094781 1445586 3913214 5830626 5490532
38627 5490532 5752003 8354216 10321395 8770407 5354867 2920728 1218679 -847219
38619 -847219 -1826461 -124340 2582439 3636400 3149018 2640677 2103426 1320477 1922982
38610 1922982 4986071 8424291 9761122 9722793 10311234 11305614 11536624 11477522 11552331
38601 11552331 10222026 7132589 5802987 9391668 15835451 20865267 23542134 24939885
38593 24939885 24211696 20877119 18430594 20054168 22840583 22189281 19835202 20775758
38585 20775758 24071909 24540959 22559921 23504323 27522349 29300680 28890728 32381816
38577 32381816 39828940 44782648 50538973 72599017 113872737 148665525 147123040 111029775
38569 111029775 70749851 48665807 40467129 33287290 25944589 23717066 25096498 24584932
38561 24584932 22841186 24856589 31123613 38140561 45498185 55095459 63875695 64318349
38553 64318349 53881283 39149649 28459683 23708391 21388116 18780540 16271070 14889033
38545 14889033 14393120 14132922 14199015 14934237 15983136 16547813 16360967 15711787 14467695
38536 14467695 11935088 8275680 5374031 5300641 8139510 12208267 16135187 19561558
38528 19561558 21901772 21963900 19488260 15991594 13197502 11245771 9220078 6972021
38520 6972021 5531537 5687048 6737258 6985715 5463117 2958098 1020250 7393
38512 7393 -1157374 -2954067 -3965155 -2641714 247944 2290116 2387360 1731280 1736582
38503 1736582 2312990 2579387 2203193 1498080 943296 927706 1300058 1143714 -93544
38494 -93544 -1293869 -715356 1553514 3584378 4260711 4237344 3797789 1954720 -960245
38485 -960245 -1900853 1378842 6646476 9591974 9344888 8953726 10371659 11830177 11199324
38476 11199324 9451208 8911602 9750682 10455215 10901142 12544375 15595482 18346936 20187966
38467 20187966 23399921 30206739 38782772 43898744 41717120 33035296 21908346 12309839
38459 12309839 6427928 4779435 6551997 9931964 12955404 14364512 13723744 11267234
38451 11267234 8013566 5413069 4153931 3631002 3128788 2951582 3599301 4548012 5119842
38442 5119842 5975786 7939072 9508169 7899682 3373367 231240 1743262 5737503
38434 5737503 7484153 5882906 4111905 4452417 5430525 4883329 3244432 2130593 1582783
38425 1582783 805847 392077 1407857 2793523 2240886 47688 -265229 3516056 8786058
38416 8786058 10881109 8539008 4830744 2883824 2566522 2072488 1201459 1382760 2810534
38407 2810534 3354873 1256213 -2013693 -2952308 -91322 4285379 6882713 6805617 5499184
38398 5499184 4313668 3470301 2952931 2948231 3444260 4606316 7241864 11227758 13779144
38389 13779144 11884401 7146130 5324822 9223666 14592457 15896103 14070601 14614047
38381 14614047 18741893 20920371 16353762 7431232 747310 84074 4224349 9614625
38373 9614625 12879353 12121189 8267433 4754853 4066048 4837174 3857699 535491 -2329288
38364 -2329288 -2318037 -403652 524304 -678603 -2135481 -1410073 1319653 3316913 2645221
38355 2645221 414536 -1142451 -1609658 -1725578 -889461 1920863 4967069 4746255 1057567
38346 1057567 -1950415 -1308936 942371 1333602 -273132 -1889896 -3032393 -4311800
38338 -4311800 -5158847 -4733884 -3628884 -2173662 1016282 5833423 8227080 5011771
38330 5011771 -390786 -1619933 1904902 4712669 3705358 1809161 2182187 3617272
38322 3617272 3855200 3540323 4246976 5418745 5640312 4774894 3133659 801580 -813802
38313 -813802 523925 4115193 5760259 2990636 -1550020 -3913000 -3590632 -2424554
38305 -2424554 -1318771 -452947 -551273 -1514970 -1742132 -825256 -550509 -1207444 -54595
38296 -54595 3725584 6024614 3757569 666999 2071949 6126652 6298761 1528472 -2468923
38287 -2468923 -2453633 -1927288 -4231172 -6943662 -6385613 -3539261 -1775291 -1534112 -923825
38278 -923825 201577 216561 -998394 -1534532 -140499 2334302 4103419 4025768 2489245
38269 2489245 1457290 2795913 5784499 7352414 5762806 3020524 2466232 4800051
38261 4800051 7646411 8471892 6921828 4704361 3966594 5424506 7564369 8108049 6509414
38252 6509414 4324795 3040595 2679891 2859244 3766759 5265965 6305440 6323244 6294816
38243 6294816 7307290 8870804 9687485 9447862 8885365 8590056 8617455 8742912 8392502
38234 8392502 6977845 4985687 3899381 4221097 4542479 3671322 2703956 3492037 5715602
38225 5715602 7185543 6834286 5776884 5355491 5710385 6613805 8193183 10093265 11113648
38216 11113648 10609540 9434031 8572255 7477881 4810549 557149 -3508695 -5438982
38208 -5438982 -4502419 -1218928 2937189 5787873 5713696 3509470 2139296 3549031 6153409
38199 6153409 6615170 3896892 285292 -1665956 -1799775 -1443113 -1171991 -587427 411446
38190 411446 1253385 1409251 854345 78450 14202 1435267 3957669 6153445 7016460
38181 7016460 6665499 5386729 3110564 385123 -1431689 -1876467 -2084716 -2791203 -2958597
38172 -2958597 -1683249 -83583 387751 335804 1287600 3206309 5081417 7003553 9520851
38163 9520851 11790429 12576432 12274753 11756602 10341446 7600712 5937130 7889058 11580511
38154 11580511 12680841 10637501 8895906 8830406 7982054 5176519 2744005 1995769 918614
38145 918614 -1408892 -2261436 190976 3514181 4938484 5013840 4533109 1893317 -2795737
38136 -2795737 -4942943 -1462182 3690203 4930354 3197590 3277391 5365981 5472264 2886168
38127 2886168 852163 145155 -1693458 -4229242 -3519920 872515 4030249 3108617 1493361
38118 1493361 2746405 4898587 4126908 668111 -2226363 -2684861 -918348 2046474
38110 2046474 4038480 2677381 -1095707 -2969967 -932328 1857879 2303502 2224202 4521219
38101 4521219 7348779 6590516 2634763 202386 1745423 4785241 5967186 4584413
38093 4584413 1754447 -1075516 -2220314 -684192 2334782 4558409 5470011 6405778
38085 6405778 7848799 8549286 7613401 5737614 3939356 2468059 1308622 522008 -193320
38076 -193320 -1259279 -2464709 -3340079 -4016777 -4666724 -4539731 -2928347 -779646 157592
38067 157592 -290796 -613238 104031 1056909 943984 -719203 -3325397 -5243552 -4685099
38058 -4685099 -1732634 1121746 1886469 1715718 2841483 4772973 5089196 3582446 2642065
38049 2642065 3254129 3670605 2948991 2801540 4301405 5408107 4040195 1678498 1433917
38040 1433917 3744620 6272180 7157479 6146346 3207997 -1443864 -5960155 -7772245
38032 -7772245 -6478597 -4181086 -2494132 -897021 1198080 2480899 1429322 -991999
38024 -991999 -2205236 -1549389 -1181967 -2745748 -4633659 -4125596 -1464035 275729 -459031
38015 -459031 -1625996 -907132 846737 1319705 434160 7095 564132 1101712 1648470
38006 1648470 3195266 4894430 4382101 1741913 142878 1111730 2100205 768078 -1124839
37997 -1124839 -836748 781670 1218761 921727 1967387 3229935 1518165 -2273049 -2868654
37988 -2868654 1832289 6880496 6699169 2508553 56250 1697647 4316325 4706619
37980 4706619 3642304 3583495 4698897 5047346 3841694 2677120 3097115 4183767 3854672
37971 3854672 2178244 1567116 2897931 3305153 -80340 -5250097 -6974909 -3449320
37963 -3449320 1410891 3135585 1692069 -13362 -310231 534485 1996048 3293045
37955 3293045 2782167 -272411 -3770914 -4640239 -2439341 503367 2164287 2322794 1334111
37946 1334111 -622934 -2832994 -4096863 -3888021 -2639824 -1133775 -401143 -1331795 -3085391
37937 -3085391 -3088521 -508338 1607298 339704 -2176462 -1547173 1693807 2308063 -1439626
37928 -1439626 -4677250 -3286113 160090 1301673 967704 2649329 5799007 6985981
37920 6985981 6232865 6601560 7823636 6143286 1503563 -763136 2105390 5553334
37912 5553334 4556843 1354869 1728777 5967041 8617599 6575000 2679478 531672
37904 531672 -308963 -2127659 -4805035 -6094188 -4912718 -2546591 -958711 -876798 -1297098
37895 -1297098 -503416 1962561 4313255 4308272 1961926 -742531 -2769186 -4811558 -6726148
37886 -6726148 -6595637 -3995285 -2102158 -3866386 -7241823 -7399190 -3551718 -244792
37878 -244792 -818294 -2610986 -885754 4459180 8816424 8714279 5277717 1914350 623491
37869 623491 1040422 1588158 938008 -725201 -1622150 -477120 1319690 981576 -1943321
37860 -1943321 -4561189 -4133434 -1405758 620634 434521 -698849 -970503 -490182 -1049569
37851 -1049569 -3524529 -5830980 -4342818 1765177 8172444 9060525 3416959 -3728403
37843 -3728403 -6880449 -5466276 -2954731 -2231047 -3250129 -4207311 -3469478 -779011 2338943
37834 2338943 3660891 2337095 -701099 -4455248 -8345431 -10547459 -8498689 -2962992
37826 -2962992 813712 -1038119 -5649809 -7261001 -5172955 -3787833 -5094023 -5772914
37818 -5772914 -2970150 1189472 3012315 1910525 -733571 -4518497 -8901704 -11242933
37810 -11242933 -9210859 -4128144 657193 3801025 6026753 7330573 6992642 5750599
37802 5750599 4944225 3537429 -952964 -7851200 -12440904 -11253774 -6361246 -2637743
37794 -2637743 -1916132 -1716275 620322 4378667 6742187 6542857 5384265 4989885 4922550
37785 4922550 4136694 3659114 5397973 8366121 8897347 5736476 2250679 1611253 2283637
37776 2283637 1255003 -302106 1346484 5983198 8947241 7741784 5116448 4141133
37768 4141133 3904468 2403886 604854 550169 1496774 1168031 -346693 -1043847 -731403
37759 -731403 -1250276 -2889982 -3372037 -1228540 1884943 3339494 2651765 1528725 1705111
37750 1705111 3441490 5571044 6618127 6248201 5523275 5194095 4315882 1771777 -1252366
37741 -1252366 -2060549 123157 3197702 5036257 5538412 5251991 4018296 2289880 1890217
37732 1890217 3493012 4726899 3106594 -7756 -957275 931079 2296078 593694
37724 593694 -2365102 -3053639 -832065 1556247 1300560 -1692638 -4820381 -5084091 -2046810
37715 -2046810 1314760 1738149 -326895 -1500577 -480061 175888 -1520241 -3349194
37707 -3349194 -2068420 1658101 4423148 4939091 4579194 3822051 1766230 -695402 -940481
37698 -940481 996976 1350647 -2274959 -7338053 -9922311 -9632610 -8615683 -7577059 -5633271
37689 -5633271 -3189967 -2132460 -3094486 -4586062 -5063974 -4319030 -2652821 -133500 2848594
37680 2848594 5234288 6060711 5336369 4090186 3497710 3501528 2452871 -809730 -4519193
37671 -4519193 -5337209 -2778212 -259026 -334000 -863789 1777229 7006701 10288971 8698808
37662 8698808 3833181 -779649 -2979004 -2538420 -619387 684575 -119818 -2207853
37654 -2207853 -3404676 -3023487 -2351170 -2227139 -1921362 -983926 -499836 -1434574 -2926945
37645 -2926945 -3419043 -2827479 -2532907 -3394521 -4502880 -4091181 -1517892 1867570 4093942
37636 4093942 4605416 4209005 3113307 487181 -3399171 -6214548 -6159731 -4375434 -3233368
37627 -3233368 -3164237 -2747718 -1114350 1267812 3324840 3530316 715460 -3533844 -5045855
37618 -5045855 -2092103 1463291 1146511 -1571001 -1613883 1820776 4296835 3010146 35929
37609 35929 -1970932 -2887715 -2779165 -763109 2143515 3068576 1935400 2065083 4306595
37600 4306595 5026563 2454099 327475 1647220 3167571 667520 -3861630 -5401444
37592 -5401444 -3565753 -1763856 -770627 1196822 3098329 1571979 -3039147 -6252087
37584 -6252087 -5755447 -3774455 -2356766 -569290 2271792 4344277 4096198 2515988
37576 2515988 1213425 558975 637301 1585737 2148612 494591 -2499920 -3328955 -515594
37567 -515594 3032873 3751276 1725708 -19041 826375 3889887 6746006 7052557 4984532
37558 4984532 3201348 3116354 2403032 -1276022 -5278457 -4666595 207394 3302810 1327123
37549 1327123 -1729967 -838137 2997209 5110583 4002944 2269711 2055128 2625137 2067030
37540 2067030 -498837 -3983853 -5698906 -3897309 -640494 -8709 -2377271 -3256289
37532 -3256289 234363 4724607 5433550 3057701 1866295 2619043 1997411 -1211979 -3840294
37523 -3840294 -3178261 -460106 1936687 3747592 5385434 5634618 3198633 -602401
37515 -602401 -2778204 -2070084 -174473 277733 -1745309 -4835325 -6262728 -4294489 94634
37506 94634 4049480 5533920 4718363 2659573 -249263 -3677782 -6151105 -6006250 -3581941
37497 -3581941 -1116527 -5754 647356 1971261 3085329 2468837 755984 23218 362592
37488 362592 -424518 -3021608 -4932750 -4069226 -1776007 -295248 739507 2720013 4763268
37479 4763268 5143107 4727484 5492337 6508763 5264742 2436577 989761 566757 -2248936
37470 -2248936 -7175459 -9107242 -5954947 -2554157 -3524001 -6727871 -7711917 -6481380
37462 -6481380 -5154194 -2542335 3160581 8750406 9295655 5935682 4416489 6213066
37454 6213066 7154712 5410460 4655234 7310122 10140086 9720467 7951192 8400108 10283399
37445 10283399 10077440 7314450 4996286 4812699 5008856 3331591 117807 -2204098
37437 -2204098 -1853903 423748 2129847 1742252 272158 -514816 -662783 -1427089 -2721119
37428 -2721119 -3060163 -1854892 136505 2384645 4465129 4764154 2187449 -777650
37420 -777650 -66608 4085773 6645467 4496924 291360 -2244022 -3337253 -4808783
37412 -4808783 -5891930 -5057538 -3729066 -4230742 -5488815 -4697119 -2296152 -1218903 -1565908
37403 -1565908 -357187 2806867 3996366 573049 -4725911 -7523398 -7170845 -6060965
37395 -6060965 -5502418 -4950029 -4285449 -4140336 -4030100 -2503359 156987 1117439 -1759260
37386 -1759260 -6522133 -8423314 -5025712 776278 3701873 1796401 -1896762 -3575301
37378 -3575301 -3101691 -2974533 -4083549 -4711450 -3688235 -2215668 -1662983 -1512052 -1012875
37369 -1012875 -1332672 -3914559 -7429861 -8645247 -6386910 -2738732 -103901 950921
37361 950921 552771 -1302882 -3132525 -1891198 3158986 8093999 8501398 4980947 1672361
37352 1672361 206640 -1260559 -3143504 -2932345 6365 2213132 1251899 -373221
37344 -373221 424633 2049908 1295705 -617482 184136 3513804 5059745 3043165 432485
37335 432485 -118596 652531 1579135 2949726 3917659 2065435 -2235317 -4595838 -2370150
37326 -2370150 1375511 2363290 776401 -523069 -849303 -1320367 -1592643 -535243 1107352
37317 1107352 1912335 2441047 3641078 3960383 1590057 -1431315 -1227264 2159911 4738806
37308 4738806 4249514 2226702 282266 -1726259 -3134421 -2135924 499110 1071580 -1648292
37299 -1648292 -3962777 -2599963 476166 1554448 929566 1603957 3922907 5368774
37291 5368774 5056550 4737687 5202802 5115547 4139146 3959409 4805005 4035327 540640
37282 540640 -1965976 596963 6235925 8671271 5581045 1356663 562171 2263184
37274 2263184 3176299 3245304 4375258 5687288 4618412 2150237 2180242 5021002 6158517
37265 6158517 3205654 -299388 -733144 34742 -1325396 -3356206 -2391308 726986 1693134
37256 1693134 -281421 -1448624 431602 3502845 5796677 7618194 9167207 9965689
37248 9965689 11857077 18238856 28156497 34957976 33598277 26374869 18840477 12958553
37240 12958553 7466566 2550254 200217 743393 2071472 2098051 178832 -2946689
37232 -2946689 -4892876 -2820652 2852131 7364869 6835193 3354245 2032845 3987081
37224 3987081 5542921 3978776 553629 -2542411 -4902030 -6409746 -5855028 -2869755
37216 -2869755 455679 1556244 112568 -2130090 -3339774 -2755898 -928652 507496
37208 507496 192333 -1330439 -2247789 -2003294 -1931475 -2944185 -4118435 -4495855 -4788942
37199 -4788942 -5814440 -6317267 -4293221 -199391 3022643 3531622 2678886 2692628 3511979
37190 3511979 3349725 1835696 815906 1622269 3105299 3497924 3101147 3469862 4509697
37181 4509697 4446962 2948796 2243484 4030110 6725476 7260579 4876020 1830178 686269
37172 686269 1871748 3673353 3942771 2087159 -203767 -705775 650311 1786847 1461107
37163 1461107 731218 632921 184252 -1631979 -3319794 -2506246 572912 3305229 4059952
37154 4059952 3457749 2697907 2637097 4248145 7687799 10710120 10301397 6627579 3452754
37145 3452754 3701269 6151134 7502447 6411036 4378633 3522002 4393814 5512528 4586315
37136 4586315 784623 -3942542 -6456718 -5480279 -2439753 514550 2299857 2830409
37128 2830409 2426007 1566513 399168 -1430608 -3617110 -4445626 -2695761 52755 752560
37119 752560 -1513226 -4831467 -7096432 -7563022 -6219154 -3934699 -2941769 -4356566 -5246788
37110 -5246788 -1566121 5384798 9249588 6910632 2688159 1814026 3326532 2977421
37102 2977421 337340 -1351692 -803263 245358 1024437 2651328 4764194 4862539 1997130
37093 1997130 -1599995 -3534873 -3704293 -2987719 -1672028 -230051 113196 -1146238 -2789163
37084 -2789163 -3218941 -2167235 -718325 -240636 -1227660 -2499023 -1955351 940388 4020010
37075 4020010 4893945 3841921 2819514 2489016 2171066 2053571 3092084 4826599 5487860
37066 5487860 4429148 2649160 1047740 37277 422842 2309720 3524814 1927440
37058 1927440 -811093 -853928 2127810 4311329 3466029 1780187 1651054 2221820 2062115
37049 2062115 1978047 2685556 2601727 706464 -958387 -549638 189626 -1062713 -3019763
37040 -3019763 -3143889 -2344846 -3362083 -5653338 -6000364 -3719427 -1355232 -228107 995964
37031 995964 3005806 4634117 5505256 6658560 7942587 7953644 7099242 7261314 7682777
37022 7682777 5197722 131673 -2195616 1347011 6508724 7175923 3428031 137400
37014 137400 -548036 -814999 -1953996 -2075799 102587 2790940 3950305 3938921 3741502
37005 3741502 2753886 304157 -2091685 -2130266 184914 2543650 3198702 2390378 949807
36996 949807 -957301 -3008844 -3757524 -1757492 2391041 6017427 6836104 5102868 3002570
36987 3002570 2138495 2083622 1401535 -434561 -2559589 -3932661 -4372468 -4022806 -2368093
36978 -2368093 1087341 4917800 5905450 2441738 -2799144 -5270440 -3631837 -751277
36970 -751277 517143 445696 595398 1261357 2339906 4487538 7112017 7243106 3505670
36961 3505670 -274333 840916 5939366 9404264 8885015 7667087 8331480 8842437 7061281
36952 7061281 4782578 4120510 3464316 741701 -2186791 -2479245 -1366474 -1823028 -2851557
36943 -2851557 -968477 3261644 5100912 2500950 -1235626 -2663720 -2325483 -2444711
36935 -2444711 -3812602 -6299217 -9458408 -11337221 -9672831 -5677974 -3583938 -4728173
36927 -4728173 -5227900 -1803529 3002380 4348757 1616933 -1747656 -3400299 -3960388
36919 -3960388 -4540685 -5277099 -6078834 -6650881 -6036134 -3945602 -2075629 -2353154 -4364885
36910 -4364885 -6121889 -6674274 -6323807 -5166591 -3425928 -2464447 -3279198 -4499766 -4032477
36901 -4032477 -2280609 -1562058 -2655470 -4116045 -4742509 -4469827 -3101707 -677295 976980
36892 976980 -177336 -2872003 -3222682 378861 5422796 8886970 10121879 9464068 6994840
36883 6994840 4190538 4035304 7268480 10478990 10120360 6940095 4449109 4374563 5677438
36874 5677438 6940323 7567081 7197726 5748253 3858054 2334866 1715623 2747578 5708276
36865 5708276 8533147 7971156 4197510 1773290 3570903 6113788 4289847 -1162850
36857 -1162850 -4961984 -5046798 -4486386 -5549195 -6478506 -5472891 -3808447 -2898189 -1636675
36848 -1636675 682295 1501715 -1773669 -7255261 -10329969 -9343246 -7044804 -6513129 -7696246
36839 -7696246 -8341179 -7005136 -4589734 -3231700 -3644119 -3747595 -956620 4029914 7288469
36830 7288469 6317516 3069591 1085451 1010866 691847 -1180762 -3392497 -3925935 -2030883
36821 -2030883 1202564 3386719 2450675 -1326470 -5392637 -7650175 -8078805 -7039348
36813 -7039348 -4006950 180580 1842987 -1576468 -6869342 -7846263 -3075666 2255792
36805 2255792 3139598 593464 -845726 837556 3807178 5773914 6396230 6364953 5686352
36796 5686352 3595593 6180 -3290834 -3730355 -1118070 1149960 -235311 -3877214
36788 -3877214 -4960279 -1543860 2875851 4289207 3317061 3300233 4869381 5199062 2394710
36779 2394710 -1756418 -4026236 -3265911 -965049 811470 1257220 879755 450312 434007
36770 434007 1379545 3837353 6926927 7813676 4467367 -1051265 -4030168 -2423356 1050853
36761 1050853 2815864 2389554 1263443 30410 -1338741 -1977197 -1288316 -722320 -2130504
36752 -2130504 -4849941 -6408378 -5735615 -3885448 -2044522 -691771 -355472 -1295288 -2563913
36743 -2563913 -2979442 -2735407 -2601811 -2228777 -977170 402385 936849 1344584 2448841
36734 2448841 2763149 649343 -1958944 -1556060 1571656 3875601 4452836 5983586 8959415
36725 8959415 9736909 6311565 1714660 -856665 -2255595 -3822777 -3679533 -402950
36717 -402950 3106055 3824055 3790063 6414952 10186273 11349190 10811241 12255836 14366359
36708 14366359 11667608 3803403 -2431497 -2349430 896453 2461478 2488596 3000212 2632693
36699 2632693 -600604 -4018906 -2851459 2831584 7945564 8937223 7040556 4912779
36691 4912779 3295968 1905362 1055725 927302 684992 -330395 -1300107 -940684 435147
36682 435147 858843 -895921 -3425009 -4083900 -2249588 -70068 450514 -370325 -1617957
36673 -1617957 -3730391 -6571207 -7386537 -4110750 280360 874928 -1831205 -2421993 701146
36664 701146 2323090 -1357236 -6508262 -7607132 -5423380 -4174477 -4002376 -2049634
36656 -2049634 1027930 1854581 939969 2339145 6270603 7942419 5157518 1614216
36648 1614216 375074 -822478 -4394368 -7374069 -5458316 78668 3958003 4105355
36640 4105355 3322075 4046248 4901457 3360733 -205029 -2373192 -226992 5157734 9125456
36631 9125456 8261138 4554806 3035173 5149684 6916447 4585266 -398829 -3822887
36623 -3822887 -4024489 -2738705 -2178605 -3186190 -4999243 -5315772 -2203593 2526911 4005976
36614 4005976 451658 -3666294 -3370195 117220 1888020 710127 -454587 -366718 -1169059
36605 -1169059 -3699199 -5452378 -4600206 -2727201 -2124159 -3037145 -4767712 -6940931 -8564107
36596 -8564107 -8265807 -6494075 -5120341 -4179446 -1877714 1299858 1955405 -1040063 -4009993
36587 -4009993 -3376378 -221363 2391477 3700887 4122404 2905190 471237 402794 4747777
36578 4747777 9259312 8150200 2582767 -646413 1195814 3581856 2286279 -753421
36570 -753421 -1449802 468771 2462231 3366765 3534322 2684540 562755 -1352537 -1330287
36561 -1330287 61287 894191 708971 480391 394407 -186425 -723059 342252 2940403
36552 2940403 4682243 3763591 1330343 -225730 -550715 -1361708 -3130993 -3428728 4172
36543 4172 5339806 7991777 6277640 3530494 3161907 3823489 2131829 -1402880 -2996379
36534 -2996379 -1848488 -1510100 -3834421 -5674338 -4065854 -1165741 -541314 -1281157 -158530
36525 -158530 1971478 920918 -3787411 -7505998 -7393678 -6454986 -8197970 -10688374 -9434530
36516 -9434530 -4338175 -128548 -233006 -3183118 -5533662 -5997293 -5636402 -5506154 -5532048
36507 -5532048 -5294175 -4906076 -4862707 -5274300 -5515539 -4867692 -3451044 -2041977 -840730
36498 -840730 800932 2823202 3463136 1170094 -2646778 -4378748 -2384807 897769
36490 897769 2170288 1569882 1942506 4220082 5912091 5018248 3187762 3034662 3895516
36481 3895516 3004019 250225 -1380012 -500029 749790 808131 1597867 4831873 7947924
36472 7947924 7231268 3624547 1625548 2742971 3848079 2585247 769701 903048
36464 903048 2353785 3068643 2786189 2386002 1857199 1070923 1026350 2095541 2356777
36455 2356777 88538 -3056503 -3855253 -1863136 464716 1513366 1763534 1495508 148788
36446 148788 -1432976 -817160 2644465 6215239 6918668 4814696 1956642 -457718 -2430833
36437 -2430833 -3733456 -3713216 -2181711 403916 3147664 4557123 3222628 -326711
36429 -326711 -3295037 -3315392 -941583 1437200 2409049 2234902 1616747 1210138 1795788
36420 1795788 3403665 4562888 3869313 1996576 548814 -777589 -3715299 -7742867
36412 -7742867 -9237730 -5776836 249871 4070182 3788318 1655549 578787 1011346
36404 1011346 1445999 652381 -1211764 -3087577 -4052709 -3947970 -3120988 -1766693 -42411
36395 -42411 1145784 536062 -1553147 -2665224 -976419 1884209 2476916 49245 -2377591
36386 -2377591 -2024413 194027 1409500 719255 -274095 -229581 373687 552625 254595
36377 254595 -101562 -597230 -1628618 -3149825 -4520068 -4841067 -3305889 261096 4803206
36368 4803206 8319943 9255073 7572702 4326448 554887 -2920690 -4975470 -4557690
36360 -4557690 -2137166 -24166 -129508 -1490612 -1219019 1686153 4729464 5129531 3486210
36351 3486210 2487008 2623510 1664613 -1226267 -3442063 -2529969 139435 1432006 870837
36342 870837 551276 1283118 1432103 -199516 -2585861 -4157823 -4415595 -3233158 -425792
36333 -425792 2928736 4307000 2337042 -1226560 -3269606 -2585670 -645079 401672
36325 401672 -70880 -551094 1162660 5265321 8890613 8978139 6111156 3798390 3741713
36316 3741713 4004909 2723291 1234899 1723172 3579706 4370877 3406872 2332241 2757027
36307 2757027 4774971 7049312 7212895 3634701 -1655692 -3655557 -278267 4283745
36299 4283745 5029060 3140324 3417813 5883849 5299979 -155123 -4994939 -3856736 1151781
36290 1151781 3932730 2473723 -170722 -1243427 -945035 -241944 897098 2711783
36282 2711783 5010856 7527814 9696876 10408326 9193979 7124825 5314058 3238263
36274 3238263 -81191 -3965676 -6688968 -7596179 -7135640 -5541904 -3289527 -2222171
36266 -2222171 -4020202 -7515568 -9445029 -8144859 -4950858 -1836533 681689 3032106
36258 3032106 5572188 8477315 11282922 12312428 10054104 5448934 1367303 -484019
36250 -484019 -610361 439130 3114587 6895773 9463254 9451676 8450363 8509148 8942976
36241 8942976 7610967 4487010 1815545 1104994 1974187 3729546 5807674 6434040 3427827
36232 3427827 -2366248 -6531312 -5987599 -3189789 -3092268 -6454106 -8780581 -6427630 -1303298
36223 -1303298 1998333 1873485 342668 -830972 -1898598 -3042591 -3269579 -2336448 -1575914
36214 -1575914 -1480239 -487488 2033012 3501921 1443708 -2163255 -2917546 78801 3510061
36205 3510061 5149053 6334962 8144318 8730481 6760835 4525617 4580812 5520470 4554208
36196 4554208 2589047 2635116 4049513 3157537 76853 -44588 5278191 11231742 12102879
36187 12102879 9043581 7315199 7982761 7177868 2984995 -1687179 -3838418 -3991714
36179 -3991714 -3764194 -3291106 -2766969 -3392765 -4649516 -3506234 987953 4758549 3466211
36170 3466211 -1615261 -5707072 -6921923 -6886639 -6189159 -3668096 -268922 844410 -827064
36161 -827064 -2011051 -1103409 -1097763 -4660529 -9235174 -10035846 -6066362 -540144 3236573
36152 3236573 4103277 2663134 1074780 2001828 5504912 8178348 7501933 5459854 5265969
36143 5265969 6280269 5650683 3680618 3297375 4480385 3770672 286327 -1939622 364130
36134 364130 4880562 6917908 5205129 2254247 594617 686218 1473726 1423796 -183501
36125 -183501 -2100307 -2338787 -1035555 -394169 -1227805 -1828992 -1249796 -1038387 -2021945
36116 -2021945 -2081770 324912 2709035 1786202 -1341185 -2589299 -713601 1471112 1438938
36107 1438938 -424228 -2636286 -4356403 -4920991 -3988079 -2641319 -2390739 -2799288 -2056194
36098 -2056194 -71217 1151475 569895 -609272 -1180057 -1382903 -1568374 -1534908 -1798122
36089 -1798122 -3268604 -4872992 -3908813 -5559 3519099 3774440 1776211 274799
36081 274799 104995 434445 667245 107504 -2311767 -5628985 -6115605 -1834420 3627646
36072 3627646 5258530 3226244 1666267 1730628 432968 -3196272 -5674285 -4766139 -3440547
36063 -3440547 -5044810 -7697267 -7261746 -3911860 -1702686 -2428884 -3779615 -3757258 -3398917
36054 -3398917 -4000494 -4411298 -2800644 571634 3867579 5855032 6408882 5793547 4599302
36045 4599302 3701460 3222206 1998189 -971768 -4804298 -7270898 -7106026 -5367585 -4367220
36036 -4367220 -5137503 -5875050 -3555838 2060054 6704367 5589516 -818677 -6880346
36028 -6880346 -8167455 -5795205 -3419486 -2239249 -1093266 226227 663913 284616
36020 284616 229769 316986 -812282 -2897551 -3954011 -3675845 -4445812 -7597596 -10793175
36011 -10793175 -10968100 -8371075 -5668228 -4063869 -2479734 -176529 1979289 3238778
36003 3238778 4263225 5790392 6998158 6327508 3790118 1530805 1515829 3046617 3590141
35994 3590141 2338034 1583860 3313828 5638369 4961175 1364953 -1080983 -159096 1325826
35985 1325826 83590 -2591634 -3255762 -2122666 -2806633 -6581470 -10297500 -10699610 -8067809
35976 -8067809 -4509530 -1036820 2106384 4030702 4033671 2997977 2467966 2735760 2790000
35967 2790000 1710368 -586015 -3394920 -5371977 -5321628 -3563297 -1873922 -1410641 -1447765
35958 -1447765 -925188 -314949 -764762 -2068026 -2917241 -2883004 -2658800 -2278201 -638216
35949 -638216 2507841 5229660 5247052 2764442 548135 958960 3346088 4711916 2898414
35940 2898414 -1153157 -4493627 -5308608 -4487029 -3992542 -4400398 -4719893 -4248680 -3590164
35931 -3590164 -3611605 -4148097 -4255383 -3413184 -2070118 -1149391 -1248075 -2149483 -2918774 -2587009
35921 -2587009 -817215 2155387 5849116 9129746 9844761 6460458 796909 -2393711
35913 -2393711 -268932 4486132 6795862 5454076 3821628 4192387 4571406 2605514
35905 2605514 -68820 -245594 1733432 2567296 1141521 -158932 439595 1694105 2026372
35896 2026372 1995800 2573246 2947746 1805472 -512892 -2589229 -3582735 -3202357 -1402525
35887 -1402525 552041 164584 -3317081 -6995254 -7325108 -4463945 -1827670 -1649296 -2785523
35878 -2785523 -3052798 -2192575 -1879449 -3457966 -6113720 -7397971 -5950448 -3482451 -2903919
35869 -2903919 -4413033 -5169093 -3452159 -1146172 -874489 -2589419 -4548722 -5773957
35861 -5773957 -5754067 -3778885 -835347 -75719 -2584625 -4641042 -2532244 1690065 3209256
35852 3209256 1760528 1333541 3288720 4788247 4209809 3045801 1672348 -1564507
35844 -1564507 -5620229 -6432538 -3617358 -2294571 -5077763 -7208118 -3888126 1828399
35836 1828399 3594644 1018074 -1179956 -1132676 -1234000 -2502385 -3083956 -2687520 -3718462
35827 -3718462 -6846441 -9121988 -7844816 -3726602 611694 3154300 3225167 1833746
35819 1833746 1357254 2953053 4706438 4347784 2712606 1803579 811277 -2162248 -5431351
35810 -5431351 -5494623 -3363038 -3836072 -7355880 -8036109 -2429400 4546697 6194573 2863774
35801 2863774 -49443 -228969 93066 -658095 -1397154 -1587915 -2643944 -5257248 -7914614
35792 -7914614 -8960897 -8454663 -7485057 -6894703 -6739687 -5952477 -3005358 1756225 5132516
35783 5132516 4235618 251348 -2821956 -2890714 -1197143 724186 2900073 5035587 5215943
35774 5215943 2166515 -2448575 -5416840 -5053604 -2170222 1080287 2513933 1115196
35766 1115196 -1919138 -3957409 -3701226 -2569385 -2491468 -3234829 -3205461 -2110265 -1059495
35757 -1059495 -333045 958004 2676507 3071326 1293409 -1054575 -2017983 -1632511 -927275
35748 -927275 88451 1780826 3336526 3878117 4331623 5838858 6869077 4884488 1087235
35739 1087235 139202 3740407 7502832 6548100 1884343 -1654326 -2157451 -1993543 -3137225
35730 -3137225 -4607829 -5052842 -5072592 -5791281 -6897482 -7167978 -5867945 -3203694 -529263
35721 -529263 -188742 -3521060 -8533617 -11134969 -9498346 -5974418 -3881578 -3537353 -2498510
35712 -2498510 940714 5460356 7860950 6249484 2179958 -673474 -325721 1720419
35704 1720419 3122259 3860680 5105046 6064625 4684151 1375450 -760110 -134340 1395140
35695 1395140 1806362 1704576 2316524 2817820 1651936 -953555 -3708391 -6284605 -8616521
35686 -8616521 -9154032 -6234575 -1201463 1889309 495764 -3474993 -5739274 -4361340
35678 -4361340 -1793714 -1791954 -4565122 -6256149 -4024773 -134124 1074626 -737079 -1869614
35669 -1869614 -575867 444101 -1247940 -3945973 -4870761 -4482280 -4932287 -6119023 -6321280
35660 -6321280 -5581692 -5464675 -6059203 -6041007 -5504465 -6027417 -7610056 -7912580 -5344791
35651 -5344791 -1311107 1357960 1191283 -1021289 -3163128 -3403193 -1623583 637791
35643 637791 2005620 2539623 2692823 1929937 -489874 -3867262 -6226149 -5885806 -2508290
35634 -2508290 2526569 6368632 6780373 4881086 4282637 6393962 8402909 7479110 4992637
35625 4992637 4225709 5414754 5766129 3575034 -63960 -2998638 -3441654 -647860 3673606
35616 3673606 5823048 4402046 2780568 4430140 7252433 6231964 891465 -3937519
35608 -3937519 -4692656 -2573521 -266510 942743 225576 -2731610 -5646083 -5143478 -1585423
35599 -1585423 829262 -108115 -2026099 -2397681 -1968946 -2090913 -2081722 -1356343 -1168528
35590 -1168528 -2096675 -2508586 -1441463 -242939 394794 1832520 3882724 3370142 -902302
35581 -902302 -4985817 -4776256 -1378639 1604949 3211838 4142945 3687279 1670846 829381
35572 829381 2879864 4623715 2641023 -426354 383247 4185898 5821505 4453091
35564 4453091 4019422 5207948 3983876 -504987 -3302470 -1582294 792210 92950
35556 92950 -1329312 -238297 1100217 -939063 -4270961 -4052512 -713990 868830 -443035
35547 -443035 -433662 3193631 7061288 7590197 6121432 5780899 6178751 4639916 1237572
35538 1237572 -864785 -118936 1179285 381339 -1792161 -2669246 -1613082 -497161 -369341
35529 -369341 68969 1624327 2161861 -881746 -6318152 -9880384 -9272505 -6527411 -4663163
35520 -4663163 -3890892 -2503142 -159312 1590969 1672417 719408 -305426 -1470857 -3130355
35511 -3130355 -4538904 -4299215 -2331618 -551570 -876524 -2975728 -4888813 -5596897 -5693745
35502 -5693745 -5514520 -4431000 -2746267 -2321597 -3755256 -4608346 -2539106 1075058 3019062
35493 3019062 2678610 1889396 1254607 -61980 -1218995 -175345 2259630 2779428 1133228
35484 1133228 1240668 4703850 7307951 5305471 1675264 1643984 4324453 4068451 -560995
35475 -560995 -4426264 -3335964 559330 2961985 3603597 5341981 9005929 12124617
35467 12124617 12415335 10329337 7670180 5018189 1524769 -2941741 -6442169 -6747480
35459 -6747480 -4336400 -2235943 -2235619 -2647457 -1035640 2178009 4702789 5988084 7426454
35450 7426454 9167712 9213283 6318348 1969031 -1278310 -2172777 -1211067 -96039 -882480
35441 -882480 -4039082 -7125865 -7056586 -3849010 -326397 1849776 3369902 4303199 3213027
35432 3213027 501173 -664787 1055479 2597287 1222326 -960138 -666993 854830
35424 854830 242504 -1574121 -701275 2406859 2731710 -1075202 -3817383 -1658752 2126740
35415 2126740 3100635 3072779 6406407 11652304 12786087 8072448 2247012 -657173 -1820791
35406 -1820791 -3691590 -5912126 -7283346 -8119022 -8126909 -5154796 884527 5426116 4147314
35397 4147314 -1194593 -5237752 -5989793 -5599690 -5080697 -2785279 1230780 3527227 1925201
35388 1925201 -1171464 -2308852 -1561228 -1262344 -1929474 -2033581 -908870 472957 1359967
35379 1359967 2039594 2867112 3758651 4469089 4484486 3289647 1690138 1723637 3725517
35370 3725517 4665916 1625330 -3801998 -7134691 -6762654 -5223727 -4428680 -2874561 823048
35361 823048 4414066 4660138 1995357 -77494 394602 2128610 3324718 3784192 3835468
35352 3835468 3094101 1492080 479085 1815883 5229716 8157531 8288699 6103872
35344 6103872 4264754 4252883 4449964 2640643 -162687 -466705 2581340 5078964 3223208
35335 3223208 -1293017 -3323681 -1078011 1942291 2110152 14879 -1594226 -1899287
35327 -1899287 -2020693 -2338065 -2134945 -1530772 -1693291 -2767778 -3134302 -1515084 1052335
35318 1052335 2214042 1038660 -853277 -1088298 720238 2385832 1585441 -1349217
35310 -1349217 -3702053 -3510964 -1703236 -697149 -1505950 -2842384 -2695312 -218815 3585686
35301 3585686 6443552 6340793 3201144 -910389 -3591313 -4070657 -3381178 -3108812 -4167736
35292 -4167736 -6040126 -6747806 -4408854 450064 4879475 6532054 5791847 4098219
35284 4098219 1639520 -1605130 -3937295 -3712337 -2429825 -3024255 -4960099 -4353665 -50061
35275 -50061 3700216 2769089 -1274533 -3841101 -3586229 -2818324 -2898543 -2828253 -2315175 -2876201
35265 -2876201 -5004426 -6834497 -6841345 -5899878 -5397542 -4883951 -3010118 173970 3021336
35256 3021336 3835805 2104579 -949869 -2657782 -958205 3140489 6272336 6545993
35248 6545993 5390324 4822658 4554219 3300396 1519230 733403 902935 688953 41571
35239 41571 238949 1124242 601273 -2199339 -5174666 -6028733 -5315429 -5037999 -5273410
35230 -5273410 -4278181 -1724097 237082 -240504 -2369368 -4165717 -5107278 -6022985 -6857693
35221 -6857693 -6112684 -2931320 1255042 3928052 4005696 2653245 1735206 1890856 2183027
35212 2183027 1413228 -360175 -1716807 -1405319 156089 1240315 629711 -1322090 -3352483
35203 -3352483 -4335804 -3609804 -1279623 1174479 1481809 -1114393 -4477124 -5532812 -3571011
35194 -3571011 -830999 94493 -1272180 -3213067 -3418200 -933419 2598464 3965153
35186 3965153 1740251 -1738279 -3087052 -2144435 -1568717 -2304437 -2183687 -38198 1566636
35177 1566636 -93168 -3598905 -5419568 -4967844 -4533008 -4759700 -3717328 -1037279 437921
35168 437921 -1068393 -2904901 -1330330 3355543 7480286 8810933 8139336 6560445
35160 6560445 4090200 1551159 1123663 3399239 5677184 5100184 2380982 479736
35152 479736 333259 129337 -1291936 -2662819 -2628974 -1936527 -2077858 -3099620 -3982670
35143 -3982670 -4173052 -3640871 -2473468 -1536791 -2304083 -4585391 -5739920 -4051924 -1656682
35134 -1656682 -1672712 -3452986 -3796978 -2379873 -2196189 -4104359 -4960142 -2875741 -621758
35125 -621758 -1110472 -2585712 -1745637 556281 529697 -2867724 -7026492 -9682547 -10425506
35116 -10425506 -8912049 -5333448 -2511244 -3575298 -7006318 -7844275 -4885732 -2764729
35108 -2764729 -5017602 -8767857 -9076728 -5641719 -1947953 15980 675708 42012 -2217026
35099 -2217026 -4315424 -3446988 255077 3542000 4274681 3441095 2512213 1292407 -576253
35090 -576253 -2082968 -2205641 -1337131 -181371 1435013 3435540 4451943 3431354 1476492
35081 1476492 627836 1349556 2541018 3463846 4049013 3603691 1191366 -2254726 -4023281
35072 -4023281 -2935545 -1211212 -1560670 -3362437 -3640548 -1602317 -99978 -1877165
35064 -1877165 -6052322 -9554785 -10790727 -10306320 -8735140 -6246992 -4014201 -3984736 -6154463
35055 -6154463 -7621650 -5854932 -2106265 -73828 -1434037 -4079651 -4917404 -3131137
35047 -3131137 -95091 2854294 5327522 6903273 6726381 4876124 3304108 4059626
35039 4059626 6506524 7573747 5462911 2080658 636434 1520384 2120968 558660
35031 558660 -2189075 -4389714 -6033057 -7858459 -8994921 -7420787 -2849310 2182005
35023 2182005 4722107 4297403 2844441 2082288 1705995 524274 -1219784 -1807550 -603054
35014 -603054 568512 -313687 -2673201 -4299340 -4523250 -4484733 -4371643 -2811383 258971
35005 258971 2459983 2164286 904269 812791 1362322 852907 -255253 -208889 634412
34996 634412 273153 -1103912 -808255 1969353 4151305 2761994 -916246 -2971734 -1563524
34987 -1563524 1585075 3716161 3671731 2314769 1388940 1886317 3026126 3193521 2165708
34978 2165708 1513745 2134253 2485493 647385 -2517268 -4027621 -2701230 -678439 -242779
34969 -242779 -618858 426679 2565851 2813219 28378 -2710217 -2150424 195005 84308
34960 84308 -2805277 -3856273 -440365 3583065 3199316 -416850 -1756873 1075069 4447758
34951 4447758 4992990 3092436 78757 -3663223 -6396585 -5252460 -1221810 126855
34943 126855 -3780450 -7936325 -6879357 -3013731 -2370822 -4508088 -3408610 2044718
34935 2044718 5662144 3650954 189102 49433 1268091 -179726 -2667085 -1615310
34927 -1615310 2400191 4008784 928855 -3527840 -6143046 -7491001 -8825470 -9109228
34919 -9109228 -7070002 -3615328 -451941 1809014 2941453 2473033 1047879 521983
$$ [...]
##END NTUPLES=NMR SPECTRUM
##END=
