##TITLE=31Pdec_PhBDP2110
 CDCl3, 24 sc
 22.10.2020
##JCAMPDX= 6.0         $$ Bruker NMR JCAMP-DX V2.0
##DATA TYPE= NMR SPECTRUM
##DATA CLASS= NTUPLES
##ORIGIN= UXNMR, Bruker Analytische Messtechnik GmbH
##OWNER= root
$$ XWIN-NMR		Version 3.5
$$ Thu Oct 22 10:31:22 2020 Russian Standard Time (UT+4h)  she@DPX200
##.OBSERVE FREQUENCY= 81.013821
##.OBSERVE NUCLEUS= ^31P
##.ACQUISITION MODE= SIMULTANEOUS
##.ACQUISITION SCHEME= undefined
##.AVERAGES= 24
##.DIGITISER RES= 17
##SPECTROMETER/DATA SYSTEM= spect
##.PULSE SEQUENCE= zgpg30
##.SOLVENT NAME= CDCl3
##.SHIFT REFERENCE= (INTERNAL, CDCl3, 0, 182.463)
##AUDIT TRAIL= $$ (NUMBER, WHEN, WHO, WHERE, WHAT)
$$ ##TITLE= Audit trail, XWIN-NMR		Version 3.5
$$ ##JCAMPDX= 5.01
$$ ##ORIGIN= Bruker BioSpin GmbH
$$ ##OWNER= she
$$ F:/spectra/data/she/nmr/P31/1/pdata/1/auditp.txt
$$ ##AUDIT TRAIL=  $$ (NUMBER, WHEN, WHO, WHERE, WHAT)
(   1,<2020-10-22 10:28:40.81 +0400>,<she>,<DPX200>,
      <created by zg, POWCHK disabled, PULCHK disabled
       configuration hash MD5:
       00 E9 B6 7A A2 85 ED C7 34 08 36 98 17 FE 4E 26
       data hash MD5: 32K
       5A FC C2 C8 03 D2 D2 36 CF BE D9 44 55 6E A9 39>)
(   2,<2020-10-22 10:28:43.32 +0400>,<she>,<DPX200>,
      <Start of raw data processing
       efp BC_mod = 2 LB = 1 FT_mod = 6 PKNL = 1 PHC0 = -2382.834 PHC1 = 64.80058 SI = 64K 
       data hash MD5: 64K
       9A 24 AA 3A 1A 44 80 6D 31 1B 40 C4 77 F1 69 EA>)
(   3,<2020-10-22 10:29:01.28 +0400>,<she>,<DPX200>,
      <pk PHC0 = -56.5045 PHC1 = 135.2 
       data hash MD5: 64K
       85 6B E0 D2 6D 3A 16 43 C2 A1 C7 E0 FF 67 DC 2B>)
$$ ##END=
$$ 
$$ hash MD5
$$ 32 43 80 52 5F 6B DC 1B 3B A0 F4 8D 98 FD 05 3C
##$RELAX= 
##$RELAX= 
##$RELAX= 
##$RELAX= 
##$RELAX= 
##$RELAX= 
##$RELAX= 
##$RELAX= 
$$ Bruker specific parameters
$$ --------------------------
##$DU= <F:/spectra>
##$EXPNO= 1
##$NAME= <P31>
##$PROCNO= 1
##$TYPE= <nmr>
##$USER= <she>
##$AMP= (0..31)
100 100 100 100 100 100 100 100 100 100 100 100 100 100 100 100 100 100 
100 100 100 100 100 100 100 100 100 100 100 100 100 100 
##$AQSEQ= 0
##$AQ_mod= 1
##$AUNM= <au_zg>
##$AUTOPOS= <>
##$BF1= 81.014009
##$BF2= 200.13
##$BF3= 200.13
##$BF4= 200.13
##$BF5= 200.13
##$BF6= 200.13
##$BF7= 200.13
##$BF8= 200.13
##$BYTORDA= 1
##$CFDGTYP= 0
##$CFRGTYP= 5
##$CHEMSTR= <none>
##$CNST= (0..31)
1 1 145 1 1 1 1 1 1 1 1 1 1 1 1 1 1 1 1 1 1 1 1 1 1 1 1 1 1 1 1 1 
##$CPDPRG= <waltz16>
##$CPDPRG1= <>
##$CPDPRG2= <waltz16>
##$CPDPRG3= <>
##$CPDPRG4= <mlev>
##$CPDPRG5= <mlev>
##$CPDPRG6= <mlev>
##$CPDPRG7= <mlev>
##$CPDPRG8= <mlev>
##$CPDPRGB= <>
##$CPDPRGT= <>
##$D= (0..31)
0 1 0 0 0 0 0 0 0 0 0 0.03 2e-05 3e-06 0 0 0 0 0 0 0 0 0 0 0 0 0 0 0 0 
0 0 
##$DATE= 1603348120
##$DBL= (0..7)
120 120 120 11 120 120 24 19 
##$DBP= (0..7)
150 150 150 150 150 150 150 150 
##$DBP07= 0
##$DBPNAM0= <>
##$DBPNAM1= <>
##$DBPNAM2= <>
##$DBPNAM3= <>
##$DBPNAM4= <>
##$DBPNAM5= <>
##$DBPNAM6= <>
##$DBPNAM7= <>
##$DBPOAL= (0..7)
0.5 0.5 0.5 0.5 0.5 0.5 0.5 0.5 
##$DBPOFFS= (0..7)
$$ [...]
##$SUBNAM2= <"">
##$SUBNAM3= <"">
##$SUBNAM4= <"">
##$SUBNAM5= <"">
##$SUBNAM6= <"">
##$SUBNAM7= <"">
##$SUBNAM8= <"">
##$SUBNAM9= <"">
##$SW= 369.568048894756
##$SWIBOX= (0..15)
0 1 3 0 0 0 0 0 0 0 0 0 0 0 0 0 
##$SW_h= 29940.119760479
##$TD= 32768
##$TD0= 1
##$TE= 0
##$TE2= 300
##$TE3= 300
##$TEG= 300
##$TL= (0..7)
0 120 53 12 22 120 120 120 
##$TP= (0..7)
150 150 150 150 150 150 150 150 
##$TP07= 0
##$TPNAME0= <>
##$TPNAME1= <>
##$TPNAME2= <>
##$TPNAME3= <>
##$TPNAME4= <>
##$TPNAME5= <>
##$TPNAME6= <>
##$TPNAME7= <>
##$TPOAL= (0..7)
0.5 0.5 0.5 0.5 0.5 0.5 0.5 0.5 
##$TPOFFS= (0..7)
0 0 0 0 0 0 0 0 
##$TUNHIN= 0
##$TUNHOUT= 0
##$TUNXOUT= 0
##$USERA1= <user>
##$USERA2= <user>
##$USERA3= <user>
##$USERA4= <user>
##$USERA5= <user>
##$V9= 5
##$VALIST= <valist>
##$VCLIST= <CCCCCCCCCCCCCCC>
##$VD= 0
##$VDLIST= <DDDDDDDDDDDDDDD>
##$VPLIST= <PPPPPPPPPPPPPPP>
##$VTLIST= <TTTTTTTTTTTTTTT>
##$WBST= 1024
##$WBSW= 4
##$XGAIN= (0..3)
0 0 0 0 
##$XL= 0
##$YL= 0
##$YMAX_a= 20449
##$YMIN_a= -17829
##$ZGOPTNS= <>
##$ZL1= 120
##$ZL2= 120
##$ZL3= 120
##$ZL4= 120
##$ABSF1= 0
##$ABSF2= 0
##$ABSG= 0
##$ABSL= 0
##$ALPHA= 0
##$AQORDER= 0
##$ASSFAC= 0
##$ASSFACI= 0
##$ASSFACX= 0
##$ASSWID= 0
##$AUNMP= <proc_1d>
##$AZFE= 0.1
##$AZFW= 0.5
##$BCFW= 0
##$BC_mod= 2
##$BYTORDP= 0
##$COROFFS= 0
##$CY= -3
##$DATMOD= 1
##$DC= 0
##$DFILT= <>
##$DTYPP= 0
##$F1P= 0
##$F2P= 0
##$FCOR= 1
##$FTSIZE= 65536
##$FT_mod= 6
##$GAMMA= 0
##$GB= 0
##$INTBC= 1
##$INTSCL= 5.30512e-09
##$ISEN= 30
##$LB= 1
##$LEV0= 0
##$LPBIN= 0
##$MAXI= 10000
##$MC2= 0
##$MEAN= 0
##$ME_mod= 0
##$MI= 50
##$NCOEF= 0
##$NC_proc= -6
##$NLEV= 6
##$NOISF1= 182.463
##$NOISF2= 159.3651
##$NSP= 0
##$NTH_PI= 0
##$NZP= 0
##$OFFSET= 182.463
##$PC= 4
##$PHC0= -2439.338
##$PHC1= 200.0006
##$PH_mod= 1
##$PKNL= yes
##$PPARMOD= 0
##$PSCAL= 0
##$PSIGN= 0
##$REVERSE= no
##$SF= 81.014009
##$SI= 65536
##$SIGF1= 159.3651
##$SIGF2= -187.1042
##$SINO= 113.3802
##$SIOLD= 16384
##$SREGLST= <1H.CDCl3>
##$SSB= 0
##$STSI= 65536
##$STSR= 0
##$SW_p= 29940.119760479
##$SYMM= 0
##$S_DEV= 0
##$TDeff= 32768
##$TDoff= 0
##$TI= <>
##$TILT= no
##$TM1= 0
##$TM2= 0
##$TOPLEV= 0
##$USERP1= <user>
##$USERP2= <user>
##$USERP3= <user>
##$USERP4= <user>
##$USERP5= <user>
##$WDW= 1
##$XDIM= 65536
##$YMAX_p= 463912863
##$YMIN_p= -20612418
$$ End of Bruker specific parameters
$$ ---------------------------------
##NTUPLES= NMR SPECTRUM
##VAR_NAME=  FREQUENCY,     SPECTRUM/REAL,   SPECTRUM/IMAG
##SYMBOL=    X,             R,               I
##VAR_TYPE=  INDEPENDENT,   DEPENDENT,       DEPENDENT
##VAR_FORM=  AFFN,          ASDF,            ASDF
##VAR_DIM=   65536,         65536,           65536
##UNITS=     HZ,            ARBITRARY UNITS, ARBITRARY UNITS
##FACTOR=    0.456856943014862, 1,           1
##FIRST=     14782.0589164895, 0,            0
##LAST=      -15158.0608439895, 0,           0
##MIN=       -15158.0608439895, -20612418,   0
##MAX=       14782.0589164895, 463912863,    0
$$ Real data points
##PAGE= N=1
##DATA TABLE= (X++(R..R)), XYDATA
$$ [...]
44909 5109 156269 -867257 -2397827 -3328993 -2428449 490689 3542374 4194181 2257128
44900 2257128 278761 321959 1610733 2252400 1967983 1763112 1899207 1802197 1474197
44891 1474197 1508767 1911227 2110220 1942003 1574792 798070 -451946 -1191504 -364090
44882 -364090 1361190 2081128 1063885 -537034 -1546581 -2089104 -2594054 -2632722 -1586401
44873 -1586401 177578 1640895 2416444 3020432 3783782 3991949 2613789 -71659 -2166193
44864 -2166193 -2090527 -512987 558957 480418 524978 1531574 2504546 2348856 1596383
44855 1596383 1202853 807571 -335513 -1611323 -1850014 -1225235 -727985 -316372 658275
44846 658275 1623315 1349823 219545 -81373 710469 1022191 172617 -517470 -136060
44837 -136060 223085 -511323 -1382976 -981860 151056 447924 5525 511532 2400820
44828 2400820 3668968 2317127 -865611 -2999213 -2519644 -977170 -888210 -2438831 -3456009
44819 -3456009 -2574960 -999511 -510666 -1097096 -1699019 -2163923 -2935866 -3563512 -3162852
44810 -3162852 -1929278 -696607 512103 1920358 2602450 1577267 -136851 -661336
44802 -661336 -123329 -73453 -347830 647449 2410806 2394400 441899 -190893 2090916
44793 2090916 4258581 3101373 -50873 -1862103 -2062038 -2715132 -3875148 -3492192 -1231946
44784 -1231946 690421 654565 -763508 -2432507 -3779968 -4195901 -3379837 -2484595 -3061621
44775 -3061621 -4687393 -5388452 -4513874 -3332235 -2642615 -1858041 -923025 -1024939 -2422720
44766 -2422720 -3334347 -2236953 21887 1629301 2262001 2811233 3351363 2814440 682037
44757 682037 -2000483 -3665362 -3870301 -3539918 -3568856 -3577088 -2591940 -828283 193589
44748 193589 -324447 -1383549 -1870174 -2167932 -2949359 -3489170 -2811715 -1656420 -1364624
44739 -1364624 -1406149 -246108 1556875 1614134 -573093 -2574600 -2553485 -1652480 -1716204
44730 -1716204 -2597916 -3210338 -3624941 -4387848 -4871847 -4048607 -2286159 -947926 -583020
44721 -583020 -604227 -420286 -58131 2417 -842349 -2535052 -3690344 -2873596 -895511
44712 -895511 -201170 -1259870 -1620819 25219 1077459 -1238931 -5067082 -6017401 -3293207
44703 -3293207 -384292 330129 262690 1105160 1903871 1396125 665794 1150776 1789367
44694 1789367 647875 -1692955 -2858277 -2264797 -1580338 -1614696 -1110762 697325 2324895
44685 2324895 2069377 459060 -686666 -757191 -491485 -173531 679367 1765025 1711358
44676 1711358 66459 -1560603 -1399709 118623 1054317 623085 -163646 -515295 -981909
44667 -981909 -1892071 -2034335 -237852 2444227 3649885 2696756 1286548 1021681 1550885
44658 1550885 1803539 1897662 2691424 4007150 4500622 3340081 1213958 -512591 -1116224
44649 -1116224 -828442 -253676 256661 755492 1316901 1611621 1224883 517498 558531 1649405
44639 1649405 2470095 1623012 -287652 -1307138 -867526 -498316 -1357815 -2493880 -2559766
44630 -2559766 -2007830 -2070644 -2396722 -1551626 386600 1645943 1435941 1018528 1460470
44621 1460470 1974713 1554038 853309 1035563 1728435 1689693 935493 627212 1021769 1010815
44611 1010815 -128653 -1725737 -2771637 -3044870 -2864620 -2520099 -2306590 -2502466 -2931093
44602 -2931093 -2926427 -1984262 -295222 1277929 1596150 96934 -2257426 -3441414 -2545062
44593 -2545062 -992685 -689222 -1535620 -2013578 -1730518 -1758107 -2567258 -3358231 -3657184
44584 -3657184 -3907423 -4104523 -3556686 -2563428 -2563594 -3789503 -4511604 -3645586 -2349668 -1733663
44574 -1733663 -819602 1367682 3230509 2428291 -637601 -3409132 -4622665 -4957946 -4707235
44565 -4707235 -3278047 -1146714 -11724 -438372 -1182851 -1357115 -1519849 -2094969 -2489383
44556 -2489383 -2507395 -2959399 -3995332 -4410300 -3596953 -2705786 -2761056 -3032124 -2518933 -1710181
44546 -1710181 -1419085 -1097938 -9154 905851 224617 -1507676 -2434168 -2129369 -1765146
44537 -1765146 -1707422 -1044589 211964 545041 -659466 -1903258 -1831891 -1167856 -1130021
44528 -1130021 -1294637 -645169 258495 50377 -997945 -1239229 -327124 243864 -347111
44519 -347111 -972173 -604983 -91100 -670326 -1903137 -2464884 -2211152 -2027052 -2177871
44510 -2177871 -2282971 -2573871 -3624913 -4934050 -5302899 -4676267 -4063324 -3535707 -2086411
44501 -2086411 134964 1378017 851800 -174157 -833069 -2149787 -4564583 -6087846
44493 -6087846 -5130580 -3392628 -3241256 -3670470 -2107426 712596 1466625 -273977 -1275339
44484 -1275339 -111824 589087 -977938 -2465356 -1496518 111361 -469004 -2184410 -2152279
44475 -2152279 -830111 -999495 -2474734 -2158050 456101 1942198 206366 -2435545
44467 -2435545 -3086963 -2221044 -1798290 -1892697 -1566728 -1318274 -2127949 -3131384 -2593710
44458 -2593710 -674737 787390 967802 782499 1074634 1633222 1991127 1856732 808036
44449 808036 -1175275 -2959951 -3311984 -2612586 -2208066 -2200688 -1504952 -160118 350568
44440 350568 -321803 -464626 857885 1795982 328876 -2349982 -3225495 -1664179 41966
44431 41966 359395 425908 1511983 2655461 2366895 1273188 1138096 1935616 1913981 582050
44421 582050 -258266 885104 3038192 4246438 4210831 4197218 4804318 5074715 3904069
44412 3904069 1499678 -755159 -1423959 -72758 2230736 3532307 2739829 805358
44404 805358 -397754 -327286 -154786 -837983 -1771515 -1837435 -1019156 -269995 -276318 -1027295
44394 -1027295 -2201099 -3229724 -3251808 -1821822 335801 1911251 2356656 2118616 1652105
44385 1652105 961978 212289 -26845 446882 1009235 977502 451386 -7131 -171318 -174349
44375 -174349 -2813 530094 1370930 2149947 2501031 2248923 1433321 439829 -35872 447058
44365 447058 1481772 2019600 1272029 -584961 -2467456 -3125371 -2156484 -473603 558276
44356 558276 655230 815532 1637282 2113693 955738 -1327616 -2818347 -2599490 -1610082
44347 -1610082 -946642 -613449 -461495 -1006907 -2304689 -3114472 -2511621 -1513474 -1568644
44338 -1568644 -2027484 -1032705 1148267 1838239 -254631 -2830270 -2979844 -1087091 -42217
44329 -42217 -1221539 -3053401 -3604337 -2982439 -2544802 -2802832 -3036844 -2570747 -1639072
44320 -1639072 -930821 -706152 -620640 -357368 -170942 -550204 -1433085 -2162540 -2312262 -2120691
44310 -2120691 -1925259 -1677916 -1346810 -1250418 -1484540 -1496269 -832601 109035 720232 1094608
44300 1094608 1496485 1412774 247051 -1313015 -1901638 -1450122 -1238212 -1769213 -2021943
44291 -2021943 -1374270 -847644 -1418438 -2215880 -1721268 -82327 1144507 1292139 1338100
44282 1338100 2254464 3623072 4276624 3746799 2708365 2124243 2031099 1319119 -824122
44273 -824122 -3297902 -3886853 -2120283 -199313 -96286 -834955 -235486 1424839 1660079
44264 1660079 -339836 -2340490 -2322603 -1102319 -418342 -129116 803240 1675139 725477
44255 725477 -1723623 -3019181 -1692168 494411 1051138 54045 -439532 449819 1427609
44246 1427609 1194068 207145 -301009 -95292 124685 5689 -165479 -238774 -376490 -417266
44236 -417266 99397 1045054 1579610 1251552 551244 -197 -578359 -1351647 -1810603 -1547735
44226 -1547735 -1061606 -931689 -789603 -75404 796752 1203489 1614796 2578035 2871659
44217 2871659 742310 -2906285 -4846444 -3873784 -2671291 -3890239 -6219860 -6396280
44209 -6396280 -3884740 -1234767 -346279 -743130 -1584273 -3057770 -4964229 -5740715 -4246064
44200 -4246064 -1590180 -9471 -324021 -1323261 -1408662 -196817 1379726 2055277 1276857
44191 1276857 -445581 -2080568 -2894584 -2754755 -1952149 -1039512 -592103 -692426 -794886
44182 -794886 -475401 -67935 -96086 -395762 -438854 -242183 -181188 -131417 271322 619583
44172 619583 66978 -1174814 -1738913 -878569 586059 1521755 1781939 1734802 1407196
44163 1407196 860269 707280 1383087 2335795 2726435 2600093 2622466 2894078 2755738 1710081
44153 1710081 -17259 -1790044 -3009018 -3341536 -2901762 -2168102 -1509649 -966707 -638729
44144 -638729 -884553 -1816223 -2973951 -3860129 -4396589 -4495588 -3744961 -2131378 -567113
44135 -567113 125320 416497 1327186 2656801 3051108 2043119 988345 1357297 2796207
44126 2796207 3661488 3135406 1992412 1245496 794640 -109054 -1449231 -2201629 -1650060
44117 -1650060 -407638 315440 154001 -276079 -532800 -869560 -1398592 -1483497 -560841
44108 -560841 831150 1482021 846716 -526082 -1800511 -2581790 -2831132 -2611062 -2228943
44099 -2228943 -2315083 -3291000 -4716289 -5518847 -5122848 -4134218 -3563956 -3560658 -3469324 -3042034
44089 -3042034 -2710479 -2464534 -1608606 -333107 -318862 -2449051 -4824576 -4804043 -2553196
44080 -2553196 -663717 -427753 -650491 -410861 -625463 -1892588 -2865402 -2211369 -643334
44071 -643334 400063 764270 946910 775386 96345 -459368 -727077 -1644547 -3237301
44062 -3237301 -3605113 -1718658 418555 574000 -328137 -152448 657345 321589 -485737
44053 -485737 257493 1675651 846719 -2035067 -3418979 -2033358 -712644 -1256928 -1476956
44044 -1476956 479792 2485228 1991158 344504 355328 1737240 2231284 1679466 1750321
44035 1750321 2641616 3042091 2698096 2369117 1875310 735428 77356 1226284 2890738
44026 2890738 2574650 572853 -334839 720555 1557713 748224 -313100 -203310 246256
44017 246256 -19417 -61512 1416838 3617872 4551226 3546131 1580828 -111485 -678238
44008 -678238 236266 1778962 1973021 -193461 -3136478 -4283649 -3083819 -1327319 -564125
43999 -564125 -383207 374955 1638454 2146827 1164021 -619284 -2042941 -2754646 -3091911
43990 -3091911 -3104767 -2465971 -1324525 -409287 33409 704901 2200573 4034628 5142235
43981 5142235 4885780 3336830 1279162 168675 1032111 2868213 3292971 1530338 -483374
43972 -483374 -943241 -679644 -1374014 -2660058 -2984794 -2382769 -2210914 -2710984 -2971734
43963 -2971734 -2854018 -2787848 -2112552 -21784 2160767 2311128 1012079 822780 1871639
43954 1871639 1455417 -1197433 -3184067 -2442390 -817641 -599710 -915275 -75267 1011485
43945 1011485 672701 -269737 -89325 591633 202762 -478738 275588 1438939 441752
43936 441752 -2322275 -3723529 -2741616 -1691612 -2080848 -2541456 -1926238 -1387990 -1837668
43927 -1837668 -1981269 -744364 529728 302223 -536459 -360572 333686 17950 -938706
43918 -938706 -768767 710757 1776114 1459934 677705 420522 420618 139873 -198610 -271551
43908 -271551 -438810 -1118084 -1926531 -2125005 -1665882 -1267206 -1484309 -2064153 -2334731 -2077118
43898 -2077118 -1784662 -1944124 -2274753 -2085818 -1385822 -1094881 -1857961 -3072852 -3541124
43889 -3541124 -2850206 -1713908 -1118380 -1486300 -2510259 -3429203 -3560558 -2850245 -1801062
43880 -1801062 -737986 452517 1554957 1620053 123920 -1799736 -2279321 -893892 946581
43871 946581 1925217 2131376 2129054 1854777 1271775 1197092 2234177 3321161 2696636 374862
43861 374862 -1525324 -1297553 424767 1729464 1641539 686566 -161642 -381128 -20386
43852 -20386 509560 835251 1079850 1716374 2787447 3637211 3664140 2949664 1903486 780666
43842 780666 -123687 -349984 166955 805694 912180 366000 -688438 -1986276 -2740533
43833 -2740533 -2042196 -226634 1104703 1088089 562872 285395 -411489 -1934125 -2911314
43824 -2911314 -2221014 -1264439 -1900321 -3059404 -2152622 611980 2301327 1720528 783897
43815 783897 901331 1021592 264296 -432471 -665599 -1739866 -3751992 -4233266 -1919696
43806 -1919696 563415 392041 -1125408 -799290 1415367 2674138 1535018 -855531
43798 -855531 -3192452 -4972366 -5534097 -4652053 -3726755 -4140183 -4961754 -4524717 -3451413
43789 -3451413 -3428995 -3728808 -2151872 781119 1954286 340475 -1599629 -1865550 -1226051
43780 -1226051 -654717 543198 2617521 3963875 3486930 2369326 2049788 2247475 2233060
43771 2233060 2221126 2243010 1415100 -396291 -1794309 -1804552 -973782 264741 2262791
43762 2262791 4278269 4324549 2209575 327457 -34289 -531089 -2101716 -2456770 51695
43753 51695 2693978 1937345 -1148223 -2700407 -1918411 -1302769 -1843949 -1910142 -928114
43744 -928114 -517621 -1357175 -2003674 -1581745 -965250 -596874 267708 1366113 1054521
43735 1054521 -828067 -2065768 -1246863 248636 703316 546507 944903 1609433 1598227
43726 1598227 1043710 651438 506494 557415 1204865 2228819 2221463 410242 -1846553
43717 -1846553 -2680805 -2051143 -1175953 -386714 918650 2527043 3155942 2175537 558315
43708 558315 -259758 49418 468625 -246883 -2157107 -3770461 -3423096 -1125835 1454023
43699 1454023 2937237 3409988 3433985 2919845 1744268 690414 726007 1679781 2529386
43690 2529386 2830911 3053728 3531966 3837605 3413364 2365711 1346145 779851 365724
43681 365724 -567575 -2131968 -3474176 -3615562 -2610506 -1454347 -886811 -799109 -836254
43672 -836254 -955099 -1188254 -1402223 -1544268 -1710215 -1832407 -1759462 -1707588 -2059911 -2626961
43662 -2626961 -2746263 -2257180 -1726326 -1573511 -1671999 -1924788 -2431239 -2938034 -3008551 -2868961
43652 -2868961 -3043610 -3029591 -1737299 344558 1087041 -287369 -1813390 -1697385 -986440
43643 -986440 -1443034 -2158454 -869961 1975364 3305666 1807441 -394616 -1257569 -1631496
43634 -1631496 -3140475 -5208999 -6104538 -5654054 -4868744 -3618356 -885369 2703104 4658069
43625 4658069 3618058 1108088 -510435 -726242 -559312 -473401 61087 1175926 2001554
43616 2001554 1736347 566658 -795450 -1955136 -2891680 -3557994 -3746345 -3187975 -1745692
43607 -1745692 164980 1391559 914399 -863710 -2291143 -2268197 -1308246 -483752 -102354
43598 -102354 -20204 -405437 -1225496 -1693559 -1422608 -1521319 -3045179 -4766026 -4341661 -1757645
43588 -1757645 387913 531778 21925 343042 529162 -875673 -2833689 -3081039 -1606659
43579 -1606659 -549992 -778664 -755875 771952 2808930 3627633 2920878 1610285 486339
43570 486339 -204332 -548807 -960156 -1798118 -2654060 -2764186 -2416729 -2885441 -4369673
43561 -4369673 -5152444 -3867444 -1710864 -1033406 -2219115 -3424252 -3297020 -2435965 -1815351
43552 -1815351 -1221443 -168433 636587 -16516 -2034371 -3976168 -4797255 -4743684 -4393340
43543 -4393340 -3742714 -2758841 -2126553 -2589265 -3733595 -4206758 -3307734 -1832712 -1075562
43534 -1075562 -1385555 -2093047 -2620443 -3138778 -4005753 -4965827 -5347024 -5019521 -4696396
43525 -4696396 -4965360 -5315476 -4674790 -2893139 -1068539 -160722 124861 609961 1313472
43516 1313472 1529072 953996 27422 -759678 -1267123 -1513753 -1712668 -2364829 -3562156
43507 -3562156 -4275185 -3246533 -731072 1506222 2096841 1111394 -865049 -3426657 -5627910
43498 -5627910 -5933967 -3957877 -1329957 264399 1139960 2535688 4249195 4887429 4129395
43489 4129395 3127411 2626233 2225031 1786663 2003875 2852693 2886553 1212888 -828663
43480 -828663 -1347192 -694668 -1012300 -2968597 -4543249 -3842677 -1932935 -1464070 -2897642
43471 -2897642 -3730038 -1924320 1278296 3107183 2911744 2480052 2993256 3480045 2831961
43462 2831961 1763021 1594828 2094662 1874916 515342 -864777 -1003390 363045 2498548
43453 2498548 4008184 3525588 1051044 -1525194 -2158351 -883967 465076 647191 207614
43444 207614 275019 1061792 1782625 1480205 -113238 -2065534 -2844336 -2052926 -1148353
43435 -1148353 -1559305 -2593441 -2449498 -921959 482894 1057118 1744581 3143085 4415553
43426 4415553 4915217 5281223 5917210 5818566 4184794 2089801 1195271 1578340 2054989
43417 2054989 1990740 1635215 1261744 1071550 1362880 1767078 1060605 -1069575 -2870598
43408 -2870598 -2583273 -942174 79182 402806 1597582 3672030 4527233 3177572 1316895
43399 1316895 626048 448425 -422326 -1293619 -812222 419171 560670 -541547 -1154773
43390 -1154773 -491272 82344 -720128 -2097320 -2346035 -1168164 168998 491027 -305271
43381 -305271 -1681642 -3104777 -4213099 -4803295 -4788070 -4088864 -2778088 -1472790 -1144550
43372 -1144550 -2044152 -3088701 -2936779 -1590245 -305499 100388 140060 608578 1324958
43363 1324958 1427768 483077 -1243416 -3265688 -4970208 -5431954 -3980954 -1236631 967083
43354 967083 1173873 -279109 -1705214 -1919652 -1443815 -1691031 -3002837 -3930525 -2969167
43345 -2969167 -779501 262199 -928296 -2579417 -2424356 -880609 -466318 -2232419
43337 -2232419 -4346233 -4656631 -3263070 -1661445 -501529 491791 1045335 361438 -1323830
43328 -1323830 -2484508 -2085154 -796947 61352 153439 68499 25610 -595662 -2294736
43319 -2294736 -4451018 -5627314 -4919153 -2926085 -1266854 -1053350 -1916686 -2609247 -2349657
43310 -2349657 -1285335 148098 1667002 2774075 2668981 1175069 -608499 -1355263
43302 -1355263 -1123883 -1152396 -2008445 -2853607 -2855728 -2365915 -2045377 -1711621 -993695 -387355
43292 -387355 -476496 -705280 -334074 -116266 -1222212 -2710716 -2323339 -194730 692772
43283 692772 -1077182 -2836811 -1627485 1426084 2960921 2184951 1068841 588612 -166469
43274 -166469 -1251232 -1272193 -158917 119531 -1361458 -2877496 -2670960 -1263168 -15624
43265 -15624 789641 1179765 585594 -791128 -1279524 -51092 1256767 958486 28724
43256 28724 351445 1358637 880159 -1091872 -2023607 -550212 1591478 2180172 1427462
43247 1427462 1122142 1868702 2481294 1913412 757763 377335 962097 1214450 272647
43238 272647 -772592 -229839 1689637 3030558 2793619 1992308 1622277 1213152 293849
43229 293849 -216226 622066 2139574 3096484 3366278 3342230 2719244 1315578 188303
43220 188303 383835 1318725 1847952 2101257 2690609 2994529 2083368 645776 51496
43211 51496 69297 -477760 -1307403 -1134810 -225829 -179025 -1188326 -1810776 -1605434 -1687413
43201 -1687413 -2291530 -2111050 -730359 459521 648588 917915 2126124 3260214 3089540
43192 3089540 2061271 1410175 1437454 1551938 1161319 22797 -1423504 -1991123 -1161649
43183 -1161649 -348413 -1132777 -2513788 -2082253 111695 1482663 1059462 782437 1747903
43174 1747903 2219148 950025 -411896 -368858 -465211 -2595527 -5463465 -6433625 -5390231
43165 -5390231 -4153951 -3325365 -2266924 -1206587 -889757 -926140 -686304 -937618 -2361893
43156 -2361893 -3448388 -2358315 -112625 629792 -612944 -2070957 -2905448 -3762453 -4443029
43147 -4443029 -3829972 -2293718 -1635128 -2317990 -3000342 -2994685 -2928282 -2810072 -1853099 -542506
43137 -542506 -451719 -1512153 -1854367 -942391 -405821 -966478 -1046913 399601 1967010
43128 1967010 2084923 1242645 551951 -51437 -756791 -821090 -92014 75753 -967660
43119 -967660 -1633054 -540540 966953 768619 -751295 -1517753 -1041824 -677653 -1026388
43110 -1026388 -1239631 -917431 -748160 -908658 -511391 704792 1463747 632442 -1006054
43101 -1006054 -1606650 -588890 707958 846150 158833 156198 1196683 1747426 611693
43092 611693 -952357 -594870 2003043 4787098 6044509 5900849 4928723 3106299 948976
43083 948976 -21093 788973 1888361 1807395 1293015 1945854 3511268 4166431 3109795
43074 3109795 1376903 216101 -64866 325884 1038715 1363532 606649 -998188 -2318751
43065 -2318751 -2388341 -1081160 1063820 3128307 4079935 3388070 1470345 -743591 -2568428
43056 -2568428 -3713164 -4082862 -3835821 -3369508 -2930143 -2471012 -2002351 -1627185 -1160670
43047 -1160670 -394737 124840 -511536 -2076619 -3101647 -2849983 -2409096 -3001077 -4053248
43038 -4053248 -3963815 -2294854 -317752 386632 -628500 -2286955 -2812285 -1517023 182453
43029 182453 441239 -443564 -654533 -101426 -798548 -3154326 -4380921 -2427422 610713
43020 610713 1413357 162392 -369673 670470 1584628 1477506 1275917 1331125 697140
43011 697140 -770277 -1911972 -2346963 -2939345 -3705782 -3352229 -1549766 246911 952771
43002 952771 1080343 1241198 1237691 1254710 2015946 2937759 2071480 -1028210 -4121640 -5133092
42992 -5133092 -4576437 -3959545 -3409704 -2354752 -1184322 -607357 -317997 265871 727484
42983 727484 353865 -620047 -1507602 -2094707 -2159415 -1128680 695509 1654050 747518
42974 747518 -816635 -1362894 -1063942 -1133865 -1644955 -1733406 -1273427 -752831 -35603 1177305
42964 1177305 2100545 1658014 248168 -722227 -794705 -583031 -320709 202027 558763
42955 558763 173097 -293091 257266 1207225 726361 -1301062 -2667751 -1798254 242602
42946 242602 1448616 1202946 84536 -1358274 -2588733 -2855244 -2132251 -1609720 -2203470
42937 -2203470 -3091839 -2734039 -1002901 639698 930726 -60212 -1524530 -2849591 -3793310
42928 -3793310 -4317469 -4548072 -4590878 -4171697 -2728768 -186342 2447728 3662595 2899134
42919 2899134 1256359 370569 600730 776587 -114799 -1555203 -2274063 -2010804 -1815599
42910 -1815599 -2598932 -3921994 -4441306 -3321384 -1064671 979459 1855853 1682794 1080508
42901 1080508 280758 -735606 -1511863 -1416673 -771041 -722777 -1618819 -2424951 -2317628 -1904313
42891 -1904313 -2053483 -2382017 -1968572 -930450 -131810 263186 812333 1638648 2305497
42882 2305497 2632819 2643412 1947437 267647 -1560634 -2190981 -1349812 78232 1368740
42873 1368740 2376355 2872525 2638011 2162826 2156506 2416935 2237024 1731303 1532817 1412710
42863 1412710 683734 -147176 163933 1390780 1923603 1391164 1212690 1863846 1695260
42854 1695260 -269635 -2215577 -1945200 -87691 964868 485073 -79005 377160 1299339
42845 1299339 1713110 1430979 792135 167975 -15958 558608 1677363 2696211 3161052
42836 3161052 3157093 3112562 3300939 3390265 2731190 1549101 1373289 3221747 5628677 5965554
42826 5965554 3864128 1688248 1147691 1240271 458510 -754458 -1167633 -920842 -870616
42817 -870616 -861158 -310924 298705 113830 -575492 -958797 -1157748 -1635757 -1931689 -1524763
42807 -1524763 -1176915 -1698692 -2111933 -991304 879365 1270607 -284433 -2032101 -2659179
42798 -2659179 -2455338 -1823343 -654915 577268 1028543 1132626 2231320 4181106 5134449
42789 5134449 4182852 2486179 1285808 549658 129235 421632 1139460 1169564 455048
42780 455048 286600 886496 592804 -1388387 -3236922 -3032234 -1520102 -747737 -1153502
42771 -1153502 -1707587 -2025592 -2589520 -3312470 -3365737 -2349659 -740800 628867 1058504
42762 1058504 480562 -182168 37816 653673 394461 -391164 231790 2643421 4519033
42753 4519033 4031833 2346331 1405223 1027468 37000 -1375039 -2478084 -3654930 -4955790
42744 -4955790 -4507208 -1097140 2791532 3530626 1240333 -870426 -1527499 -2418353 -4223017
42735 -4223017 -5160059 -4275347 -3001223 -2252241 -827639 1819282 3788295 3448362 1803749
42726 1803749 436980 -874351 -2602483 -3466389 -2292931 -480364 -216849 -1179315 -1350028
42717 -1350028 -504995 -412147 -1515023 -1719193 684818 4378565 6341722 5173264 2301305
42708 2301305 34758 -992577 -1938076 -3333910 -3594543 -1140773 2589784 4281873
42700 4281873 3182888 2185150 3390487 4783679 3303081 -432693 -3028899 -3082110 -2344017
42691 -2344017 -2266691 -2059422 -866840 330962 264552 -578872 -743830 129669 1078935
42682 1078935 1254069 781513 300131 106099 -135561 -816986 -1578286 -1557790 -767896 -531871
42672 -531871 -1775872 -3474853 -3858664 -2737279 -1382351 -404676 708879 1884877 1962558
42663 1962558 514356 -1161244 -1659953 -1109654 -525116 -458244 -937545 -1797554 -2337179
42654 -2337179 -1590572 225054 1441775 1059645 209621 355100 961032 531587 -653556
42645 -653556 -804377 379806 1006543 -21447 -1100887 -317752 1530976 2023879 641191
42636 641191 -629297 -330178 529378 352932 -563242 -753293 -99203 -74967 -1392740
42627 -1392740 -2727617 -2420551 -648149 828642 662719 -915028 -2645702 -3466322 -3362396
42618 -3362396 -3301917 -4078769 -5123970 -5082651 -3809695 -2806246 -2950498 -2884116 -1039701
42609 -1039701 1501047 2100381 407894 -977162 -298194 854022 122459 -2023789 -3065149
42600 -3065149 -2041897 -538878 -137814 -485918 -330925 653308 1697013 1948286 1173351
42591 1173351 -146852 -1078404 -893889 281033 1659640 2652835 3215970 3351524 2793345
42582 2793345 1462323 -123366 -1257594 -1732033 -1883427 -2095855 -2500279 -3062219 -3624789
42573 -3624789 -3765356 -2912446 -955583 1300436 2677347 2807500 2459658 2388803 2238445
42564 2238445 1216532 -304467 -764202 667531 2849317 3917959 3327353 2028377
42556 2028377 972333 234093 -399547 -748267 -520910 107425 607796 729407 785407
42547 785407 1218540 1946255 2324485 1937588 1288522 1329522 2258866 3186756 3174992 2254201
42537 2254201 1217293 796321 1281376 2483240 3673462 3969928 3253160 2355123 1886206
42528 1886206 1330872 -30824 -1706268 -2396908 -1703599 -535124 246176 711859 1161761
42519 1161761 1377044 1104288 714423 755903 1108313 1124998 601446 213338 789555 2216944
42509 2216944 3303693 3023997 1848578 1306914 1998361 2711179 2133141 809764 375724
42500 375724 1158052 1774408 1181392 -81782 -1022968 -1448360 -1569646 -1394444 -1176414
42491 -1176414 -1523996 -2261951 -2097893 -454606 1137274 764750 -1197218 -2527223 -2175281
42482 -2175281 -1460743 -1954238 -3364916 -4215224 -3855994 -3039125 -2775787 -3179146 -3424683
42473 -3424683 -2660102 -970260 646071 1426877 1696358 2109600 2375471 1652081 283048
42464 283048 5156 1672540 3533885 2940934 -298551 -3330678 -3461012 -1223685 528408
42455 528408 268613 -547281 160262 2082687 3030605 2100767 827169 714641 1049061
42446 1049061 351450 -990774 -1267314 -324655 -49963 -1532718 -3319903 -3416724 -1851866
42437 -1851866 -129768 995758 1861337 2477736 2232256 1132577 192126 125162 392354
42428 392354 16559 -1095449 -2048989 -1965983 -869769 320507 652040 116727 -390641
42419 -390641 -316052 -290883 -1168651 -2498042 -2849199 -1739015 -302703 316346 349177 516672
42409 516672 549486 -363095 -1977251 -2942082 -2449916 -1107019 28804 513996 342359
42400 342359 -492367 -1650747 -2200874 -1444781 206163 1710056 2526309 2755430 2486536
42391 2486536 1810976 1343078 1718741 2372406 1867886 40263 -1164725 -50601 2213081
42382 2213081 2678170 341959 -2441657 -2734308 -288439 2578594 3709393 2918552 1454114
42373 1454114 525420 484743 939667 1367183 1626071 1819732 1744890 939525 -460677 -1379188
42363 -1379188 -868789 669883 1871889 1924281 1195707 406527 -214892 -740086 -986894
42354 -986894 -575223 548935 1847177 2484875 1965233 588183 -790285 -1576430 -1881989
42345 -1881989 -2018014 -1847092 -1031804 232383 1186587 1214055 294108 -1090678 -2120461
42336 -2120461 -1947489 -460927 1279807 1943328 1282983 127441 -788435 -1240840 -970829
42327 -970829 107412 963478 63615 -2345439 -3752256 -2319547 540042 1857926 811374
42318 811374 -795328 -1522121 -1984391 -3075241 -4088109 -3786319 -2468172 -1642648 -1853334
42309 -1853334 -1958064 -858702 814741 1340858 18144 -1883134 -2482575 -1351734 155228
42300 155228 607061 18624 -652908 -1054221 -1729321 -2909675 -3798914 -3487295 -2195190
42291 -2195190 -1188735 -1560196 -3245246 -5055102 -5574262 -4335950 -2332241 -1089544
42283 -1089544 -989600 -820708 601123 2623628 3225771 1433950 -1271582 -2394761 -1025935
42274 -1025935 1445468 3114055 3447629 3151346 2744337 2036219 955009 97207 25294
42265 25294 457405 660059 439127 265466 492331 911898 1178203 1305033 1512481 1732468
42255 1732468 1522633 597771 -604704 -1135586 -524960 616214 1328090 1444337 1430583
42246 1430583 1217493 154674 -1556145 -2403442 -1376252 429264 989558 -196299 -1710386
42237 -1710386 -2026852 -907489 755052 1621056 666959 -1753437 -3707814 -3516435 -1750041
42228 -1750041 -450872 -462030 -683312 -15011 1301465 2641328 3972989 5178472 5464419
42219 5464419 4333950 2487912 1062205 468208 422546 499609 257360 -482825 -1078718
42210 -1078718 -530827 1110161 2601084 3127052 3116395 3030060 2494141 1323311 277031
42201 277031 -96626 -374217 -1072073 -1493333 -769463 797974 2393676 3762228 4632820
42192 4632820 4151750 2161162 77417 -879150 -1408892 -2630406 -3848473 -3618793 -2281857
42183 -2281857 -1466328 -1511455 -1307396 -424839 455929 1034373 1491250 1325320 -18112
42174 -18112 -1530798 -1619193 -571370 -18140 -118371 387658 1371572 1258177 128016
42165 128016 34912 1408199 1977536 546503 -903994 -586849 126630 -774475 -2541035
42156 -2541035 -3089278 -2188849 -966387 356385 1923019 2659362 1671733 405770 1036112
42147 1036112 3155210 4190455 2858268 366945 -1563287 -2212867 -1652611 -505598
42139 -505598 348854 949013 2380647 4565690 5230273 2898976 -344724 -1396023 -412381
42130 -412381 51609 -592558 -482848 1058607 2513643 3065627 3529316 3813501 2462771
42121 2462771 -207603 -1385130 214986 1980280 949397 -2128107 -4235727 -4173300
42113 -4173300 -3215157 -2595364 -2183877 -1367545 14256 1510426 2256319 1739598 640374
42104 640374 195990 618819 1130075 1477373 1915763 1691520 -358407 -3191867 -3890106
42095 -3890106 -1719502 366953 -181824 -2040067 -2573048 -1961867 -2269178 -3716811 -4621008
42086 -4621008 -4423500 -4229935 -4425489 -3996748 -2514807 -1016147 -457727 -543357 -419614
42077 -419614 303588 1285626 1645407 779174 -528015 -653507 518716 1020693 -375926
42068 -375926 -2161252 -2398607 -1589205 -1275236 -1121423 141665 1783887 1797981 113719
42059 113719 -1511249 -2456424 -3338408 -3384880 -907660 3144269 5190379 3563781 419735
42050 419735 -1807785 -3113389 -3952018 -3503679 -1728175 -621722 -1273042 -1746016 -101470
42041 -101470 2328613 3035341 2084172 1260204 801420 -274705 -1436891 -1048883 706184
42032 706184 1801551 1426989 1017786 1952842 3925324 5879269 7171879 7640820 7657758
42023 7657758 8003106 8626885 8057092 5427306 2438344 1469320 2195670 2216570 869348
42014 869348 5196 623021 1183614 255425 -1238483 -1744131 -1449703 -1525131 -2152737 -2617020
42004 -2617020 -2496195 -1710370 -221311 1369580 1833910 952874 266390 1054955 2352628
41995 2352628 2228346 446917 -1485396 -2551413 -3108901 -3607596 -3726946 -3094841 -1914931
41986 -1914931 -517476 1010116 2422897 3176988 3139704 3049777 3765479 5118081 5881988
41977 5881988 5068472 3130486 1609967 1488244 2175289 2405872 1813326 1094454 849127
41968 849127 995165 1297776 1623837 1469821 133753 -2099348 -3580647 -2783445 36075
41959 36075 2977900 4086434 2794757 313898 -1338400 -1300768 -876210 -1802587 -3638299
41950 -3638299 -4223014 -3020461 -2239742 -3506742 -4990667 -3752985 -165121 2151183
41942 2151183 887021 -2192769 -3612901 -2080718 712643 2404580 2254524 1278899
41934 1278899 615414 137823 -1012420 -2738829 -3701829 -3063315 -1661366 -809579 -709966
41925 -709966 -816119 -932498 -957643 -321200 1123340 2295045 2234849 1619455 1548740 1515858
41915 1515858 284237 -1756971 -3078489 -3536414 -4229941 -4867975 -3720417 -731326 1661077
41906 1661077 1788669 805704 389884 345167 -170207 -825557 -1109952 -1621331 -2709061
41897 -2709061 -3181345 -2136629 -906666 -1256519 -2565745 -2803248 -1688188 -873909 -1291154
41888 -1291154 -2201928 -2834787 -3225186 -3299130 -2660062 -1569362 -901592 -901697 -1042415 -1192843
41878 -1192843 -1824141 -2887385 -3491362 -2970464 -1595234 -170400 521463 122896 -786819
41869 -786819 -947426 97099 1268628 1483548 1165981 1172229 1040576 -211311 -2129161
41860 -2129161 -3258439 -3162952 -2501599 -1582872 -571532 -653924 -2871057 -5848183 -6822435
41851 -6822435 -5197623 -3146630 -2440559 -2696055 -3097674 -3647097 -3991745 -3107129 -1143869
41842 -1143869 161711 -145168 -1025701 -1296470 -1004773 -378668 641853 1182132 -9186
41833 -9186 -1918285 -1689798 1102538 3305205 2920852 2076504 2946462 3641421 1489128
41824 1489128 -1840019 -2447281 -196715 1389097 755970 24288 866804 2138701 2356557
41815 2356557 1703253 762627 -348412 -996128 -515663 -151950 -2004852 -5390464 -6875519
41806 -6875519 -4935404 -2057662 -952931 -1128765 -858307 -273155 -364968 -618568 26079
41797 26079 861920 205004 -1982634 -3957715 -4402350 -3487421 -2093908 -1104547 -1102471 -1734543
41787 -1734543 -1679457 -131406 1974847 2911090 1955429 -276882 -2681593 -4194073 -4114512
41778 -4114512 -2701287 -1071218 -33399 493145 691133 405949 -110150 -147336 134945
41769 134945 -471932 -2242352 -3596700 -3261653 -2172816 -1904081 -2280918 -2126685 -1508032
41760 -1508032 -1439119 -1848809 -1642608 -622362 303923 810018 1454329 2111493 1652094
41751 1652094 -220945 -1943292 -1640490 807362 3637422 4840422 3875333 2015663
41743 2015663 859969 473464 -299221 -1556274 -1779631 -388003 757368 39258 -1101916
41734 -1101916 -313689 1649435 1815982 -375359 -2288170 -2280658 -1707546 -1767775 -1298151
41725 -1298151 533710 1852064 749826 -1446607 -2087664 -1109294 -486940 -681023 -365075
41716 -365075 622872 826151 -15783 -253970 710090 998353 -812951 -3029849 -2855250
41707 -2855250 -144546 2483192 2897274 1461477 -82273 -523785 230436 1570306 2716786
41698 2716786 3229196 3262737 3216963 3198803 3046220 2692697 2142731 1257072 44783 -923564
41688 -923564 -988730 -393413 -231408 -1114953 -2307954 -2528979 -1335839 564880 2068559
41679 2068559 2394211 1398921 -293217 -1586591 -1812970 -1337769 -951841 -821609 -535485
41670 -535485 -78373 -63413 -810403 -1800782 -2391198 -2585175 -2671258 -2487323 -1615686 -194772
41660 -194772 966222 1215515 780631 530433 1021651 1831799 2018532 1344061 677837
41651 677837 746510 863786 -226020 -2306237 -3570447 -2887754 -1147728 256559 1239479
41642 1239479 2330730 3050327 2395634 665531 -544944 -305224 681638 1185669 645370
41633 645370 -831506 -2737137 -4191213 -4491489 -3909158 -3300473 -2839331 -1930523 -514071
41624 -514071 499280 488331 -2703 -115924 282784 836436 1273922 1329428 792704 72617
41614 72617 -59039 250103 -154210 -1544795 -2358106 -1216153 911683 1915531 1384266
41605 1384266 738371 759907 653241 -169628 -930697 -835025 -390478 -495306 -1074266 -1513102
41595 -1513102 -1737091 -1882093 -1437519 169194 2343990 3713908 3766893 3271721 3065952
41586 3065952 3309531 4011975 5254829 6482985 6529330 5028405 3105605 1955080 1390541
41577 1390541 636545 -128254 -232751 -113773 -943777 -2538075 -3144687 -1930013 -345742
41568 -345742 -20297 -340613 513160 2701562 4385292 4236985 3008266 2249512 2450551
41559 2450551 2948212 2957624 2143723 683079 -671739 -926859 155953 1487561 1582294
41550 1582294 182636 -1348788 -1459036 -98905 1231053 1141088 -185601 -1377819 -1486519
41541 -1486519 -778933 11587 630612 1237565 1871311 2388690 2666739 2564622 1973963
41532 1973963 1176466 786691 1010095 1312660 1114913 348865 -961645 -2942960 -5098508
41523 -5098508 -6059949 -5076018 -3263401 -2365053 -2636631 -3023445 -3056224 -3209269 -3427062
41514 -3427062 -2778039 -1035245 553369 716385 -385803 -1652819 -2325391 -2322925 -1873253
41505 -1873253 -1266673 -669402 -14387 621202 682600 -222704 -1476748 -1949280 -1260390
41496 -1260390 111148 1666581 2938937 3137253 2034541 954762 1345125 2439159
41488 2439159 2081416 24227 -1561058 -1355460 -591396 -569428 -560408 395484 1423655
41479 1423655 1339273 826856 1197893 2046591 2055452 1303828 848323 616228 -330835 -1754509
41469 -1754509 -2323117 -1699398 -950576 -822046 -950649 -813155 -291068 600393 1483945
41460 1483945 1449881 255798 -785224 -434675 504066 406999 -505790 -592559 407422 1036559
41450 1036559 624232 78356 -133764 -775863 -2010749 -2614476 -1822710 -443805 543851
41441 543851 1025891 831238 -514418 -2331870 -2817736 -1560510 -395101 -580950 -800101
41432 -800101 488126 2178545 1965570 -251048 -2359002 -2987895 -2712870 -2468866 -2346556
41423 -2346556 -2112803 -1727366 -1157608 -545650 -533035 -1563197 -2933175 -3406576 -2741073
41414 -2741073 -1799350 -1204855 -767011 -302629 -147300 -558374 -1243101 -1770702 -1984558
41405 -1984558 -1790025 -1001904 248953 1220779 1061497 -318502 -1994805 -2797552 -2420886
41396 -2420886 -1681580 -1560659 -2153425 -2776704 -2850602 -2280229 -1251873 -249786 -47918
41387 -47918 -926503 -2036888 -2405185 -2425409 -3233026 -4580408 -4749403 -3019599 -820589
41378 -820589 350629 846254 1622820 2246235 1601099 -94194 -1464705 -1891245 -1972796
41369 -1972796 -2212778 -2416224 -2435744 -2503641 -2653455 -2595484 -2307895 -2083280 -1861435 -1128707
41359 -1128707 282015 1672757 1997700 852577 -1012470 -2237778 -2214397 -1802453 -2157975
41350 -2157975 -3000190 -2987449 -1850322 -869483 -819732 -860807 -281717 82656 -620328 -1593430
41340 -1593430 -1714740 -1425636 -1659936 -1932505 -1448318 -1238258 -2809365 -5063978 -5158599
41331 -5158599 -2658265 -349665 -202812 -804964 -1739 1790147 2466807 1257172 -568810
41322 -568810 -1394442 -719830 571516 929846 -199155 -1274076 -342154 2017345 3055761
41313 3055761 1700726 138572 434361 1449776 874319 -1176109 -2728879 -3113683 -3240805
41304 -3240805 -3233985 -2157287 -170208 1172167 1188116 860361 932486 944876 690282 797003
41294 797003 1017601 -200773 -3088271 -5142604 -4212483 -1832687 -1287507 -2931216 -3847908
41285 -3847908 -2284667 34732 971405 1190879 2556509 4693636 5342770 3713244 1475226
41276 1475226 251633 -129109 -385248 -433054 -257675 -801863 -2594721 -4272135 -3965927
41267 -3965927 -1903818 -233414 -179424 -671396 -251744 731533 695249 -924247 -2838387
41258 -2838387 -3369957 -2294986 -1014266 -968652 -2062290 -2896074 -2571606 -1796360 -1813285
41249 -1813285 -2625952 -2982763 -2063884 -484518 609111 959641 1384848 2734208 4834122
41240 4834122 6421043 6200235 4141948 1635326 205718 229285 958870 1360239 700729
41231 700729 -1010162 -2587215 -2346119 -124489 1863033 1321213 -1199561 -2873978 -2094306
41222 -2094306 -159830 756271 115718 -1049335 -1754290 -1940918 -2282327 -3476979 -5238293
41213 -5238293 -5980140 -4409181 -1547318 -12662 -890508 -2520320 -2990062 -2510862 -2275258
41204 -2275258 -2149154 -1071164 788236 1835327 1094780 -657206 -1994394 -2296934 -1926916
41195 -1926916 -1528922 -1375676 -1171919 -505428 467158 1134827 1327014 1468160 1560003 843686
41185 843686 -885147 -2406163 -2458814 -1473722 -921358 -1278692 -1666010 -1319132 -396896
41176 -396896 675125 1717430 2484961 2603156 2059939 1286657 696452 535200 977225
41167 977225 1750777 1865737 516181 -1716149 -3241594 -3085512 -1545855 625708 2837484
41158 2837484 4396944 4604103 3552533 2228430 1441393 1135971 976033 955693 1021144
41149 1021144 699520 -259657 -1233982 -1404866 -962639 -941944 -1685437 -2095643 -981426
41140 -981426 1119783 2245879 1361595 -305315 -872013 -132645 713094 1258206 2294195
41131 2294195 3757333 3920800 1716588 -1311992 -2778403 -2452937 -2035110 -2387412 -2629450
41122 -2629450 -1988510 -969547 -237534 365238 996891 1011138 -148417 -1795238 -2542764
41113 -2542764 -1859701 -623608 -168186 -974681 -2242304 -2716464 -1990836 -811333 9092
41104 9092 513385 1067587 1485619 1428401 1260517 1583692 2124606 2039200 1242706 493828
41094 493828 174719 -57276 -374443 -511629 -451700 -373392 124223 1588607 3376034 4054400
41084 4054400 3441557 2810449 2558485 1315514 -1602853 -4375005 -4822353 -3300483 -1797917
41075 -1797917 -980883 -28936 1057774 1183635 428711 513908 2109188 3370547 2487895
41066 2487895 456332 -319382 574525 1435875 1530830 2187913 4097862 5423218 4210666
41057 4210666 1526559 185428 790734 1182232 41446 -1150786 -762823 244141 -170798
41048 -170798 -2097926 -3888380 -4594624 -4477413 -3645801 -2032103 -528244 -383313 -1377992
41039 -1377992 -2137689 -2333897 -2967165 -4224485 -4699549 -3337356 -886363 1109621 1735987
41030 1735987 906594 -688316 -1673557 -1257033 -444644 -659892 -1398837 -1087993 -31146
41021 -31146 -23975 -871901 -272674 1984965 2916552 1084556 -661471 429266 2692373
41012 2692373 3156883 2598154 3767627 6125761 6422055 4057482 2064963 2472539 3941992
41003 3941992 4581678 4268224 3474439 2285436 1295871 1288125 1491750 330143 -1746519
40994 -1746519 -2565222 -1763836 -1348685 -2055249 -2074119 -595745 314988 -811512 -2144490
40985 -2144490 -1572985 -220790 -365853 -1549596 -1547221 -148885 752187 339050 -295706
40976 -295706 -323189 -57722 372503 1404564 2924483 4243180 5239114 6204990 6661628
40967 6661628 5752001 3828483 2275436 1669990 1406617 1187925 1467544 2161264 2332894
40958 2332894 1710165 1334841 2016575 3057106 3237901 2388259 1247321 262321 -688941
40949 -688941 -1510649 -1504537 -104281 2143891 3693339 3436264 1969125 949925 1121579
40940 1121579 1619012 1511370 1206813 1629707 2660352 3341385 3285943 2935356 2560168
40931 2560168 1883212 735914 -588626 -1706609 -2415081 -2692409 -2830793 -3322003 -4178624
40922 -4178624 -4700265 -4334695 -3287859 -1852373 72590 2081255 2875538 1984305 1020389
40913 1020389 1647306 2864328 2156868 -836602 -3731017 -4635134 -4098596 -3379812 -2659067
40904 -2659067 -1823176 -1370527 -1422898 -1138578 -175272 477259 218281 130183 1175184 2194294
40894 2194294 1414455 -673106 -1682791 -435631 1782838 3111333 2984016 1937143
40886 1937143 668197 -327489 -911609 -1371970 -1902126 -2123562 -1709491 -1215279 -1434455
40877 -1434455 -2092731 -2192398 -1678271 -1681642 -2824753 -4249985 -4761507 -4118202 -2773833
40868 -2773833 -1170641 155796 573809 206800 164126 1118935 2177953 2065951 1007801
40859 1007801 350914 511458 514231 -275633 -1181163 -1471662 -1491711 -1718683 -1608131 -508612
40849 -508612 866402 1217320 704509 803318 1919405 2547368 1453549 -477343 -1540825
40840 -1540825 -1503089 -1454954 -1875206 -2027519 -1214783 277699 1542715 1755528 676842
40831 676842 -947420 -1780331 -1368674 -822378 -1204876 -1817269 -1309045 -14367 491127
40822 491127 59892 239803 1418582 1698584 -274973 -3008548 -4148309 -3557966 -2816867
40813 -2816867 -2539246 -1948318 -724642 352131 626499 239312 -379749 -674991 170402
40804 170402 2366157 4572450 4961033 3290409 967648 -861751 -2140208 -2828336 -2397303
40795 -2397303 -882024 614160 1094295 693664 188034 167817 944132 2431502 3740635
40786 3740635 3736496 2545620 1757697 2460595 3680836 3555122 1678671 -514522 -1605587
40777 -1605587 -1678690 -1736310 -2148226 -2232053 -1388070 -121195 569388 562982 595818 853785
40767 853785 652666 -32486 59724 1538939 2838609 2131994 118472 -822000 44094
40758 44094 1161555 1403384 1488927 2177461 2827450 2666441 2135143 2027886 2358186 2856011
40748 2856011 3571375 4263268 4180904 3115422 1719157 350801 -1152389 -2136417 -1267082
40739 -1267082 1128646 2630298 1913481 713433 1051537 2115855 1882350 506315 -229884
40730 -229884 -3487 -95659 -856340 -1285607 -1044830 -831680 -729616 -124499 614579 251893
40720 251893 -1235821 -2384213 -2334571 -1647480 -839596 247914 1338126 1626786 1242601
40711 1242601 1330484 2277240 3206741 3472547 3228496 2428367 938383 -210978 400327
40702 400327 2222111 3164043 2837858 3127736 4760186 5723032 4428662 2255431 1263424
40693 1263424 1262607 986593 532664 628953 792042 218070 -550239 -727379 -1029202 -2364295
40683 -2364295 -3669063 -3079620 -675329 1757165 3081470 3193795 1838625 -907189
40675 -907189 -3488953 -4265089 -3698095 -3254123 -2674572 -648057 2115285 3133130 1801935
40666 1801935 350028 447789 1069375 691478 -337357 -861019 -814621 -746284 -518708 323213
40656 323213 1571680 2598649 3070393 2962866 2476281 2179895 2492440 2893315 2536138
40647 2536138 1666489 1315844 1527415 1194826 -121317 -1575395 -2530591 -3260465 -3782727
40638 -3782727 -3475701 -2376886 -1411580 -794129 259934 1660810 2063845 1220868 847622
40629 847622 1907726 2810493 1908428 230139 -157255 710468 1203628 870016 661510
40620 661510 943770 1236275 1631648 2621033 3607205 3309543 1711137 91538 -920311
40611 -920311 -1847207 -2854949 -3294982 -3055173 -2930292 -3161407 -2855509 -1465204 158087
40602 158087 809730 300780 -648872 -1214395 -883225 166044 799407 -126383 -2105153
40593 -2105153 -3042138 -1587433 1154406 2888497 2715121 1790371 1589507 2221284 2706963
40584 2706963 2481893 2042335 2008929 2085434 1500667 237875 -908309 -1455885 -1550871 -1063639
40574 -1063639 502776 2703997 3897467 3189654 1734889 1092432 1134540 779255 53685
40565 53685 -34203 733914 1602839 2242690 2960359 3596942 3554266 2957645 2539776 2315636
40555 2315636 1631515 629327 346294 1081865 1867946 1913296 1518208 1244315 1146060 1051966
40545 1051966 699635 -419764 -2278552 -3484729 -2619479 -413377 988886 1079624 1492821
40536 1492821 3044888 4271067 3818363 2456523 1516026 974130 436968 454950 1259624
40527 1259624 1560959 404083 -889677 -544138 817683 1188915 392640 47953 551343
40518 551343 394082 -1126318 -2518444 -2246697 -797908 334322 710925 1074819 1992600
40509 1992600 3098305 3518640 2794017 1522514 960514 1634344 2613891 2653484 1681825
40500 1681825 528187 -331550 -843217 -662055 406599 1460794 1310601 281632 -57403
40491 -57403 850070 1830743 1838271 1247853 761726 242625 -562249 -1118063 -857166 -165510
40481 -165510 242745 434882 966575 1865662 2618809 2909879 2790318 2331669 1582694 693303
40471 693303 -219106 -1047323 -1348086 -528026 1279227 3033472 3891121 3995200 3808346
40462 3808346 3353896 2712313 2544332 3208855 3865046 3486447 2458717 2047166 2393172
40453 2393172 2288099 1168996 123565 308153 1359992 2226133 2824271 3822306 5155879
40444 5155879 5902955 5654183 5022275 4564112 4085940 3394634 2845524 2489075 1489123
40435 1489123 -598898 -2519474 -2567781 -999380 170060 -57306 -544524 -225628 166747
40426 166747 -203338 -219521 1639409 4349755 5078621 2982022 350799 -560004 -102550
40417 -102550 209934 83741 48217 -78767 -690128 -1062110 -179213 1406670 2085241 1526797
40407 1526797 1047273 1440629 1894822 1610961 1207492 1598417 2364511 2271561 936551
40398 936551 -900813 -2441372 -3339920 -3383344 -2532491 -1339602 -618924 -516723 -401405
40389 -401405 202187 1044013 1647494 1900477 1937218 1852295 1784607 1906458 2048388 1708532
40379 1708532 776519 -131339 -520827 -850732 -1843736 -3119861 -3334197 -1897082 109825
40370 109825 1160076 975122 522036 647589 1278705 1880960 2171936 2237899 2247486 2192093
40360 2192093 1791449 721102 -815205 -1809624 -1191939 932779 3096035 3860055 3276623
40351 3276623 2619509 2718877 3019096 2500472 1119180 -184978 -773624 -979326 -1334995
40342 -1334995 -1722458 -1716219 -1361894 -1046507 -797509 -265298 673796 1763815 2703294 3160273
40332 3160273 2675915 1236913 -190031 -527279 -6305 164400 -375879 -724270 -419825
40323 -419825 -331665 -1127221 -1965147 -1759517 -908612 -571621 -796770 -611048 351982 1497622
40313 1497622 2361174 2935009 3003307 2255650 1092379 295482 -164693 -992788 -2146169
40304 -2146169 -2614484 -1919821 -898945 -551087 -802262 -828810 -140354 919448 1467734
40295 1467734 948488 8045 68772 1471587 2719887 2494519 1614747 1611952 2161937 1908019
40285 1908019 1294213 2013619 3570648 3318234 815496 -756762 782841 3169296 3181275
40276 3181275 1449400 914722 1946936 2238465 1017325 190804 982151 2103225 2054273
40267 2054273 1156044 404256 -40674 -348918 -355837 -197893 -498859 -1253737 -1516135 -728535
40257 -728535 605522 1979086 3472343 4757086 4750134 3168652 1507971 1437448 2735929
40248 2735929 3674934 3140974 1704302 739990 925803 1549139 1229988 -445784 -2188753
40239 -2188753 -2423781 -1207458 120062 1041699 2398216 4557699 6338194 6506421 5406681
40230 5406681 4220997 3290159 2123344 718911 -40477 599168 2290120 3730217 3773519
40221 3773519 2573192 1542362 1872757 3291154 4720523 5740082 6549257 6910175 6413919
40212 6413919 5652557 5586948 5588820 3879699 571095 -1490673 -106937 3394570 5950103
40203 5950103 6281902 5289397 4063903 3235958 3566284 5330412 7324676 8058407 7860511
40194 7860511 8374692 9988036 11220843 10909849 9717624 9064419 9566090 10927308 12544856
40185 12544856 13808340 14394036 14503562 14372766 13650505 11964446 10012050 9191050 9960142
40176 9960142 11263816 11741447 10924655 9224250 7411561 6197257 5734866 5511209 5190141
40167 5190141 5268016 6162084 7035365 6634640 5149286 4007795 3791254 3698037 3353777
40158 3353777 3672558 5167542 6658274 6750178 5804185 5361650 6117267 7446623 8587284
40149 8587284 9273565 9284036 8326795 6690580 5420961 5398464 6410487 7446512 7899226
40140 7899226 8161849 8818070 9558723 9530507 8720915 8099422 8034801 7604969 6290398 5354344
40130 5354344 6223449 8173668 9220986 9011383 9145337 10625355 12670483 14332685 15662879
40121 15662879 16825021 17594799 18264020 19527451 20934866 21114779 20233795 20429011 22773622
40112 22773622 25570381 26916390 27255524 27932454 28974769 30173264 32767850 37813529
40104 37813529 44094351 50014420 56479491 65180184 74647871 80975708 82563392 81562767
40096 81562767 80341395 79055244 77367922 76208015 76675473 78771987 82002161 85995196
40088 85995196 90391169 95730372 104404664 118754827 138627263 163923040 199632973
40081 199632973 253468651 324891338 398374930 450538100 463912863 434456267 370850045
40074 370850045 290991513 216131659 161099607 127040100 105157808 87688564 73375483
40067 73375483 63551932 57457316 53006999 49042034 44716890 38749585 31246548 24696607
40059 24696607 21225474 19874977 18144541 15270263 12476956 10795070 10131882 9949089
40051 9949089 9531496 8076437 5776159 4368289 5342133 7879054 9680640 9502302 7797073
40042 7797073 5410418 3131684 2220226 3545561 5904296 6827721 5684788 4550121
40034 4550121 5192424 6635917 6987614 6525327 7161758 9289275 11119100 11531879 11889471
40025 11889471 13942497 17013461 18679124 17946716 16477677 16500248 18591737 22040159
40017 22040159 26499318 32255362 39017604 45331495 49592176 51435053 52001685 52950103
40009 52950103 55226523 58792733 63663913 70974047 82082297 95869862 107453567 110881862
40001 110881862 103680346 88473248 70319392 53263272 39374453 29519330 23639809
39994 23639809 20590572 18828279 17510503 16495148 15450648 13714142 11160287 8580465
39986 8580465 6845129 6010122 5526379 5076628 4841437 4971014 5138245 4889221 4376024
39977 4376024 4370479 5290573 6495564 7041315 7000152 7308123 8131541 8215963 6513081 3931668
39967 3931668 2612233 3570550 5768369 7522411 8132159 7924002 7365838 6704814 6229620
39958 6229620 6273232 6706177 6720715 5625799 4015170 3614390 5297281 7467210 7371875
39949 7371875 4303413 613935 -972448 -233188 1081053 1788114 2117666 2487108 2752160
39940 2752160 2680490 2172584 1074002 -251735 -366598 1898979 5449893 7652445 7385966
39931 7385966 6018503 4953125 3867752 2323006 1464782 2476679 4344763 4942201
39923 4942201 3866550 2591117 2090993 1966744 1911370 2377714 3380082 4039936 3930686
39914 3930686 3725523 3854429 3573721 2214242 533650 -122544 506043 1605102 2547592
39905 2547592 3256593 3553305 3097092 2090311 1311898 1170307 1214051 887637 402017
39896 402017 426765 1045256 1497121 1191662 667335 1026487 2383355 3484553 3282057
39887 3282057 2358316 2055304 2515009 2608194 1858984 1301670 1904374 3106302 3744434
39878 3744434 3711030 3688309 3738247 3347933 2718127 2760754 3587028 4095824 3534503 2551232
39868 2551232 2109158 2195076 2379874 2923139 4266506 5840091 6490893 5963122 4905627
39859 4905627 3533291 1608800 -57411 298781 2882498 5257921 5195966 3711020 3577348
39850 3577348 5324489 6682929 6097817 4733800 4218795 4218379 3559720 2383377 1593490
39841 1593490 1118864 403061 -2994 896348 2585964 3495808 3348384 3308094 3711057
39832 3711057 3586600 2896009 3193579 5032935 6583538 6324538 5567264 6426686 8421508
39823 8421508 9262360 8422764 7631444 7852865 8090914 7814765 8482482 11324690 15006971
39814 15006971 17087611 17191778 17380748 19559801 23667869 28661295 34581424 43187119
39806 43187119 56398788 73687946 90678454 100885703 99908561 88522507 71767629
39799 71767629 55169594 41843554 32405177 26273669 22420426 19630323 17244770 15880821
39791 15880821 16607582 18888038 20009284 17563717 12366303 7839834 6243445 6545636
39783 6545636 6538018 5805039 5347035 5155515 4060731 2017748 729114 1223637 2143669
39774 2143669 1561691 -271048 -1152629 360616 3384978 5817742 6356728 5356696 4141428
39765 4141428 3636632 3592860 3193729 2303261 1658846 1761931 2188988 2321858 2197465 2166720
39755 2166720 2175727 1938492 1531303 1356699 1748593 2879065 4616586 6187730 6685295
39746 6685295 6531139 7732880 11670190 16908280 20170878 19461410 15543110 10573071
39738 10573071 6229041 3214172 1602556 1114648 1366150 2069375 2896344 3373686 3233739
39729 3233739 2578298 1378457 -622717 -2971552 -4253358 -3776384 -2841065 -3035531 -3793411
39720 -3793411 -3258364 -1296084 274278 597392 873788 1901415 2543913 1789491 574995
39711 574995 91254 -236492 -1345175 -2312383 -1532518 602875 2171229 2471664 2410694
39702 2410694 2354768 1623982 349528 -77208 936930 2184034 2429198 1946731 1601842
39693 1601842 1538723 1504205 1453825 1133113 70391 -1276494 -1470399 -168683 821962
39684 821962 -92350 -1646105 -1058677 2193463 5526716 6449477 5312836 4260745 4376549
39675 4376549 4732209 3924682 1871186 10074 -68447 1801479 4134919 5266060 4981152
39666 4981152 4449533 4627088 5185778 5193786 4465679 3825127 4053358 4861572 5121319 4160719
39656 4160719 2668274 2014679 2639834 3519726 3526295 2924616 2942100 4031742 5311813
39647 5311813 5894000 6079999 6775403 8142252 9393296 9791155 9425899 9009019 9124665
39638 9124665 9600495 9495101 8014656 5724007 4443061 5358649 7451160 8454598 7309537
39629 7309537 5012811 3128722 2331182 2502744 3189852 3468692 2371687 240713 -1150519
39620 -1150519 -685870 674246 1553284 2288760 3884301 5581032 5561275 3966320 2968671
39611 2968671 3357628 3312367 1661463 240171 1240386 3825012 5497707 5774203 6213821
39602 6213821 7342377 7848405 6863768 5049873 3199017 1560273 816757 1849319 3942950
39593 3942950 4945588 3984332 2517274 1942453 1769917 1160173 663752 1029059 1590401
39584 1590401 1435500 1163286 1783134 2619875 2124062 349611 -1167322 -1819462 -2374955
39575 -2374955 -2874824 -1997385 722538 3556522 4566908 3970477 3445854 3713867 3893572
39566 3893572 3017205 1245106 -469418 -1242036 -665453 1051335 3024747 4110634 3771208
39557 3771208 2503961 1239685 447737 106490 365236 1552689 3253490 4073402 3094050
39548 3094050 1238153 330807 937108 2053044 2854977 3501411 3913314 3230848 1439998
39539 1439998 343553 1485127 3758732 4588992 3257228 1607125 1389802 2352461 3400192
39530 3400192 4297028 5231970 5573630 4386725 2120737 683333 1323631 3047535 3847997
39521 3847997 3252563 2701453 3184064 3649499 2773143 1453829 1878432 4221637 6108024
39512 6108024 5902416 4858624 5002930 6326167 7407621 7707724 7745686 7775071 7732211
39503 7732211 7941031 8619490 9352475 10272073 12758822 17243523 21169613 21316095 17822742
39494 17822742 13828384 11314390 9513433 7430012 5465293 3957775 2354609 762337
39486 762337 459213 1890269 3705185 4565717 4392016 3282715 1096554 -1130198 -1452547
39477 -1452547 119900 1016463 -213736 -1504123 -260573 2906175 5310385 5679252
39469 5679252 4662261 3144746 1999772 2367658 4130765 5058035 3496607 1046452
39461 1046452 505057 2000735 3350037 3451442 2890536 1789177 -219482 -2026201 -1793717
39452 -1793717 38967 984096 162008 -670861 -284190 339437 369186 697315 1764275
39443 1764275 2013043 355515 -1456883 -962137 1489460 3231537 2842223 1620997 1588956
39434 1588956 3196212 5189373 6112956 5766711 5255366 5473504 5895007 5579859 4967512
39425 4967512 5312703 6382563 6425439 4917890 3612323 3925039 4883848 4956753 4523512
39416 4523512 4894069 5872965 6124176 5466895 5074789 5481750 5892306 5635839 5045543
39407 5045543 4535915 3778298 2300021 366495 -1132608 -1499641 -859786 -90003 2491
39398 2491 -511869 -989485 -1260289 -1672736 -1971545 -1167470 840244 2442168 2100322 347391
39388 347391 -994687 -1135680 -803244 -714966 -710539 -455610 -86525 61056 -208163 -923218
39378 -923218 -1773621 -2068742 -1404610 -242018 694777 1361830 2116275 2755565 2661402 1870646
39368 1870646 1220680 1308740 1942198 2714300 3470666 4026811 4075727 3749152 3790264 4654283
39358 4654283 5610862 5256783 3158351 788276 409212 2795809 6333011 8736163 9427088
39349 9427088 9730090 11066690 13803216 17605933 21566905 23728441 22065645 16974627
39341 16974627 11697295 9077728 8635995 7950355 6101567 4276287 3476508 3345455 3357442
39332 3357442 3719773 4646766 5734240 6488094 6804649 6691306 6099574 5179252 4214709
39323 4214709 3321674 2644550 2599535 3300188 4029205 4032478 3595282 3560867 4083333 4736782
39313 4736782 5528263 6717568 7806017 7855560 6846995 5744676 5253426 5446647 6382744
39304 6382744 7867364 8737489 7798644 5631870 4181605 4359111 5279352 5953205 6316927
39295 6316927 6390198 5942288 5383271 5550435 6260763 6564139 6676024 7854385 9971386
39286 9971386 11294165 11351992 11778585 13399651 14979530 16111347 18521196 22631796 25867634
39277 25867634 27070155 29627758 36831642 47343537 59983523 79440625 109040005
39270 109040005 138189407 146620892 125863889 90369027 62021221 48301951 41356316
39263 41356316 33807270 26685656 22718014 20595525 18617160 18009640 19366651 20151330
39255 20151330 18810442 17662596 18630153 19562641 18197415 16542270 17392219 19363551
39247 19363551 19869433 20468472 23994950 28601530 31325834 36422373 51512035 73273892
39239 73273892 85380915 76362083 54005120 35735902 28707884 26409892 22225253 17662977
39231 17662977 16244287 16671681 15561650 12497728 9104792 6048242 3558594 2539576
39223 2539576 2880594 2694036 1168107 225148 1548154 3943509 5482009 6212986 6728680
39214 6728680 6103524 3719680 1415839 1159776 1942058 1660721 857106 1582499 3366603
39205 3366603 3552182 1558199 -170494 146935 1543486 2433889 2536403 2035715 900155
39196 900155 -239051 -326990 372961 480667 -93330 148838 1576694 2490621 1855648
39187 1855648 956553 1022192 1081571 -98829 -1458135 -1039548 973632 2555286 2652931
39178 2652931 1937436 1049625 -85011 -1032552 -576859 1640667 4222053 5490841 5325871
39169 5325871 4925382 5066411 5233325 4582887 3326473 2620806 3014364 3572202 3068364
39160 3068364 1701246 885890 1434530 2710473 3659870 3941914 3845566 3733356 3786541
39151 3786541 3799976 3196469 1801366 454487 74350 318004 216150 -26448 757911
39142 757911 2615482 4182580 4885970 5790143 7534589 9048155 9337029 9076062 9243258
39133 9243258 9557199 9578779 10032658 11618952 13875639 16752137 21623670 28476018 33558920
39124 33558920 32916106 27741466 23250310 22291161 23007921 22975836 22255482 21268331 18928919
39115 18928919 14976799 11694847 10901639 11069442 9948033 8595674 9884832 13618480
39107 13618480 16029226 14434666 10147939 6236510 4282504 4077626 4854943 5709270
39099 5709270 5828364 5319614 5204920 5921022 6464296 5735989 4203189 3395441 3938269
39090 3938269 4772303 4415159 2632186 694245 9681 552252 904059 113462 -874228
39081 -874228 -365109 1643171 3223440 3092665 2367852 2845933 4291673 4786707 3640510
39072 3640510 2538824 3253857 5247961 6440085 5772586 4064708 2597526 1889341 1961483
39063 1961483 2784313 3906581 4364311 3731445 2882495 2908136 3434618 2914824 788987
39054 788987 -1431425 -1772120 -67586 1926255 2525011 1754316 1004056 1411337 2727812
39045 2727812 3657583 3212298 1693946 302642 -111938 327331 1109652 2168315 3946434
39036 3946434 6852092 10732278 14581026 16717535 15849097 12424526 8558604 6067067
39028 6067067 4799850 3427458 1575504 375834 865186 2604586 4204395 4712121
39020 4712121 4194000 3406457 3250415 4175573 5678691 6551235 5965778 4273776 2586528
39011 2586528 1707648 1569425 1470767 712417 -756307 -2165117 -2677037 -2465148 -2632467
39002 -2632467 -3770404 -5050433 -5263090 -4407765 -3525222 -3046195 -2157638 -190951 1942568
38993 1942568 2416771 628713 -1817372 -2671859 -1521270 -234754 -626223 -2121746 -2531315
38984 -2531315 -1016959 805421 1129715 200809 -606670 -939114 -1252310 -1105621 392417
38975 392417 2371940 2476461 171172 -1948738 -1433626 808654 2150546 2015246 2053459
38966 2053459 3104595 4140613 4364791 4368856 4611758 4485336 3769865 3483036 4143664
38957 4143664 4529262 3567501 2354584 2578476 3689150 3624201 2115637 1173452 1877132
38948 1877132 2627623 1589866 -599017 -1840981 -1320246 41159 1179777 1627756 1068367
38939 1068367 -493640 -2150480 -2804066 -2537017 -2294619 -2171293 -1160712 1072325 3282642
38930 3282642 4137188 3763005 3074312 2260859 879537 -903735 -2112837 -2072654 -1137876
38921 -1137876 -220960 31695 -406772 -1032143 -1152348 -395131 936879 1966024 1729996
38912 1729996 -133480 -2841652 -4793167 -4965481 -3902862 -2743157 -1511129 583461
38904 583461 3167130 4474296 3692977 2192975 1502875 1365161 1016686 1057639 2247281
38895 2247281 3425961 2822648 968508 25193 286756 -244859 -2371183 -4148029 -3797639
38886 -3797639 -2171101 -1078671 -826670 -742902 -746358 -996528 -1073856 -742635 -544144 -634784
38876 -634784 -225935 827410 1361167 1059480 1565334 3701506 5260383 3870103 755419
38867 755419 -993019 -961632 -1292846 -2480610 -2491007 -449241 1734604 2369728 2185418
38858 2185418 2400822 2665714 2188758 1243426 349104 -642896 -1631384 -1819544 -1160575
38849 -1160575 -868618 -1486207 -1817337 -873019 463362 939200 882213 1304384 2049207
38840 2049207 2187596 1546029 694948 63212 4091 980422 2755196 4165792 4543834
38831 4543834 4493173 4494146 3907124 2422612 1312250 1867457 3521194 4902141 5949525
38822 5949525 7564074 9779059 11607905 12262760 11529308 9596726 7438765 6477471 6885198
38813 6885198 7226230 6716650 6497840 7572268 9158131 10537635 12610056 15712605 17996130
38804 17996130 18428618 19297607 22741384 27020311 29980741 33925186 42210612 53366753
38796 53366753 65485847 85005326 120832998 165999156 194530815 185223619 144709949
38789 144709949 99817478 69931674 54198166 43426407 34139425 27812776 24167456
38782 24167456 21347651 19501606 19486081 19668839 17599300 13776708 10768353 9327743
38774 9327743 8065800 6477945 5614370 5650799 5209840 3724021 2522200 2639368 3081028
38765 3081028 2432420 1112005 724349 1777678 3305333 4487036 5393264 6013302 5721741
38756 5721741 4277571 2596429 1883646 2403589 3501996 4322363 4082297 2353167 -197876
38747 -197876 -1944753 -2072412 -1699222 -2243685 -3248348 -3169681 -1890941 -718366 35339
38738 35339 1439800 3479032 4287431 2897633 929676 199540 304796 178510 357458
38729 357458 1498117 1977952 -200718 -3669055 -4861801 -3174007 -2022356 -3747869
38721 -3747869 -6111880 -5683257 -2755915 -598300 -855383 -2001554 -2103403 -1089195 50426
38712 50426 725863 738408 -107885 -1595056 -2864618 -3181442 -2561385 -1333470 347614
38703 347614 2050677 2708935 1588868 -508962 -1820696 -1505970 -304002 821236 1875512
38694 1875512 3233118 4605489 5393301 5607359 5599928 5189659 3986658 2461257 1703280
38685 1703280 2008744 2548249 2531818 1842771 470862 -1594790 -3642178 -4544339 -4262632
38676 -4262632 -3966557 -4140054 -3798024 -2381284 -1169810 -1600947 -3123494 -4036231 -3769732
38667 -3769732 -3069907 -2539669 -2312126 -2620326 -3319582 -3353685 -2193580 -1356991 -2746578
38658 -2746578 -5628543 -7108424 -5813181 -3352172 -1721385 -1019223 -489968 -196476 -445470
38649 -445470 -655455 -77755 930453 1370298 1011830 586330 754826 1383232 1774391
38640 1774391 1502576 1155464 1920531 3880643 5241935 4378263 2268948 1287540 1567105
38631 1567105 615394 -2696810 -5778072 -5504034 -2381321 285655 574266 -523207 -1337917
38622 -1337917 -1447730 -1170556 -645954 -42565 207698 -39786 -318357 -138543 339898
38613 339898 387698 -603610 -2364369 -3607405 -3090020 -1129067 427237 214671 -1111434
38604 -1111434 -1907383 -1612862 -1013710 -786553 -751699 -585988 -407039 -361969 -235716 168547
38594 168547 603593 654582 292388 -89403 -205237 -317942 -975805 -2235814 -3378366
38585 -3378366 -3669901 -3208373 -2613593 -2101936 -1461864 -778423 -388523 -132386 454949
38576 454949 1101722 965430 125779 -189280 580133 1318921 799497 -624876 -1707059
38567 -1707059 -1915176 -1500314 -650051 502782 1511563 1996929 1938918 1170806 -530788
38558 -530788 -2323260 -2546330 -1063507 -14362 -882801 -2172270 -1814255 -638029 -1000157
38549 -1000157 -2685003 -3022386 -1181537 440934 -83610 -1567948 -2035133 -1708735 -2023142
38540 -2023142 -2982736 -3263852 -2373816 -1337858 -1357797 -2541747 -3857015 -4096623 -3254385
38531 -3254385 -2861707 -4171008 -6158887 -6602104 -5190348 -3921803 -3939415 -3853269 -2315077
38522 -2315077 -523313 -423946 -1565306 -1723745 -201455 1306104 1177795 -213152 -1353678
38513 -1353678 -1429247 -976962 -1154307 -2422495 -3805614 -3832668 -2382351 -879389 -375910
38504 -375910 -466584 -623434 -1245151 -2335020 -2534266 -1104768 225157 -581177 -2556660
38495 -2556660 -2853135 -997386 325267 -866287 -3336976 -4750247 -4445642 -3132065
38487 -3132065 -1438805 20344 424498 -136527 -259574 953243 2547625 3224638 3249841
38478 3249841 3649181 4364612 4625627 4515137 4633414 4609360 3587429 2115765 1880070
38469 1880070 3224372 4425047 4070200 2916845 2498474 2819516 2525527 944813 -1004124
38460 -1004124 -1907877 -1261093 214457 1231935 934249 -448644 -1898561 -2684019 -3018223
38451 -3018223 -3525441 -4282544 -4676302 -4154800 -2912717 -1783109 -1457621 -1796420 -2040950
38442 -2040950 -1828948 -1688025 -2108945 -2464339 -1681200 20418 1058527 521434 -685723
38433 -685723 -1333630 -1549913 -2053116 -2530750 -2114993 -1038336 -361532 -171604 433311
38424 433311 1395350 1344145 -190974 -1692388 -1789395 -1304406 -1903099 -3507238 -4413286
38415 -4413286 -3587611 -1632437 308995 1505688 1618170 769945 -315175 -1047490 -1757188
38406 -1757188 -2972048 -4163471 -4229832 -3116711 -1872209 -1100252 -501442 -27505 -203810
38397 -203810 -946264 -1272436 -727619 -16772 351805 944856 2190547 3325310 3468147
38388 3468147 2910387 2427628 2076135 1595279 1233416 1149597 746184 -230320 -623603 694576
38378 694576 2794356 3614500 2707158 1532861 1054754 664465 -196055 -923062 -936431
38369 -936431 -692645 -702317 -571748 117809 823751 824326 340887 63788 120592 284491 637025
38358 637025 1148068 1061467 -310208 -2364066 -3631373 -3362146 -2044404 -537447 596764
38349 596764 1068300 949929 741170 660263 56639 -1612130 -3405434 -3693842 -2464727
38340 -2464727 -1498623 -1703337 -1653870 92959 2336358 2536648 351131 -1862521 -2236500
38331 -2236500 -1514295 -1402821 -2188951 -3005351 -3459249 -3724212 -3559388 -2555595 -1236043
38322 -1236043 -753837 -1375752 -2211069 -2559658 -2561868 -2324888 -1508515 -275580 368537 -74496
38312 -74496 -764488 -905042 -1154662 -2516191 -4405802 -5230348 -4687243 -4004010 -3718848
38303 -3718848 -2772505 -524782 1643561 1935114 562863 -693609 -955489 -974915 -1471241
38294 -1471241 -2061940 -2216059 -2115186 -1876259 -878863 1122193 2863501 2809708 1309285
38285 1309285 222071 287590 237674 -945787 -2273528 -2321314 -1461213 -1057584 -1152896 -685092
38275 -685092 295635 553650 -25792 -69370 672359 364131 -1954089 -4189850 -3857476
38266 -3857476 -1735910 -748841 -1822557 -3044937 -2814199 -1668648 -612632 432941
38258 432941 1704523 2615296 2612898 1953941 950799 -491889 -1977478 -2452690 -1779752
38249 -1779752 -1378304 -2325205 -3782663 -4364431 -4130101 -3953393 -3673790 -2404430 -354721
38240 -354721 1144464 1507527 1557705 2073196 2659920 2449276 1238724 -375153 -1549282
38231 -1549282 -1774041 -1347742 -1270414 -2168288 -3358763 -3550948 -2486426 -1270241 -929055
38222 -929055 -1187214 -939551 413940 2345330 3706726 3695565 2395818 476434 -1451434
38213 -1451434 -2943470 -3469089 -2804297 -1759772 -1573530 -2147074 -1891929 -79209 1726278
38204 1726278 1803623 977013 1506191 3644538 5125247 4279381 2050098 382173 -40897
38195 -40897 224272 560087 689571 656008 923562 1823971 2691523 2508709 1610336 1460615
38185 1460615 2312015 2609229 1548100 626914 1293929 2455637 2180986 942525 985308
38176 985308 2737522 3978253 2930205 434077 -1573172 -2288005 -1932427 -625705 1495919
38167 1495919 3600090 4580018 4099088 2819065 1777750 1708123 2535320 3247060 2666114
38158 2666114 707237 -1420444 -2536488 -2724872 -2981137 -3892707 -4982381 -5262971 -4279606
38149 -4279606 -2655828 -1562432 -1455811 -1485037 -560765 1049344 1780803 634305 -1531535
38140 -1531535 -2962909 -2963325 -2449353 -2644243 -3608793 -4250929 -3663510 -2172788 -868213
38131 -868213 -303738 -158053 -173619 -658492 -1609885 -2084080 -1303668 53107 656708 364950
38121 364950 170866 421035 384220 -137411 -107353 1083350 2292088 1992795 373951
38112 373951 -944360 -1029410 -578857 -737686 -1647790 -2393560 -2102095 -933314 66204
38103 66204 183731 -81454 234516 1105616 1517693 983221 247215 199816 839114 1675166
38093 1675166 2405040 2741319 2331509 1384575 669486 387051 -141091 -1096189 -1483341
38084 -1483341 -689536 266355 181915 -483520 -576957 -403504 -1326538 -3508902 -5601997
38075 -5601997 -6655496 -6899659 -6534388 -5181270 -2931204 -768059 528078 1079803 1303340
38066 1303340 1411326 1560535 1586952 678539 -1553053 -3724678 -3797651 -1776710 65347
38057 65347 31586 -1227581 -2142219 -1996096 -798102 1044032 2175246 1025529 -1830892
38048 -1830892 -3518174 -2380775 -375908 -444727 -2603937 -4378594 -4308381 -3134055 -1888712
38039 -1888712 -690489 449506 1126304 1192760 938321 544052 186736 433019 1445678
38030 1445678 2004861 601291 -2416688 -4943140 -5533777 -4707781 -3712794 -3074753 -2649858
38021 -2649858 -2125942 -1102999 499177 1819254 1678584 179214 -1105195 -948772 183462
38012 183462 1002718 984254 648259 739794 1539914 2654412 3208505 2563385 1053822 -222437
38002 -222437 -420372 452709 1769503 2663277 2342737 678218 -1433193 -2753220 -2823058
37993 -2823058 -2123146 -1348223 -979406 -1266025 -1982943 -2419993 -2242566 -2070518 -2508355
37984 -2508355 -3041567 -2868521 -2434021 -2870893 -4044168 -4500749 -3507701 -1895044 -669055
37975 -669055 -54826 -202567 -1452606 -3267537 -4088280 -3059423 -1089640 349683 643426
37966 643426 -125885 -1608772 -2781136 -2209985 277667 2884003 3652970 2499037 864394
37957 864394 12942 258611 1199963 2035112 2149973 1879352 2126407 2911069 3093490 1947623
37947 1947623 150471 -1238564 -1873524 -1769953 -924276 150532 587390 471839 871865
37938 871865 1977524 2520189 1766581 631178 -91696 -960134 -2147382 -2252930 -593675
37929 -593675 854428 -87794 -2527390 -3820722 -3258846 -2242507 -1563433 -893030 -511846
37920 -511846 -1126467 -2082746 -1973484 -962574 -393060 -258001 592923 1765915 1447848
37911 1447848 -414385 -1644927 -1248591 -795681 -1417258 -1822262 -679824 1095036 1984128
37902 1984128 2081503 2152456 2010840 1381948 1045392 1551832 1907563 1005466 -598887 -1653316
37892 -1653316 -1966382 -1947508 -1465291 -536990 -130832 -806906 -1479305 -1038172 -310805 -764203
37882 -764203 -2039522 -2594240 -2265426 -2291650 -2975327 -3155722 -2168253 -783706 110200
37873 110200 520988 763961 914575 1107132 1530007 1960880 1975718 1556439 862026 -254463
37863 -254463 -1677266 -2473018 -2044230 -1437305 -2130139 -3715313 -4298177 -3245163 -1957377
37854 -1957377 -1581203 -1536045 -1015255 -525013 -865101 -1588818 -1649344 -991023 -445000 -387772
37844 -387772 -441787 -338452 -227491 -117994 246638 759897 773678 -91020 -1287362 -1925644
37834 -1925644 -1910248 -2022766 -2697924 -3157628 -2290949 -258745 1404232 1450782 199800
37825 199800 -1034558 -1289697 -475742 876096 1897987 1813238 627051 -752993 -1393225
37816 -1393225 -1149651 -499554 3449 -86004 -897752 -1859990 -1991651 -898567 944540
37807 944540 2950321 4663834 5184872 3625085 727854 -1218942 -978275 225199 753580
37798 753580 650717 474310 -418348 -2494689 -4131994 -3422768 -1281660 -373040 -1223455
37789 -1223455 -1841701 -1217303 -613782 -884636 -1007823 -258315 358129 36322 -375457
37780 -375457 -120682 47725 -409828 -383802 925576 2077587 1332058 -551289 -1413411
37771 -1413411 -848818 -297331 -434298 -455380 58447 398502 234883 375761 1375615 2426753
37761 2426753 2350838 1099366 -310005 -1044161 -1207133 -1405548 -1848281 -2126401 -1937825
37752 -1937825 -1602417 -1387425 -781802 624947 1861139 1569525 361810 506587 2673078
37743 2673078 4662229 4401304 2632239 1276763 610468 -178415 -811133 -372694 759185
37734 759185 1430292 1651537 2084467 2102914 601830 -1480718 -1895060 -587772 -63572
37725 -63572 -1553948 -3094484 -2525809 -455214 1114435 1472675 1059730 24008 -1463581
37716 -1463581 -2446540 -2277651 -1746808 -1753991 -1631312 -315581 1426335 1725179 443230
37707 443230 -423804 443560 1844989 1758479 42683 -1396055 -916374 956213 2146352
37698 2146352 1416594 -264443 -1132431 -1023868 -1366096 -2713762 -3634464 -2818465 -1159637
37689 -1159637 -521100 -1165568 -1738871 -1367244 -447473 395416 838185 509031 -547821
37680 -547821 -1111204 69458 2228590 3190451 2363758 1534452 1987795 2464014 1204289
37671 1204289 -1242245 -2823740 -2845442 -2417365 -2373044 -2324818 -1929535 -1714756 -2080057 -2392665
37661 -2392665 -1791752 -484598 349155 -50008 -964975 -728791 1474774 4384111 5719766
37652 5719766 4661996 2683247 1554420 1288645 806685 -87151 -583469 -386429 -70414
37643 -70414 95067 486338 1102550 1324590 1015649 801661 852495 460666 -594177 -1300694
37633 -1300694 -825074 175736 500527 -13186 -673047 -1056457 -1065659 -422115 922116
37624 922116 2243649 2802051 2797515 2757771 2408037 1157861 -572195 -1577731 -1366875
37615 -1366875 -552443 138245 372064 -126597 -1435245 -2917480 -3691109 -3644960 -3294579
37606 -3294579 -2829022 -2150749 -1559137 -1282730 -565526 1405721 3638555 3894740 1515692
37597 1515692 -1601163 -3345156 -3550961 -3326629 -3397813 -3747565 -3914209 -3147049 -1288277
37588 -1288277 147695 -868832 -4043714 -6517872 -6301702 -4500566 -3112610 -2232915
37580 -2232915 -977059 233184 311995 -388376 -584620 -238370 -456503 -1501190 -2531691
37571 -2531691 -3096928 -3331429 -2955424 -1752493 -809892 -1438005 -2891885 -3123681 -1998405
37562 -1998405 -1674167 -3174112 -4623884 -4012065 -2041064 -866424 -1205479 -2067399 -2503014
37553 -2503014 -2340611 -1735758 -1050518 -773035 -791541 -303231 840091 1435319 505511
37544 505511 -1101763 -1797174 -1417345 -1072510 -1113973 -642880 759332 2027864 1952841
37535 1952841 766955 -296269 -656079 -921855 -1781290 -2890882 -3250524 -2535180 -1575498
37526 -1575498 -1290560 -1537470 -1504327 -1004167 -712382 -1124474 -1946738 -2638033 -2888236 -2398016
37516 -2398016 -985115 708808 1429715 855704 220976 575492 1038286 -37321 -2351319
37507 -2351319 -3452610 -1729786 1366703 2936609 1981506 207472 -466394 -220534 -618478
37498 -618478 -2209142 -3765018 -3892599 -2600676 -959108 204839 835056 1302876 1982421
37489 1982421 2865039 3290188 2511166 907466 67204 1069364 3127867 4499989 4238005
37480 4238005 2511474 -11173 -2223556 -2832072 -1742791 -573631 -532524 -511062 1128395
37471 1128395 3571810 4438854 3335812 2210549 2081862 1889748 1125690 1054304 2241783
37462 2241783 3195063 2842375 2258604 2402041 2241592 983320 142795 1136732 2525933
37453 2525933 2176700 735457 215931 338713 -612762 -2060411 -1694209 301415 1022907
37444 1022907 -551120 -1973519 -1472073 -627373 -1141014 -1580206 193026 3135075 4274620
37435 4274620 3013296 1684051 1972899 2934949 2957089 1978520 947440 209164 -535810
37426 -535810 -1177501 -1104015 -234049 590665 659202 376022 563129 1043067 822086 -234836
37416 -234836 -946280 -471390 566028 1244477 1592801 1790280 1229707 -342228 -1706098
37407 -1706098 -1739416 -1317171 -1875703 -2731191 -1942036 431548 2197182 2279597 1834171
37398 1834171 1683363 949985 -848643 -2417836 -2622661 -2136037 -1944502 -1711872 -850221
37389 -850221 168996 799389 1390524 1961546 1401317 -687806 -2646128 -2836681 -1940924
37380 -1940924 -1567479 -1720879 -1555623 -1643785 -3134462 -5029076 -4720921 -1655910 1475648
37371 1475648 1984035 290375 -1024422 -441342 981353 1016758 -1179521 -3944675 -4719199
37362 -4719199 -2825396 -60568 1679001 2403582 3073175 3776547 4021724 3999920 4177193
37353 4177193 4126829 3106028 1470296 276592 -232680 -563026 -713945 -246391 647116
37344 647116 1349164 1790737 1983685 1066805 -1547373 -4323315 -4784941 -2774546 -805322
37335 -805322 -720731 -1624571 -1796175 -1163881 -888381 -1545388 -2710892 -3711754 -4060372
37326 -4060372 -3602028 -2703069 -1947915 -1524178 -1324551 -1433537 -1770477 -1589975 -426207
37317 -426207 755696 725212 124402 761839 2678094 3821267 3156835 2160074 2275480
37308 2275480 2696019 1980349 367637 -1035504 -2156791 -3392983 -4042188 -3057668 -960044
37299 -960044 526483 633202 197931 296738 1158583 2223338 2466092 1032658 -1563903
37290 -1563903 -3262979 -2453002 73961 2027480 2250671 1617931 1516876 2272100 3029212
37281 3029212 2619589 681969 -1677754 -2733917 -2042352 -900836 -499710 -539043 -370226
37272 -370226 -339549 -778730 -710548 772217 2513579 2545332 1055702 226862 1064555 2255208
37262 2255208 2552759 2505553 3038678 3820354 4053566 3798903 3503208 3036968 2177590 1460467
37252 1460467 1603081 2354405 2633850 1737210 44760 -1307116 -1285441 201156 2146772
37243 2146772 3378711 3641226 3446061 3091222 2481818 1789535 1468665 1550138 1648300 1691575
37233 1691575 1901874 2117641 2003894 1796347 1771065 1176909 -825410 -3131445 -3421222
37224 -3421222 -1427913 377664 246146 -582774 -336159 468541 511014 337058 1110745
37215 1110745 1787766 335465 -2570822 -3901726 -2653152 -1228641 -1584161 -2431836 -1781384
37206 -1781384 -338409 -390817 -2382263 -4475269 -5059407 -4153672 -2541659 -880677 262022
37197 262022 532339 163092 -354149 -877032 -1368286 -1427148 -875621 -485220 -1086420 -2072716
37187 -2072716 -1943357 -508069 578002 -76375 -1947027 -3647484 -4683746 -5269085 -5150078
37178 -5150078 -3844283 -1796292 -132428 802753 1630470 2442299 2195955 211226 -2547317
37169 -2547317 -4473696 -5065960 -4871764 -4166701 -2729586 -826664 589949 852345 -3460
37160 -3460 -1827141 -4391334 -6593248 -6754202 -4466795 -1377716 599396 1133374 822710
37151 822710 -288370 -2198324 -3658669 -3205537 -1482601 -827682 -2104072 -3459163 -2960464
37142 -2960464 -1131439 111026 -35014 -904284 -1662446 -1815949 -1095474 55556 467438
37133 467438 -216806 -718766 -107841 269159 -1298714 -3590084 -3439108 -230633 2959309
37124 2959309 3527068 2436029 1870845 1890272 1358652 605943 738059 1173471 354372
37115 354372 -1384129 -2044176 -1140728 -279292 -98495 927292 3505966 5522044 4764947
37106 4764947 2145476 293461 19502 153561 147335 601090 1357337 1279020 344867 10309
37096 10309 696229 694301 -1178604 -3255341 -3031988 -745796 825618 16936 -1849407
37087 -1849407 -2582957 -1839409 -997008 -1123137 -1890492 -2219917 -1405403 308354 1914027
37078 1914027 2478020 1982858 1216700 787106 604600 476088 647117 1277699 1804904
37069 1804904 1485460 375603 -842199 -1812867 -2565703 -2793980 -2085708 -1013154 -883462
37060 -883462 -1882517 -2484054 -1510376 124060 810974 636285 931871 1824090 1908577 540372
37050 540372 -1149867 -2099714 -2743148 -3719225 -4413288 -4000004 -3029330 -2619323 -2679252 -2340375
37040 -2340375 -1728230 -1711494 -1961607 -996282 1352250 3054551 2427762 460150 -534055
37031 -534055 161953 1311279 1869052 2131019 2604619 2873378 2184707 593934 -1024944
37022 -1024944 -1866672 -1769459 -1136778 -581036 -450005 -424051 217804 1581609 2602629
37013 2602629 2076015 322994 -774194 194382 2493778 4106156 3973360 2747824 1497877
37004 1497877 545639 -231048 -829564 -1391460 -2349314 -3585178 -3933803 -2373147 510491
36995 510491 3013378 4124998 4112111 3484409 2358813 974739 -105081 -690630 -1154332
36986 -1154332 -1604072 -1603897 -1109213 -875245 -1315055 -1664028 -1102865 -195548 -264752 -1589683
36976 -1589683 -3136145 -3969220 -4005307 -3311184 -1678734 640691 2538094 3049406 2374891
36967 2374891 1373946 429629 -503053 -972417 -128862 1946085 3802828 4200258 3655303
36958 3655303 3555663 3936895 3292647 950554 -1485867 -2018511 -880396 -85741 -647834
36949 -647834 -1537012 -1509929 -704617 64406 522741 749722 620677 201855 25049 223901
36939 223901 73239 -773439 -1293072 -444150 1027550 1467241 767503 497828 1414396
36930 1414396 2251152 1598373 -123787 -1410058 -1644729 -1425838 -1304920 -1075555 -356643
36921 -356643 641294 1159709 679338 -322200 -608938 461149 1994142 2539928 1911370
36912 1911370 1251084 1259975 1379962 1086452 866173 1124145 1110157 98739 -1031347 -778044
36902 -778044 693445 1637502 1153221 168705 -300424 -521496 -1002179 -1269505 -715332
36893 -715332 159493 473990 416861 836092 1710192 2194765 2045728 1783020 1407294 282498
36883 282498 -1355403 -2118138 -1430186 -611621 -1007510 -2032750 -2322859 -2010677 -2270816
36874 -2270816 -3027333 -2932690 -1777479 -1185222 -2242080 -3798476 -3980748 -2358477 171060
36865 171060 2609862 4017647 3425958 879138 -1934063 -3191214 -2766796 -1770563 -896261
36856 -896261 -269816 -278778 -1149586 -2015214 -1798622 -863228 -397258 -314513 563870 2070480
36846 2070480 2269566 230103 -2295729 -3031074 -1936870 -776131 -749751 -1584160 -2377718
36837 -2377718 -2438592 -1662881 -713997 -413260 -575502 -148758 1106032 2063761 1967599 1580333
36827 1580333 1702771 1708940 828017 -134444 52484 882591 821631 -257382 -1134586 -1511504
36817 -1511504 -2274008 -3333881 -3189312 -1304066 756174 1463491 1197307 974227 587484
36808 587484 -696386 -2466198 -3552740 -3636059 -3306701 -2811622 -1818148 -329789 1122165
36799 1122165 2272244 3336394 4328063 4862340 4872546 4910661 5291655 5289633 3791106 879580
36789 879580 -1675713 -2057766 -539364 617324 -233889 -2144111 -2809846 -1348680 1010956
36780 1010956 2674370 2995164 1970355 18386 -1607187 -1554944 -220370 336023 -864575
36771 -864575 -2250020 -2051029 -930928 -717856 -1376243 -1149866 545757 2270442 2830497
36762 2830497 2742395 2880445 3039532 2591603 1563655 386175 -598907 -855913 173396
36753 173396 1951856 2810765 1877718 316435 -233529 182577 201846 -825790 -2228492
36744 -2228492 -3158763 -3330250 -2742553 -1679964 -1021527 -1585756 -2939955 -3696807 -3328269
36735 -3328269 -2950687 -3833391 -5669890 -6879120 -6350614 -4460007 -2491430 -1355571 -833812
36726 -833812 10777 1582017 3013363 3080858 1901234 1151429 2169355 4159911 4859030
36717 4859030 3039081 -15064 -1758209 -1012919 893567 1736574 869201 -411660 -917059
36708 -917059 -1053036 -1656487 -2270765 -1922118 -1208832 -1880535 -4040846 -5505955 -4832444
36699 -4832444 -3420565 -3230308 -3718587 -2969854 -1149147 -633183 -2620307 -5470963 -6845255
36690 -6845255 -5988243 -3521431 -562452 1302710 716053 -1768048 -3803709 -3916211 -2981145
36681 -2981145 -2338443 -1858022 -1019797 -491937 -995288 -1649765 -1264288 -507824 -858805
36672 -858805 -1901353 -1770204 -184209 1042152 752249 -236513 -1013511 -1872840 -2993224
36663 -2993224 -3552702 -3154521 -2714345 -2918768 -3057930 -2376704 -1369830 -708618 -94371
36654 -94371 702041 904880 160147 -309519 438607 1143877 197536 -1368496 -1002768 1448002
36644 1448002 3204017 2368509 358471 -294116 893823 2334279 2451479 862673 -1787035
36635 -1787035 -4294514 -5548981 -5282628 -4053075 -2457171 -817828 427503 797988
36627 797988 374121 -342428 -1212209 -2310895 -3035337 -2485740 -1017694 -246057 -952535
36618 -952535 -2054235 -2332741 -2112700 -2246111 -2335682 -1266328 894705 2719684 3095291
36609 3095291 2216496 951175 -46590 -587153 -926966 -1534734 -2456950 -3043874 -2734159
36600 -2734159 -1901025 -1426057 -1630366 -2118553 -2451816 -2450203 -2075796 -1583918 -1519976 -1941474
36590 -1941474 -1974207 -947969 307055 322796 -906120 -1799134 -1366099 -407190 -126901
36581 -126901 -645495 -1594256 -3171638 -5459893 -7248933 -6846859 -4143209 -978130 720114
36572 720114 548943 -629533 -1775313 -2207720 -1714416 -658226 238550 481553 40276
36563 40276 -928306 -2078868 -2555802 -1478423 760005 2354835 2000869 476856 -509002
36554 -509002 -638351 -1042453 -2211009 -3176711 -3085514 -2317978 -1431072 -163223 1547058
36545 1547058 2522659 1596069 -636421 -2489760 -3210117 -3136247 -2282539 -323059 1991231
36536 1991231 2996545 2227983 1150011 1158438 1830774 1768065 339611 -1945577 -4010983
36527 -4010983 -4706892 -3614124 -1826442 -999803 -1187465 -787550 783174 1854066 1021346
36518 1021346 -551532 -936842 -366640 -419560 -1112072 -1034341 -88710 204272 -642473 -1261155
36508 -1261155 -837748 -400716 -855528 -1477463 -1436032 -1266915 -1532371 -1349963 209706
36499 209706 2224140 3010529 2470155 1775534 1158451 -294300 -2617834 -4304982 -4154194
36490 -4154194 -2739556 -1567089 -1516245 -2453900 -3674002 -4294464 -3737430 -2224958 -558410
36481 -558410 664876 1278959 1154395 286534 -670931 -793054 -122704 231181 -323711
36472 -323711 -932001 -597115 244977 364598 -472749 -1401146 -1969429 -2602298 -3371065 -3467111
36462 -3467111 -2469981 -1163449 -287090 659859 2242157 3366014 2277196 -769362 -3398922
36453 -3398922 -4112429 -3954149 -4379272 -4835217 -3888418 -1879506 -670523 -880554 -1025932
36444 -1025932 183707 2010015 2838431 2232408 1056216 165762 -224976 -168646 324370
36435 324370 1182311 2176597 2971905 3270357 3074392 2728472 2406145 1736452 452096
36426 452096 -774663 -923119 -65334 647782 609843 455583 832815 1444905 1795143 1936170
36416 1936170 1894465 1347602 613198 865189 2312724 3231811 2256609 774121 1199713
36407 1199713 3291956 4258840 2714536 510212 -132259 419558 328002 -860144 -1915439
36398 -1915439 -1882809 -1049415 -118127 610514 1149097 1484719 1403397 502005 -1282155 -2941484
36388 -2941484 -2843208 -535720 2284638 3272098 1710640 -1110579 -3368554 -3983587 -2930765
36379 -2930765 -1184272 -217428 -795099 -2296940 -3746155 -5082057 -6542671 -7297612 -6206643
36370 -6206643 -3992436 -2956917 -3824073 -4386089 -2493921 805358 2664234 2132259 646292
36361 646292 -738337 -2477172 -4622820 -5866046 -5480660 -4601186 -4291543 -3689425 -1636654
36352 -1636654 913678 2032351 1745470 1726915 2210323 1530529 -686530 -2134872 -1011415
36343 -1011415 1099375 1316456 -625898 -2452079 -2703644 -1978358 -908556 945754 3465343
36334 3465343 4979607 4207540 2197436 1030097 1157247 1320340 859502 670527 1493904
36325 1493904 2447165 2188873 940487 252903 777319 1260616 221316 -2048305 -3851257
36316 -3851257 -4112840 -3285313 -2352992 -1784501 -1674229 -2125974 -2959259 -3538411 -3488089 -3272225
36306 -3272225 -3477288 -3732751 -3050783 -1343385 21040 -352743 -2095341 -3246424 -2490450
36297 -2490450 -863664 -555136 -1988637 -3098144 -2169887 -388932 -144235 -1413332 -1835879
36288 -1835879 -498940 582824 -301988 -1911740 -2223860 -1590464 -1688980 -2519202 -2752092
36279 -2752092 -2362519 -2497036 -2995392 -2497027 -1140161 -707695 -1528280 -1543299 577258
36270 577258 3352540 4580679 3790043 1669250 -1035122 -2856439 -1882682 1552654 4138048
36261 4138048 3490050 1335704 723828 1561205 1605007 801330 1310467 3287612 3951407
36252 3951407 1756056 -1274677 -2735944 -3009659 -3475685 -3496857 -1529433 1775685 3935357
36243 3935357 3915978 3118704 2890834 2749365 1713367 82766 -1089384 -1524602 -1713631
36234 -1713631 -1793866 -1476317 -1053162 -1401031 -2510592 -2879301 -1289928 1216198 2255491
36225 2255491 1093374 -308018 280294 2669940 4678882 4666347 2869334 599039 -999561
36216 -999561 -1438600 -919864 -121219 386516 552725 509746 139474 -588741 -1159972 -1034069
36206 -1034069 -516497 -498802 -1305117 -2278407 -2552825 -1891686 -824770 -247839 -666032
36197 -666032 -1477765 -1342763 242853 2081195 2569946 1528259 81816 -856911 -1134651
36188 -1134651 -753711 153474 800695 295193 -1112789 -2203643 -2312014 -1822610 -1169579
36179 -1169579 -427829 -17384 -563054 -1621057 -1722362 -356730 1059495 951133 -464202
36170 -464202 -1728533 -1979911 -1513280 -1029423 -922854 -872676 157683 2736830 5452150
36161 5452150 5770771 3235496 625336 664253 2529021 3248795 1950058 727308 1252528
36152 1252528 2506887 2666991 1705073 881960 598287 166364 -564941 -675234 404808
36143 404808 1804677 2167992 1321117 400879 429199 1329356 2420604 3223706 3380048
36134 3380048 2413093 405657 -1368951 -1482200 -111986 1106436 1180139 763383 696011
36125 696011 620882 -106676 -990121 -1049989 -503244 -564976 -1573372 -2419908 -2210084 -1641160
36115 -1641160 -2052733 -3444865 -4113257 -2490714 835967 3282085 2699722 -399888 -3324408
36106 -3324408 -3862878 -2152321 -11562 951523 405343 -870931 -1751992 -1675479 -1056882
36097 -1056882 -576329 -172261 613863 1404796 1207532 156237 -201983 938749 2358767
36088 2358767 2648818 2249364 2391479 2921599 2770720 2045312 1935980 2666949 3141962
36079 3141962 2786266 2313245 2353391 2582080 2582908 2439787 2075516 1090919 -267911 -995779
36069 -995779 -728005 -371862 -808836 -1809730 -2799720 -3832628 -5026101 -5694745 -4983255
36060 -4983255 -3138927 -1443094 -867879 -1191829 -1480019 -1256929 -1084671 -1776357 -3025569
36051 -3025569 -3440053 -2431956 -1373550 -1875195 -3391619 -3846585 -2480943 -657681 287802
36042 287802 538823 760940 993570 1195329 1638058 2062771 1601842 234730 -851469
36033 -851469 -1045575 -1126229 -1467987 -1024819 571324 1453218 -9966 -2281021 -2453557
36024 -2453557 -469700 778509 -397900 -2430429 -3116769 -2368754 -1439669 -980946 -1037677
36015 -1037677 -1840635 -3296052 -4323972 -3916469 -2623651 -2027819 -2761302 -3771496 -3645362
36006 -3645362 -2153715 -374425 335063 -621764 -2705055 -4627556 -5263837 -4486089 -3219929
35997 -3219929 -2561255 -2741706 -3054515 -2854695 -2378028 -2302562 -2739690 -3153877 -3224986 -3227933
35987 -3227933 -3440370 -3699446 -3770583 -3715985 -3649509 -3482279 -3110153 -2556770 -1866190 -1180640
35977 -1180640 -813049 -751596 -337973 793294 1727857 1319185 46805 -577675 -424398
35968 -424398 -760591 -1572539 -1119878 856466 1814191 22161 -2576100 -3360489 -3097973
35959 -3097973 -4184401 -6134865 -6182712 -3925188 -1958269 -1560082 -924650 1397555 4088808
35950 4088808 5336763 5157081 4142925 2115826 -417884 -1430969 155381 2563103
35942 2563103 3362516 2401933 1099177 83590 -843081 -1466477 -1554543 -1732053 -2512354
35933 -2512354 -3161023 -2794461 -1814778 -1045425 -404600 244083 10638 -1655703 -3479100
35924 -3479100 -3932240 -3419412 -3131286 -2691976 -1086095 795334 946655 -683195 -2205035
35915 -2205035 -2746290 -3085095 -3367927 -2742277 -1629015 -1789795 -3347414 -4139769 -3063224
35906 -3063224 -1754010 -1675311 -1799550 -854952 186000 -83580 -890779 -749021 -222267
35897 -222267 -777730 -1814063 -1471463 858 345613 -1096370 -2380502 -2151685 -1558485
35888 -1558485 -1958891 -2715870 -2728915 -2602124 -3494884 -4758322 -4624963 -3000363 -1885641
35879 -1885641 -2777368 -4935238 -6654527 -7181144 -6743308 -5596886 -4008044 -2719997 -2369794
35870 -2369794 -2450769 -1818979 -521809 -216699 -2078181 -4926247 -6419518 -5865917 -4764059
35861 -4764059 -4438600 -4307452 -3158442 -1234796 35766 23006 -485055 -653030 -580956
35852 -580956 -590050 -402886 295917 1020947 1022974 489599 416527 1170154 1912810 1855682 1472567
35841 1472567 1746467 2500164 2399053 822410 -1044114 -1529405 -442761 868068 1179370
35832 1179370 542430 -123637 -78416 603787 1110903 732216 -96513 -4967 1479504 2844880
35822 2844880 2404611 894108 770855 2679257 4229829 3184903 467241 -1349866
35814 -1349866 -1490537 -1212340 -1238839 -995369 -483641 -916372 -2671536 -4127571 -3667745
35805 -3667745 -1823778 -276239 470041 1083356 1562183 917649 -1145838 -3450770 -4721078
35796 -4721078 -4904572 -4659534 -4272290 -3744695 -3442797 -3846926 -4753969 -5347516 -5132595
35787 -5132595 -4377995 -3551145 -2687777 -1519260 -41328 1233325 1647903 1119593 476319
35778 476319 768114 2042642 3167920 3253827 2827254 2905436 3253703 2675715 1099004
35769 1099004 62538 503357 1249371 805144 -291141 -397328 408917 191288 -1930240
35760 -1930240 -4288271 -4824576 -3615293 -2361690 -2145507 -2616608 -2932028 -2622788 -1717184
35751 -1717184 -649715 52046 375904 865037 1711225 2241631 1819786 847032 211274
35742 211274 16597 -411048 -1326506 -2049460 -1800698 -667276 403616 458840 -503811
35733 -503811 -1361915 -977154 395002 1298196 887820 -140902 -830983 -1270493 -1832742
35724 -1832742 -2020487 -1352946 -802894 -1715487 -3383570 -3420798 -1042309 1494811 1602259
35715 1602259 -534420 -2520991 -2679457 -1400794 -23744 606957 474187 24643 -277442
35706 -277442 -286622 -184666 -201506 -498209 -1219051 -2243762 -2926570 -2663817 -1818726 -1429613
35696 -1429613 -1778656 -1953297 -1217883 -148642 160924 -478891 -1317721 -1690368 -1554098
35687 -1554098 -1285453 -1350871 -1861619 -2143405 -1256214 612511 1849365 1154922 -880437
35678 -880437 -2618025 -3292668 -3229625 -2593981 -1161404 620940 1559742 1235758 759858
35669 759858 1297785 2332590 2202927 292497 -2047928 -3095040 -2813803 -2697478 -3608457
35660 -3608457 -4599598 -4410318 -3423352 -3018282 -3216300 -2419541 39159 2409321 2598223
35651 2598223 861519 -730573 -952709 -347486 185196 441540 499383 339006 159132
35642 159132 298872 618249 587661 150546 -71329 441754 1564854 2694499 2955958
35633 2955958 1512083 -1490058 -4320490 -4919171 -2986895 -219547 1580431 1935600
35625 1935600 1286140 136665 -1041558 -1800970 -2067677 -2134878 -2185190 -2197206 -2181851 -1949427
35615 -1949427 -947467 826601 2099523 1705618 510083 488218 1822584 2582782 1688497
35606 1688497 400918 56475 90765 -422881 -850461 -278771 468544 -35690 -1421081
35597 -1421081 -2114553 -1906689 -2083683 -3108886 -3931816 -3837353 -3469265 -3565583 -3849266 -3640441
35587 -3640441 -2701588 -1188362 465721 1495288 1448049 938184 913491 1220395 925042
35578 925042 75528 -82856 1027509 2342480 2516460 1370515 -368012 -1835950 -2187632
35569 -2187632 -1022556 785569 1608853 976675 75174 -167016 -356904 -1177365 -1801444
35560 -1801444 -1051074 615948 1673684 1646248 1267889 788029 -310645 -1712950 -1951255
35551 -1951255 -466607 1117157 808309 -1283228 -3271364 -3897883 -3550730 -2983151 -2213551
35542 -2213551 -1163525 -418832 -444785 -543713 376859 2105898 3196409 2883446 1971524
35533 1971524 1433522 1078837 289468 -723464 -1297372 -1399640 -1411498 -1269739 -798645
35524 -798645 -552050 -1244931 -2490453 -3130241 -2768525 -2023749 -1349200 -631763 82755
35515 82755 527712 855804 1266692 1120110 -275425 -2055120 -2527584 -1621593 -871295
35506 -871295 -688699 256800 2150071 2765079 655690 -2186055 -2822297 -1273884 54373
35497 54373 -78903 -848731 -1458752 -2089418 -2841966 -3429628 -3959331 -4655207 -4908314 -3922629
35487 -3922629 -2166344 -891357 -371289 147980 1017409 1982863 3011223 3888275 3492928
35478 3492928 1225694 -1216202 -1511027 -25904 715991 -29212 -241188 1328823 3027965
35469 3027965 2833849 1042063 -834553 -2151262 -2803741 -2311051 -608151 1374998 2951171
35460 2951171 4244989 4734261 3031686 -562279 -3118791 -2534558 -492511 -30867 -1402273
35451 -1402273 -2453376 -2100043 -1146583 -304253 358316 352194 -761556 -2073288 -2375618
35442 -2375618 -2147511 -2561921 -3051156 -2187148 -621071 -453130 -1645861 -1967328 -969186
35433 -969186 -910489 -2602345 -3459540 -1653698 492188 -119807 -2594252 -3617960 -2523917
35424 -2523917 -1630666 -2023867 -2168482 -1149699 -521289 -1712942 -3551094 -3843239 -2289196
35415 -2289196 -524931 23793 -749695 -2150937 -3241811 -3073184 -1329360 1078556 2685309
35406 2685309 2993657 2905192 3354483 3915326 3337981 1382389 -606633 -1295612 -909484
35397 -909484 -540128 -445461 -79490 430739 241296 -476472 -234913 1457778 2784189
35388 2784189 2014502 296750 257042 2165429 3478720 2534950 824505 595407 1696160
35379 1696160 2305485 1916220 1810030 2657129 3277869 2378649 408343 -1137086 -1570257
35370 -1570257 -1287803 -623256 505577 1747229 2106619 1132140 -215857 -455526 873504
35361 873504 2897155 4317891 4263911 2670915 480557 -796071 -476325 402023 321133
35352 321133 -662285 -1052555 -246130 412196 -450544 -2184308 -2983479 -2312873 -1400546
35343 -1400546 -1378457 -1872491 -1760285 -753257 288268 561378 462784 1095878 2546162
35334 2546162 3305886 2181087 333701 140377 1948334 3446497 2840550 1165029 400520
35325 400520 685554 907475 946531 1460210 2146038 2237300 2327243 3545754 5038755 4647263
35315 4647263 2450624 1161539 2077413 3034267 1898485 -40496 -267542 942386 1178464
35306 1178464 -256745 -1625172 -1722758 -1340805 -1422184 -1615474 -1343703 -956433 -1081464
35297 -1081464 -1727414 -2539566 -3209805 -3324015 -2575587 -1432695 -882273 -1256833 -1950412
35288 -1950412 -2371861 -2397904 -1861041 -634260 543531 489687 -623347 -964263 621333
35279 621333 2783614 3173891 1327235 -876590 -1418031 -12324 2149866 3784303 4348581
35270 4348581 3868345 2434242 263154 -1751977 -2297985 -1178920 -94740 -765042 -2520329
35261 -2520329 -3182079 -2350734 -1961953 -2930453 -3281157 -1176132 1803308 2562362 821337
$$ [...]
##END NTUPLES=NMR SPECTRUM
##END=
