##TITLE=31Pdec_PhBDP1910
 CDCl3, 24 sc
 20.10.2020
##JCAMPDX= 6.0         $$ Bruker NMR JCAMP-DX V2.0
##DATA TYPE= NMR SPECTRUM
##DATA CLASS= NTUPLES
##ORIGIN= UXNMR, Bruker Analytische Messtechnik GmbH
##OWNER= root
$$ XWIN-NMR		Version 3.5
$$ Tue Oct 20 11:25:03 2020 Russian Standard Time (UT+4h)  she@DPX200
##.OBSERVE FREQUENCY= 81.013821
##.OBSERVE NUCLEUS= ^31P
##.ACQUISITION MODE= SIMULTANEOUS
##.ACQUISITION SCHEME= undefined
##.AVERAGES= 24
##.DIGITISER RES= 17
##SPECTROMETER/DATA SYSTEM= spect
##.PULSE SEQUENCE= zgpg30
##.SOLVENT NAME= D2O
##.SHIFT REFERENCE= (INTERNAL, D2O, 0, 182.463)
##AUDIT TRAIL= $$ (NUMBER, WHEN, WHO, WHERE, WHAT)
$$ ##TITLE= Audit trail, XWIN-NMR		Version 3.5
$$ ##JCAMPDX= 5.01
$$ ##ORIGIN= Bruker BioSpin GmbH
$$ ##OWNER= she
$$ F:/spectra/data/she/nmr/P31/1/pdata/1/auditp.txt
$$ ##AUDIT TRAIL=  $$ (NUMBER, WHEN, WHO, WHERE, WHAT)
(   1,<2020-10-20 11:23:52.57 +0400>,<she>,<DPX200>,
      <created by zg, POWCHK disabled, PULCHK disabled
       configuration hash MD5:
       00 E9 B6 7A A2 85 ED C7 34 08 36 98 17 FE 4E 26
       data hash MD5: 32K
       A0 1A 23 73 6A ED 23 B4 8E B5 00 E6 B8 43 41 70>)
(   2,<2020-10-20 11:23:55.62 +0400>,<she>,<DPX200>,
      <Start of raw data processing
       efp BC_mod = 2 LB = 1 FT_mod = 6 PKNL = 1 PHC0 = -2750.694 PHC1 = 71.60141 SI = 64K 
       data hash MD5: 64K
       D4 7C 2A 83 46 22 44 F1 C4 C2 54 EC 18 6A C6 30>)
(   3,<2020-10-20 11:24:12.14 +0400>,<she>,<DPX200>,
      <pk PHC0 = 6.429214 PHC1 = 0 
       data hash MD5: 64K
       37 AF 8B 1F FA 9A 3A 97 68 F5 07 B6 B2 C0 13 CB>)
(   4,<2020-10-20 11:24:37.39 +0400>,<she>,<DPX200>,
      <pk PHC0 = -4.000004 PHC1 = 0 
       data hash MD5: 64K
       71 7A 85 0C 19 E5 21 4F D3 66 47 30 E5 C9 0A 14>)
$$ ##END=
$$ 
$$ hash MD5
$$ 10 AF 22 E2 02 56 B7 DB 65 63 A2 34 78 66 0B 3D
##$RELAX= 
##$RELAX= 
##$RELAX= 
##$RELAX= 
##$RELAX= 
##$RELAX= 
##$RELAX= 
##$RELAX= 
$$ Bruker specific parameters
$$ --------------------------
##$DU= <F:/spectra>
##$EXPNO= 1
##$NAME= <P31>
##$PROCNO= 1
##$TYPE= <nmr>
##$USER= <she>
##$AMP= (0..31)
100 100 100 100 100 100 100 100 100 100 100 100 100 100 100 100 100 100 
100 100 100 100 100 100 100 100 100 100 100 100 100 100 
##$AQSEQ= 0
##$AQ_mod= 1
##$AUNM= <au_zg>
##$AUTOPOS= <>
##$BF1= 81.014009
##$BF2= 200.13
##$BF3= 200.13
##$BF4= 200.13
##$BF5= 200.13
##$BF6= 200.13
##$BF7= 200.13
##$BF8= 200.13
##$BYTORDA= 1
##$CFDGTYP= 0
##$CFRGTYP= 5
##$CHEMSTR= <none>
##$CNST= (0..31)
1 1 145 1 1 1 1 1 1 1 1 1 1 1 1 1 1 1 1 1 1 1 1 1 1 1 1 1 1 1 1 1 
##$CPDPRG= <waltz16>
##$CPDPRG1= <>
##$CPDPRG2= <waltz16>
##$CPDPRG3= <>
##$CPDPRG4= <mlev>
##$CPDPRG5= <mlev>
##$CPDPRG6= <mlev>
##$CPDPRG7= <mlev>
##$CPDPRG8= <mlev>
##$CPDPRGB= <>
##$CPDPRGT= <>
##$D= (0..31)
0 1 0 0 0 0 0 0 0 0 0 0.03 2e-05 3e-06 0 0 0 0 0 0 0 0 0 0 0 0 0 0 0 0 
0 0 
##$DATE= 1603178632
##$DBL= (0..7)
120 120 120 11 120 120 24 19 
##$DBP= (0..7)
150 150 150 150 150 150 150 150 
##$DBP07= 0
##$DBPNAM0= <>
##$DBPNAM1= <>
$$ [...]
##$SUBNAM2= <"">
##$SUBNAM3= <"">
##$SUBNAM4= <"">
##$SUBNAM5= <"">
##$SUBNAM6= <"">
##$SUBNAM7= <"">
##$SUBNAM8= <"">
##$SUBNAM9= <"">
##$SW= 369.568048894756
##$SWIBOX= (0..15)
0 1 3 0 0 0 0 0 0 0 0 0 0 0 0 0 
##$SW_h= 29940.119760479
##$TD= 32768
##$TD0= 1
##$TE= 0
##$TE2= 300
##$TE3= 300
##$TEG= 300
##$TL= (0..7)
0 120 53 12 22 120 120 120 
##$TP= (0..7)
150 150 150 150 150 150 150 150 
##$TP07= 0
##$TPNAME0= <>
##$TPNAME1= <>
##$TPNAME2= <>
##$TPNAME3= <>
##$TPNAME4= <>
##$TPNAME5= <>
##$TPNAME6= <>
##$TPNAME7= <>
##$TPOAL= (0..7)
0.5 0.5 0.5 0.5 0.5 0.5 0.5 0.5 
##$TPOFFS= (0..7)
0 0 0 0 0 0 0 0 
##$TUNHIN= 0
##$TUNHOUT= 0
##$TUNXOUT= 0
##$USERA1= <user>
##$USERA2= <user>
##$USERA3= <user>
##$USERA4= <user>
##$USERA5= <user>
##$V9= 5
##$VALIST= <valist>
##$VCLIST= <CCCCCCCCCCCCCCC>
##$VD= 0
##$VDLIST= <DDDDDDDDDDDDDDD>
##$VPLIST= <PPPPPPPPPPPPPPP>
##$VTLIST= <TTTTTTTTTTTTTTT>
##$WBST= 1024
##$WBSW= 4
##$XGAIN= (0..3)
0 0 0 0 
##$XL= 0
##$YL= 0
##$YMAX_a= 20845
##$YMIN_a= -29237
##$ZGOPTNS= <>
##$ZL1= 120
##$ZL2= 120
##$ZL3= 120
##$ZL4= 120
##$ABSF1= 0
##$ABSF2= 0
##$ABSG= 0
##$ABSL= 0
##$ALPHA= 0
##$AQORDER= 0
##$ASSFAC= 0
##$ASSFACI= 0
##$ASSFACX= 0
##$ASSWID= 0
##$AUNMP= <proc_1d>
##$AZFE= 0.1
##$AZFW= 0.5
##$BCFW= 0
##$BC_mod= 2
##$BYTORDP= 0
##$COROFFS= 0
##$CY= -3
##$DATMOD= 1
##$DC= 0
##$DFILT= <>
##$DTYPP= 0
##$F1P= 0
##$F2P= 0
##$FCOR= 1
##$FTSIZE= 65536
##$FT_mod= 6
##$GAMMA= 0
##$GB= 0
##$INTBC= 1
##$INTSCL= 5.30512e-09
##$ISEN= 30
##$LB= 1
##$LEV0= 0
##$LPBIN= 0
##$MAXI= 10000
##$MC2= 0
##$MEAN= 0
##$ME_mod= 0
##$MI= 50
##$NCOEF= 0
##$NC_proc= -6
##$NLEV= 6
##$NOISF1= 182.463
##$NOISF2= 159.3651
##$NSP= 0
##$NTH_PI= 0
##$NZP= 0
##$OFFSET= 182.463
##$PC= 4
##$PHC0= -2748.265
##$PHC1= 71.60141
##$PH_mod= 1
##$PKNL= yes
##$PPARMOD= 0
##$PSCAL= 0
##$PSIGN= 0
##$REVERSE= no
##$SF= 81.0140089999434
##$SI= 65536
##$SIGF1= 159.3651
##$SIGF2= -187.1042
##$SINO= 113.3802
##$SIOLD= 16384
##$SREGLST= <1H.CDCl3>
##$SSB= 0
##$STSI= 65536
##$STSR= 0
##$SW_p= 29940.119760479
##$SYMM= 0
##$S_DEV= 0
##$TDeff= 32768
##$TDoff= 0
##$TI= <>
##$TILT= no
##$TM1= 0
##$TM2= 0
##$TOPLEV= 0
##$USERP1= <user>
##$USERP2= <user>
##$USERP3= <user>
##$USERP4= <user>
##$USERP5= <user>
##$WDW= 1
##$XDIM= 65536
##$YMAX_p= 532674506
##$YMIN_p= -19723586
$$ End of Bruker specific parameters
$$ ---------------------------------
##NTUPLES= NMR SPECTRUM
##VAR_NAME=  FREQUENCY,     SPECTRUM/REAL,   SPECTRUM/IMAG
##SYMBOL=    X,             R,               I
##VAR_TYPE=  INDEPENDENT,   DEPENDENT,       DEPENDENT
##VAR_FORM=  AFFN,          ASDF,            ASDF
##VAR_DIM=   65536,         65536,           65536
##UNITS=     HZ,            ARBITRARY UNITS, ARBITRARY UNITS
##FACTOR=    0.456856943014862, 1,           1
##FIRST=     14782.0589164792, 0,            0
##LAST=      -15158.0608439998, 0,           0
##MIN=       -15158.0608439998, -19723586,   0
##MAX=       14782.0589164792, 532674506,    0
$$ Real data points
##PAGE= N=1
##DATA TABLE= (X++(R..R)), XYDATA
$$ [...]
44716 -3751364 -4294294 -2170850 246546 856982 385007 253221 270968 -174130 -627616
44707 -627616 -779850 -1460081 -2845416 -3150035 -845437 2816106 5103206 4970512 3633567
44698 3633567 2599141 2323698 2430742 2353505 2058238 2486643 4494753 7062944 7857030
44689 7857030 6204019 4058092 3124315 2702138 1760328 1389773 2982357 5106203 4820405
44680 4820405 1897918 -621497 -449474 1310093 2156034 1255336 -317759 -1289008 -1262286
44671 -1262286 -725602 -590068 -1321828 -2239050 -2119196 -699272 906321 1471283 894613
44662 894613 -18661 -610691 -909504 -1258065 -1633912 -1550060 -825118 -193881 -514696 -1395947
44652 -1395947 -1508481 -543280 167082 -386229 -1281932 -996336 370829 1259382 604100
44643 604100 -1266937 -3254369 -4200396 -3525308 -2004574 -1310696 -1944591 -2461854 -1776031
44634 -1776031 -1086688 -1905588 -3211845 -2794379 -872645 165048 -337682 -348737 1180685
44625 1180685 2199776 543224 -2851076 -5342982 -5863678 -5205538 -4083467 -2566279
44617 -2566279 -937635 213839 573777 48222 -1332817 -2847445 -3294240 -2596227 -2229958
44608 -2229958 -3044707 -3702967 -2647325 -679537 141768 -419635 -728043 -156741 -30706
44599 -30706 -1251999 -2658152 -2573839 -877359 1212706 2549332 2673489 1840325 1001727
44590 1001727 1034026 1510301 1062184 -523981 -1568381 -693930 1142829 1963235 1459581
44581 1459581 1028816 1457605 2082881 2334894 2565173 2773502 1930671 -344600 -2427868
44572 -2427868 -2380707 -547909 862707 651405 -234729 -542915 -308090 -55394 342254
44563 342254 1035438 1309009 499166 -687086 -964220 -395735 -366552 -1524718 -2789867
44554 -2789867 -2762767 -1348357 377551 1273000 800368 -712501 -2025739 -1777214 115410
44545 115410 2161243 2812619 1977451 713436 -146967 -561157 -744429 -644200 -3159
44536 -3159 1246718 2591647 2973534 1677873 -591679 -2025954 -1549775 -2761 985629
44527 985629 952252 783894 1112162 1323529 484664 -1187227 -2240724 -1426359 910667
44518 910667 2999009 3334031 2185285 1204271 1508625 2506168 2820388 2002164 859955
44509 859955 260113 201851 302436 739905 2087484 4101334 5259056 4204486 1603219
44500 1603219 -222026 138813 1651360 2390317 1857007 860493 -158606 -1250968 -1776307
44491 -1776307 -887806 589597 588912 -1167171 -2238369 -673935 2304152 4166348 4322118
44482 4322118 3891746 3382243 2610044 2238666 3157928 4455996 4125125 2055320 445326
44473 445326 795859 2234762 3373017 4078389 4594208 4514727 3723549 3081565 3147635 3335808
44463 3335808 3244700 3547782 4490218 4826986 3607847 1826118 810446 188384 -759156
44454 -759156 -915263 1097654 3846869 4359506 2506795 1354219 2470311 3573931 2234296
44445 2234296 -409918 -1602151 -922042 -5385 577214 1666277 3115728 3481999 2471667
44436 2471667 1728355 2482922 3979790 5015553 5597227 6012860 5509751 3400979 828918
44427 828918 -154621 786130 1866442 1598124 446272 -394901 -826448 -1536776 -2467800
44418 -2467800 -2709386 -1977692 -1337113 -1997517 -3753573 -5003325 -4239869 -1414577 1976888
44409 1976888 4019612 3861368 2415381 1535766 2234845 3695955 4185890 2869746 552142
44400 552142 -1249265 -1669659 -1001105 -217977 -118732 -671808 -1072581 -603292 557835
44391 557835 1611161 2137345 2382060 2510061 2197951 1296295 331721 -182264 -495825
44382 -495825 -1036939 -1430076 -944489 179916 770134 301217 -327348 16713 1311003
44373 1311003 2600941 3136964 2856641 2146167 1617154 1822676 2687950 3395005 3259533
44364 3259533 2559268 2083092 2050016 2002869 1729296 1734581 2590265 4101955 5307335 5223747
44354 5223747 3665663 1527009 171027 226203 939509 965433 -141792 -1423648 -1567090
44345 -1567090 -282363 1450572 2355796 1931520 626820 -769292 -1649678 -1589613 -368338
44336 -368338 1578963 3061426 3173445 2415907 2093318 2497894 2493778 1242992 -474697
44327 -474697 -1291864 -974955 -404518 -336491 -925056 -2022225 -3116630 -3343938 -2460873
44318 -2460873 -1528145 -1682390 -2469085 -2445139 -1287434 -113064 346595 642048 1389891
44309 1389891 2351857 3205933 4152200 5129135 5369492 4428247 2863926 1293941 -345956
44300 -345956 -1901341 -2377935 -1330777 -131702 -525115 -2236690 -3246516 -2354250 -353116
44291 -353116 1385499 2357454 2624736 2073417 682109 -928442 -1817198 -1511192 -265452
44282 -265452 1258716 2396712 2802949 2636144 2334696 2048369 1430618 247504 -894198
44273 -894198 -904672 385080 1555759 1039899 -795418 -1872710 -1045392 421260 730039
44264 730039 -16244 -452695 -316834 -566956 -1364411 -1641534 -876993 237338 1151177
44255 1151177 1877478 1804916 72672 -2182590 -2113788 1014960 4247393 4778094 3516546
44246 3516546 2864345 2792988 1795693 390614 492602 1789924 1902231 317808 -728417
44237 -728417 121346 1508600 2007286 2143920 2586628 2500918 1166652 -513049 -1532281
44228 -1532281 -2281987 -3196562 -3444557 -2490953 -1568448 -1874533 -2432340 -1564497 346489
44219 346489 1427543 1111741 561241 524123 457974 -93882 -605984 -320916 983471 2982444
44209 2982444 4813678 5377531 4527685 3644383 4028214 5070690 5148760 3966567 2594489
44200 2594489 1375004 -466231 -2788774 -3877808 -2794561 -1082107 -841819 -1902827
44192 -1902827 -2270413 -1039160 536387 1056389 844652 1101238 1934516 2235983 1382423
44183 1382423 114770 -634093 -1064043 -1947669 -3107814 -3356039 -2087619 -238906 718397
44174 718397 339597 -552753 -903360 -393740 504445 1257739 1955432 3002376 4044756
44165 4044756 3872776 2057854 61638 -448731 -39113 -725555 -2684365 -3568475 -1898224
44156 -1898224 508045 873852 -860581 -2248899 -1622333 309680 1893338 2248906 1519482
44147 1519482 446101 -90970 270539 1075622 1676184 1839351 1457537 331614 -1195544
44138 -1195544 -2136247 -2137546 -2097202 -2625343 -2773074 -1498630 393028 1287411 1205976 1547717
44128 1547717 2630094 3246168 2814041 2317316 2632289 3266013 3346020 2827697 2190773
44119 2190773 1745127 1592877 1577131 1147568 50836 -887556 -614165 615783 1675292
44110 1675292 2420396 3675409 5258099 5676365 4375653 2811347 2441627 2851701 2760849
44101 2760849 1874019 813966 41834 -266895 93584 1032364 1970806 2440549 2389868
44092 2389868 1773599 681351 -26489 610525 2057144 2683517 2186789 2083300 3092179
44083 3092179 3712058 2556602 592867 -370289 -138910 418745 1128980 1975018 1920333
44074 1920333 330195 -1180290 -518872 1599145 2297740 464750 -2029487 -3279015
44066 -3279015 -3480460 -3490273 -3070984 -1691980 82456 1091771 908529 79113 -471124
44057 -471124 10111 1562555 3331583 4418792 4788510 4687811 3651997 1324123 -1034983
44048 -1034983 -1500873 -104181 1166873 1370407 1810819 3423705 4780206 4140941 2168465
44039 2168465 915380 943883 1116916 778499 516630 852424 1573402 2493792 3726588
44030 3726588 4999131 5648330 5497172 4940956 4085629 2701312 1216558 788066 1869920
44021 1869920 3377711 3803033 2742043 982876 -420879 -742363 262626 2165175
44013 2165175 3983040 4944678 5075511 4783346 4122915 2883088 1202688 -436925 -1808505
44004 -1808505 -3009467 -3872644 -3882842 -2949748 -1741472 -802844 224110 1877332 3672981
43995 3672981 4450643 3916118 3001087 2475102 2056838 1342139 730356 635535 493938 -358777
43985 -358777 -1245307 -831930 817023 2124988 2143455 1572823 1200008 577964 -848115
43976 -848115 -2277707 -2401162 -1221770 29914 525116 432136 97770 -397781 -914780
43967 -914780 -1338057 -1954807 -2939429 -3586023 -3055698 -1859246 -1387478 -1755208 -1499358
43958 -1499358 -58131 855077 -428879 -2858668 -3862543 -2745572 -1296550 -1069064
43950 -1069064 -1631507 -1885445 -1684862 -1358219 -720323 405870 1348091 1284494 431214
43941 431214 -348145 -857311 -1590164 -2521005 -2768682 -1672010 422989 2617988 4162532
43932 4162532 4588923 3805633 2409076 1434224 1392041 1813377 1980679 1773396 1528496
43923 1528496 1464789 1669708 2351791 3538997 4578598 4473294 2950419 969986 -62564
43914 -62564 376460 1414687 1674221 790289 -77328 408024 1912043 2517395 1020917
43905 1020917 -1414139 -2623392 -2121106 -1400264 -1510277 -1569112 -413000 1293715 1925665
43896 1925665 1435352 1431921 2502351 3072069 1859510 119583 -79608 1007510 1261290
43887 1261290 52331 -917104 -557951 -138553 -919161 -1727393 -637541 1959143 3824710
43878 3824710 3882857 2975015 1916093 685067 -375059 -431232 295265 516261 4524
43869 4524 83574 1157248 1466361 -281403 -2381159 -2034323 902887 3831397 4840220
43860 4840220 4578527 4498098 4680331 4153537 2562410 689483 -525029 -958973 -1126833
43851 -1126833 -1230201 -853216 104620 702237 6182 -1338948 -1704726 -757588 87527
43842 87527 -168158 -876356 -1293793 -1787696 -2392344 -1768853 650556 2717972 1957404
43833 1957404 -748638 -2133527 -1042971 280600 -342275 -2419136 -4271643 -5185962
43825 -5185962 -5082495 -3678060 -1293562 606527 966772 534676 637890 1174104 954226
43816 954226 -216186 -889386 290897 2714291 4120605 2979147 391419 -991916
43808 -991916 -194986 832563 -52174 -2193959 -3254169 -2503776 -1101639 426536 2551908
43799 2551908 4423181 3877310 799701 -1912001 -2228316 -1694635 -2405986 -3283150 -1926225
43790 -1926225 1114339 2782651 1823125 68477 -614185 -323368 315991 1438516 2931196
43781 2931196 3764397 3311782 2266148 1525312 1087399 595721 61865 -467970 -1102200
43772 -1102200 -1541169 -1274599 -757671 -1241626 -2735288 -3300629 -1460948 1593022 3486472
43763 3486472 3695673 3598738 3815466 3318594 1660491 428920 1237392 3227587 4092429
43754 4092429 3257049 2447108 2842098 3283397 2325564 801972 665572 1786334 1825030
43745 1825030 -375363 -2971180 -3601828 -2418776 -1404064 -1504448 -1859502 -1553289 -761777
43736 -761777 -5280 689611 1503845 2356739 3036333 3394670 3305259 2826207 2414004 2504553
43726 2504553 2865632 2889389 2594287 2726950 3578499 4201153 3321474 916692 -1508662
43717 -1508662 -2306579 -1153215 957854 2929040 4313120 4832412 3917324 1495653 -1139145
43708 -1139145 -2328907 -2012053 -1672075 -2106156 -2447596 -1997325 -1726426 -2752051 -4234676
43699 -4234676 -4328711 -2864674 -1588536 -1694944 -2464482 -2691415 -2352041 -2274472 -2878843
43690 -2878843 -3818215 -4474471 -4437182 -3754966 -2902854 -2280496 -1742621 -945304 -86571 178230
43680 178230 -346885 -975735 -856860 38444 780392 411854 -865226 -1610650 -696983
43671 -696983 1164352 2156152 1642264 764134 522257 488452 71163 -224132 129840 484964
43661 484964 234896 221039 1306889 2372935 1659783 -331305 -1314400 -534571 367896
43652 367896 24407 -1024504 -1818033 -2327018 -2620419 -2228873 -1176813 -413391 -472807
43643 -472807 -772219 -776379 -697543 -548707 160976 1115917 933026 -871412 -2768237 -3007836
43633 -3007836 -1651175 -82372 607963 149443 -978266 -1559263 -708693 530138 36874
43624 36874 -2232165 -3576512 -2178499 193311 656168 -945676 -2475599 -2757047 -2400986
43615 -2400986 -1969293 -1300204 -578380 -435625 -852047 -1136756 -952470 -361152 813411
43606 813411 2495509 3574859 2950448 1220847 94493 213527 740248 946268 905224
43597 905224 639539 -45436 -669964 -287480 1025967 1916057 1400608 -24480 -1227213
43588 -1227213 -1656134 -1476471 -1162229 -1152765 -1355039 -960993 597709 2530099 3258789
43579 3258789 2197957 313329 -1121026 -1658945 -1554886 -1237701 -1126057 -1463314 -2146603
43570 -2146603 -2949443 -3788951 -4518338 -4792215 -4494565 -3871794 -2914552 -1332892 340422
43561 340422 627308 -939855 -2650089 -2651047 -1378157 -535267 -402667 74753 997820 1318668
43551 1318668 889625 762519 1208769 1276468 739516 741421 1893236 3305475 4172503 4842647
43541 4842647 5613526 5896504 5374093 4682962 4187745 3397198 2393497 2428346 4039074
43532 4039074 5791559 6026914 4829591 3229126 1551013 -225103 -1432830 -1396986 -517071
43523 -517071 430562 1408244 2490123 2900374 1953319 440025 -118343 731447 2222297
43514 2222297 3465776 3801333 2824486 1264508 1096750 3278290 5836206 5837040 3108893
43505 3108893 404566 -211967 482389 735326 286542 51613 372391 683622 541147
43496 541147 155056 -63248 -22878 23301 -217614 -782679 -1422879 -1826427 -1756099 -1017322
43486 -1017322 376991 1920800 2889848 3084435 2918585 2656177 2114445 1316142 724652
43477 724652 467605 75414 -533329 -621297 187867 1145688 1577649 1971295 2878941 3609110
43467 3609110 3308509 2668512 3057898 4364391 5230412 5186187 4940680 4652014 3691469
43458 3691469 2375022 2126475 3263268 4213776 3815637 2971381 2927160 3143792 2252086
43449 2252086 285182 -1482801 -2474414 -3231708 -4054458 -4436299 -3997158 -3043957 -1985072
43440 -1985072 -899053 118563 793857 1086207 1286675 1551028 1795994 2167082 3000211
43431 3000211 3992243 4006199 2359989 45315 -1077411 -391846 769517 801832 -306858
43422 -306858 -1255532 -1199592 -542393 9680 476900 1347502 2679052 3857015 4185973
43413 4185973 3595730 2820207 2756932 3381523 3513697 2235466 422718 -5430 1444100
43404 1444100 3092765 3331727 2620222 2323117 2393467 1626996 -29754 -936432 55457
43395 55457 1959174 2871684 2189592 960221 444339 1023498 2391815 4087046 5474898
43386 5474898 5640249 4023417 1368166 -546784 -682455 118779 459290 448636 1262110
43377 1262110 2730956 3019142 1392958 -224408 229260 2018539 2819942 2142355 1683319
43368 1683319 2465195 3466219 3440644 2527009 1388815 8444 -1757559 -3181361 -3128432
43359 -3128432 -1352946 1060342 2480359 2043807 525570 -280914 516931 1929054 2551937
43350 2551937 2439172 2552935 2875311 2418941 944633 -749142 -2287443 -4006485 -5550005
43341 -5550005 -5702926 -4209986 -2487147 -1864725 -2177873 -2594239 -2657259 -1938296 48566
43332 48566 2725635 4342195 3906131 2348167 1039338 184484 -506045 -730635 -346613
43323 -346613 -273057 -1367924 -3015673 -3934727 -3831248 -3250403 -2408973 -1276281 -322756
43314 -322756 -110006 -448671 -755813 -770699 -252699 1186518 3015580 3516936 1891783
43305 1891783 -170743 -516809 533616 937728 147967 -342426 339940 1164895 1108300
43296 1108300 797479 1393119 2769763 3570203 2663561 305112 -1794582 -1755197 472667
43287 472667 2677698 2755070 1125909 -163286 -212611 250044 758057 1656148 2636305
43278 2636305 2557022 1324979 430404 888223 1984868 2779660 3447120 4174629 4068382
43269 4068382 2489284 555665 -103343 389771 399502 -931886 -2681135 -3416570 -2681834
43260 -2681834 -1127539 305048 1181424 1691155 1943216 1402731 -351317 -2419528 -3155564
43251 -3155564 -2247771 -1182596 -1085175 -1195742 -404605 665229 411436 -1378794 -3156480
43242 -3156480 -3485008 -2303311 -422220 1281725 2128492 1938955 1264536 768905 409382
43233 409382 -190863 -724674 -408395 698939 1434313 964346 -125255 -596587 22990
43224 22990 1218981 2346036 3174614 3659359 3655291 3095513 2249405 1536699 1086795 697591
43214 697591 296264 177838 558861 1089447 1114853 320551 -1094849 -2600602 -3321048
43205 -3321048 -2301014 388701 2983414 3482156 1983235 653954 1015638 2162566
43197 2162566 2274506 1118915 190813 718918 2266617 3288823 2780618 1463635 1250595
43188 1250595 3070271 5422106 5975996 4493163 2854934 2082870 1154184 -446931 -1020384
43179 -1020384 805493 3345612 3843511 2252392 780509 299608 -261887 -1080837 -732010
43170 -732010 1035061 2244280 1603399 559640 1105593 3051128 4845870 5826495 6208875
43161 6208875 5911913 4919719 4083594 4132954 4387849 3681524 2074409 510900 -661967
43152 -661967 -1590946 -1871551 -1006449 425383 1418191 2050202 2906546 3329006 2076747
43143 2076747 -191642 -1101598 133379 1453432 1067984 131202 690305 2228482 2373444
43134 2373444 620206 -821079 -315897 840177 411151 -1540673 -2705068 -1444408
43126 -1444408 1435270 3874300 4649461 3966438 2630458 1248547 96205 -724308 -1153243
43117 -1153243 -1101694 -573963 39455 60661 -685805 -1327867 -784221 737183 1707031 1131052
43107 1131052 -78194 -176261 1292453 3130205 4090601 4093738 3751223 3412875 3073866
43098 3073866 2767361 2585596 2465445 2232041 1796944 1243696 850765 985377 1702916
43089 1702916 2503761 2867095 2987026 3474962 4312417 4743004 4366161 3612532 2818113
43080 2818113 1658332 111945 -804122 -206678 1246010 2115640 1994672 1488258 718566
43071 718566 -717145 -2188856 -2008442 291669 2872924 3810834 3521481 3799864 5039047
43062 5039047 5772699 4868089 2897746 1067569 -156381 -831039 -775344 181533 1524473
43053 1524473 2318419 2166076 1516706 1011108 836175 808895 831981 1025410 1452860 1942707
43043 1942707 2294140 2524108 2753225 2979936 3196185 3554223 4011971 3961147 2895929
43034 2895929 1542084 1437615 2894845 4233000 3908232 2698672 2516715 3443993 3569455
43025 3569455 2006973 416950 583440 1737143 1707023 131169 -968049 166976 2976544
43016 2976544 5461413 6226996 5292972 3629633 2438089 2410082 3139895 3487894 2872670
43007 2872670 1888430 1257056 631342 -748316 -2329166 -2232573 468580 4108401 5887293
42998 5887293 4798765 2435245 996625 1262745 2566005 3804874 4024409 2841194
42990 2841194 1077822 400072 1434145 2647389 2081928 -81015 -1835498 -2132528 -1960264
42981 -1960264 -2301385 -2469151 -1472486 1404 321597 -781422 -1903934 -1964092 -1455541
42972 -1455541 -1414429 -1902713 -2009288 -1035333 664913 1948742 1918521 789624 -315142
42963 -315142 -548148 -169647 -26400 -411623 -767886 -438545 597115 1772321 2549171
42954 2549171 2942774 3402269 4079991 4408803 3802944 2647996 1934503 1849129 1551381
42945 1551381 633301 -137162 -104495 194750 122832 223270 1168713 2072828 1404212 -603434
42935 -603434 -2012101 -1794156 -891048 -272798 516010 1978171 3075472 2340815 58237
42926 58237 -1789348 -1651706 189961 2186570 2901609 1992233 378906 -560981 -289914
42917 -289914 454994 655125 133810 -546478 -902424 -791443 -114224 1193959 2836889
42908 2836889 4167150 4671149 4381722 3774997 3226751 2605544 1665375 919519 1515189
42899 1515189 3630296 5516267 5190688 2924601 858661 85674 -443394 -1595530 -2199417
42890 -2199417 -774034 1900244 3462632 2836559 1121897 -166676 -516533 -90725 805380
42881 805380 1633009 1907783 1912011 2413944 3458079 4201838 4264196 4417365 5339648 6306671
42871 6306671 5974581 4282864 2759445 2679474 3452758 3348070 1675069 -297035 -795119
42862 -795119 484062 2201238 2852090 1966750 185625 -1152164 -734269 1452858 3557306
42853 3557306 3591648 1908442 841050 1584295 2758104 2649707 1380968 -153669 -1928999
42844 -1928999 -3795094 -4223409 -2190907 497730 1078325 -348581 -1173620 -317988 618075
42835 618075 538675 489449 1180619 1420801 515116 20022 1233922 2762279 2696712 1727390
42825 1727390 1749401 2528715 2341380 1222923 830617 1256626 782785 -802956 -1364043
42816 -1364043 131720 1736098 1553054 614295 889790 2032079 2306140 1746629 1944904
42807 1944904 2960555 2875243 973919 -663581 76972 2362880 3615481 2923592 1738761
42798 1738761 1340814 1128829 9392 -1595419 -2218763 -1493126 -725745 -1060425 -1916758
42789 -1916758 -1951195 -1088067 -619041 -1212921 -1761350 -817013 1325455 2769397 2187951
42780 2187951 228414 -1409460 -1787982 -1278693 -631105 -46450 717201 1702122 2615854
42771 2615854 3342318 4197063 5337418 6121878 5629380 3958546 2425534 2020316 2152565
42762 2152565 1646957 645730 459633 1421634 2049218 990042 -1088919 -2450915 -2466146
42753 -2466146 -1771657 -750666 766306 2317873 2763157 1870480 796365 387303 70956
42744 70956 -810527 -1631412 -1553669 -1123481 -1388508 -1877832 -1044061 1215844 2968409 2700861
42734 2700861 1229996 419158 809962 1381554 1178869 312532 -536478 -908203 -744728
42725 -744728 -235109 299733 583941 667328 955484 1705172 2420611 2126074 644735 -727988
42715 -727988 -621668 446801 644718 -387656 -780930 642445 2212868 1816170 226974
42706 226974 -214522 491131 234052 -1060404 -689878 2338241 5029896 4595528 2520726
42697 2520726 1894019 2516916 1826573 -276303 -987689 799880 2525332 1673158 -784002
42688 -784002 -1999275 -785605 1652460 3354050 2952964 440337 -2406513 -3206670 -1524654
42679 -1524654 475879 704037 -372527 -830055 -23676 1034256 1553066 1888818 2577422
42670 2577422 3453495 3921001 3447711 1749238 -883252 -3364082 -4505654 -4105841 -2997021
42661 -2997021 -2046498 -1562400 -1636421 -2407885 -3687955 -4753438 -4889559 -3964150 -2292270
42652 -2292270 -252916 1614959 2428737 1561612 -361455 -1600388 -965611 853336 2156570
42643 2156570 2300334 2162200 2435511 2402746 1088224 -998836 -2198918 -1582367 236028
42634 236028 1988871 2756423 2275106 1063893 170668 64385 -2303 -659867 -880133
42625 -880133 777324 3458312 4421824 2765899 931380 1299780 2866027 2992578 1343616
42616 1343616 24444 291400 1164656 1378452 924738 313983 -138868 170887 1838882
42607 1838882 3999646 4588185 2986497 1172275 1087849 1971064 1781763 458181 -127701
42598 -127701 736919 1548380 1169352 738103 1813662 3799733 4763696 4278390 3815782
42589 3815782 4277496 4716789 4131655 3200220 3129645 3660507 3589706 2878812 2751092 3579444
42579 3579444 4103898 3342888 2126413 1821146 2342090 2496066 1842099 1113885 919782
42570 919782 1037773 1166623 1557100 2512960 3731325 4470070 4174208 2876390 1232514
42561 1232514 138685 -21468 222958 34311 -801700 -1810144 -2470227 -2481681 -1634147
42552 -1634147 -119440 1032314 593729 -1506257 -3995954 -5600445 -5974833 -5157577 -3037060
42543 -3037060 -87241 2048134 1843326 -240534 -2070248 -2298995 -1823493 -2326361 -3891897
42534 -3891897 -4847394 -3928350 -1815715 -81802 842431 1816135 3195576 3908697 2907509
42525 2907509 877545 -399769 -150661 825712 1668084 2519611 3727413 4892810 5453783
42516 5453783 5631297 5927009 5967739 4807546 2491599 503000 218664 1384735 2566126
42507 2566126 2810811 2384861 1987841 1796417 1489082 867159 105160 -512637 -818113
42498 -818113 -752748 -431798 -260270 -644527 -1386099 -1657828 -929817 255459 860002 672349
42488 672349 581594 1353151 2529409 2929290 2082964 780974 164541 589028 1543648
42479 1543648 2410662 2920632 2928735 2289518 1300924 890803 1738447 3256538 4059997 3577846
42469 3577846 2610303 2082033 1968792 1932954 2242485 3124389 3674684 2629003 285942
42460 285942 -1426191 -1210969 82688 705803 97913 -872337 -1224059 -662286 693702
42451 693702 2576092 4406380 5405280 5226081 4346349 3611779 3377478 3220012 2595734
42442 2595734 1685349 1265102 1590365 1790393 849877 -982500 -2347768 -2344978 -1336585
42433 -1336585 -47926 1414260 3109424 4316384 3880152 1659710 -862089 -1816064
42425 -1816064 -786279 788707 1160067 59104 -1315150 -1965322 -2160381 -2597809 -3140010
42416 -3140010 -3009701 -1895888 -266681 1108132 1406659 116116 -1936490 -2505175 -272370
42407 -272370 2963956 4053325 2521966 1078220 1676681 3044879 3143309 2178652 1488684
42398 1488684 913296 -561057 -2318243 -2509761 -866271 718440 617347 -919836 -2654238
42389 -2654238 -3496864 -2736719 -594419 1261755 1156622 -392464 -1297923 -885141 -540227
42380 -540227 -907391 -442242 1977670 4621105 4865737 2715401 639609 322180 1138243
42371 1138243 1760348 1821785 1699307 1729403 2040604 2422146 2093501 337145 -2270041
42362 -2270041 -3906683 -3362224 -1495523 -240926 -253709 -203542 1260709 3371245 3923443
42353 3923443 2161345 -10205 -406903 620022 934390 -251178 -1578855 -2017972 -2350647
42344 -2350647 -3276294 -3562998 -1689607 1450011 3180332 2267132 155953 -1096165 -951558
42335 -951558 -204701 294458 216513 -312037 -875876 -1123633 -1046461 -665300 291583 1820712
42325 1820712 3023180 2926209 1900356 1346277 1837863 2502702 2512990 2209872 2212474 2275071
42315 2275071 1809281 987091 520330 591981 628308 41911 -1118833 -2054759 -1633398 528496
42305 528496 3138940 4136897 3064397 1768777 1965766 2896500 2585475 857972 -429617
42296 -429617 -75377 1149684 2194191 3159859 4242817 4616548 3627684 2228909 1875021
42287 1875021 2501361 2908320 2825260 3165424 4224386 5048321 4969758 4553718 4472868 4520678
42277 4520678 4396045 4420033 4598660 3946689 1942082 -32673 -92789 1623278 3215310
42268 3215310 3702717 3948414 4664799 5064883 4320290 3157446 2878957 3517137 4029990
42259 4029990 3844373 3168102 2119551 654547 -731728 -1267746 -962219 -490644 66717
42250 66717 1336349 3165618 4127374 3315016 1853204 1580193 2629481 3438327 3088340
42241 3088340 2443120 2552408 2982886 2640064 1633005 1162922 1628994 1975956 1310335
42232 1310335 218734 -234787 -102635 -155813 -316596 279569 1605574 2363577 1807501
42223 1807501 948125 1126649 2069988 2303641 1128164 -708319 -2106095 -2538148 -1993309
42214 -1993309 -857190 113720 475040 776990 1714928 2558834 1588283 -1410075 -4184213
42205 -4184213 -4500376 -2836959 -1483858 -1430502 -1479877 -425230 1297497 2678281 3699224
42196 3699224 4804437 5449253 4463522 1940221 -272768 -495734 919183 2159013 2003226
42187 2003226 739150 -707930 -1784375 -2305426 -2105677 -1177045 75998 1051225 1315951
42178 1315951 683161 -690167 -2019306 -2199983 -1014888 209104 -148137 -2096149 -3992040
42169 -3992040 -4407642 -3337608 -1480473 692608 2593379 3151213 1906886 171345
42161 171345 -21205 1724395 3692370 4193370 3360552 2361833 1618508 701603 -357508
42152 -357508 -707053 135197 1434412 2005506 1449963 291386 -769433 -1300562 -1097861
42143 -1097861 -272487 605682 938365 830419 1025206 1916921 2951743 3269291 2671797
42134 2671797 1655970 739559 188274 244992 1001828 1859149 1664737 -70304 -2244214
42125 -2244214 -2962078 -1395618 1449830 3928969 5322489 5875830 5660417 4223615 1641254
42116 1641254 -733447 -1291516 124145 2013248 2760317 2056023 818450 101909 163206
42107 163206 316549 -326729 -1772308 -2975493 -3130898 -2831227 -3255195 -4418117 -5217519
42098 -5217519 -5243627 -5333800 -5923945 -6106949 -5119642 -3619719 -2431320 -1109624 829641
42089 829641 2167516 1329597 -919523 -2085630 -1308324 -244172 -270360 -728873 -690402
42080 -690402 -618865 -1059664 -1173967 -96990 1294736 1522307 686816 39185 -48293 -141139
42070 -141139 -163207 581836 1821603 2326013 1828087 1562346 2337365 3215815 2882574 1570357
42060 1570357 845865 1818993 4027893 5851155 5829197 3943028 1719490 678468 682038
42051 682038 387119 -745277 -1835707 -2209839 -2518924 -3461702 -4242305 -3463590 -1258729
42042 -1258729 593746 830029 127126 28900 1050409 2317421 2766767 2218739 1289462
42033 1289462 579238 105112 -514936 -1370117 -1826880 -1010129 1081864 3094628 3421444
42024 3421444 2005769 621775 870803 2196988 2660677 1633919 694970 1386397 3076197
42015 3076197 4000324 3741060 3387257 3497723 3362022 2572169 1999707 2439563 3184138
42006 3184138 2857157 1172454 -904984 -2387414 -2958244 -2748366 -2145433 -1699335 -1649581
41997 -1649581 -1671374 -1494935 -1365153 -1248242 -140643 2626580 5527310 5774546 2706583
41988 2706583 -940464 -2072632 -661511 996120 1676196 2223332 3275189 3916863 3481183
41979 3481183 3220904 4663551 6991565 7712540 5924946 3454049 2344229 2495304 2527989
41970 2527989 1944913 1307332 809008 -111819 -1686397 -3156539 -3435100 -2082360 325918
41961 325918 2510946 3404985 3108334 2620009 2311344 1356204 -627386 -2185872 -1579534
41952 -1579534 692249 2418888 2643498 2464341 2662678 2389060 1043641 -233478 -299807
41943 -299807 33585 -655682 -2009271 -2521149 -2009793 -1726843 -2188400 -2565759 -2344866
41934 -2344866 -2040957 -1909724 -1345041 -108633 1024380 1457649 1558626 1616118 1077148
41925 1077148 -293861 -1367787 -856543 899357 2319349 2488682 1840638 1152260 722415
41916 722415 546002 542760 409218 -231296 -1244856 -1795764 -986938 1206348 3548539
41907 3548539 4259446 2596644 -188035 -1998288 -2155741 -1839380 -2008516 -1907793 -498800
41898 -498800 1470155 2162483 1102251 -397424 -1199003 -1388816 -1181927 -222518 1369985
41889 1369985 2449639 2250791 1485806 1129376 881344 -82979 -1411632 -1882307 -1226270
41880 -1226270 -496400 -527424 -956048 -938958 -92755 1397973 2885189 3374047 2335332
41871 2335332 658956 108620 1512907 4021355 6300042 7794873 8571173 8606585 7687177
41862 7687177 5631125 2507239 -867226 -2798977 -2098800 242042 1834427 1657173
41854 1657173 875357 563745 188464 -813700 -1611370 -1509271 -1438102 -2239040 -2822289
41845 -2822289 -2051196 -1147287 -1650960 -2070713 151924 3756382 4553578 1788196 -275773
41836 -275773 1295135 3850270 3773818 2147605 2360313 4353059 5193059 4162583 3304959
41827 3304959 3225978 2127560 -507147 -2549235 -2474407 -1300491 -341432 520919 1311857
41818 1311857 1072536 -249495 -1069483 -569526 86679 109101 540587 1904851 2558150
41809 2558150 1321294 -153409 101023 1116854 827855 -114019 721122 3374187 5181710
41800 5181710 4695488 3365482 2921814 3310464 3787713 4068254 3704830 2115779 -3993
41791 -3993 -876225 8686 1181041 1495048 1580144 2152452 2479960 1761744 773265 781010
41781 781010 1687837 2433458 2478710 1842797 477183 -1262244 -2238499 -1785394 -718730
41772 -718730 -32943 635895 1943149 3004813 2376097 575940 -162260 1112180 2807438
41763 2807438 2921394 1204429 -1185724 -3002778 -3409785 -2293278 -734236 -260004 -1021284
41754 -1021284 -1556297 -899324 101411 329137 161104 492658 872166 212317 -975160
41745 -975160 -783565 1369560 3730406 4597630 4484873 4876187 5724913 5556886 3798635
41736 3798635 1712184 772561 1069635 1719639 2095124 2108446 1877100 1782927 2471771 4047096
41726 4047096 5441638 5362033 3921135 2656587 2718221 3598549 3948609 3171047 1832010
41717 1832010 859579 751762 1352742 2011943 2039191 1273065 192756 -576480 -707101
41708 -707101 -179810 709463 1253686 805780 -334782 -1018068 -648683 -1058 -109468
41699 -109468 -852027 -1353818 -1373040 -1349372 -1245705 -378495 1389994 3111346 3781402 3413463
41689 3413463 2845649 2893438 3805231 5096886 5808524 5338893 4069110 2798191 1772908
41680 1772908 879134 476296 1043039 2102243 2696421 3020527 4173614 5916009 6317054
41671 6317054 4556385 2506665 2099570 2434620 1376498 -897296 -2182718 -1754292 -1240973
41662 -1240973 -1708723 -2119103 -1575076 -1121184 -1887679 -2888284 -2350862 -416122 1079056
41653 1079056 1075789 156905 -769176 -1282797 -1055332 11061 1095544 1120647 356188 197320
41643 197320 1012373 1518686 962077 555189 1525746 2808682 2409937 599570 -195635
41634 -195635 1093870 2634866 2490311 1358395 1141667 1953398 2343819 1945017 1908438
41625 1908438 2583655 2625069 1138039 -734946 -1365679 -738514 -13169 146500 -197951
41616 -197951 -912817 -1561897 -1202308 372181 1766380 1705505 1108661 1844570 3713307
41607 3713307 4532535 3347526 1599858 578699 -260201 -1360490 -1411317 530906 2591165
41598 2591165 2003506 -952459 -3056052 -2344277 -357695 426291 -146083 -352089 578253
41589 578253 1423577 791454 -893000 -1738513 -593399 1530920 2583670 1851346 585668
41580 585668 124823 263750 191415 265017 1528256 3604326 4496332 3024133 428701
41571 428701 -1233712 -1585465 -1867940 -2743536 -3246889 -2223454 -131488 1188317 474013
41562 474013 -1562363 -2935760 -2409367 -698308 395283 -47081 -1166175 -1500059 -814819
41553 -814819 -323413 -963845 -1987401 -1885140 -496521 743674 910265 910459 1928455
41544 1928455 3429702 3955898 3368562 2776315 2416531 1380184 -262411 -908776 191800
41535 191800 1660296 2183130 2405600 3224038 3704836 2623270 961161 684352 1688533
41526 1688533 2180635 1725533 1603339 2187421 2331162 1689368 1387303 1815662 1960489
41517 1960489 1675716 2342861 4121085 4734782 2613087 -569602 -2239386 -2231637 -1874604
41508 -1874604 -1238815 383616 2173533 2392860 1050274 -100200 -197749 -95343 -449429
41499 -449429 -692314 -281678 363590 602107 309994 -315887 -941775 -1132657 -872086 -693970
41489 -693970 -596697 395518 2479979 3830096 2772444 500801 -368312 494671 1072774
41480 1072774 451453 -157593 -80437 -262508 -927646 -662306 957626 2086381 1436538
41471 1436538 366910 489044 1067947 709226 -61315 -72592 80255 -688566 -1386383
41462 -1386383 -303901 1675379 1833491 -401016 -2711055 -3315348 -2812902 -2232583 -1546347
41453 -1546347 -875590 -1070664 -1997249 -1981565 -188233 1837149 2215149 1177878 304528
41444 304528 320971 862526 1605256 2376651 2644628 1997935 867988 13078 -363143 -392186
41434 -392186 1623 739908 1237327 1133020 889038 1015142 1252519 1178949 984598 909045
41424 909045 578517 -265253 -1046357 -1264021 -1416311 -1996948 -2303841 -1476404 -72404
41415 -72404 785156 1295204 2452749 4020684 4744161 4451841 4190433 4231281 3763141 2795297
41405 2795297 2461468 2916826 2794306 1490813 213266 -115546 -185866 -491607 -86994
41396 -86994 1429629 2492268 1908533 1042382 1626050 2791545 2617302 1487185 1248247
41387 1248247 1787797 1394389 292387 715731 3025637 4704995 4187988 3021125 2889877
41378 2889877 2970355 2007386 896620 1012831 1534082 778787 -792267 -1212798 -100289
41369 -100289 1050557 1434088 1721919 2158146 1819500 386798 -873659 -772832 136512
41360 136512 374260 -575375 -1849655 -2378575 -1993544 -1422175 -1343318 -1501344 -998972 387950
41350 387950 1619905 1546444 315004 -871044 -1138684 -612929 27464 177413 -265738
41341 -265738 -720648 -525506 638 -188411 -1054548 -934542 1102967 3215385 2707184
41332 2707184 -283626 -2683491 -2317366 -417818 274544 -1169936 -3207508 -3846343 -2660876
41323 -2660876 -977754 -334945 -746825 -785020 347457 1469822 957145 -923411 -2364057
41314 -2364057 -2412091 -1707928 -891136 296284 1979641 3445657 3977941 3555680 2511932
41305 2511932 1419486 1333855 2873233 4829645 5083017 3324945 1476036 888656 729086
41296 729086 -34482 -733670 -451713 45489 -427994 -1224014 -727039 999317 2235024
41287 2235024 2193811 1933179 2395201 2955895 2558136 1330892 338046 170881 369597
41278 369597 127231 -751560 -1654673 -1860302 -1297791 -469319 208925 649590 888276 1176715
41268 1176715 2052293 3511979 4291817 3082371 529497 -1219494 -1208895 -551569 -248174
41259 -248174 220122 1327950 2226284 2248399 2179714 2590479 2374854 701670 -956825
41250 -956825 -894750 -152078 -896745 -2519420 -2198308 619346 3103422 3077454 1724981
41241 1724981 1204387 1635589 1837894 1480406 977905 270958 -904329 -2092737 -2490480
41232 -2490480 -1909134 -820183 111485 264426 -463563 -1169074 -771575 460388 1217072
41223 1217072 1175656 1400059 2261727 2483077 1200311 -364266 -572410 280390 657277
41214 657277 121314 -408095 -329503 22700 268883 352470 65710 -784760 -1691174 -1799442
41204 -1799442 -1063146 -299080 26558 332893 963860 1315749 502313 -1227936 -2251229
41195 -2251229 -1173570 1319766 2795746 1803226 -151463 -334322 1597866 2993551
41187 2993551 1707646 -1025037 -2243007 -936397 1213958 2367926 2412873 2197101 2086492
41178 2086492 1903121 1622681 1409793 1133408 397305 -802041 -1737195 -1581186 -378714
41169 -378714 929613 1640953 2126797 3147298 4582815 5427820 5008202 3659650 2166819
41160 2166819 1051321 478382 358954 411419 451630 554008 610270 114233 -1001702 -1799085
41150 -1799085 -1531965 -937435 -1060537 -1185465 328561 3134329 4799675 4161541 2831319
41141 2831319 2423551 2202076 912517 -718213 -1190934 -776198 -830940 -1245790 -552259
41132 -552259 1610377 3802307 4596507 3818836 2072478 231283 -676535 -225950 743292
41123 743292 1070280 648878 75903 -481103 -949786 -552322 1130289 2685185 2195199
41114 2195199 54174 -1192622 -107399 2001373 3107007 2812499 2123433 1955467 2465048
41105 2465048 3127417 3119969 2235000 1451985 1860697 3122378 3898820 3621560 2773554 1705067
41095 1705067 571300 265860 1659614 3690563 4031650 2259838 668940 1104709 2571508
41086 2571508 3022804 2097631 834599 -130399 -708801 -638645 -15243 126367 -916775
41077 -916775 -2119715 -1795088 255826 2619525 3907466 3612008 1853516 -587743 -2271865
41068 -2271865 -2235776 -1071892 -70222 448346 1045896 1752990 1932340 1573675 1595031
41059 1595031 2532366 3750392 4259745 3650850 2027504 -197232 -2068908 -2436186 -1214421
41050 -1214421 156779 287231 -324644 131899 2215960 4140743 3964118 2293654 1610142
41041 1610142 2865045 4126505 3345363 1223582 -76632 -276440 -1124174 -3266477 -4980586
41032 -4980586 -4734382 -3372106 -2632249 -2703732 -2555374 -1861130 -1222366 -909639 -651062
41023 -651062 -531424 -1024365 -2063475 -2876858 -2864561 -2153507 -1334999 -1014836 -1364345 -1726601
41013 -1726601 -1068594 691389 2268891 2473364 1539640 361068 -877969 -2263148 -2944638
41004 -2944638 -1832887 528283 2144200 1972340 1069313 894740 1420643 1568725 843243
40995 843243 -203291 -797971 -660712 -55366 446773 351038 -269429 -666826 -44915 1602563
40985 1602563 3342228 4098230 3675860 2919646 2720787 3016132 3095722 2732124 2348786
40976 2348786 2005730 1108556 -381316 -1300258 -751661 346650 319663 -871144 -1520772
40967 -1520772 -678969 391322 -69720 -1882499 -3083145 -2283137 -128509 1671118 2172081
40958 2172081 1704367 928368 34259 -974107 -1741173 -1826281 -1316277 -679325 -118487
40949 -118487 405021 622374 177232 -468344 -109925 1792368 4257422 5682890 5273698
40940 5273698 3485452 1584644 876435 1686086 2865291 2931775 1839490 876132 766686
40931 766686 977376 1139603 1789345 3004426 3603570 2709695 1101054 35822 -299711
40922 -299711 -232898 377857 1397565 1763229 920816 -30976 23399 440211 136930 -404856
40912 -404856 -196731 226843 -164498 -708411 -38878 1489573 2628621 3675989 5436522
40903 5436522 6452689 4526450 895057 -621883 801499 1761099 43704 -2171746
40895 -2171746 -2253475 -1063016 -664442 -794342 -273939 209232 -469023 -1292614 -690414
40886 -690414 593998 841976 419959 797104 1431945 507006 -1684646 -2834599 -2012890
40877 -2012890 -520032 628132 1691574 2582332 2618067 2267566 2953415 4594892 5374358
40868 5374358 4546121 3495004 3199855 2527662 210693 -2897574 -4751591 -4427319 -2701699
40859 -2701699 -1073186 -689531 -1440358 -1834680 -689399 1009471 1168561 -424268 -1750823
40850 -1750823 -1521327 -715192 -504098 -467745 18944 262562 -460106 -1371414 -1420028 -991262
40840 -991262 -948040 -920924 -79025 1199005 1968487 2308838 2693921 2549800 1343110 528916
40830 528916 2125298 5352825 7002030 5666232 3489426 2843362 3265658 2992917 1802051
40821 1802051 614585 -463394 -1783222 -2595438 -1789493 108755 1436855 1768888 2061902
40812 2061902 2437935 1772405 -28883 -1236519 -707849 527903 1198027 1740398 2883040
40803 2883040 3674215 2801764 902912 -425719 -1159093 -2185185 -2703490 -986901 2151841
40794 2151841 3469067 1704498 -628428 -1035484 -198937 229645 602646 1776839 2558335
40785 2558335 1392664 -603087 -1092555 -260028 -284005 -1447235 -1704230 -302521 1023233
40776 1023233 1173787 1377795 2600268 3494581 2473848 222440 -1334693 -1423981 -605021
40767 -605021 401138 1026608 922173 536000 706535 1159200 715587 -428913 -374951
40758 -374951 1509205 3122827 2668885 1459350 1704091 2894046 2808463 1328744 691373
40749 691373 2031641 3908648 4562213 3842259 2574040 1563887 1519699 2510613 3255427
40740 3255427 2372708 573739 97741 1581953 3029045 2506664 472096 -1362193 -2230251
40731 -2230251 -2458731 -2387288 -2080310 -1501471 -388642 1388290 3021007 3310654 2458767
40722 2458767 2084843 2751600 2849722 1137675 -852362 -671619 1459780 2806367 1807523
40713 1807523 -78565 -609383 561714 2149997 3175782 3720205 4207915 4713574 4923955
40704 4923955 4395868 2917831 868078 -858538 -1488216 -963866 101582 972553 1281524
40695 1281524 1134422 876203 792918 1034617 1732943 2985617 4601351 5972094 6401269
40686 6401269 5681690 4384056 3475483 3412067 3553099 2825287 1190754 -17438 251497
40677 251497 1233704 1363747 592526 495671 1843826 3309524 3310934 2166181 1451494 1875012
40667 1875012 2776409 3263144 2842963 1290419 -1027068 -2824435 -2930297 -1679154 -428923
40658 -428923 229142 805107 1503241 1711850 1250298 979981 1490690 2035276 1560503 193520
40648 193520 -1087550 -1825377 -2305013 -2629791 -2394274 -1391725 -116254 665380 652862
40639 652862 260619 205355 778368 1481627 1533601 759427 -232587 -743338 -540680 232997
40629 232997 1231587 1911726 1909059 1574534 1581723 1847351 1604136 888013 978868 2519483
40619 2519483 3999237 3386359 944883 -962249 -1000831 -418275 -856906 -1819464 -1534919
40610 -1534919 199078 1475197 846342 -664614 -895392 723880 2747192 3829331
40602 3829331 4104878 4082610 3328634 1360562 -771429 -1233839 212703 1841489 2286940
40593 2286940 2070177 2249156 2693490 2630215 2068969 1636113 1537676 1648087 2131149 2963231
40583 2963231 3277568 2325895 871970 506071 1609618 2983294 3474609 3042539 2237188
40574 2237188 1571487 1432959 1729339 1637688 577081 -708749 -1039876 -559434 -375115
40565 -375115 -619218 -390904 345338 600855 469222 1383195 3327931 3769548 1042776
40556 1042776 -2555635 -3049496 392987 4575153 5991710 4114669 1141491 -298358
40548 -298358 856928 3391311 4859461 3821982 1036078 -1650385 -2915019 -2194869
40540 -2194869 485217 3872088 5593080 4306761 1381750 -643795 -842720 -142411
40532 -142411 535316 1010391 1147472 868278 724768 1269698 2103988 2673887 3458624 4869040
40522 4869040 5545958 3802910 687186 -582149 1298315 4104816 5150738 4075842
40514 4075842 1822378 -1113059 -4000744 -5115231 -3496813 -619782 1239801 1713061
40506 1713061 2107069 3047020 3791519 3719664 3238398 3026894 3144324 3026976 1986336
40497 1986336 -135732 -2486155 -3726882 -3417151 -2456454 -1789445 -1226873 -57627 1712398
40488 1712398 3361581 4318411 4503334 4145351 3663850 3352395 2890629 1696012 10027
40479 10027 -1107542 -1238466 -1186277 -1547779 -1655163 -782514 408302 679144 -12158 -501010
40469 -501010 101724 1585651 2943394 3028526 1523220 -283162 -552252 685545 1322864
40460 1322864 242808 -839363 -58283 1468452 1341487 -196358 -656250 555649 1142101
40451 1142101 -307542 -2033351 -1889351 -441687 400854 465456 1097981 2519144 3235081
40442 3235081 2176941 164331 -1091132 -718318 750646 1988193 1908556 569397 -769537
40433 -769537 -780708 574848 1981767 2143053 1080602 -30570 -207958 364296 732248
40424 732248 274879 -834442 -2046865 -2865866 -2921052 -2151877 -1000149 57837 1144208
40415 1144208 2491706 3444835 3082767 2045322 2265732 4084134 5104524 3335841 312104
40406 312104 -730730 920084 3029608 3888977 4076863 4522053 4848256 4451117 3674450
40397 3674450 2967548 2013004 575054 -680757 -992444 -409262 649524 1909762 2753202
40388 2753202 2173360 113863 -1789597 -1737847 231001 2438280 3570152 3918274 4605098
40379 4605098 5911666 6658995 5539974 3003826 1054862 781006 1083424 754055 627303
40370 627303 1998236 3823215 3831374 2152405 1270994 2067956 2558770 1432072 230045
40361 230045 570989 1552552 1759542 1809158 2756827 3717615 3501331 3241211 4747016 7142497
40351 7142497 7835676 6372560 4721769 3900276 2933307 1421067 645879 1365614 2489005
40342 2489005 2808001 2513010 2315424 2454331 3084649 4234422 4923851 3860150 1557748
40333 1557748 167386 500843 895378 -23220 -1168763 -964374 14659 170674 -349178
40324 -349178 -38369 1193306 1615800 348733 -1166538 -1144672 93638 604588 -610740
40315 -610740 -2362427 -2760401 -1433666 236141 993830 1147422 1735057 2852393 3639004
40306 3639004 3661975 3310036 2768334 1657425 64370 -997326 -768426 243354 963652
40297 963652 936279 378517 -347367 -811513 -623405 -1851 251946 -159801 -501248 -50136
40287 -50136 933816 1866693 2787977 3875934 4633557 4511107 3892279 3461466 2965654 1739814
40277 1739814 239694 -234655 570158 1491799 1788860 2145073 3243497 4396576 4491207
40268 4491207 3597380 2697411 2250316 1942123 1608205 1447014 1287162 521667 -890590
40259 -890590 -1959518 -1665673 -162563 1376019 1988322 1740134 1350249 1233477 1058579
40250 1058579 264511 -1101170 -2265065 -2514975 -1906206 -1056893 -487515 -388843 -735063
40241 -735063 -1191897 -1148572 -444494 52125 -641642 -2049521 -2481979 -1250042 290015
40232 290015 646330 304725 773432 2043584 2521185 1575236 643205 1114062 2276547
40223 2276547 2414329 1240020 99862 41329 758937 1503148 2063078 2485268 2552353
40214 2552353 2123572 1599820 1469836 1587174 1469456 1213751 1372310 1750345 1233917
40205 1233917 -506956 -1958327 -1615801 -409757 -603690 -2240271 -2724633 -742443 1510482
40196 1510482 1606719 515569 649497 1780725 1910981 1361855 2417484 4795197 5249844
40187 5249844 2784408 662456 1343672 2721163 2010958 451201 726887 1938867 1133395
40178 1133395 -1359923 -2208919 -408357 1498363 1841075 1879770 2589045 2693590 1352958
40169 1352958 103323 465232 1740769 2723302 3676538 5041861 5897612 5374794 4232123
40160 4232123 3505918 2870750 1800725 1066325 1432308 1939565 1216997 -245739 -763278
40151 -763278 136922 1419480 2209914 2405020 1974239 971175 108965 222011 1133151
40142 1133151 1782507 1409053 184908 -995868 -1097916 67781 1244831 1052608 66676
40133 66676 187173 1595855 2284984 1527156 1543338 3921049 6451544 6101747 3625099
40124 3625099 2229845 2603661 2568648 1407853 1001389 2003378 2206510 235130 -1807210
40115 -1807210 -1378500 749788 1917844 1446840 941430 1450164 2351633 2920117 3283051
40106 3283051 3526892 3114905 1748332 89071 -891249 -942066 -520032 101328 1223134
40097 1223134 2919786 4212250 3925476 2580439 2310757 3986853 5447239 4182924
40089 4182924 1190387 41752 1974901 4169063 3859956 2119194 1822813 3298837
40081 3298837 4184668 3072287 1188344 273499 511161 1151760 1886638 2716513 3212381
40072 3212381 2814345 1664098 602538 394267 1173888 2467543 3545957 3960312 3967265
40063 3967265 4254213 5005155 5430061 4603136 2735346 1179327 981085 1770236 2388885
40054 2388885 2303044 1885548 1499680 1057488 639149 777851 1623195 2396307 2363747 2002541
40044 2002541 2435915 3836492 5128162 5340385 4628490 3779709 3237195 2897128 2553466
40035 2553466 2278660 2425294 3214763 4205931 4426003 3405116 1897126 1095993 1242374
40026 1242374 1528813 1327467 890920 727528 905357 1304623 2089702 3417943 4816772
40017 4816772 5354319 4706288 3870009 4317355 6154256 7571094 6800087 4363840 2420788
40008 2420788 1954542 1956080 1705024 2110397 3612392 4353845 2465738 -647601 -1531402
39999 -1531402 922683 4280761 5932664 5798481 5321087 5611581 7265947 10295004 13253006
39990 13253006 13881925 11753789 9155879 8328344 8900538 9136679 8629425 8360654 8766361
39981 8766361 9117257 8588690 7036895 5044106 3851198 4563474 6556378 7430583 5700687
39972 5700687 2935568 1943765 3250015 4782824 4895039 4168485 3910396 4200659 4212800
39963 4212800 3719116 3456453 4168969 5738867 7296691 8072986 8095607 7975799 8121966
39954 8121966 8522981 9249983 10505038 11947949 12716445 12594778 12512220 13324411 14734269
39945 14734269 16041625 17278351 18812304 20452903 21877794 23484548 25938304 29278677
39937 29278677 33193042 37549163 41960181 45921595 50520219 58620222 71575316 87441816
39929 87441816 105488474 130838271 168785871 212419086 241046701 236514502 200536206
39922 200536206 152722593 112478612 86098957 69922176 59529381 52684240 47360227
39915 47360227 41943444 37069062 34232848 32597478 29564501 24605612 20181956 18227223
39907 18227223 17679291 16437076 14157651 11968548 10667193 10455491 11493524 13385484
39899 13385484 14753205 14606253 13781952 13938466 15425603 17146171 18165293 18355235 17706146
39890 17706146 16192809 14316322 12753908 11469841 10102153 9095596 9317521 10515166
39882 10515166 11309937 10915755 9802721 8494093 6918609 5366444 4893660 6000817
39874 6000817 7670148 8429139 7922872 6993891 6622749 7092921 7866378 8210549 8265519
39865 8265519 9169520 11461398 13808936 14406973 13345346 12291468 11999198 11701820 11089144
39856 11089144 11136397 12338423 13602526 13784943 13278200 13277588 14214370 15452780 15986258
39847 15986258 15322887 14284043 14578510 16687717 18895180 19791573 20767845 23955562 28598104
39838 28598104 32162367 34441697 37476013 41858063 46670400 52770481 61907060 72470254
39830 72470254 80879786 87668365 96860809 108743388 120007036 132679010 154931760
39823 154931760 190140900 234739157 291447994 370645970 464948811 532674506 528028001
39816 528028001 449974578 345867187 263110987 210941552 173372452 141513582 119031835
39809 119031835 106277407 96149099 84796781 75041819 68457231 62273159 55080816
39802 55080816 49188681 46270939 45425856 45751142 46499569 44943913 38616874 29794219
39794 29794219 23681307 21972923 21798224 20807449 19433290 18089761 16024793 13522997
39786 13522997 12016704 11565708 10990337 10422897 10824424 11328112 10344207 9017674 9977432
39777 9977432 12625165 13419355 11240236 8772962 7917738 7527055 6639663 6263829 6567545
39768 6567545 5751146 3433182 2098393 3346512 5404538 6116352 5801484 5369608 4224177
39759 4224177 2163880 1083487 2481064 5000574 6434604 6558229 6240111 5563016 4788006
39750 4788006 5453987 8291579 11359029 12385468 11917618 12197316 13887314 15769617 16798114
39741 16798114 16652774 15088013 12525716 10633106 10660277 11777327 12445577 12583029 12823288
39732 12823288 12612045 11060824 9168007 9109316 11293973 13819933 15054981 15386417 16111658
39723 16111658 17625628 19056850 19193111 17765623 16035531 15593356 16299992 16336758 14788034
39714 14788034 12935522 12110116 11629433 10247855 8471605 7691264 7803378 7513223 6573649
39705 6573649 6034133 6476944 7451935 8409454 8848050 7926764 5414849 2711629 1425924
39696 1425924 1256113 826858 227975 846258 2813288 4628630 5503705 6119157 6686142
39687 6686142 6282763 4838997 3860434 4123353 4324526 3277385 1980255 1992390 2881631
39678 2881631 2959750 1876950 861577 713177 1080301 1670809 2705489 3850434 3979796
39669 3979796 2711241 1329866 1331845 2486635 3192802 2626054 1682020 1581492 2332208
39660 2332208 3142600 3740662 4371107 4800886 4486709 3812449 3910510 4800471 5007822 3925449
39650 3925449 3291411 4845223 7383911 8019399 6106394 4015686 3774766 4782069 5531858
39641 5531858 5882111 6393274 6741878 6412309 6264971 7694797 10262301 11642722 10365626
39632 10365626 7531893 5234791 4174231 3686077 3480350 4059693 5339181 6078503 5424073
39623 5424073 4252535 4019225 4716268 5098344 4744670 4531327 4819562 4650241 3521162
39614 3521162 2662523 3341475 4871397 5700087 5719873 5870923 5952519 4775263 2539715
39605 2539715 1093648 1217402 1404295 355700 -790369 -155725 1902804 3120205 2317612
39596 2317612 659464 -194688 -46492 191485 60037 115792 1097153 2935390 4695917
39587 4695917 5407867 4884170 3752693 2822331 2487149 2538022 2346067 1453915 316004
39578 316004 204186 1828211 4141283 5176501 4224196 2619160 2115417 2960092 3923235
39569 3923235 3883576 2956896 2139195 2141644 2738612 3302555 3787192 4691179 5904211 6287417
39559 6287417 5039006 2973348 1593631 1228976 1059024 732277 743973 1171195 1342707
39550 1342707 1149780 1488018 2800957 4232167 4912465 5107362 5282846 4995995 3785300
39541 3785300 2433215 2118017 2696812 2968991 2430881 1706486 1369936 1445855 2118869
39532 2118869 3771191 5911596 7065680 6473246 5300936 5329552 6650210 7513910 6683677
39523 6683677 5211663 5172909 6919169 8576334 8573734 7687249 7671736 8577951 8809621 7658873
39513 7658873 6233923 5541608 5166329 4603269 4492321 5344424 6161226 5809831 5062693
39504 5062693 5682811 7794246 9670678 10067461 9350152 8269262 7123399 6492651 7300313
39495 7300313 9295982 10552410 9488455 6799964 4549574 3779142 3788795 3463516 2531662
39486 2531662 1567307 1367347 2420673 4546147 6825541 8083811 7730346 6343358 5405098
39477 5405098 6075059 7902678 9067453 8390334 6795217 5996302 5946370 4825804 1959224
39468 1959224 -533540 -119066 2830734 5456310 5974924 5449025 5666945 6582603 6879544
39459 6879544 6310959 6113276 7104287 8574736 9537013 10111379 10850412 11376342 10864446
39450 10864446 9681043 9264670 10086695 10910630 10766858 10638317 12050862 14586308 16166192
39441 16166192 15793826 14783879 14880525 16125352 17250433 17552131 17550788 17953525 18679601
39432 18679601 19168140 19281690 19439611 19780392 19643210 18406855 16649365 15642699 15505205
39423 15505205 14828376 12769969 10570176 9903499 10459496 10616836 10106953 10219040 11243535
39414 11243535 11630626 10470546 9136988 9197446 9952249 9626935 8264527 7741473 9031303
39405 9031303 10863346 11365419 10124308 8404607 7978953 9815026 13349800 17025730
39397 17025730 19875298 22201580 24176897 24507377 21736759 16623039 11825685 9030554
39389 9030554 7586398 6287101 5225642 5211392 6368122 8100742 9683635 10205426 8822638
39380 8822638 6018268 3859727 3812773 4716698 4155927 1674456 -638999 -918069 336385
39371 336385 1388135 1556887 1513003 1783572 1953981 1547322 1135621 2013992 4586637
39362 4586637 7355486 8111474 6389419 4193641 3711354 4761306 5391271 4722140 3933974
39353 3933974 4184744 4863311 4738272 3863099 3204458 2953621 2441439 1517443 798657
39344 798657 454748 -127208 -1101784 -1544612 -655774 1076269 2506867 3165728 3404640
39335 3404640 3560673 3515669 2966198 1843707 621664 234768 1189014 2617369 2975249
39326 2975249 2086917 1643340 2903199 4722242 5060396 3927448 3336087 4353059 5729000
39317 5729000 5932777 5220363 4830539 5068422 5175161 4555959 3282366 1764490 671717
39308 671717 803505 2227106 3758687 4066228 3197822 2370002 2354032 2752820 2856417
39299 2856417 2551950 2261872 2450098 3245489 4174226 4351068 3395547 2058878 1452875
39290 1452875 1799200 2490051 3155208 3886976 4529649 4709770 4691349 5213062 6147705 6289910
39280 6289910 5039134 3471321 3019912 3704735 4402668 4378115 3757429 2823537 1676342
39271 1676342 571180 5830 348862 1530048 2925707 3554915 2970252 2109817 2414685
39262 2414685 3674511 3802918 1639457 -1023112 -1553190 48827 1386654 1078712 201833
39253 201833 174180 881871 1514807 1854763 1871516 1118971 -493439 -2026675 -2443701 -1750246
39243 -1750246 -665107 287672 894121 1122348 1363312 2088425 2819777 2377410 810315
39234 810315 11508 1351049 3600930 4557651 4093134 4036501 5250222 6423141 6069649
39225 6069649 4500165 3316063 3731832 5660515 7725180 8043139 5890562 2911397
39217 2911397 1883665 3869424 7190198 9502187 10154731 10071228 10057338 10016594 9518440
39208 9518440 8407923 6820384 5041795 3487531 2588991 2502308 2877488 3006803 2425460
39199 2425460 1451269 912549 1230065 2029911 2747862 3181631 3269763 2915330 2386661 2249468
39189 2249468 2421516 2051645 1024608 724533 2250137 4598929 5903570 5875891 5555316
39180 5555316 5159916 4048306 2688009 2617798 4021677 5126512 4631581 3165030 1778730
39171 1778730 713410 360911 1539456 3657020 4385349 2650554 406023 -188228 183843
39162 183843 -223101 -739633 785440 4136922 6517936 6445068 5592370 6070079 7679025
39153 7679025 8759398 8385589 6788689 4652471 2930210 2628466 3868422 5508616
39145 5508616 6318246 6305159 6485784 7566456 9216236 10561593 11124157 11121435 10858552
39136 10858552 10162281 8887301 7770923 7899303 9153170 10157834 10179413 10004008 10328403
39127 10328403 10531664 10090056 10024362 11480080 13730518 15125920 15271585 14614694 12707720
39118 12707720 9130109 5824167 5930756 9644146 13283942 13571508 11461562 10727599
39110 10727599 13621509 18587071 21601670 19592705 13419919 7559283 5843994 7571043
39102 7571043 8902704 7698185 5237792 3429240 2665252 2909541 4496589 6716251
39094 6716251 7614518 6587209 5541046 6143747 7489670 7924140 7624060 7616440 7483933
39085 7483933 5966892 3113847 232422 -1664120 -2060179 -535548 2271915 4141423
39077 4141423 3459433 1426801 519744 1278806 2206681 2317359 2008988 1680571 1258282
39068 1258282 1104199 1819401 3011386 3578342 3268760 2767362 2370685 1884565 1658136
39059 1658136 2219001 2892830 2346499 696847 -415128 -154823 565497 904389 1368617
39050 1368617 2518513 3619270 3576362 2507173 1558604 1538758 2217623 2685322 2198756
39041 2198756 1019987 395217 1209217 2798498 3759650 3751713 3636945 3933693 4136583
39032 4136583 3690934 2718848 1576419 485596 -250532 -431902 -438749 -734312 -866717
39023 -866717 131595 2226703 4149387 4882544 4640275 4257550 4332751 5019909 5969314
39014 5969314 6521481 6579719 6903161 7690675 7556768 5327272 2330342 1104207 2070759
39005 2070759 3525959 4880165 7375227 10906272 12724814 10877718 7039585 4226891
38997 4226891 3207517 2873374 2747504 3072754 3347468 2844437 2112353 2164566 2588706
38988 2588706 2265584 1654875 2330864 4061399 4357532 1797940 -1644467 -2770624 -915014
38979 -915014 1512705 1995860 561326 -731296 -413810 901363 1765892 1918292 2187405
38970 2187405 2670745 2382794 1158322 545439 1721945 3486971 3685585 2070553 333282
38961 333282 -409835 -644368 -934928 -923905 -372002 77909 -4926 101365 1187589 2698229
38951 2698229 3378256 3018639 2592107 2720693 2978088 2930520 2914585 3166989 2933830 1427809
38941 1427809 -637505 -1514232 -479888 1448153 2934769 3496359 3143023 2160757 1743267
38932 1743267 3367259 6501185 8272234 6868916 4209696 3545072 5278593 7078012
38924 7078012 7431525 6848121 5865185 4359351 3074638 3447619 5223446 6258789 5441779
38915 5441779 4021554 3426096 3639640 4414163 6086564 8254446 9471641 9245156 8705345
38906 8705345 8561037 8178740 7339245 6927046 7267521 7928480 9558373 13248006 17700151
38897 17700151 20374213 21947974 25467324 30291689 32396696 32529906 37287507 48553032
38889 48553032 60030550 70883248 93657163 135774937 177840229 186724443 153228750
38882 153228750 103713074 69139598 54324168 45220343 34881391 28781589 29707914
38875 29707914 31512169 29081102 24633943 21478078 18731201 15165375 12626473 12397089
38867 12397089 12307588 10461206 8654976 9364169 11805623 13450177 13442587 12345376 10332077
38858 10332077 7910507 6964253 8679567 11318233 12227301 11476735 11405025 12923615 14587505
38849 14587505 15534315 16896039 19183480 20452604 19145976 17331369 18479264 22812601
38841 22812601 28234411 35863984 49776584 68360552 80226982 74580091 54626262
38834 54626262 35102341 25977809 23874194 20942669 16104417 13343388 13422857 13189744
38826 13189744 11359554 9757968 9156686 8201616 6700868 6278641 7203936 7706329 7060309
38817 7060309 6544514 6732090 6511105 5493955 4825181 4795980 4172196 2845233 2649478
38808 2649478 4270687 5638434 4938397 3254191 2548454 2731279 2589315 2309229 3091140
38799 3091140 4929127 6440187 6626384 5679873 4342716 3315443 2959989 2964637 2676636
38790 2676636 2090580 1885543 2284468 2787942 3267835 4159546 5196947 5320221 4466407
38781 4466407 4023178 4620094 4910403 3782130 2532565 3312357 6200640 9257455 10903953
38772 10903953 10936118 9695988 7645372 5595524 4220677 3394244 2779742 2729278 3707431
38763 3707431 5182317 6064197 6024578 5526876 4850807 4029089 3523373 3954248 5156108
38754 5156108 6275860 6752916 6537224 5588619 4037618 2719990 2606968 3607170 4704722
38745 4704722 5331205 5760296 5989069 5181336 2825999 -88990 -1730663 -1151922 1001122
38736 1001122 3419030 5374617 6933735 8267551 9195332 9453699 9017448 7944681 6318616
38727 6318616 4678898 3970219 4392812 4757396 3914976 2531636 2304320 3522509 4744584
38718 4744584 5065300 5240607 6007871 6685534 6333246 5166253 3841772 2352814 710072
38709 710072 -177798 451821 1895808 2851436 3122733 3428826 3989890 4377867 4481061
38700 4481061 4779295 6024307 9205548 14894541 21598187 25781252 25099100 21067540
38692 21067540 17073927 14379382 11872027 9258342 8088387 9143124 10840922 11244754
38684 11244754 10272827 8980661 7796896 6514645 5258879 4457014 4201134 4301831 4722063
38675 4722063 5522549 6564781 7473947 7735378 6933673 5262224 3601565 2624684 2143338
38666 2143338 1918136 2541290 4484959 6722276 7635011 7128482 6468245 6131240 5443088
38657 5443088 4447102 4226415 4769853 4409366 2463234 767433 1103552 2417070 2344428
38648 2344428 671013 -576443 -167794 933790 1380056 1229183 1390592 2167476 2978240
38639 2978240 3188734 2801089 2268782 1701497 564850 -1346673 -2862498 -2370814 -49759
38630 -49759 1982078 2425361 2582660 4272361 6912443 8247490 7525893 6232141 5588261
38621 5588261 5018271 3729488 2428514 2358978 3391929 4176552 3889078 2937317 2087396
38612 2087396 1773983 2306388 3822488 5675561 6726670 6912040 7731221 10102940 12364967
38603 12364967 12088173 9859609 9239075 12176602 16476859 19260028 20956833 23544125
38595 23544125 26457736 27549326 27416134 29098364 33243542 37328085 40624483 46147509
38587 46147509 56277953 70858063 91964561 124690140 166754281 200616002 204726034
38580 204726034 174778528 128687921 88790340 63719680 49175698 39726217 33843074
38573 33843074 30473153 27508878 24569533 23352034 24109527 24420502 22368630 18867451
38565 18867451 15927627 14214208 13123776 12012287 10642772 9387115 9388913 11466429
38557 11466429 14462942 15839046 14486356 11917002 10026294 8773165 7063324 5047330
38549 5047330 4156191 5033648 6583319 7287706 6730089 5568663 4571389 3971585 3411816
38540 3411816 2332051 776650 -69613 1204516 4260088 6503007 5536570 2045118
38532 2045118 -806508 -1095273 -125771 -46259 -735090 -527201 705764 1224937 342636
38523 342636 -269638 884180 2754968 3209930 1915484 407386 -141696 88984 498442
38514 498442 730257 473488 -317381 -952099 -665732 220278 645271 307388 -51766 157577
38504 157577 819228 1755302 2898109 3751312 3882780 4258155 6750373 11517250 15868157
38495 15868157 16757102 13895136 9673491 6560499 5310349 5184859 4994449 4064570 2792409
38486 2792409 2105152 2079820 1676716 348155 -844156 -607925 665146 1432768 1078666
38477 1078666 330748 -161665 -445795 -486931 -26313 567250 455723 -344044 -913626 -1082440
38467 -1082440 -1868957 -3590400 -4745175 -3842788 -1468057 589692 1498733 1425099 139366
38458 139366 -2666668 -5753640 -6791897 -5043171 -2339201 -720108 -169890 499090 1503996
38449 1503996 2026255 1792371 1490785 1590257 1666610 1146260 145874 -624137 -452914 826026
38439 826026 2456488 3083419 2117552 762438 891834 2695078 4242766 3817302 1903661
38430 1903661 223806 -465633 -612201 -402851 568586 2012438 2568649 1432067 -359618
38421 -359618 -1007584 29260 1659997 2521341 2207956 1399083 1254157 2464719 4419336
38412 4419336 5527194 4893618 3454836 2849531 3381247 3858745 3333031 2049365 584909
38403 584909 -863666 -1872083 -1544603 217858 1945729 2166167 1289293 819148 1021636
38394 1021636 778165 -185496 -532095 496543 1505561 850315 -789888 -1333427 -405149
38385 -405149 241893 -388703 -1008604 -249875 1126217 1616918 1484485 2106664 3389008
38376 3389008 3819720 3120973 2796942 3454486 3553516 1981840 142423 -160350 478154
38367 478154 400069 3127 1048708 3189567 3815849 1811906 -873448 -2242116 -2660914
38358 -2660914 -3069001 -2849248 -1292046 368615 486545 -361150 -309709 776547 1193038
38349 1193038 76046 -1614286 -2754897 -3032867 -2235178 -296612 1648591 1881014 286871
38340 286871 -1407150 -2039606 -2287707 -2991168 -3625938 -3336442 -2382488 -1613604 -1304421
38331 -1304421 -1284388 -1494043 -1753182 -1691587 -1447468 -1630120 -2132081 -2016062 -1164945 -801178
38321 -801178 -1460334 -1717187 -232395 1974012 2857574 2252682 1780417 2211131 2560704
38312 2560704 1829179 245114 -1367082 -2299617 -1979254 -462355 942264 736076 -772222
38303 -772222 -1603256 -633409 985306 1403085 211528 -1542309 -2752152 -3002722 -2382645
38294 -2382645 -1214564 51012 911244 849501 -379886 -2109423 -2780441 -1438466 835791
38285 835791 1833539 703471 -1211035 -2163633 -1818690 -985826 -361774 -87866 -34835
38276 -34835 13042 196906 300834 -98186 -973279 -1587797 -1078056 769261 3171574 4618825
38266 4618825 3948138 1661190 -306995 -824263 -951575 -2053833 -3226431 -2348027 489354
38257 489354 2672908 2682279 2041241 2689002 4174558 4841802 4358678 3452520 2243959
38248 2243959 593466 -683936 -753513 -438205 -1216221 -2776636 -3238197 -1756717 624078
38239 624078 2700927 4099994 4463039 3415320 1853092 1663648 3342219 5120644 5268481
38230 5268481 4190467 3475543 3903810 5202839 6731411 7452570 6239934 3391584 1028577
38221 1028577 706057 1274830 486427 -1812970 -3668280 -3910648 -3307710 -2689030 -1723749
38212 -1723749 -210067 986198 1259526 1278133 1580955 1288657 -448168 -2618727 -3540837
38203 -3540837 -3289564 -3239378 -3520356 -2875207 -1184831 -89361 -345848 -396948 1211244
38194 1211244 3432374 4197655 3223277 1826005 773218 -69186 -551602 -410888 -289254
38185 -289254 -906998 -1429421 -427566 1566386 2383809 1399175 452822 955009 1930798
38176 1930798 1951630 1358045 1281967 1799972 2419470 3266720 4349104 4581695 3119273
38167 3119273 1071740 449549 1743802 3690530 4974013 5063456 3942521 2280372 1429582
38158 1429582 2016065 2917752 2759088 1822175 1192567 752279 -284196 -1393476 -1288397
38149 -1288397 -226698 287918 154090 829883 2437221 2989603 1500479 -143530 147509
38140 147509 1613851 1840837 37157 -2344345 -3658378 -3481183 -2338174 -1060819 -299953
38131 -299953 -80951 -1555 -6413 -337397 -592587 127820 1709507 2761030 2487370 1726729
38121 1726729 1388879 1088346 403660 369304 2255962 5456767 7855187 7963728 5879127
38112 5879127 2812958 609580 836425 3074912 4811624 4298267 2768354 2415437 3068464
38103 3068464 2784605 1185569 12141 382612 1556029 2643239 3582188 4043425 3344147
38094 3344147 2036610 1642222 2069897 1332346 -1115758 -2841048 -1790397 627693 1704727
38085 1704727 1150214 530176 312575 -26741 96486 1473446 2484328 587065 -3153254
38076 -3153254 -4307894 -1272936 1728308 184558 -4334782 -6330824 -3737738 70390
38068 70390 1556511 1265771 1784549 3723289 5354797 5091211 2956926 199132 -1641750
38059 -1641750 -1786633 -1024042 -932194 -1853650 -2486308 -2027480 -1538002 -2109550 -2789842 -1932392
38049 -1932392 45020 1066411 412927 -425275 -135141 794015 1297966 1110002 259108
38040 259108 -1384865 -3140701 -3349837 -1411664 895845 1418968 364037 -241325 574719
38031 574719 1754445 2080540 1723289 1543453 1829818 2328784 2916769 3539267 3671332
38022 3671332 2512462 59039 -2277580 -2717696 -1073053 792763 1054270 134568 -63750
38013 -63750 1025926 1863718 1222620 89108 233492 1811470 3478074 4252119 4133231
38004 4133231 3307742 1964635 787131 539183 1055987 1441051 1280650 930794 676968
37995 676968 470896 570398 1555421 3343104 4764022 4555031 2640082 324385 -777486
37986 -777486 -260108 528793 -66374 -1859545 -2899765 -2117316 -874872 -988224 -2163827
37977 -2163827 -2710230 -2085791 -1175664 -426722 606684 1879465 2596096 2515778 2131298
37968 2131298 1435126 -1755 -1540827 -1746534 -632991 7877 -741663 -1514289 -867775
37959 -867775 533734 1163789 870868 510495 238227 -390600 -1136303 -1220977 -597789 -109889
37949 -109889 -447318 -1495889 -2445229 -2208578 -363924 1924907 2800798 2076140 1637671
37940 1637671 2715328 4010443 3788477 2630599 2320758 2774831 2176868 34253 -1915211
37931 -1915211 -2219160 -1446364 -789492 -352789 310599 988202 1094275 636233 190832
37922 190832 176272 482640 560885 -151333 -1412224 -1878318 -434199 2091691 3498235
37913 3498235 2845979 1570499 1391323 2036565 1986605 840065 -261456 -432655 -127208
37904 -127208 -130458 -384834 -431162 -420083 -842296 -1440416 -1317570 -415040 -73989 -1402144
37894 -1402144 -3532296 -4432627 -3385251 -1736433 -982834 -1020947 -790566 109819 1173064
37885 1173064 1864714 2041723 1781934 1386684 1294832 1505865 1446788 917465 659144 1263885
37875 1263885 2026036 1857119 999467 643264 903322 519041 -1000432 -2118251 -1086532
37866 -1086532 1557023 3243096 2086077 -1200988 -4163614 -5017560 -4050201 -2831649
37858 -2831649 -2421564 -2622136 -2743525 -2426109 -1532129 19139 1732281 2468574 1738186
37849 1738186 676790 761971 1706820 1689399 -151364 -2429414 -3212609 -2358500 -1553929
37840 -1553929 -2269377 -4097201 -5164881 -4141990 -1767840 -92216 -120500 -795535 -689729
37831 -689729 73430 438224 273197 321009 602047 336704 -444830 -663587 37235 638210
37821 638210 498940 509404 1580993 3027602 3551814 3111156 2660667 2502923 2010784
37812 2010784 807410 -695254 -1844728 -2132214 -1283903 206974 874784 -337458 -2399546
37803 -2399546 -2937637 -1101011 1131648 1183630 -1093233 -3379765 -3633439 -2030662 -67180
37794 -67180 1390560 2469858 3201216 3106592 2082358 893142 281889 119452 -25692
37785 -25692 -325 469893 777699 -99502 -2049554 -3590084 -3477582 -1961026 -200370
37776 -200370 987049 1504114 1622327 1676402 1847861 1968579 1695036 990051 267355 51036
37766 51036 619797 1766388 2644003 2249512 606436 -896097 -1061397 -436874 -388538
37757 -388538 -921347 -677882 819702 2255332 2327978 1389820 639695 511949 503908 -2410
37747 -2410 -1204644 -2578973 -2842908 -1000933 2214938 4738646 5353432 4674710 3746548
37738 3746548 2825429 2049262 2014756 2775729 3307302 2949623 2471821 2701172 3022556 2447608
37728 2447608 1429486 1282708 2237023 3280062 3656565 3481862 3106916 2774471 2646822
37719 2646822 2439891 1475848 -160264 -1159458 -611518 561236 846789 195337 -314983
37710 -314983 -239864 82872 579896 1250171 1436535 788288 480002 1777584 3740393
37701 3740393 4280179 3410310 3286208 4640551 5353896 3543484 311116 -1807975 -1802189
37692 -1802189 -392032 1530036 3243345 3765750 2613359 854731 253530 1192332 2160891
37683 2160891 1532146 -538548 -2221892 -1966339 -175029 1343275 1587782 1392053 1865681
37674 1865681 2657447 2727237 2203018 2144142 2752916 3250584 3471320 4058774 4869312 4718007
37664 4718007 3237273 1647392 1054448 1167297 1287673 1330903 1158825 173455 -1464911
37655 -1464911 -2317469 -1486447 -128634 -25864 -1220606 -2099936 -1443860 466453 2491838
37646 2491838 3708147 4046356 4238691 4833312 5237696 4466083 2858199 1918656 2162226
37637 2162226 2433797 1902643 1297423 1353799 1545510 1494615 2128738 3876234 5027956
37628 5027956 3846511 1430469 424972 1387890 2479657 2506189 2143921 2012993 1627143
37619 1627143 861594 672544 1449151 2026964 1320412 -99362 -974107 -1044059 -841547
37610 -841547 -520278 52164 440280 4801 -813624 -526693 1559104 4046299 4764754
37601 4764754 3402047 2026857 2485503 3981854 4287919 2974148 1917839 2355774 3075471
37592 3075471 2470414 1028190 402152 914218 1447793 1276462 617815 -259885 -1175150
37583 -1175150 -1522097 -796802 562031 1786006 2722661 3177479 2230391 -215366 -2018086
37574 -2018086 -1006733 1770268 3184949 2279986 1033296 778897 551659 -278898 -445896
37565 -445896 699594 1423942 230149 -1551661 -1786548 -743438 -240372 -676136 -997265
37556 -997265 -837636 -604302 56410 1766724 3548662 3481502 1494944 -181749 194226
37547 194226 1977940 3419676 3652277 2921209 1810550 784353 -58382 -980809 -1936352
37538 -1936352 -2166830 -1240969 -137519 -177872 -1074040 -1324376 -515088 231479 330508 693639
37528 693639 1980528 3277435 3416060 2502527 1211992 -391409 -2215370 -3186877 -2271055
37519 -2271055 -43349 1857107 2565061 2381610 1769060 1044767 784368 1343641 2031883
37510 2031883 1859988 1131665 1175325 2358843 3531862 3772164 3536300 3515715 3430882 2802085
37500 2802085 2074259 1962532 2190759 1858700 785688 -361445 -1073223 -1334909 -1137818
37491 -1137818 -487891 155633 262394 92381 407713 1235402 1710149 1363977 807547
37482 807547 784193 1240774 1793562 2496192 3516435 4432695 4515209 3622995 2371868 1427947
37472 1427947 926032 559049 19548 -668843 -1173819 -1203796 -800096 -259478 60026 -186188
37462 -186188 -1006649 -1567908 -677317 1559161 3229124 2823960 1396750 1073361 1819031
37453 1819031 1668767 274801 -169115 1496621 3193615 2706471 1154409 1166508 2863937
37444 2863937 4057792 3669431 2509607 1077388 -866804 -2503035 -2251639 -394032
37436 -394032 831622 468229 105642 1034314 2161086 2004088 1026141 518681 526340 357965
37426 357965 80407 107038 207423 184455 605080 1595461 1944099 940113 201272 1821375
37416 1821375 5141009 7179076 6213646 3361804 588276 -1281606 -2292942 -2583606
37408 -2583606 -2532389 -2730266 -3234262 -3453585 -3017711 -2101390 -771032 1167049 3375630
37399 3375630 4782392 4592726 3069610 1102730 -541810 -1441030 -1560980 -1323263 -1217140
37390 -1217140 -1208045 -894700 -244984 309342 535105 655976 908225 1292626 1726993 1966971
37380 1966971 1562696 579331 138276 1214617 2869696 2936465 953284 -763676 129355
37371 129355 3049011 5331626 5403259 3908849 2089656 511942 -421051 -86031 1473587
37362 1473587 3112149 3784096 3608934 3120846 2205901 790131 -9573 1088613 3315000
37353 3315000 4166267 2554186 387831 57190 1324327 1953199 778422 -1262525 -2881233
37344 -2881233 -3775055 -4100183 -3912295 -3551879 -3614043 -4102014 -4327319 -3866123 -2876641 -1451677
37334 -1451677 321444 1567655 1181495 -407208 -1275052 -401894 1151550 2081499 2546785
37325 2546785 3167746 3620301 3398066 2914740 2639198 2098649 965881 143336 410102
37316 410102 980741 913629 910966 1891915 2740240 1742903 -293790 -844895 564358 1943284
37306 1943284 2382274 3253625 5015133 5504758 3111550 -348778 -1893628 -1175990 -139816
37297 -139816 130621 221831 512177 400440 -389188 -1077386 -793304 509822 2264932
37288 2264932 3785577 4462517 4021984 2776431 1414064 586964 747281 1942087 3464979
37279 3464979 4185931 3702787 2802643 2335373 2083778 1398331 589879 779537 2263638
37270 2263638 3776313 3821835 2410350 1013754 824827 1474451 1756135 1332530 1075133
37261 1075133 1589391 2163800 1792393 709622 72202 387629 1136047 1810862 2378090
37252 2378090 2681362 2394530 1787623 1596456 1802609 1482341 360096 -383987 424050
37243 424050 2358953 4048694 4887019 5166741 4789409 2990869 -237047 -3219138 -3949515
37234 -3949515 -2317968 -247691 665201 855929 1390396 1706378 381557 -2048432 -3155063
37225 -3155063 -2137133 -1116481 -1629910 -2047956 -611766 977991 55435 -2254034 -2402730
37216 -2402730 -96065 1265556 210492 -673169 444896 1371223 -324240 -3227208
37208 -3227208 -4501937 -4204535 -4319394 -4978347 -4466521 -2273484 188001 1559255 1587622
37199 1587622 734023 24666 482373 1580445 1442914 -274012 -1340829 -293052 1098507
37190 1098507 741250 -316964 3953 884542 -22540 -2322164 -3339081 -2387156 -1298125
37181 -1298125 -796191 362772 2262403 2958462 1582199 -296281 -1235495 -1478241 -1206259
37172 -1206259 288239 2649175 3924103 3211164 1976907 1659793 1745145 1284855 605976
37163 605976 354154 309748 158280 87774 -105816 -975913 -1860307 -1201815 733424 1473819
37153 1473819 -129990 -1959104 -1731097 -265084 201766 -470486 -582422 451162 1367805
37144 1367805 1051930 -159903 -1150474 -1156030 -328061 489791 877900 1564840 3099944
37135 3099944 4196379 3184981 1077682 808763 2837682 4089306 2461094 -185245
37127 -185245 -1210939 -876352 -656755 -221291 1167910 2141027 1213120 -65116 832540
37118 832540 3140209 3908251 2813243 2367090 3320557 3406893 1430182 -605787 -795315
37109 -795315 -109547 -253423 -865139 -673668 62029 93026 -704086 -1242765 -813605 255269
37099 255269 1176226 1283823 405853 -925152 -1971995 -2572555 -2881753 -2533622 -1044646
37090 -1044646 990471 2282375 2577689 2807824 3292557 3146639 1966076 791021 619749
37081 619749 1014534 994708 471562 55441 179261 1070330 2848963 4973517 6264699
37072 6264699 6174032 5480086 5167401 5218608 5076588 4652510 4186904 3613452 2747751 1796920
37062 1796920 1180082 1095538 1490867 2001038 1796723 296120 -1629447 -2091677 -478221
37053 -478221 1505737 1898911 892011 241858 847547 2000034 2726819 2735121 2053011
37044 2053011 850172 -112498 179089 1651987 2810489 2417414 1120338 635987 1419401
37035 1419401 2029242 1194955 -259921 -480663 749949 1620902 862910 -476798 -663234
37026 -663234 244409 734423 105246 -989850 -2045306 -3266839 -4435281 -4605660 -3494951
37017 -3494951 -2068782 -1158979 -511925 156912 257159 -562940 -1282657 -702765 721916
37008 721916 1465782 1160739 1045499 2006316 3178764 3048499 1396176 -443196 -1115606
36999 -1115606 -588975 178928 628954 1189463 2298411 3311580 3066008 1495263 -28251
36990 -28251 -258389 509054 931827 201793 -1154519 -1813150 -856123 1232500 2687008
36981 2687008 2032252 -307267 -2438249 -3134356 -2851544 -2372524 -1417301 536177 2693679
36972 2693679 3429120 2339147 804844 150841 12329 -838237 -2467310 -3418834 -2524667
36963 -2524667 -454832 1055813 1275787 1160129 1928611 3558448 4954502 5134633 3946958
36954 3946958 2121509 980827 1506451 3159430 4222050 3912910 3381895 3700661 3802497
36945 3802497 1996576 -996899 -2498036 -1472529 240602 858372 937778 1686250 2627987
36936 2627987 2499232 1425232 592295 322914 -30075 -572683 -699616 -455931 -750628
36927 -750628 -1836872 -2610944 -2061142 -780417 -285392 -1032160 -1847815 -1570401 -621325
36918 -621325 -198721 -207059 752686 2909581 4219986 2979023 532095 -339453 818074
36909 818074 1964395 1977024 1929177 2515511 2545594 1165689 -347209 -493586 251899 670891
36899 670891 914549 1726592 2591120 2389524 1249659 243743 -176702 -137442 531395
36890 531395 1714989 2287519 1489057 388304 396383 943457 400618 -1128545 -1863652
36881 -1863652 -1105631 -100462 62696 -176641 74577 1017481 2390012 3742229 4306801
36872 4306801 3590954 2172429 1061719 503462 336658 973289 2626834 4030433 3626871
36863 3626871 1892208 795283 991440 1284253 903710 423640 129553 -600989 -1705810
36854 -1705810 -1990181 -1012077 142012 685031 1204360 2135784 2706170 2363272 1855185
36845 1855185 1820586 1602219 681811 184940 1543927 4301519 6477913 6799594 5678276
36836 5678276 4263549 3240925 2434286 1227549 -492594 -1885237 -2084975 -1339899 -526920
36827 -526920 81833 596122 612687 4989 117435 2212594 4898632 5388377 3533040
36818 3533040 2110558 2495069 2744174 1205979 -620092 -679581 366526 585055 -224827
36809 -224827 -1035541 -1593498 -1875941 -978413 1298945 3008082 2379895 496166 -446302
36800 -446302 -329181 -358431 -477618 -180645 -681165 -3136705 -5479151 -4429292 -494807
36791 -494807 2403723 2456542 1680800 1598801 939680 -883182 -1490258 802581 3550842
36782 3550842 3197208 332 -2632287 -2818440 -1833980 -1477072 -1930903 -2446677 -2628520
36773 -2628520 -2559060 -2394446 -2078944 -1248205 254486 1555587 1216005 -902651 -2975631
36764 -2975631 -3169184 -1639350 147101 1352031 2023181 2023551 1048946 -325808 -788295
36755 -788295 173133 1597236 2224900 1803006 952755 272417 9022 265254 937557
36746 937557 1481997 1318059 696936 642796 1533914 2194677 1244508 -846873 -2157296
36737 -2157296 -1919262 -1452336 -1866285 -2125484 -651908 1964395 3342669 2167818 -530084
36728 -530084 -2861221 -3813037 -3535188 -2790051 -2211419 -1649541 -556308 642143 495156
36719 495156 -1322722 -2924991 -2606754 -1300835 -972642 -1533118 -1482872 -927181 -1385779
36710 -1385779 -2753528 -3097566 -1810892 -469708 -15598 425243 1166730 975352 -424943
36701 -424943 -1321343 -888858 -751277 -1999919 -2920898 -1771103 135410 453389 -646765
36692 -646765 -1362248 -1394853 -1707130 -2139304 -1824744 -1301169 -1665883 -2081380 -776897 1505419
36682 1505419 1738316 -1130404 -4382536 -4932955 -2879950 -735378 -363775 -1539398 -2652963
36673 -2652963 -2173310 -15828 2172588 2633811 1527305 740986 1651939 3702415 5193500
36664 5193500 4904513 2976920 693170 -726197 -1353884 -2116330 -2950759 -2484329 -237674
36655 -237674 2062450 2517728 1380802 125378 -677019 -1088295 -643118 637662 1132199
36646 1132199 -290371 -1960131 -1649909 -344268 -844279 -3019631 -3815342 -2259351 -935587
36637 -935587 -1430264 -1738396 -48487 1862195 1486980 -349212 -928811 335706 1788800
36628 1788800 2360549 2164837 1049998 -1161360 -3352633 -4034696 -3436278 -3031496 -3255788
36619 -3255788 -3353543 -3254743 -3762931 -4737732 -4816442 -3455628 -1885152 -1389786 -1689549 -1713691
36609 -1713691 -1191774 -689926 -447241 103907 1554726 3556830 4905013 4712733 3359882
36600 3359882 1965258 1033269 125008 -1170292 -2622040 -3830544 -4579414 -4531818 -3400276
36591 -3400276 -1723277 -609837 -309046 94620 1132595 2083239 2218389 1896725 1693586
36582 1693586 1439755 953810 743796 1051346 1183258 824613 975400 2303859 3523410
36573 3523410 2946045 985884 -445012 -562967 -211571 -127325 -288347 -780405 -1734665
36564 -1734665 -2397367 -1687315 209475 1981247 2844645 2849896 1797210 -583444 -3328237
36555 -3328237 -4689524 -4213730 -3092681 -2296371 -1750258 -1529511 -2240112 -3667917 -4495648
36546 -4495648 -4072767 -3289735 -3080683 -3172175 -2862601 -1913074 -171432 2424590 4865409
36537 4865409 5434264 3895150 2152015 1909173 2831660 3800462 4572892 5064735 4410794
36528 4410794 2354176 547633 707140 2084194 2450163 1179222 -291485 -820875 -721207
36519 -721207 -571248 -452668 -557107 -1115139 -1463197 -593336 1025640 1662137 903992
36510 903992 450860 1382640 2187751 1058583 -1003124 -1400116 225928 1586823 1394384
36501 1394384 1147811 2195666 3026822 1544387 -1106536 -1537290 1104861 3775489 3705794
36492 3705794 1836811 743211 876283 806318 94818 -295297 -55932 125246 352706
36483 352706 1696723 4158161 6177410 6777813 6684973 6681886 6372707 5381277 4297004
36474 4297004 3455746 2208579 532226 -108014 984421 1905422 467357 -2478299 -4010751
36465 -4010751 -3001069 -1082600 61792 430902 533930 357153 129527 632883 1952256
36456 1952256 3000570 2983494 2432304 2184437 2211268 2089634 1850192 1674062 1369028 778680
36446 778680 214189 -17187 -3001 241679 947714 1792683 1720042 360261 -1015983 -981587
36436 -981587 24465 337220 -348039 -315641 1739360 4576939 5586122 3716403 466003
36427 466003 -1945185 -2672907 -2408593 -2145271 -2266051 -2489974 -2180375 -843493 1209119
36418 1209119 2792664 2957877 2146319 1696905 2197374 2985679 3375146 3520464 3685748
36409 3685748 3513739 2714341 1817324 1446430 1374648 1135827 1062550 1704793 2596520 2765644
36399 2765644 2310877 2242926 2699188 2583073 1319010 -216536 -1094686 -1631860 -2494492
36390 -2494492 -3298459 -3068078 -1714656 -225325 487340 314514 -358036 -1111324 -1572898
36381 -1572898 -1429059 -583694 686242 1732658 1849921 884015 -466843 -1247334 -1169148
36372 -1169148 -710434 -404092 -399241 -633213 -976029 -1229907 -1390132 -1755515 -2297109 -2256499
36362 -2256499 -1199205 -184894 -685646 -2301136 -2953876 -1813237 -575582 -881370 -1725113
36353 -1725113 -898394 1706708 3867005 4010398 3000872 2584317 3123299 3538434 2942662
36344 2942662 1646218 589202 209681 141284 -38966 -170124 56444 366945 272252
36335 272252 12710 282484 970892 1179030 732717 538192 923887 881473 -138728 -867015
36325 -867015 40846 1802265 2583460 2161719 1825646 1930762 1414468 -53033 -1174978
36316 -1174978 -931278 -20094 387125 270140 289984 479743 274941 -564442 -1666899
36307 -1666899 -2390704 -2163524 -948897 385179 745728 132224 -356654 -88270 315150
36298 315150 139678 -346908 -598324 -705621 -750572 -1091 2075451 4388407 5089824
36289 5089824 3923214 2623941 2668166 3508569 3562488 2330906 878345 433399 1056183
36280 1056183 1774283 1805712 1509275 2018266 3786193 5604870 5512096 2957896 -208698
36271 -208698 -1387843 89033 2281245 2774037 1134183 -1024042 -2006505 -1472930 -116540
36262 -116540 1201145 1722485 1008556 -447804 -1270453 -563455 990724 1981921 1992083
36253 1992083 1835632 2281720 3245666 4151797 4392413 3518705 1766395 337953 233468
36244 233468 725855 53676 -2081710 -3848258 -3713840 -2469715 -1868702 -2054081 -1576733
36235 -1576733 336661 2676712 3893083 3458233 2078989 927947 746188 1266068 1489697
36226 1489697 828702 -211207 -812668 -931497 -1006866 -955242 -358703 410124 258187 -1088351
36216 -1088351 -2386051 -2250137 -773015 694687 1036520 200204 -1179229 -2427277 -3093225
36207 -3093225 -2996186 -2263690 -1286258 -534714 -304994 -511916 -760393 -778941 -758192 -1028409
36197 -1028409 -1399968 -1202984 -213547 793113 878226 231871 93326 1206598 2834154
36188 2834154 3711002 3609703 3313825 3196628 2716840 1607584 680287 706231 1123434
36179 1123434 882762 287764 776271 2699262 4454901 4381445 2656202 683625 -646735
36170 -646735 -1316972 -1452125 -1242807 -1276293 -1955158 -2666113 -2405953 -1229006 -185300
36161 -185300 281055 887470 2066440 2886475 2219481 457028 -861622 -1007038 -784136
36152 -784136 -1123333 -1736983 -1764142 -1279396 -1268133 -2006939 -2309292 -1019792 1166983 2233518
36142 2233518 1253299 -441383 -861759 370639 1863711 2292722 1811291 1540551 2067497
36133 2067497 2819796 2946937 2510790 2412306 3137056 4090696 4476223 4297663 3934880 3255326
36123 3255326 2064465 1098791 1367043 2488839 2950223 2281780 1676653 1926126 2111113
36114 2111113 1239802 -49954 -591615 -438108 -140102 812330 3112016 5653175 6217801
36105 6217801 4225708 1378540 -551181 -1229087 -918117 356933 2164874 3324881
36097 3324881 3043783 1818851 710216 229759 288163 666745 1089436 1153974 552153
36088 552153 -646204 -1846534 -2050792 -645702 1607002 3021808 2923139 2307788 1967926
36079 1967926 1221160 -288158 -965288 508702 2383341 1871022 -533218 -1647472 -501352
36070 -501352 514860 4513 -226113 1295187 3021455 3223974 2817412 2993625 2511574
36061 2511574 238310 -1667501 -538685 2152437 2550136 251482 -1210131 127950
36053 127950 2041521 1856863 -28506 -1583943 -1880336 -1113543 317675 1503721 1198018
36044 1198018 -582962 -2227348 -2592577 -2285061 -2234362 -2280741 -1994793 -1679763 -1600738 -1213932
36034 -1213932 -75765 1315368 2340568 3070906 3569215 3328002 2212773 1098422 712596
36025 712596 626096 246897 50053 814964 2160108 2800988 2033407 335623 -1209999
36016 -1209999 -1661801 -848794 298850 505078 -446803 -1599884 -2231568 -2463847 -2232512
36007 -2232512 -908886 1352802 3059310 3114029 2133222 1122505 -13916 -1415879 -1876159
35998 -1876159 -289382 2106743 2794579 1197730 -739913 -1227619 -358810 1005949 2486263
35989 2486263 3679317 3730488 2397214 806693 262933 686960 968988 664838 621305
35980 621305 1692028 3239403 3489235 1616442 -975480 -2165398 -1737080 -1458909 -2345746
35971 -2345746 -3138378 -2303658 -348892 1118696 1719438 2160501 2440986 1989888 1294280
35962 1294280 1465599 2103262 1565686 -157754 -826459 815802 2900996 2915740 1046644
35953 1046644 -478930 -488338 316364 1104093 1829490 2444238 2602385 2436433 2609312 3277415
35943 3277415 3756429 3451419 2476199 1205295 -113279 -1118257 -1410290 -1169841 -1073333
35934 -1073333 -1248824 -982526 -4183 586714 -398882 -2306886 -3069638 -1777732 162244
35925 162244 1007788 928924 1252712 2071419 2152463 1325551 1251607 2883037 4569160 4271853
35915 4271853 2808773 2896383 5113896 6938784 6396273 4713373 4070207 4262462 3439295
35906 3439295 1320185 -362625 -563276 -254006 -629355 -1457104 -1951499 -2128444 -2333375
35897 -2333375 -2225955 -1331597 -236858 -220898 -1694417 -3697908 -4948197 -4790321 -3188553
35888 -3188553 -578515 2002338 3315404 3010940 2049698 1613711 1747012 1427500 -87748
35879 -87748 -2268402 -3650549 -3081822 -835071 1364707 1759700 366221 -900407 -341543
35870 -341543 1552411 2830902 2549992 1665335 1430798 1864853 2210444 2107781 1711659
35861 1711659 1263151 1173753 1966058 3400140 4161811 3299304 1644027 885478 1432390
35852 1432390 2148741 2134773 1737635 1645239 1957112 2497401 3205972 3763623 3512511 2242315
35842 2242315 558762 -879547 -1951125 -2584901 -2372732 -1233886 46887 566718 262676
35833 262676 -381737 -1216308 -2395148 -3688911 -4454816 -4309790 -3442602 -2269149 -1069682
35824 -1069682 57894 1083808 1856101 2025520 1441148 673199 671756 1617744 2505261
35815 2505261 2242230 899695 -440092 -802600 -24471 1278724 2054953 1455236 -376189
35806 -376189 -2272581 -3123982 -2845429 -2100450 -1429473 -1001074 -904029 -1233828 -1994053 -3100516
35796 -3100516 -4220183 -4530762 -3270232 -931971 720793 536731 -512902 -446122 1303180
35787 1303180 3258407 3652280 2268947 557292 285695 1955069 4196992 4943375 3526763
35778 3526763 1349910 178316 259543 640797 799138 1093377 1764088 2251821 1657143
35769 1657143 -345239 -2851922 -3964137 -2460182 401551 1800165 831974 -131555
35761 -131555 1146496 3197476 2731432 -511377 -3221194 -3036844 -1290558 -417565 -644831
35752 -644831 -613368 154661 991430 1514519 1973691 2512052 2989987 3241596 2932434 1691943
35742 1691943 -44381 -986684 -497028 433127 446645 -443828 -1111961 -848359 122842
35733 122842 1297830 2280965 2656675 2113043 799928 -611521 -1197509 -339192 1495440
35724 1495440 2782515 2582104 1910647 2309597 3263433 2792802 831644 -168136 1031430
35715 1031430 2294500 1360861 -596068 -859510 741266 2111348 2395725 2567399 2820880
35706 2820880 1971511 -276629 -2601524 -3918014 -4097042 -2797559 186720 3123816
35698 3123816 3372993 1069558 -523866 505277 2112533 1690471 -11283 -444433 762833
35689 762833 1694991 1185359 -154846 -1508468 -2580921 -2988727 -2591089 -2302432 -3044040
35680 -3044040 -3990688 -3385837 -1092870 1205224 2472900 3398039 4630515 5520186 5365252
35671 5365252 4625156 3936282 2906526 936822 -1442026 -3106891 -3800188 -4053319 -3885327
35662 -3885327 -2649484 -396651 1435969 1304136 -673157 -2623591 -2690056 -784190 1482273
35653 1482273 2531382 2280757 1800959 1834815 2101095 2019693 1580644 1194720 1012964 804555
35643 804555 432673 123668 187036 625114 1101965 1265551 1080747 823448 710963 614134
35633 614134 293713 -114277 -135899 366333 797833 420004 -723551 -1757485 -1896299
35624 -1896299 -1179585 -219802 504027 898218 1034776 1037414 1150956 1589579 2209478 2546219
35614 2546219 2283226 1546176 723617 208278 306609 1055240 1995247 2450418 2201463 1581395
35604 1581395 808974 -229723 -1238213 -1252414 119308 1661029 1761561 561746 -151926
35595 -151926 591172 1593213 1146508 -733047 -2505088 -3077685 -2726060 -2159628 -1509996
35586 -1509996 -569812 459260 1000474 865902 557600 506867 255725 -1031829 -3143466
35577 -3143466 -4567318 -4165852 -2618452 -1534867 -1518819 -1954549 -2431169 -3227398 -4238712
35568 -4238712 -4561061 -3694760 -2356134 -1497688 -1158965 -896146 -799933 -1342486 -2421781
35559 -2421781 -3112645 -2376179 85185 3388402 5810202 6049986 4386588 2256704 710040
35550 710040 -207669 -739654 -1057651 -1673997 -3064591 -4513187 -4437454 -2400768 183722
35541 183722 1790707 2102398 1251303 -624056 -2276475 -1673624 1120002 3045927 1889606
35532 1889606 -444997 -714605 872666 1366404 -182068 -1735750 -1973381 -1919449 -2301161
35523 -2301161 -2139648 -1093590 -718516 -1925501 -3220249 -3031465 -2080204 -1855806 -2241522
35514 -2241522 -2289622 -2067997 -2089363 -1999788 -1422105 -1069854 -1425635 -1367893 84276 1595371
35504 1595371 1140659 -801115 -1848688 -1264629 -712816 -1307656 -1992039 -1484223 -147894
35495 -147894 888357 1173894 736193 -437231 -1905719 -2635423 -2119222 -1028390 -244712
35486 -244712 87568 135002 -138694 -423586 192808 2028068 3822587 3870131 1995631
35477 1995631 -264965 -1353290 -969367 212066 1366122 1845232 1278985 -115098 -1448645
35468 -1448645 -1823008 -1195676 -361146 21858 71830 106897 -170013 -1232674 -2561668
35459 -2561668 -2779941 -1341959 586454 1514137 1406884 1441494 2342430 3690510 4709375
35450 4709375 5018370 4599083 3625268 2453588 1391440 435842 -449816 -890428 -330981
35441 -330981 1250133 3067094 3931123 2984667 519461 -1796565 -2230792 -950741 86778
35432 86778 -227003 -636618 340371 1815374 1754443 218565 -653495 59673 819122 245178
35422 245178 -868716 -1134228 -629532 -214029 -43734 -35749 -710493 -2127796 -2866108 -1688843
35412 -1688843 309883 883451 -270349 -1197504 -487008 1173192 2456755 2855290 2181810
35403 2181810 194731 -2298130 -3232273 -1540400 1101575 2080115 943654 -567966
35395 -567966 -1207446 -1337766 -1289706 -403242 1394390 2482062 1474680 -526267 -1205313
35386 -1205313 -239254 456955 -155073 -646488 513970 2478558 3295205 2760600 2390827
35377 2390827 2879060 3214705 2578115 1716891 1743956 2495154 2910055 2549095 1962518 1708213
35367 1708213 1624135 1253768 754563 1078369 2930905 5496094 6739122 5535923 3153652
35358 3153652 1842216 2126263 2451875 1609123 409742 388848 1658658 2857833 2839310
35349 2839310 1733031 533643 147413 721917 1562037 1839816 1571220 1564803 2182120
35340 2182120 2661137 2168581 1114509 726819 1466807 2566487 3216563 3550980 4077860
35331 4077860 4593847 4337761 3251099 2404663 2606790 2977240 1904440 -414182 -1582202
35322 -1582202 -77054 2211573 2079660 -612890 -2469935 -1001076 2062358 3074798
35314 3074798 1054238 -1532051 -2165989 -979289 236559 635605 1132514 2856040 5393837
35305 5393837 6940271 6226858 3987068 2105602 1466191 1267284 567405 -240524 -23660
35296 -23660 1445768 3061315 3586721 2951166 2207719 2206244 2468337 1857694 521299 280439
35286 280439 2206497 4560701 4653683 2489788 769421 1040323 1804303 1278586 139896
35277 139896 27147 762083 959047 600642 1073218 2818990 4551049 4931044 3857132
35268 3857132 2008553 139131 -1033787 -1066585 -147052 1149398 2309311 2848576 2434475
35259 2434475 1509088 1034020 1029060 353331 -1254145 -2184736 -1327480 -172224 -675345
35250 -675345 -1967737 -1492870 966738 2832137 2467324 1111896 543855 887821 1594785
35241 1594785 2768767 4362420 5411031 5227510 4443960 3991399 3818558 3262079 1961835
35232 1961835 26319 -1890863 -2540525 -1254070 651866 1046681 -125635 -746440 159193
35223 159193 879086 -143864 -1700979 -1662344 -161267 864838 613688 238248 973409
35214 973409 2682224 4160513 4101492 2092040 -680343 -2181513 -1595288 -108496 740562
35205 740562 585951 -338465 -1966848 -3671592 -4040768 -2599200 -681574 554278 1671194
35196 1671194 3072284 3125143 415497 -3159283 -4227477 -2586795 -1401657 -2565656
35188 -2565656 -4431744 -4911390 -4432314 -4373394 -4356307 -2971581 -335406 1780299 2208318
35179 2208318 1573924 1094699 1021472 696001 -142992 -683181 -106644 891416 599750 -1304672
35169 -1304672 -2912083 -2584931 -1324442 -1164735 -1926216 -1558243 393408 1834344 1240321
35160 1240321 -191519 -575022 47451 476824 547469 927968 1375447 814956 -857597
35151 -857597 -2262179 -2072718 -378552 1559530 2377370 1527093 -238428 -1272711 -478052
35142 -478052 1526040 2999040 2829628 1393474 -158748 -935037 -642750 452908 1583846
35133 1583846 1918516 1381185 816177 934427 1300319 940062 -85100 -484316 541904
35124 541904 2088929 2679301 2027667 868220 -419446 -1837169 -2751211 -2333437 -1107176
35115 -1107176 -534013 -736077 -263518 1295597 2319120 1796752 1067864 1342197 1303532
35106 1303532 -609465 -2975675 -3155251 -1446194 -578565 -1352433 -1780460 -838023 -69665
35097 -69665 -587515 -1197382 -791430 -184731 -47860 738836 2769341 4070985 2629885
35088 2629885 -376287 -2118936 -1962007 -1545194 -1613070 -1044382 893384 3175811 4318171
35079 4318171 3844976 2271988 573051 -337668 -473033 -1003786 -2767228 -4777580 -5185633
35070 -5185633 -3579673 -1417283 -264180 -402867 -1031332 -1087501 -83755 1206480 1269861
35061 1269861 -250908 -1795091 -1932266 -1420821 -1896947 -3111761 -3171864 -1395970 747765
35052 747765 1747560 1588560 910887 123014 -180434 630340 1936668 2010261 314297
35043 314297 -1374567 -1087734 915986 2774063 3348975 2946001 2239988 1550712 1009105
35034 1009105 595787 41819 -717765 -1102959 -475663 895892 1997774 2230529 1979683
35025 1979683 1935326 2164171 2047638 1084635 -325800 -1042648 -308009 1381729 2842786
35016 2842786 3553916 3925597 4175440 3670564 1887053 -471376 -1990688 -2021135 -1094654
35007 -1094654 3427 974539 1786000 2344835 2709579 3197226 3844172 3984745 2853309
34998 2853309 639474 -1403004 -2026251 -1008796 824189 2250963 2344235 1103179 -280887
34989 -280887 -298332 1222474 2725738 2793216 1972195 1860764 2668981 2931792 1820871
34980 1820871 469931 354779 1342580 2174578 2146019 1446792 452223 -375047 -332933 751311
34970 751311 1814643 1555959 85422 -1214690 -1454921 -1124857 -1137776 -1593994 -1655949
34961 -1655949 -363741 2320133 5022726 5890030 4480731 2382222 1432438 1769128 2270688
34952 2270688 2386096 2548457 3025215 3388112 3216271 2615364 1985553 1761885 2207389
34943 2207389 2964960 3154003 2481514 1793808 1874116 2320228 2455397 2592569 3225061 3663076
34933 3663076 2929942 1511972 659728 369240 -228949 -826903 -286553 1045122 1497944
34924 1497944 776107 349658 741781 666243 -454713 -1414430 -1605552 -2082813 -2928811
34915 -2928811 -2070395 1273439 4194207 3769691 1527565 1291630 3497017 4759995 3048181
$$ [...]
##END NTUPLES=NMR SPECTRUM
##END=
