##TITLE=31Pdec_PhBDP0208
 CDCl3, 24 sc
 3.08.2021
##JCAMPDX= 6.0         $$ Bruker NMR JCAMP-DX V2.0
##DATA TYPE= NMR SPECTRUM
##DATA CLASS= NTUPLES
##ORIGIN= UXNMR, Bruker Analytische Messtechnik GmbH
##OWNER= root
$$ XWIN-NMR		Version 3.5
$$ Tue Aug  3 08:57:50 2021 Russian Standard Time (UT+4h)  she@DPX200
##.OBSERVE FREQUENCY= 81.013821
##.OBSERVE NUCLEUS= ^31P
##.ACQUISITION MODE= SIMULTANEOUS
##.ACQUISITION SCHEME= undefined
##.AVERAGES= 24
##.DIGITISER RES= 16
##SPECTROMETER/DATA SYSTEM= spect
##.PULSE SEQUENCE= zgpg30
##.SOLVENT NAME= CDCl3
##.SHIFT REFERENCE= (INTERNAL, CDCl3, 0, 248.564)
##AUDIT TRAIL= $$ (NUMBER, WHEN, WHO, WHERE, WHAT)
$$ ##TITLE= Audit trail, XWIN-NMR		Version 3.5
$$ ##JCAMPDX= 5.01
$$ ##ORIGIN= Bruker BioSpin GmbH
$$ ##OWNER= she
$$ F:/spectra/data/she/nmr/P31/1/pdata/1/auditp.txt
$$ ##AUDIT TRAIL=  $$ (NUMBER, WHEN, WHO, WHERE, WHAT)
(   1,<2021-08-03 08:56:49.07 +0400>,<she>,<DPX200>,
      <created by zg, POWCHK disabled, PULCHK disabled
       configuration hash MD5:
       00 E9 B6 7A A2 85 ED C7 34 08 36 98 17 FE 4E 26
       data hash MD5: 32K
       39 A2 0F 86 5F 35 2E 05 EC BE ED D6 8F AA 94 9F>)
(   2,<2021-08-03 08:56:51.26 +0400>,<she>,<DPX200>,
      <Start of raw data processing
       efp BC_mod = 2 LB = 1 FT_mod = 6 PKNL = 1 PHC0 = -7449.513 PHC1 = 264.0743 SI = 64K 
       data hash MD5: 64K
       59 65 EF 55 DB 39 9C D9 CD A0 DF 7D 5D 85 D7 23>)
(   3,<2021-08-03 08:57:19.39 +0400>,<she>,<DPX200>,
      <pk PHC0 = -86.45882 PHC1 = 207.6 
       data hash MD5: 64K
       B8 52 F7 72 C0 9E E5 0E FA 00 13 AC 37 AD 06 B3>)
(   4,<2021-08-03 08:57:22.68 +0400>,<she>,<DPX200>,
      <abs ABSG = 5 
       data hash MD5: 64K
       6A F0 05 D0 E9 D1 09 DC 47 69 B1 6A AA CD 40 44>)
$$ ##END=
$$ 
$$ hash MD5
$$ 18 7D E7 5B F9 A1 66 E6 48 FF 61 E5 8E 82 73 43
##$RELAX= 
##$RELAX= 
##$RELAX= 
##$RELAX= 
##$RELAX= 
##$RELAX= 
##$RELAX= 
##$RELAX= 
$$ Bruker specific parameters
$$ --------------------------
##$DU= <F:/spectra>
##$EXPNO= 1
##$NAME= <P31>
##$PROCNO= 1
##$TYPE= <nmr>
##$USER= <she>
##$AMP= (0..31)
100 100 100 100 100 100 100 100 100 100 100 100 100 100 100 100 100 100 
100 100 100 100 100 100 100 100 100 100 100 100 100 100 
##$AQSEQ= 0
##$AQ_mod= 1
##$AUNM= <au_zg>
##$AUTOPOS= <>
##$BF1= 81.014009
##$BF2= 200.13
##$BF3= 200.13
##$BF4= 200.13
##$BF5= 200.13
##$BF6= 200.13
##$BF7= 200.13
##$BF8= 200.13
##$BYTORDA= 1
##$CFDGTYP= 0
##$CFRGTYP= 5
##$CHEMSTR= <none>
##$CNST= (0..31)
1 1 145 1 1 1 1 1 1 1 1 1 1 1 1 1 1 1 1 1 1 1 1 1 1 1 1 1 1 1 1 1 
##$CPDPRG= <waltz16>
##$CPDPRG1= <>
##$CPDPRG2= <waltz16>
##$CPDPRG3= <>
##$CPDPRG4= <mlev>
##$CPDPRG5= <mlev>
##$CPDPRG6= <mlev>
##$CPDPRG7= <mlev>
##$CPDPRG8= <mlev>
##$CPDPRGB= <>
##$CPDPRGT= <>
##$D= (0..31)
0 1 0 0 0 0 0 0 0 0 0 0.03 2e-05 3e-06 0 0 0 0 0 0 0 0 0 0 0 0 0 0 0 0 
0 0 
##$DATE= 1627966608
##$DBL= (0..7)
120 120 120 11 120 120 24 19 
##$DBP= (0..7)
150 150 150 150 150 150 150 150 
##$DBP07= 0
##$DBPNAM0= <>
##$DBPNAM1= <>
##$DBPNAM2= <>
$$ [...]
##$SUBNAM3= <"">
##$SUBNAM4= <"">
##$SUBNAM5= <"">
##$SUBNAM6= <"">
##$SUBNAM7= <"">
##$SUBNAM8= <"">
##$SUBNAM9= <"">
##$SW= 501.771253377433
##$SWIBOX= (0..15)
0 1 3 0 0 0 0 0 0 0 0 0 0 0 0 0 
##$SW_h= 40650.406504065
##$TD= 32768
##$TD0= 1
##$TE= 0
##$TE2= 300
##$TE3= 300
##$TEG= 300
##$TL= (0..7)
0 120 53 12 22 120 120 120 
##$TP= (0..7)
150 150 150 150 150 150 150 150 
##$TP07= 0
##$TPNAME0= <>
##$TPNAME1= <>
##$TPNAME2= <>
##$TPNAME3= <>
##$TPNAME4= <>
##$TPNAME5= <>
##$TPNAME6= <>
##$TPNAME7= <>
##$TPOAL= (0..7)
0.5 0.5 0.5 0.5 0.5 0.5 0.5 0.5 
##$TPOFFS= (0..7)
0 0 0 0 0 0 0 0 
##$TUNHIN= 0
##$TUNHOUT= 0
##$TUNXOUT= 0
##$USERA1= <user>
##$USERA2= <user>
##$USERA3= <user>
##$USERA4= <user>
##$USERA5= <user>
##$V9= 5
##$VALIST= <valist>
##$VCLIST= <CCCCCCCCCCCCCCC>
##$VD= 0
##$VDLIST= <DDDDDDDDDDDDDDD>
##$VPLIST= <PPPPPPPPPPPPPPP>
##$VTLIST= <TTTTTTTTTTTTTTT>
##$WBST= 1024
##$WBSW= 4
##$XGAIN= (0..3)
0 0 0 0 
##$XL= 0
##$YL= 0
##$YMAX_a= 1799
##$YMIN_a= -4067
##$ZGOPTNS= <>
##$ZL1= 120
##$ZL2= 120
##$ZL3= 120
##$ZL4= 120
##$ABSF1= 248.5645
##$ABSF2= -253.2056
##$ABSG= 5
##$ABSL= 3
##$ALPHA= 0
##$AQORDER= 0
##$ASSFAC= 0
##$ASSFACI= 0
##$ASSFACX= 0
##$ASSWID= 0
##$AUNMP= <proc_1d>
##$AZFE= 0.1
##$AZFW= 0.5
##$BCFW= 0
##$BC_mod= 2
##$BYTORDP= 0
##$COROFFS= 0
##$CY= -3
##$DATMOD= 1
##$DC= 0
##$DFILT= <>
##$DTYPP= 0
##$F1P= 0
##$F2P= 0
##$FCOR= 1
##$FTSIZE= 65536
##$FT_mod= 6
##$GAMMA= 0
##$GB= 0
##$INTBC= 1
##$INTSCL= 5.30512e-09
##$ISEN= 30
##$LB= 1
##$LEV0= 0
##$LPBIN= 0
##$MAXI= 10000
##$MC2= 0
##$MEAN= 0
##$ME_mod= 0
##$MI= 50
##$NCOEF= 0
##$NC_proc= -7
##$NLEV= 6
##$NOISF1= 182.463
##$NOISF2= 159.3651
##$NSP= 0
##$NTH_PI= 0
##$NZP= 0
##$OFFSET= 248.5645
##$PC= 4
##$PHC0= -7535.972
##$PHC1= 471.6743
##$PH_mod= 1
##$PKNL= yes
##$PPARMOD= 0
##$PSCAL= 0
##$PSIGN= 0
##$REVERSE= no
##$SF= 81.014009
##$SI= 65536
##$SIGF1= 159.3651
##$SIGF2= -187.1042
##$SINO= 113.3802
##$SIOLD= 16384
##$SREGLST= <1H.CDCl3>
##$SSB= 0
##$STSI= 65536
##$STSR= 0
##$SW_p= 40650.406504065
##$SYMM= 0
##$S_DEV= 0
##$TDeff= 32768
##$TDoff= 0
##$TI= <>
##$TILT= no
##$TM1= 0
##$TM2= 0
##$TOPLEV= 0
##$USERP1= <user>
##$USERP2= <user>
##$USERP3= <user>
##$USERP4= <user>
##$USERP5= <user>
##$WDW= 1
##$XDIM= 65536
##$YMAX_p= 294977817
##$YMIN_p= -28070493
$$ End of Bruker specific parameters
$$ ---------------------------------
##NTUPLES= NMR SPECTRUM
##VAR_NAME=  FREQUENCY,     SPECTRUM/REAL,   SPECTRUM/IMAG
##SYMBOL=    X,             R,               I
##VAR_TYPE=  INDEPENDENT,   DEPENDENT,       DEPENDENT
##VAR_FORM=  AFFN,          ASDF,            ASDF
##VAR_DIM=   65536,         65536,           65536
##UNITS=     HZ,            ARBITRARY UNITS, ARBITRARY UNITS
##FACTOR=    0.620285442955139, 1,           1
##FIRST=     20137.2065510759, 0,            0
##LAST=      -20513.1999529892, 0,           0
##MIN=       -20513.1999529892, -28070493,   0
##MAX=       20137.2065510759, 294977817,    0
$$ Real data points
##PAGE= N=1
##DATA TABLE= (X++(R..R)), XYDATA
$$ [...]
40335B342503k087295j308913N27537J159795O03563O35409J401425J246229k49236
$$ 2342503 255208 -1053705 -526168 633627 1237190 1872599 3274024 4520253 4271017
40326D271017j480822j385373q00616o83216o30215m8094M69262P1458p38609
$$ 4271017 2790195 1404822 604206 -79010 -709225 -757319 -288057 -216599 -955208
40317i55208o16709O20026J523764Q92264o13554j378977r31710k22824R6665
$$ -955208 -1571917 -951891 571873 1464137 850583 -528394 -1460104 -1682928 -1586263
40308a586263N30062J414595J859720R82005n61537j442827j570510j866018k424924
$$ -1586263 -1056201 358394 2218114 3200119 2638582 1195755 -374755 -2240773 -4665697
40299d665697k279941j027626N71081J780073K533048K728883K057180Q04053
$$ -4665697 -6945638 -7973264 -7402183 -5622110 -3089062 -360179 1697001 2501054
40291B501054k18838p26133q83821k94928J363337K618172J257265k076269l527496
$$ 2501054 2282216 1556083 672262 377334 1740671 4358843 5616108 3539839 12343
40282A2343q86168K935203L389588J44753k857368k688807m73830J011197P41127
$$ 12343 -873825 2061378 5450966 5595719 2738351 49544 -424286 586911 1328038
40273A328038k79703p56910k75373N61696O98419k03916j155783j025667j39128
$$ 1328038 1048335 291425 16052 577748 1276167 1072251 -83532 -1109199 -1248327
40264a248327K07579l28337p94457n20357J26458O96356J200852J483394J233769
$$ -1248327 -1040748 -1369085 -2163542 -2683899 -2557441 -1861085 -660233 823161 2056930
40255B056930Q82104J181491J584790O03571j565949k504266q64549J313267J209065
$$ 2056930 2939034 4120525 5705315 6308886 4742937 2238671 1374122 2687389 3896454
40246C896454j008440k832677k965527k190470j238074q744J077454J100657M19761
$$ 3896454 2888014 55337 -2910190 -5100660 -6338734 -6347478 -5270024 -4169367 -3749606
40237c749606N33552J616240K010437Q71826n04939q88118p62866o46853K09931
$$ -3749606 -3216054 -1599814 410623 1282449 777510 -110608 -873474 -1520327 -1310396
40228a310396J731750J621412j410847m440044l451825Q54473L610445K380691
$$ -1310396 421354 2042766 631919 -3808125 -7259950 -6405477 -2795032 -414341
40220d14341K5216j04103J174311J068897n20824j181295J67605J973680K367056
$$ -414341 -389125 -493228 681083 1749980 1229156 47861 215466 2189146 4556202
40211D556202J032043j098806k607614k250359k03725J525593J233592j73996
$$ 4556202 5588245 4489439 1881825 -368534 -572259 953334 2186926 2012930
40203B012930m20780Q09764J488845L32387j477080k200485j619672n05316N38253
$$ 2012930 1592150 2401914 3890759 4223146 2746066 545581 -1074091 -1579407 -1041154
40194a041154Q63550j40830j688268j687067M53957K360548J681637n23800j384323
$$ -1041154 -177604 -318434 -2006702 -3693769 -3239812 -879264 802373 278573 -1105750
40185a105750m18247K79018j81406k45930R09498J619504O15728n22091R2250
$$ -1105750 -1523997 -1244979 -1426385 -1672315 -762817 856687 1472415 950324 1042574
40176A042574J248325L77904k077297k862828o55324K007270K448572J229081
$$ 1042574 2290899 2668803 591506 -2271322 -2926646 -919376 1529196 2758277
40168B758277K94241l18931j674403l007944k364967r7212R74497k61671j290717
$$ 2758277 3052518 2733587 1059184 -1948760 -4313727 -4410939 -3436442 -3698113 -4988830
40159d988830J13473K087605J377335j321350j974378O83470K960486J612445
$$ -4988830 -4875357 -2787752 -1410417 -2731767 -4706145 -4022675 -1062189 550256
40151E50256j334599j709852O79235K240448J268423P4562Q21734K092625J239167
$$ 550256 -784343 -2494195 -1814960 425488 1693911 1768473 2590207 4682832 5921999
40142E921999j618138l726970l060080k85809K196811K502262R69392j68909M85440
$$ 5921999 4303861 576891 -2483189 -2768998 -572187 1930075 2899467 2730558 3215998
40133C215998J399679K32935k228471k723199n62545R72790k46615j761261p15548
$$ 3215998 4615677 4848612 2620141 -103058 -665603 307187 60572 -1700689 -2416237
40124b416237J294574J054560o76578n96757J276929J706643L220q57895M10161
$$ -2416237 -1121663 -67103 -743681 -1340438 -63509 1643134 1646354 788459 1198620
40115A198620J283464J28235r38970L512J274354O18657j104614j794613j368422
$$ 1198620 2482084 2610319 1671349 1674861 2949215 3567872 2463258 668645 -699777
40106f99777p40631L11677J831705K249541P69834o85922m18982J34893q32936
$$ -699777 -1440408 -1128731 702974 2952515 3722349 3036427 2617445 2752338 1919402
40097A919402j887810p99190J156937J139376k56835q6874J465559J134678j581616
$$ 1919402 31592 -767598 389339 1528715 1271880 1185006 2650565 3785243 2203627
40088B203627k973901q56042J983579K067734N9485j000224k02007Q64223J032707
$$ 2203627 -770274 -1626316 357263 2424997 2484482 1484258 1282251 2146474 3179181
40079C179181P05509M80857J83838o06096j738435k364304j713273j83016Q19896
$$ 3179181 3884690 4365547 4549385 3943289 2204854 -159450 -1872723 -2055739 -1235843
40070a235843N99662j5192k36279n01937r77104l86677J801174L456824K465909
$$ -1235843 -636181 -651373 -887652 -1389589 -2366693 -2753370 -952196 2504628 4970537
40061D970537J27608q80317p88392j650748k898671k076366J96841N67513j092740
$$ 4970537 5098145 4217828 3429436 1778688 -1119983 -3196349 -2999508 -2431995 -3524735
40052c524735q60623K439716M345832J512109k717991l191486l15797J505494
$$ -3524735 -4385358 -1945642 2400190 3912299 1194308 -1997178 -2312975 -807481
40044h07481O84865m50053k64448L02574K35555j96092o16237q46191k55324J281809
$$ -807481 -122616 -572669 -837117 -534543 -298988 -495080 -1111317 -1957508 -2212832 -931023
40034i31023K306364J539570K1056m85328l70100j171591k401571k028830L93
$$ -931023 1375341 2914911 2935967 2450639 2080539 908948 -1492623 -3521453 -3521060
40025c521060J305733N65521o65497l31660J507759L109521K999483J093834j278500
$$ -3521060 -2215327 -1649806 -2315303 -2646963 -1139204 1970317 4969800 6063634 4785134
40016D785134k332510j523659j86627J29840m94957r21998o86802j83393K27109
$$ 4785134 2452624 928965 742338 872178 377221 -544777 -1231579 -1414972 -1187863
40007a187863K51848m75975j478984j238829P31941K454224J747661o45833j917317
$$ -1187863 -936015 -1411990 -2890974 -4129803 -3397862 -943638 804023 158190 -1759127
39998a759127q70294R16693J561686R91551L36444L50889Q05940Q92718J44012
$$ -1759127 -2629421 -1712728 -151042 840509 1176953 1527842 2333782 3226500 3370512
39989C370512q88287j269776r84234o95465k84840Q26510J755633P46835j604398
$$ 3370512 2482225 1212449 228215 -467250 -752090 74420 1830053 2576888 972490
39980I72490k228713k4229K161910J830613M43291L21150O08531m80682j680047
$$ 972490 -1256223 -1280452 881458 2712071 3155362 3476512 4085043 3604361 1924314
39971A924314p10070J349345J643441K85863m04813l37826j155326k175278j338952
$$ 1924314 1214244 2563589 4207030 4492893 4088080 3750254 2594928 419650 -919302
39962i19302L18790j8254j356877L8407L534506L945352K0897k809790r47383
$$ -919302 -600512 -618766 -1975643 -1937236 1597270 5542622 5563519 2753729 1806346
39953A806346J740050P06685j826358j263326J379567J673960m54368j126000
$$ 1806346 3546396 4253081 2426723 1163397 2542964 4216924 3762556 2636556
39945B636556M16280R17347o54586j423497k42998k5164k272415l571234q07187
$$ 2636556 3052836 3970183 3315597 1892100 1649102 1623938 -648477 -4219711 -5026898
39936e026898L200968L254911o14776l211789j680904J000263J244146N4133L32836
$$ -5026898 -1825930 1428981 814205 -2397584 -4078488 -3078225 -1834079 -1779946 -1447110
39927a447110J474023N20459k105965k344007J112822M091073K834274n85556
$$ -1447110 26913 547372 -1558593 -3902600 -2789778 1301295 4135569 3550013
39919C550013j810842o21542m1446p14925m91291R33564J241235k57832j402224
$$ 3550013 1739171 1117629 1076183 361258 -130033 803531 2044766 1786934 384710
39910C84710r92286l64480k50466M69611J653789J040975j715881l393184j808277
$$ 384710 -607576 -972056 -1222522 -752911 900878 1941853 225972 -3167212 -4975489
39901d975489P03473R06652o22976j118316q3787P09887N29665L43768O97189
$$ -4975489 -4272016 -3365364 -3988340 -5106656 -5190443 -4480556 -3950891 -3607123 -2909934
39892b909934R91562P23131J09592l02716K7279J124562K015795J710219P18692
$$ -2909934 -1918372 -1195241 -1085649 -1388365 -1361086 -236524 1779271 3489490 4208182
39883D208182K79186L00430n7453j84713R16435J642556n90158m340585m820155
$$ 4208182 4487368 4787798 4730345 4545632 5462067 7104623 6514465 2173880 -2646275
39874b646275q47065K948589K755871M22273o66859n21036m29034K47342J710582
$$ -2646275 -3493340 -544751 2211120 2633393 1966534 1445498 1016464 1263806 2974388
39865B974388J616964j007025k961815j713872K80970Q0186n33769R12719J980034
$$ 2974388 4591352 3584327 622512 -1091360 -810390 -730204 -1263973 -351254 1628780
39856A628780m19012l203838j329625L234132L970217K95698j884654k44403Q63540
$$ 1628780 1209768 -1994070 -3323695 -89563 3880654 4176352 2291698 2047295 2910835
39847B910835j176671k809889j011893J570687J535050j5548m94016k05893n02710
$$ 2910835 1734164 -1075725 -2087618 -516931 1018119 1002571 508555 302662 -200048
39838b00048p50227j0099Q60280J048092J254507J616101Q59578r52522j723895
$$ -200048 -950275 -960374 -100094 947998 2202505 3818606 4678184 3725662 2001767
39829B001767p87725j467j09697M79162J845518J465466j049433k249212m82288
$$ 2001767 1214042 1212575 1102878 1582040 3427558 4893024 3843591 1594379 1112091
39820A112091Q44003j090861l402264k007819J777386L425760J828638l13550
$$ 1112091 1956094 865233 -2537031 -4544850 -2767464 658296 2486934 2173384
39812B173384j157111j065522n07870J38880j94768j483506j514949O94434K308017
$$ 2173384 1016273 -49249 -557119 -418239 -613007 -2096513 -3611462 -2917028 -609011
39803f09011O95365j891943j485572J269999K194336J93694j520928q95845K80243
$$ -609011 86354 -1805589 -3291161 -2021162 173174 366868 -1154060 -2049905 -1769662
39794a769662n6491j236816j530227n14371J056125K058169J440183n62653j848714
$$ -1769662 -1826153 -3062969 -4593196 -5107567 -4051442 -1993273 -553090 -1115743 -2964457
39785b964457p70256J392535K044823P21998r83783k067078k446670j570698P22646
$$ -2964457 -3734713 -2342178 -297355 424643 -559140 -2626218 -5072888 -6643586 -5920940
39776e920940K635523K360056R58338N81374O86446o73739k475493j622184J657764
$$ -5920940 -3285417 -925361 32977 614351 1300797 627058 -1848435 -3470619 -1812855
39767a812855L388253J707012o42077r89785l32353m98783j009016q94518q40343
$$ -1812855 1575398 3282410 2640333 1650548 1318195 819412 -189604 -1084122 -1924465
39758a924465j255457p14543J319352K539089J149235q69709p03274P87910O84405
$$ -1924465 -3179922 -3894465 -2575113 -36024 1113211 243502 -459772 328138 1012543
39749A012543r89933j350541M44972J682492K97998j973639k089197K12855K301190
$$ 1012543 22610 -1327931 -882959 799533 1097531 -876108 -2965305 -2752450 -451260
39740d51260K010678j3504j356803o72089Q90657J242160K9545j008485m87194
$$ -451260 1559418 1545914 189111 -482978 407679 1649839 1679384 670899 183705
39731A83705Q18029J238255M33032n56916q76740n13873J83931O92326L46351
$$ 183705 1001734 2239989 2673021 2116105 1239365 725492 909423 1601749 1948100
39722A948100q38313j640698r60841M78142Q76521j37078r37852k38784J102210
$$ 1948100 1109787 -530911 -1491752 -1013610 -137089 -274167 -1212019 -1450803 -348593
39713c48593J379274L77822n56495m38742L30152Q44901P31410O0406r94885j885406
$$ -348593 1030681 1408503 852008 413266 743418 1588319 2319729 2380135 1385250 -500156
39703e00156j649249M4855J965701K214733L00105k122779k851022j299838R92404
$$ -500156 -2149405 -2104550 -138849 2075884 2375989 253210 -2597812 -3897650 -2905246
39694b905246J871306O67377j045846j092648O44103J846784P78521j100600j020741
$$ -2905246 -1033940 -366563 -1412409 -2505057 -1860954 -14170 764351 -336249 -1356990
39685a356990R55914J770084j44797k384161k062151o9216L67410j437567k623639
$$ -1356990 -401076 1369008 1224211 -1159950 -3222101 -3291317 -2923907 -4361474 -6985113
39676f985113q84829K411565M068639K755708j05703k345404k851535j656642
$$ -6985113 -7869942 -5458377 -1389738 1365970 1260267 -1085137 -3936672 -5593314
39668e593314O17606K817638L373972J494771j443803k697771j221053Q31023
$$ -5593314 -4975708 -2158070 1215902 2710673 1266870 -1430901 -2651954 -1820931
39660a820931Q65228n97903r07139N81242J679405R65682k90685p03401p94950
$$ -1820931 -955703 -1553606 -2460745 -1879503 -200098 765584 474899 -228502 -1023452
39651a023452j062125m77946J140602J626833j45335j484411L23998L079369K338788
$$ -1023452 -2085577 -2563523 -1422921 203912 58577 -1425834 -1101836 1977533 4316321
39642D316321j719902m168308k316515J033345K387406K073187K038694J997177
$$ 4316321 2596419 -1571889 -3888404 -2855059 -467653 1605534 3644228 5641405
39634E641405M43978k016948k955577j390349R82698J948446J118507j34512n86810
$$ 5641405 6085383 4068435 1112858 -277491 705207 2653653 3772160 3637648 3050838
39625C050838n55630j067611j895486j577178J17220J214034L15373j044980p05750
$$ 3050838 2495208 1427597 -467889 -2045067 -1927847 -713813 -398440 -1443420 -2149170
39616b149170O72114Q96709J17739M45157J923365K088589J12753j613117j199888
$$ -2149170 -1477056 -580347 -462608 -17451 1905914 3994503 4107256 2494139 1294251
39607A294251J605j19970j276989j720697q45398N58409J551886J539912N24253
$$ 1294251 1295856 1175886 -101103 -1821800 -2667198 -2108789 -556903 983009 1507262
39598A507262m99777m81176Q3378j15046p89157l13511J312190K007462Q17073
$$ 1507262 1007485 526309 609687 494641 -294516 -608027 704163 2711625 3528698
39589C528698o76499j070720j004377j157897p23350N77765J089521k65693j782152
$$ 3528698 2852199 1781479 777102 -380795 -1104145 -526380 563141 297448 -1484704
39580a484704j254420Q15631K107914J571036N6555j228594j539136o93529M87218
$$ -1484704 -2739124 -1923493 184421 1755457 1812012 583418 -955718 -1649247 -1162029
39571a162029O20152n28083j669133j841532j359403m95367J038657K584142K444420
$$ -1162029 -541877 -1069960 -2739093 -4580625 -5940028 -6435395 -5396738 -2812596 -368176
39562c68176M08875j348135j058996M57965J389105J164336K65611o43639p67329
$$ -368176 40699 -1307436 -2366432 -1908467 -519362 644974 910585 266946 -500383
39553e00383L2418L23417r65313j955516j47347K845042K883081R093j247921
$$ -500383 -467965 -144548 -1109861 -3065377 -3212724 -367682 2515399 2524492 1276571
39544A276571N40772J322299q80754j965980P97603L019521K99064l760530l145780
$$ 1276571 1817343 3139642 2258888 292908 1090511 4110032 4409096 648566 -2497214
39535b497214O74138J602063q71929j824158L3953R88698q0384P547J924986K052811
$$ -2497214 -1823076 -221013 -1092942 -2917100 -2883147 -1894449 -1974833 -1967286 -42300 2010511
39525B010511p32084k504223q48545J262967P66792q38183r07039N9431K90157
$$ 2010511 1278427 -1225796 -2074341 -811374 -44582 -882765 -1789804 -1730373 -1440216
39516a440216j00906k30629k64938l08558K70935J161015J065764J45590n7050
$$ -1440216 -1541122 -1771751 -2036689 -2345247 -2074312 -913297 152467 298057 241007
39507B41007M23345N4433q65185m28930R34160O56444j179979j528299J66477
$$ 241007 664352 718785 -146400 -575330 358830 1015274 -164705 -1693004 -1526527
39498a526527Q04200o37751j114691O49334J396725o38866j852851O66325L482872
$$ -1526527 -722327 -1360078 -2474769 -1825435 -428710 -1067576 -2920427 -2254102 1228770
39489A228770J930496k328853l805440j165734J892305K467362J091843o64589
$$ 1228770 3159266 830413 -2975027 -4140761 -2248456 218906 1310749 646160
39481F46160j732276j150929J040132K904577K654464Q81437p27282j515636j344280
$$ 646160 -1086116 -2237045 -1196913 1707664 4362128 5243565 4516283 3000647 1656367
39472A656367K8338J470805P90665j670097k518261m94670J025382n60690k599835
$$ 1656367 1684705 3155510 3946175 2276078 -242183 -736853 288529 -272161 -2871996
39463b871996j671704O59067Q81880l79742j19202J300354J162275k81191m77393
$$ -2871996 -4543700 -3884633 -3002753 -3382495 -3501697 -2201343 -1039068 -1320259 -1797652
39454a797652M63884L48734m11730L36753J623405O30151j489623p76744K187134
$$ -1797652 -1333768 -985034 -1396764 -1060011 563394 1193545 -296078 -1072822 1114312
39445A114312K142086k162719n016601k158206K908738M393084J943496p46191
$$ 1114312 3256398 1093679 -3922922 -6081128 -3172390 1220694 3164190 2417999
39437B417999j808999j855855j086016N29999J576484Q01163o25323r32740o12092
$$ 2417999 609000 -1246855 -2332871 -1802872 -226388 574775 -50548 -983288 -1595380
39428a595380j004246j342214n0701J873941J861766k1788q58396N92478J875847
$$ -1595380 -2599626 -3941840 -3992541 -2118600 -256834 -278622 -1137018 -544540 1331307
39419A331307O50094j672519k083693m78932L85775p86557j946929j002534R47852
$$ 1331307 1981401 308882 -1774811 -2253743 -1867968 -2654525 -4601454 -5603988 -4656136
39410d656136J405966K83892k40308Q01619K069149K298248J599925K09613j659764
$$ -4656136 -3250170 -2966278 -3206586 -2404967 -335818 1962430 3562355 3771968 2112204
39401B112204k386557k51838K974720L012705q37863m003463l197816r78748o55630
$$ 2112204 -274353 -526191 2448529 5461234 4623371 619908 -2577908 -3556656 -4212286
39392d212286n57058J987608M248104J793995l166023l867919O83301M044028
$$ -4212286 -4769344 -2781736 1466368 3260363 94340 -3773579 -3090278 953750
39384I53750K175071j237591j611568j6989M24422M4452N63622R94288l36924
$$ 953750 3128821 1891230 279662 262673 687095 731547 1295169 2289457 1952533
39375A952533k141089k253604j399945j431499j568472M8922K389643K718760
$$ 1952533 -188556 -2442160 -3842105 -5273604 -6842076 -6793154 -4403511 -1684751
39367a684751J035440n4013L93650O97633k1411m76657K6603Q4596j287730k531924
$$ -1684751 -649311 -703324 -309674 387959 366548 -110109 -83506 1090 -1286640 -3818564
39357c818564j522408J312421L304828K772094Q41142k67191n9780J1903r06903
$$ -3818564 -5340972 -4028551 -723723 2048371 2889513 2622322 2562542 2574445 1667542
39348A667542j584748o58428R71469J309800K82618l66607q9321k35119j301738
$$ 1667542 82794 -575634 395835 1705635 1988253 1621646 1532325 1297206 -4532
39339d532j730232m88473J072660J280924M76522j18558m65983j096145j529370
$$ -4532 -1734764 -2223237 -1150577 130347 606869 488311 22328 -1073817 -2603187
39330b603187r21580L83990J273964J319338Q33762J42322l06293J30084J289973
$$ -2603187 -3524767 -3140777 -1866813 -547475 286287 428609 122316 252400 1542373
39321A542373J867437R80819o03188j592683j714248j371454p16480J2360J52093
$$ 1542373 3409810 4390629 3787441 2194758 480510 -890944 -1607424 -1595064 -1442971
39312a442971l54707m29005N82086J599941J217824k45012j265654j187742n99853
$$ -1442971 -1797678 -2226683 -1644597 -44656 1173168 928156 -337498 -1525240 -2125093
39303b125093l381O69801J225095J007213l5661p81952j77306J015973O10171
$$ -2125093 -2128474 -1458673 -233578 773635 737974 -43978 -221284 794689 1404860
39294A404860k040657m132877k296821K434309M962788K704203p77619j085452
$$ 1404860 -635797 -4768674 -7065495 -4631186 331602 3035805 2258186 1172734
39286A172734O51347M63307j406418j189422J285991J818460q65553k545996m67434
$$ 1172734 1824081 2287388 880970 -308452 977539 2795999 1930446 -615550 -1082984
39277a082984K138955J646828k09622l8219J334586J018402o23290j242748j080761
$$ -1082984 1055971 2702799 2493177 2454958 3789544 4807946 4184656 2941908 1861147
39268A861147j875975k687659j211877J586444K353832N27867j149798j175978
$$ 1861147 -14828 -2702487 -3914364 -2327920 25912 553779 -596019 -1771997
39260a771997q06846r55965q66940k21130K39351M21480P61785N91210q13387
$$ -1771997 -2578843 -3534808 -4401748 -4622878 -4383527 -3962047 -3200262 -2609052 -3422439
39251c422439j971421q92876J331713J798606M45953k034J131548J399744k56892
$$ -3422439 -5393860 -6286736 -4955023 -3156417 -2710464 -2712498 -1580950 -181206 -438098
39242d38098j494383m24954J527141K147345J291679r5353j451920j909179n55167
$$ -438098 -1932481 -2357435 -830294 1317051 2608730 2513377 1061457 -847722 -1402889
39233a402889J400867J212947j320706k918430j517821P06017R94314J21824L12884
$$ -1402889 -2022 1210925 -109781 -3028211 -4546032 -3840015 -2845701 -2723877 -2410993
39224b410993J190151Q69648k90237k66268Q79932R09704p90577k040241j225031
$$ -2410993 -1220842 -351194 -641431 -907699 -27767 881937 91360 -1948881 -3173912
39215c173912M08069R50005N70095N40622P04674j72908j831749k259327o47814
$$ -3173912 -2765843 -1815838 -1245743 -705121 -447 -173355 -2005104 -4264431 -4912245
39206d912245J007875O15345q57194q41237Q00420J610711N90647k24146P23733
$$ -4912245 -3904370 -3289025 -4146219 -4987456 -4187036 -2576325 -1985678 -2209824 -1486091
39197a486091J934976J499632J32949n29877p18543j230552j208639M1105P63046
$$ -1486091 448885 1948517 2081466 1551589 833046 -397506 -1606145 -1565040 -801994
39188h01994n40146j738152j41730K417898J961802j000702k152932o04767l8163
$$ -801994 -1342140 -3080292 -3222022 -804124 1157678 156976 -1995956 -2600723 -2638886
39179b638886j723483k050522P90189L007908J395980j271149j010179R99990
$$ -2638886 -4362369 -6412891 -5622702 -2614794 -1218814 -2489963 -3500142 -2500152
39171b500152J218087j58755n56812p9269l71286l32530J872497L767893J162410
$$ -2500152 -1282065 -1440820 -1997632 -2076901 -2448187 -2780717 -908220 2859673 4022083
39162D022083m313185n951266j469033L408606L162112j64466j108177J033974
$$ 4022083 -291102 -6242368 -7711401 -4302795 -1140683 -1305149 -2413326 -1379352
39154a379352K260620N09315j742630j608060M25229J792671J226822k32386q49896
$$ -1379352 881268 1390583 -352047 -1960107 -1534878 257793 1484615 1252229 402333
39145D02333m5082J186170J360488L8236j695007k333539j471838r6403N95319
$$ 402333 357251 1543421 2903909 2942145 1247138 -1086401 -2558239 -2654642 -2059323
39136b059323M48632K39271M46100O43732L86096J17572M71550J038076Q61650
$$ -2059323 -1610691 -1371420 -925320 -281588 104508 222080 693630 1731706 2593356
39127B593356O2446k31894K84217O41975L70360L04212Q68924R39671m37916k265872
$$ 2593356 2655802 2423908 2708125 3350100 3720460 4024672 4893596 5833267 5395351 3129479
39117C129479k804044j768054j66948J222866J964627J380512n91228k463339
$$ 3129479 325435 -1442619 -1609567 -386701 1577926 2958438 2367210 -96129
39109i6129k637291j477542n80751l30146K74865J492532K180597J541682K24317
$$ -96129 -2733420 -4210962 -4791713 -5121859 -4846994 -3354462 -1173865 367817 592134
39100E92134o74082p13460m8945P97275J046787M85762O8755O08862J106408o7348
$$ 592134 -81948 -795408 -844353 -47078 999709 1485471 1554226 2163088 3269496 3202148
39090C202148k267948k753261m86192J984139J754050n90735j981901j012806
$$ 3202148 934200 -1819061 -2305253 -321114 1432936 842201 -1139700 -2152506
39082b152506O52264R41710j10685j021680r28448k01969M58583P56138P26296
$$ -2152506 -1500242 -558532 -669217 -1690897 -2619345 -2821314 -2362731 -1606593 -880297
39073h80297M84202J33226k95378p37722p80005J39792J646405J998163k2911
$$ -880297 -396095 -262869 -558247 -1295969 -2075974 -1936182 -289777 1708386 1685475
39064A685475k706970k542551J249049M766889L818916o23168l592319k491661
$$ 1685475 -1021495 -3564046 -2314997 2451892 6270808 5647640 2055321 -436340
39056d36340K16912J160991L02982l61362k24190j41141l77658n31774p92087
$$ -436340 -219428 941563 1244545 883183 658993 517852 140194 -391580 -1183667
39047a183667j463152j730111n85008J315480K231378J544909O3282j449416k538548
$$ -1183667 -2646819 -4376930 -4961938 -3646458 -1415080 129829 193111 -1256305 -3794853
39038c794853k307835k69738K091672K487477Q85236k93885M41650J666518J242117
$$ -3794853 -6102688 -6372426 -4280754 -1793277 -908041 -1201926 -760276 906242 2148359
39029B148359p78313k409118k074466L2656K267273K726377Q57567j695948k590925
$$ 2148359 1370046 -1039072 -3113538 -3080882 -813609 1912768 2770335 1074387 -1516538
39020a516538j450453j71662k54165r55143p70746L73077J481694K207194K857208
$$ -1516538 -2966991 -3138653 -3392818 -4347961 -5118707 -4745630 -3263936 -1056742 1800466
39011A800466L057547J862432n01869k146790j581713K57545R60714l60535j922886
$$ 1800466 4858013 6720445 6218576 4071786 2490073 2747618 3708332 3347797 1424911
39002A424911j650392O7924J126590Q19866N24620R31137N72040j512001l299083
$$ 1424911 -225481 -157557 969033 1788899 2313519 3244656 3816696 2304695 -994388
38993i94388k199488R09945K541768J340672m68878p08156R3461M85116K83549
$$ -994388 -3193876 -2283931 257837 1598509 1129631 421475 514936 1000052 1283601
38984A283601k75131j546645l053323k829742j19473K689460K919525J254708
$$ 1283601 1008470 -538175 -3591498 -6421240 -6540713 -3851253 -931728 322980
38976C22980K92502M62580J37202o93147j03579J876233K230624n84864l690872
$$ 322980 615482 1078062 1215264 522117 418538 2294771 4525395 3940531 249659
38967B49659l562811j000830L63869m14574n95662J504002L581296K616895p17405
$$ 249659 -3313152 -4313982 -3950113 -4364687 -4960349 -3456347 124949 2741844 2024439
38958B024439k842680j765214R16360K405574J680554k26863j728828j791248
$$ 2024439 -818241 -2583455 -1667095 738479 2419033 2192170 463342 -1327906
38950a327906l68136J415089J911529N81820j180066j524211l49115O79927L20568
$$ -1327906 -1696042 -280953 1630576 2212396 1032330 -491881 -840996 -161069 159499
38941A59499q45370j446247r54240K25573J569044K500833K151409K10095j971313
$$ 159499 -685871 -2132118 -3086358 -2860785 -1291741 1209092 3360501 3570596 1599283
38932A599283k321393o16381Q72842J73967j697041k115946n84076N87283k14585
$$ 1599283 -722110 -1338491 -465649 -291682 -1988723 -4104669 -4688745 -4101462 -4316047
38923d316047j370518l84768K281198L646616K274051n8099j189414j209165j173447
$$ -4316047 -5686565 -6071333 -3790135 -143519 2130532 2072433 883019 -326146 -1499593
38914a499593q50296M42824J735538J300789n30692j501646o86749L26314K54413
$$ -1499593 -2349889 -1907065 -171527 1129262 598570 -903076 -1589825 -1263511 -1009098
38905a009098J81604J347153K417499J151909j789441l038846r89454J812630
$$ -1009098 -827494 519659 2937158 4089067 2299626 -739220 -1728674 83956
38897H3956J922629n32812k218828j130900Q57546P32554j424103k464454n33322
$$ 83956 2006585 1473773 -745055 -1875955 -1018409 -285855 -1709958 -4174412 -4707734
38888d707734K169891K214293m07110k325719j415151P61209J842519J827106
$$ -4707734 -2537843 -323550 -730660 -3056379 -4471530 -3710321 -1867802 -40696
38880d0696J713594R57324j089744k447410n94767K834716L051289j133162m867281
$$ -40696 1672898 2630222 1540478 -906932 -1501699 1333017 4384306 3251144 -1616137
38871a616137l612425Q01995L174948J951662R4001J13198J444284K396711J926282
$$ -1616137 -5228562 -4426567 -1251619 700043 794044 907242 2351526 4748237 6674519
38862F674519l58786l418571m381169j745049J417181Q85368k164512k291797
$$ 6674519 6315733 2897162 -1484007 -3229056 -1811875 -926507 -3091019 -5382816
38854e382816J681059M148590J224093k870151k090663K231129L768269Q98084
$$ -5382816 -3701757 446833 1670926 -1199225 -3289888 -1058759 2709510 3607594
38846C607594j659524p29977J149448P62840r78198j460074m43902O13458J114478
$$ 3607594 1948070 1218093 2367541 3130381 2152183 692109 248207 861665 1976143
38837A976143J124510K88223j250628k165724j665981o76610j02380O37042J961520
$$ 1976143 3100653 3388876 2138248 -27476 -1693457 -2370067 -2472447 -1835405 126115
38828A26115K522943J041296j316720k274809j544885q33968j047244j141891
$$ 126115 2649058 3690354 2373634 98825 -1446060 -2280028 -3327272 -4469163
38820d469163R105J794321K444744J065196j166205j996371n87266J342037J650372
$$ -4469163 -4460058 -2665737 -220993 844203 -322002 -2318373 -2905639 -1563602 86770
38811H6770O09482J72365O56365L15787j267632j800034K51770K841365L013730
$$ 86770 696252 868617 1524982 1840769 573137 -1226897 -975127 1866238 4879968
38802D879968R05245j104692k045682k656906k739579j041246J922432L364632
$$ 4879968 5785213 4680521 2634839 -22067 -2761646 -3802892 -1880460 1484172
38794A484172J587886j653238l174013j897717L63575J159815p8888j649908j630633
$$ 1484172 3072058 1418820 -1755193 -3652910 -3289335 -2129520 -2208408 -3858316 -5488949
38785e488949k06331O92599K08345k07532Q44025K430030K762808J856613R33669
$$ -5488949 -5695280 -5002681 -4794336 -5001868 -4157843 -1727813 1034995 2891608 3825277
38776C825277O3686j417117k631296j854823L47080J227310j26119j233784J3990
$$ 3825277 3888963 2471846 -159450 -2014273 -1667193 -439883 -566002 -1799786 -1785796
38767a785796K074093K056066r3056j753828j305557K28751J013111L41170j250539
$$ -1785796 288297 2344363 2251307 497479 -808078 -579327 433784 774954 -475585
38758d75585k504428k021532L89962K721699K448855k32429k112934r00956J616063
$$ -475585 -2980013 -5001545 -4611583 -1889884 558971 326542 -1786392 -2687348 -1071285
38749a071285J864185n88205k351102q89492J963240K539667K36214j976850j683154
$$ -1071285 792900 204695 -2146407 -3035899 -1072659 1467008 1703222 -273628 -1956782
38740a956782J52916J001352O8864j146615r62387O43582K163449K178242Q53012
$$ -1956782 -1803866 -802514 -733650 -1880265 -2842652 -2199070 -35621 2142621 2995633
38731B995633l07597l71824j21441o54959j510530j377742k92172L71553M5493
$$ 2995633 2688036 2316212 2194771 1539812 29282 -1348460 -1640632 -1269079 -1223586
38722a223586m28106m42678k73266R4355R61030J410367n3004k600197l108201
$$ -1223586 -1651692 -2094370 -2367636 -2273281 -1312251 98116 45112 -2555085 -5663286
38713e663286m44947K396403K237549n1110j362551q42351r1408Q6339M57548
$$ -5663286 -6108233 -3711830 -1474281 -1525391 -2887942 -3730293 -3821701 -3735362 -3277814
38704c277814J141134J012170l18810j626976j629232l69899J120266J823521
$$ -3277814 -2136680 -1124510 -1443320 -3070296 -4699528 -5069427 -3949161 -2125640
38696b125640J485371Q36979P01143P50633J30247o36772j18453J220810J021597
$$ -2125640 -640269 196710 897853 1648486 1778733 1141961 1023508 2244318 3265915
38687C265915j088465k224160o15551J395128J109753l44460n61612j69706r91262
$$ 3265915 2177450 -46710 -662261 732867 1842620 1498160 936548 766842 -224420
38678b24420j952725r81130N82068Q339j474140l53536K580176K711467p43037
$$ -224420 -2177145 -3158275 -2576207 -2567868 -4042008 -4395544 -1815368 896099 153062
38669A53062k883085n75113L001425L563805J456747m27663j107495j189658p63613
$$ 153062 -2730023 -3305136 -303711 3260094 4716841 4289178 3181683 1992025 1228412
38660A228412j00668k92055j207059r60487R29190K223931J439851J08965j42930
$$ 1228412 1127744 835689 -371370 -1331857 -402667 1821264 3261115 3370080 3227150
38651C227150j23067p79334j080584l29837q73r81890j487235j07125J491549
$$ 3227150 3104083 2324749 1244165 914328 913455 -68435 -1555670 -1662795 -171246
38642a71246J383252N01507L93481L14449o83918j211376o5688J078432O15426
$$ -171246 1212006 1713513 2106994 2421443 1737525 526149 460461 1538893 2154319
38633B154319J23753J064636J090251k001987m985763l089454K232085M892656
$$ 2154319 2278072 3342708 4432959 2430972 -2554791 -5644245 -3412160 1480496
38625A480496L021591O82322N16278L64788j357909k259586n35817J340602O14483
$$ 1480496 4502087 5184409 5700687 6065475 4707566 2447980 1912163 3252765 3867248
38616C867248j289647j481319l10457r0666p96895l46902J469158K242311M27767
$$ 3867248 2577601 1096282 785825 695159 -101736 -448638 1020520 3262831 3690598
38607C690598k386452l373101j647246R79750K063853J000498o98521j456529
$$ 3690598 1304146 -2068955 -3716201 -2736451 -672598 327900 -370621 -1827150
38599a827150j242415p07803K63407J895867L082669K287666j33238j969678j759515
$$ -1827150 -3069565 -3777368 -3513961 -1618094 1464575 3752241 3619003 1649325 -110190
38590a10190k80633O91343K62539q83443j038327P84880L048915K781110m48293
$$ -110190 -390823 300520 563059 -320384 -1358711 -573831 2475084 5256194 4807901
38581D807901l173066k435680P8639Q19467k38482l63869P42884O46109r00017
$$ 4807901 1634835 -800845 -722206 97261 -141221 -505090 237794 883903 -16114
38572a6114j040650J086108K403626R11144r89997o61719M15673m85021k466172
$$ -16114 -1056764 29344 2432970 3344114 2354117 1692398 2108071 1623050 -843122
38563h43122k387883K01544K603374K827072J420256j68096r86606o43487L35988
$$ -843122 -3231005 -3029461 -426087 2400985 3821241 3653145 2666539 2023052 2359040
38554B359040N46724n47170j487353p41637J000888J786172Q58267j062536k931034
$$ 2359040 2905764 2358594 871241 129604 1130492 2916664 3774931 2712395 -218639
38545b18639l512980j742963J350503K525554L02979k249276j302670K210216
$$ -218639 -3731619 -5474582 -4124079 -1598525 -1295546 -3544822 -4847492 -2637276
38537b637276L882645K072646m47788j138477o28262k80192M3768N07561K64522
$$ -2637276 1245369 3318015 2870227 1731750 1103488 823296 867064 1374625 1639147
38528A639147o46930p03751M00023Q12096j88807n44337R00839J720924k04316
$$ 1639147 992217 288466 688489 1500585 1311778 767441 1668280 3389204 3184888
38519C184888k386843j028705K727882L950970J016041k451213l212692k175038
$$ 3184888 798045 -230660 2497222 6448192 7464233 5013020 1800328 -374710
38511c74710j322408m83929Q53570J490988P15478K31649J367971K328492R50549
$$ -374710 -1697118 -2181047 -1327477 163511 878989 1110638 2478609 4807101 5757650
38502E757650j467239k094819j056237p27545j360956r51163O63963J201664O6009
$$ 5757650 4290411 2195592 1139355 411810 -949146 -1900309 -1236346 -34682 31327
38493C1327l53535J174693K343213R64995j450441k026945o73150L60801o2764
$$ 31327 -322208 852485 3195698 4160693 2710252 683307 10157 370958 308194
38484C08194j018486j337848o92769O53890J857897J748049J68465j436914j619321
$$ 308194 -710292 -2048140 -2740909 -2087019 -229122 1518927 1687392 250478 -1368843
38475a368843m77746R51412J863758J685217K43035j319195j321079p3618J96208
$$ -1368843 -1846589 -895177 968581 2653798 2896833 1577638 256559 182941 379149
38466C79149j038288j375140M83715J994690O03251j874795j887841M29389J930365
$$ 379149 -659139 -2034279 -1550564 444126 1047377 -827418 -2715259 -2285870 -355505
38457c55505J454389N41574j16002j101988j442298N66267L313399K792460j291272
$$ -355505 1098884 1640458 1524456 422468 -1019830 -453563 2859836 5652296 4361024
38448D361024m163159k470284J238529K612412J135814o96001j356394r00749
$$ 4361024 197865 -2272419 -1033890 1578522 2714336 2018335 661941 -238808
38440b38808M41130J783380J257508j454582l576617k511722M75343K074120J394415
$$ -238808 202322 1985702 3243210 1788628 -1787989 -4299711 -3824368 -1750248 -355833
38431c55833K87035k6053j81372p38837j174623j007341l90873M81000J352886
$$ -355833 -68798 -94851 -276223 -1015060 -2189683 -3197024 -3587897 -3106897 -1754011
38422a754011J515275O39042l41570l99214J176j72561n67859r1723Q30951N73207
$$ -1754011 -238736 400306 58736 -340478 -339302 -511863 -1079722 -1171445 -340494 232713
38412B32713r55023j736088m65975J535330K142669J093505j64913o24519o39655
$$ 232713 -722310 -2458398 -2924373 -1389043 753626 1847131 1682218 1057699 418044
38403D18044q32080r68880l62834R10700J741200J185592l33930j458429j384626
$$ 418044 -414036 -1382916 -1745750 -835050 906150 2091742 1757812 299383 -1085243
38394a085243m50834N95385J201017R55443j21380j067904p58265M53446Q95747
$$ -1085243 -1536077 -940692 260325 1215768 1094388 26484 -731781 -278335 617412
38385F17412p8834r79005k31315J546108K377773J480570n2621q51925o68636
$$ 617412 538578 -440427 -671742 874366 3252139 4732709 4680088 3828163 3159527
38376C159527j95419q8019l10376l37672o750J52761j76860m03821o5024P0792
$$ 3159527 2964108 2876089 2565713 2228041 2221291 2374052 2197192 1793371 1728347 1799139
38366A799139p33292j420804n42823R53585P89483p42360q83217Q88140J556648
$$ 1799139 1065847 -354957 -897780 55805 845288 102928 -780289 107851 1664499
38357A664499m46496k267559j121844J201581J513993L79103K75731O08782r33896
$$ 1664499 1218003 -1049556 -2171400 -969819 544174 923277 1199008 1807790 873894
38348H73894l115322k167642J755500L840187J509661k014793k789040j246467
$$ 873894 -2241428 -4409070 -2653570 1186617 2696278 681485 -2107555 -3354022
38340c354022l9099K46683N92232Q68649K95989o47554r03765n81078m47294n24393
$$ -3354022 -3393121 -3146438 -2554206 -1685557 -1389568 -2037122 -2940887 -3521965 -3969259 -4493652
38330d493652m51386l21625j14474O12620J539042J458196L53577k7331J013877
$$ -4493652 -4945038 -5266663 -5381137 -4768517 -3229475 -1771279 -1417702 -1445033 -431156
38321d31156J492700k80465k645176k731905n79329J213756J303955P62706O55293
$$ -431156 1061544 781079 -1864097 -4596002 -5175331 -3961575 -2657620 -1894914 -1239621
38312a239621O43581K40477k60290m74660l40314K47384J140978J446329M85895
$$ -1239621 -596040 -355563 -615853 -1090513 -1430827 -1183443 -42465 1403864 1889759
38303A889759r35325j385835o76578K64355R34985J327400R74893l77602j478026
$$ 1889759 954434 -431401 -1107979 -843624 91361 1418761 2393654 2016052 538026
38294E38026q31195Q15521J228532O6559o27098J83144Q27429l10207k188669
$$ 538026 -293169 522352 1750884 1817443 1190345 1373489 2200918 1890711 -297958
38285b97958k681835j434118K25299J224619J347989P06307j89421l99562L96127
$$ -297958 -2979793 -4413911 -4188612 -2963993 -1616004 -909697 -1099118 -1498680 -1102553
38276a102553J262269J137735R7282j004642j428430o98389J089048K562840J953187
$$ -1102553 159716 1297451 1394733 390091 -1038339 -1736728 -647680 1915160 3868347
38267C868347n14099k389722k112949r15821m45494j78830R80750K060133J397863
$$ 3868347 3354248 964526 -1148423 -2064244 -2509738 -2688568 -1707818 352315 1750178
38258A750178k95200q67392k01609p5902p59333o55460L55270K72696j316878
$$ 1750178 1454978 587586 385977 310075 -449258 -1104718 -749448 -476752 -1793630
38249a793630j815505L54429K761377K340226m4183j090057o7425N38460p05192
$$ -1793630 -3609135 -3254706 -493329 1846897 1802714 712657 645232 1183692 478500
38240D78500j959511j085608J071940J879256N37333j000752q06369N01481Q27941
$$ 478500 -1481011 -2566619 -1494679 384577 921910 -78842 -885211 -383730 444211
38231D44211l36161j212622m17354R68824J104514J57059k44866K79371O38956
$$ 444211 108050 -1104572 -1521926 -553102 551412 708471 463605 742976 1381932
38222A381932N23230O61877O77002q00276l109046l322385n44788K020836J443174
$$ 1381932 1905162 2567039 3244041 2443765 -665281 -3987666 -4532454 -2511618 -1068444
38213a068444o22545o82743J167720J789579J59468j388194j162084k64310l2579
$$ -1068444 -1690989 -2373732 -1206012 583567 743035 -645159 -1807243 -2071553 -2104132
38204b104132k3788K90901O0918j196696k046446j001493J083795K041368J272934
$$ -2104132 -2127920 -1837019 -1776101 -2972797 -5019243 -6020736 -4936941 -2895573 -1622639
38195a622639K59334L19321R64102Q28107l32122j164698m07427J351141K270137
$$ -1622639 -1363305 -1043984 -79882 748225 416103 -748595 -1156022 195119 2465256
38186B465256J581111L52008l60915q62755j533124j582883n25258K79731n49964
$$ 2465256 4046367 4398375 4037460 3174705 1641581 58698 -466560 -186829 -736793
38177g36793j836641j261572R99127K369843J670021M67251J37846r5618j074462
$$ -736793 -2573434 -3835006 -2835879 -466036 1203985 1671236 1809082 1713464 639002
38168F39002j609432j62999K413056L423573J460264j877795l520790k076884
$$ 639002 -970430 -1133429 1279627 4703200 6163464 4285669 764879 -1312005
38160a312005N85735J412960n200r53691J92435J148288p09049l583104l451171
$$ -1312005 -726270 686690 681490 -272201 -79766 1068522 359473 -3223631 -6674802
38151f674802l23683J669896Q17968K14312K044235L526592J429470k390082l429875
$$ -6674802 -6998485 -5328589 -4510621 -4296309 -2252074 1274518 2703988 313906 -3115969
38142c115969p28364K604245L855671K778953J21185k917364m148137k173019
$$ -3115969 -3844333 -1240088 2615583 5394536 5515721 2598357 -1549780 -3722799
38134c722799J104362K077602p9061k462305k355130k84803J464399J851494J555874
$$ -3722799 -2618437 -540835 -619896 -3082201 -5437331 -5722134 -4257735 -2406241 -850367
38125h50367J279202O86159p57306k322829k225118L0754K212914J832983j98994
$$ -850367 428835 1114994 357688 -1965141 -4190259 -4159505 -1946591 -113608 -312602
38116c12602n79578J381248K491686P17731j393688p82209J066216N30669k153949
$$ -312602 -892180 489068 2980754 3698485 2304797 1522588 2588804 3119473 965524
38107I65524l176182j079045J303262J434240L83359L13948J193130J568545R08424
$$ 965524 -2210658 -3289703 -1986441 -552201 -168842 145106 1338236 2906781 3815205
38098C815205k48813j317861j786079j251028r8963O83651Q10345Q55810Q78960
$$ 3815205 3566392 2248531 462452 -788576 -887539 -203888 606457 1462267 2341227
38089B341227J65935j197319j858593j075005R2094L29713j44605k95916L1513
$$ 2341227 2507162 1309843 -548750 -1623755 -1531661 -1201948 -1346553 -1642469 -1610956
38080a610956K19197K26853P23651J811303K436541J527627n38572k080650j945827
$$ -1610956 -1391759 -1164906 -441255 1370048 3806589 5334216 4795644 2714994 769167
38071G69167q70722m30500p93356n58849Q33742J797861P76035j182586j537894
$$ 769167 -101555 -532055 -1325411 -1884260 -1050518 747343 1523378 340792 -1197102
38062a197102L27427K290764K300812P96178k47970Q2439P58544M15981p43712
$$ -1197102 -869675 1421089 3721901 4518079 4270109 4352548 5111092 5527073 4783361
38053D783361j242348n76811k23640j404928k690772j729109Q70366J849860O2772
$$ 4783361 3541013 2964202 2740562 1335634 -1355138 -3084247 -2213881 -364021 -301249
38044c01249j738164j167052M30420Q94795R13770J887626K339965J49156k964378
$$ -301249 -2039413 -3206465 -2776045 -1881250 -967480 920146 3260111 3409267 444889
38035D44889l181757l62220J815188J542574P96360R50450M94721j344022k338537
$$ 444889 -2736868 -3099088 -1283900 258674 1055034 2005484 2500205 1156183 -1182354
38026a182354r24416P48660J10911j620697j443550N46825J281684n25996k336270
$$ -1182354 -2106770 -1358110 -1247199 -2867896 -4311446 -3764621 -2482937 -3008933 -5345203
38017e345203j239947K095342M130196K755497j80960j380807n09053k86641j757286
$$ -5345203 -6585150 -4489808 -359612 2395885 2214925 834118 325065 38424 -1718862
38008a718862k055790R80868M344754L667543J29044j079761R45557J344832k237541
$$ -1718862 -3774652 -2793784 1550970 5218513 5347557 4267796 5213353 6558185 4320644
37999D320644n228892l200235J091945K209686L66196L0659K025091K620048L51236
$$ 4320644 -908248 -4108483 -3016538 -806852 -440656 -409997 1615094 4235142 4586378
37990D586378j526690o41284Q29055K26845j242093r69718N52202P13478q14626
$$ 4586378 3059688 2418404 3247459 3474304 2232211 1262493 1814695 2528173 1713547
37981A713547j533112n5662J638098Q65456j992514l627909j714565K105242L820879
$$ 1713547 180435 124773 1762871 2628327 635813 -2992096 -4706661 -2601419 1219460
37972A219460J590894k101561l355151j267523J535766K457269J619773O43977
$$ 1219460 2810354 708793 -2646358 -3913881 -2378115 79154 1698927 2342904
37964B342904J20105n05914j215576j093374J11291J273553J321794N64553r3334
$$ 2342904 2463009 1957095 741519 -351855 -240564 1032989 2354783 2919336 2826002
37955B826002n49977j180731j637045j201538j98830K41528j2172J99180J436291
$$ 2826002 2276025 1095294 -541751 -1743289 -1942119 -1700591 -1712763 -1513583 -77292
37946g7292K672698K681054J318846q88013l085130l718736j713737J263905J896070
$$ -77292 2595406 5276460 6595306 5707293 2622163 -1096573 -2810310 -1546405 349665
37937C49665k61962j736904k95324J554445P84600j099477q49164Q19907P68347
$$ 349665 87703 -1649201 -1944525 -390080 394520 -704957 -1554121 -734214 34133
37928C4133o34558j43799K124377K375264k11308j706403L374J744157O41036
$$ 34133 -600425 -744224 1380153 3755417 3544109 1837706 1841080 3585237 4226273
37919D226273j200165p69695P72253O96566n06516o12558K62635N45921L67006
$$ 4226273 3026108 2256413 3028666 3725232 3218716 2606158 2868793 3414714 3781720
37910C781720O09686M61880r55078k088672j212094L50542M23514j86288M82002
$$ 3781720 4391406 4853286 3898208 1809536 597442 947984 1371498 1185210 1667212
37901A667212J408268K64172j844479j621171Q48743K121762J113880L90437J006083
$$ 1667212 3075480 3339652 1495173 -125998 722745 2844507 3958387 4348824 5354907
37892E354907N17648k147618l855532j878482J700353L060064J913898P94690
$$ 5354907 5872555 3724937 -130595 -2009077 -308724 2751340 4665238 5459928
37884E459928O18398N3875j238957j645831l94463Q06773J22011j550673j561198
$$ 5459928 6078326 6132201 4893244 3247413 2852950 3659723 3781734 2231061 669863
37875F69863P12602K506612J172834j810340k324851O59075L163368J439789k870338
$$ 669863 1382465 3889077 5061911 3251571 926720 1585795 4749163 6188952 3318614
37866C318614n097533l653029r67012Q75529K146146K973793K177188j62847j635420
$$ 3318614 -1778919 -5431948 -6398960 -5523431 -3377285 -403492 1773696 1610849 -24571
37857b4571p59534O23528O6518j819678k382349p40182J327928K028368J465655
$$ -24571 -784105 -160577 -94059 -1913737 -4296086 -5036268 -3708340 -1679972 -214317
37848b14317P41817L65389P1611m06238r18241j116519q01003j4456R82281J626882
$$ -214317 527500 892889 964500 558262 -359979 -1476498 -2277501 -2291957 -1309676 317206
37838C17206J206671l32984j771141j605816O6113J460934J277300J02388p72225
$$ 317206 1523877 1190893 -580248 -2186064 -2119951 -659017 618283 720671 -51554
37829e1554r00437m47989M18243J084951O40503o00529j047427l16534p2607j006895
$$ -51554 -951991 -1399980 -981737 103214 743717 143188 -904239 -1220773 -1293380 -2300275
37819b300275j055073J161681L155906J957007q36769j190523R25891J491660
$$ -2300275 -3355348 -2193667 962239 2919246 2082477 891954 1817845 3309505
37811C309505q90730k629359r16942J945210K323100M27952r54073q45144m64068
$$ 3309505 2418775 -210584 -1127526 817684 3140784 3568736 2614663 1769519 1305451
37802A305451m80807l75361k1154j0415n43046j140571j231719m67234Q86091
$$ 1305451 824644 449283 428129 417714 -125332 -1265903 -2497622 -2964856 -2078765
37793b078765J563773M98804j214213j154791R11731K203286Q03935j424712j512827
$$ -2078765 -514992 -16188 -1230401 -2385192 -1473461 729825 1533760 109048 -1403779
37784a403779M89918K030990J705225L69538q01955j400034j089416L41449J940996
$$ -1403779 -913861 1117129 2822354 3191892 2389937 989903 -99513 241936 2182932
37775B182932K002717J28604j870731j739584O70593K867727K071966j611319
$$ 2182932 4185649 4314253 2443522 703938 1374531 4242258 6314224 4702905
37767D702905m826845m510765j321116J565579K469565K228045J588347J48355
$$ 4702905 -123940 -4634705 -5955821 -4390242 -1920677 307368 1895715 2044070
37759B044070j605854j849243k20253J235740J294197J341204K262282K174302
$$ 2044070 438216 -1411027 -1631280 -395540 898657 2239861 4502143 6676445
37751F676445k48938k556472j827466N75191J139617j71937m41045O64079L21683
$$ 6676445 6427507 3871035 2043569 2618760 3758377 3586440 3145395 3809474 4131157
37742D131157j938288k582807K82928L336219K735252l24402j761139n47653O48163
$$ 4131157 2192869 -389938 -107010 3229209 5964461 5640059 3878920 3331267 3979430
37733C979430K2542j092181q00202O39961J463991O55475j055118j989414j190025
$$ 3979430 4001972 2909791 2109589 2749550 4213541 4869016 3813898 1824484 634459
37724F34459M83761J253809O58422J34702Q17263J763444J475017L23560j18589
$$ 634459 1118220 2372029 3030451 3165153 3982416 5745860 7220877 7544437 7425848
37715G425848K72491K3596j316073k219956j494771K0164J011205J540717K051418
$$ 7425848 7698339 7721935 6405862 4185906 2691135 2711299 3722504 5263221 7314639
37706G314639J778456Q145j784844j270652J189218K507380J136589o26473k4666
$$ 7314639 9093095 9101240 7316396 6045744 7234962 9742342 10878931 10252458 10227792
37697A0227792K090618K665150J075020n5294J211018L579286M787691M675062
$$ 10227792 12318410 14983560 16058580 16003286 17214304 20793590 25581281 30256343
37689C0256343M647993N303123O244419P686780J0462050J4281896J7522810J9439674
$$ 30256343 34904336 40207459 46451878 54138658 64600708 78882604 96405414 115845088
37681A15845088K1536373K5720077L1461353L5452878L3783499K4135425P043124
$$ 115845088 137381461 163101538 194562891 230015769 263799268 287934693 294977817
37674B94977817j3248205k9484313l5556448l1718295k4629457k0648732j9794926
$$ 294977817 281729612 252245299 216688851 184970556 160341099 139692367 119897441
37667A19897441j7829454j3164488q872440p763540q609286q749756p957317p441774
$$ 119897441 102067987 88903499 80031059 72267519 63658233 54908477 46951160 39509386
37659C9509386o760407m515054j436368q9635j337175l170736l471329k286889
$$ 39509386 32748979 28233925 26797557 26707922 25370747 22200011 18728682 16441793
37651A6441793r59627m24932q22032j584235j558176j43506J451398J292593o30319
$$ 16441793 15482166 15057234 14235202 12650967 11092791 10949285 12400683 13693276 13062957
37642A3062957k076402j402241L27617P70129q50114k936000l277171j405566
$$ 13062957 10986555 9584314 9911931 10682060 9831946 6895946 3618775 2213209
37634B213209P17689P31433j200023k412978j316086M32751O45423k0310L86923
$$ 2213209 2930898 3662331 2462308 49330 -1266756 -834005 -188582 -208892 178031
37625A78031J384808Q52595r16453j264022M13306J568042P53186j71478M44689
$$ 178031 1562839 2415434 1498981 234959 648265 2216307 2969493 2798015 3242704
37616C242704J218724M01354j070660j405232q32061m00584K93619J737069K369800
$$ 3242704 4461428 4862782 3792122 2386890 1554829 1154245 1447864 3184933 5554733
37607E554733N45175k285194k961624q27962J662493K371032J549767N14273m3618
$$ 5554733 6099908 3814714 853090 25128 1687621 4058653 5608420 6122693 6079075
37598F079075j66993k08107m59129o69169l28744K08925n8438q69565n41716J200421
$$ 6079075 5912082 5703975 5244846 4575677 4246933 4455858 4397420 3527855 2986139 4186560
37588D186560J984850Q2631k608075k995178j044694O85368R13749O33616O65738
$$ 4186560 6171410 6254041 3645966 650788 -393906 291462 1205211 1838827 2504565
37579B504565N40797j06520q19182j083750n95993P94275K232588J939263l15567
$$ 2504565 3045362 2938842 2119660 1035910 439917 1234192 3466780 5406043 5090476
37570E090476k032762j257985K60313l20499k348261k758882j027882L52387K01706
$$ 5090476 3057714 1799729 2060042 1739543 -608718 -3367600 -4395482 -4043095 -3841389
37561c841389J1917O35971R96731Q32274J430054K547489J879970q34731k293993
$$ -3841389 -3829472 -3193501 -2196770 -1364496 65558 2613047 4493017 3658286 1364293
37552A364293l40284K442277K342717k78791k033876j371227J31414N77564k90232
$$ 1364293 1024009 3466286 5809003 5530212 3496336 2125109 2256523 2834087 2543855
37543B543855j562405k003846q06777J317076K378100J417885k62554j110752
$$ 2543855 981450 -1022396 -1829173 -512097 1866003 3283888 3021334 1910582
37535A910582j368055j853413j960116o07459J593058K852143K467874J165501
$$ 1910582 542527 -1310886 -3271002 -3878461 -2285403 566740 3034614 4200115
37527D200115l27649j589704j817668m46395J542230K244818R79106j042225k171760
$$ 4200115 3872466 2282762 465094 18699 1560929 3805747 4784853 3742628 1570868
37518A570868j777505m30019O89313P86283L34552M99970J316389J357271q3202
$$ 1570868 -206637 -636656 52657 838940 1173492 1673462 2989851 4347122 4263920
37509D263920j613634j684902q41968n34227n58811M16506K184755K852374J514184
$$ 4263920 2650286 965384 123416 -410811 -969622 -553116 1631639 4484013 5998197
37500E998197n99108j962552k280262j820133o88681O15456J132573O48185R1583
$$ 5998197 5399089 3436537 1156275 -663858 -1352539 -737083 395490 1043675 1135258
37491A135258J92212N76122O49828M71556K22974k61393q10374o70136K82933
$$ 1135258 1327470 1903592 2553420 3024976 3247950 2986557 2176183 1506047 1788980
37482A788980R19589L91509m30463k14427O13793L10747j493937k907630k173214
$$ 1788980 2708569 3100078 2669615 2455188 3068981 3379728 1885791 -1021839 -3195053
37473c195053j0992J310737P79960m03378o30859K16593J068596J258823J080710
$$ -3195053 -3206045 -1895308 -1115348 -1518726 -2149585 -1932992 -864396 394427 1475137
37464A475137R04952N74739l144l49073j31043P2647m03640r76279m33037R68309
$$ 1475137 2380089 2954828 2951684 2602611 2471568 2544215 2140575 1164296 731259 1699568
37454A699568J338143j63800j660797q92198J505251K676174J311311r64565k177440
$$ 1699568 3037711 2873911 1213114 320916 1826167 4502341 5813652 4849087 2671647
37445B671647k179570j529080l0777K131427L183755J674882j005659j953443
$$ 2671647 492077 -1037003 -1067780 1063647 4247402 5922284 4916625 2963182
37437B963182m70258J273840J368735K39630p49849j118739j007417m59392K09184
$$ 2963182 2492924 3766764 5135499 5375129 4625280 3506541 2499124 2039732 2248916
37428B248916L37723j15364m39114m14914n74822q07438j28023J429292K141896
$$ 2248916 2586639 2471275 2032161 1617247 1042425 234987 106964 1536256 3678152
37419C678152Q71415j237154k427988k524569k298631j860604j027288k46088
$$ 3678152 4549567 3312413 884425 -1640144 -3938775 -5799379 -6826667 -7072755
37411g072755K06542R70771K270173K965799K314175J364702J018803K22376j831760
$$ -7072755 -6866213 -5895442 -3625269 -659470 1654705 3019407 4038210 4260586 2428826
37402B428826l239538j860666Q49565J594810K20656l70513Q24150J531256L75056
$$ 2428826 -810712 -2671378 -1821813 -227003 -6347 -376860 447290 1978546 2353602
37393B353602q92300n43577N58491R60261P78197M93432j74066q52054k32001
$$ 2353602 1461302 917725 1476216 2436477 3214674 3708106 3534040 2681986 2449985
37384B449985J364544J467000p60174k521897j359634R49509J097776p02979j343607
$$ 2449985 3814529 5281529 4521355 1999458 639824 1589333 2687109 1984130 640523
37375F40523K69881J834567J256810p18994k032264j795734o21134M81276R45847
$$ 640523 910404 2744971 4001781 3282787 1250523 -545211 -1166345 -685069 260778
37366B60778Q67083O49466M23935P5169k16658j26129J49363K49489N36988J376678
$$ 260778 1127861 1777327 2201262 2276431 2059773 1933644 2083007 2332496 2869484 4246162
37356D246162J743833L73469j671907j865517o7119J089249M78224J88537J474655
$$ 4246162 5989995 6363464 4691557 2826040 2758921 3848170 4326394 4514931 5989586
37347E989586K141703L01174k098222k371374j249719p27741r4539K073681L872912
$$ 5989586 8131289 8432463 6334241 3962867 2713148 1985407 1890868 3964549 7837461
37338G837461K434678p77306j602276K81505R99569j126154l267900k991070j343252
$$ 7837461 10272139 9494833 7892557 8174062 9173631 8047477 4779577 1788507 445255
37329D45255J13762J491496K394732J286876j255479k162786o04729L82589r09844
$$ 445255 559017 2050513 4445245 5732121 4476642 2313856 1709127 2091716 1181872
37320A181872j724829K87710K557936J667176q25060r15063J228530J672419q48845
$$ 1181872 -542957 -255247 2302689 3969865 3144805 2229742 3458272 5130691 4281846
37311D281846l092953k342087R5724J400149Q39806k03021l15458N54075J061188
$$ 4281846 1188893 -1153194 -1057470 342679 1182485 979464 664006 1218081 2279269
37302B279269k7445j752421j559571R24126K510131Q74394j535394j063000J215565
$$ 2279269 2251824 499403 -1060168 -136042 2374089 3248483 1713089 650089 1865654
37293A865654J120052j684525k938317n93321K153584K287372J223329J075981
$$ 1865654 2985706 1301181 -1637136 -2230457 -76873 2210499 3433828 4509809
37285D509809M87047k216446m559347k952691J286886L235461J284415j132478
$$ 4509809 4996856 2780410 -1778937 -4731628 -3444742 -209281 1075134 -57344
37277e7344j035391M56845R75259L21785n04505j319231k013715j554435M55814
$$ -57344 -1092735 -635890 339369 661154 156649 -1162582 -3176297 -4730732 -4274918
37268d274918K383074K379888Q43248k90560p9152P65730J179302O58745n66419
$$ -4274918 -1891844 488044 1331292 1040732 961580 1727310 2906612 3565357 2998938
37259B998938j375105n28282J379091J746094p21537l414464k701982Q57360K729597
$$ 2998938 1623833 1095551 2474642 4220736 3499199 84735 -2617247 -1759887 969710
37250I69710N14379k609870k275771J038308K916032J287202j063729r89447N63115
$$ 969710 1484089 -1125781 -3401552 -2363244 552788 1839990 776261 -213186 349929
37241C49929O23285q26843q99414J217885K459257N97360j833728j161779J479067
$$ 349929 973214 146371 -753043 464842 2924099 3521459 1687731 525952 2005019
37232B005019J601318j460581l054715l16249L173195K718560n74122k096163
$$ 2005019 3606337 2145756 -908959 -1225208 1947987 4666547 4092425 1996262
37224A996262r26833j80799r51349p50779J352928K524651Q73408j268938j079443
$$ 1996262 1069429 888630 -62719 -813498 539430 3064081 3937489 2668551 1589108
37215A589108O30022J438077J040889M55754l75862j550357j609119K47471J938469
$$ 1589108 2219130 3657207 4698096 5153850 4777988 3227631 1618512 1865983 3804452
37206C804452J366311L6979O28657K176643J399259j707407l515194k279834k90046
$$ 3804452 5170763 5207742 5836399 8013042 9412301 7704894 4189700 1909866 1619820
37197A619820L43787M91053J114857Q50874j297915l324831k821456n99550O89938
$$ 1619820 1963607 2454660 3569517 4420391 3122476 -202355 -3023811 -3623361 -2933423
37188b933423M79799N38163J818582L094592K813362R54381j138993k033821j362959
$$ -2933423 -2453624 -1915461 -96879 2997713 5811075 6765456 5626463 3592642 2229683
37179B229683j09448N54114P34609J251366J620219K92530k418567l635064j721697
$$ 2229683 2120235 2674349 3408958 4660324 6280543 6573073 4154506 519442 -1202255
37170a202255Q77228Q37218j184970j644445L87777J963140J130503k3966R23888
$$ -1202255 -325027 512191 -672779 -2317224 -1929447 33693 1164196 1140230 2064118
37161B064118K430920J287462j974095l340783j214061J171263O92373j035994
$$ 2064118 4495038 5782500 3808405 467622 -746439 424824 1117197 81203
37153H1203o16821J406432J412554j145037k452790l61779J979166J025916j509653
$$ 81203 -535618 870814 2283368 1138331 -1314459 -1676238 302928 1328844 -180809
37144a80809j433354J253337K509936O38349j522200j450342l72734l24013p73716
$$ -180809 -1614163 -360826 2149110 2787459 1265259 -185083 -557817 -881830 -1655546
37135a655546k89358O18381N78883j63649m41160k85281m50842n99222J91325
$$ -1655546 -1944904 -1326523 -747640 -911289 -1352449 -1637730 -2088572 -2687794 -2496469
37126b496469J501416J780930M42721j371331k080377j056707R40721K196198
$$ -2496469 -995053 785877 1228598 -142733 -2223110 -3279817 -2339096 -142898
37118a42898J451818o14757j983511j676979n71271M26222J470141K380616J969505
$$ -142898 1308920 694163 -1289348 -2966327 -3537598 -3111376 -1641235 739381 2708886
37109B708886O1067j421762j017962j1679l60151j543899j535789p5012J120556
$$ 2708886 2769953 1348191 330229 318550 -41601 -1585500 -3121289 -3196301 -2075745
37100b075745R71656N0490o69076n40557P16468K222902K040017k21875j935445
$$ -2075745 -1104089 -1053599 -1722675 -2263232 -1546764 676138 2716155 2494280 558835
37091E58835p28881J805615K305525P23565L0176J082048J374768m18198k151712
$$ 558835 -170046 1635569 3941094 4664659 4694835 5776883 7151651 6733453 4581741
37082D581741j961124j294049k078855l199697k274098N07052K658609K740162
$$ 4581741 2620617 1326568 -752287 -3951984 -6226082 -5719030 -3060421 -320259
37074c20259J515245K96180k61508m6782M85796L81404p09093j729917j381708
$$ -320259 1194986 1491166 1229658 1182876 1668672 2050076 1340983 -388934 -1770642
37065a770642J78388J535682J670631Q03373j68582n70237m56451m72327r70078
$$ -1770642 -1592254 -56572 1614059 2417432 2248850 1678613 1222162 749835 -220243
37056b20243j305119n88974Q65128J644317R69150l90679j112145o16234O19485
$$ -220243 -1525362 -2114336 -1249208 395109 1364259 973580 -138565 -754799 -135314
37047a35314J384665O01187j301293k291955j131522O99524R71639R522j4343
$$ -135314 1249351 1850538 549245 -1742710 -2874232 -2174708 -1203069 -1193547 -1207890
37038a207890J276040K024251J416042O24859M984j614621l760089l637001n18513
$$ -1207890 68150 2092401 3508443 4133302 4138286 2523665 -1236424 -4873425 -5391938
37029e391938K091943J191228j253028j444029N99665J792923J061810K46210
$$ -5391938 -3299995 -2108767 -3361795 -4805824 -4206159 -2413236 -1351426 -1105216
37021a105216M20560N02461k50478r36083p31805m5785N01350Q87874J270216
$$ -1105216 -684656 -182195 -432673 -1368756 -2100561 -2146346 -1644996 -757122 513094
37012E13094J662115J836684J040453j161394l134328k207401J173094K717808
$$ 513094 2175209 4011893 5052346 3890952 756624 -1450777 -277683 2440125
37004B440125O2335l160560k363323R66649J658441r22373k148006K15460K723141
$$ 2440125 2502460 -658100 -3021423 -2054774 -396333 -1318706 -3466712 -3251252 -528111
36995e28111K091904j16880r39753n21115m63014m40885O26343J882351J688000
$$ -528111 1563793 1446913 507160 -13955 -476969 -917854 -291511 1590840 3278840
36986C278840L33249n67923n91382o67209j267942j735602j171516N34449K190175
$$ 3278840 3612089 3044166 2452784 1785575 517633 -1217969 -2389485 -1855036 335139
36977C35139K060696R2144j312082l81170J097914M31857j337871r35727J441521
$$ 335139 2395835 2487979 1175897 794727 1892641 2324498 986627 50900 1492421
36968A492421K196201M53239o37458J28460j27217k387935k931575J68742K744693
$$ 1492421 3688622 4141861 3504403 3632863 3505646 1117711 -1813864 -1645122 1099571
36959A099571J090884j673768j018315J133097Q2735l013218l001101L69922K243264
$$ 1099571 2190455 516687 -501628 631469 714204 -2299014 -5300115 -4930193 -2686929
36950b686929R12595k32492O24044J268601O44187P10354J693793R51003j618152
$$ -2686929 -1774334 -2006826 -1382782 -114181 530006 1240360 2934153 3885156 2267004
36941B267004k265955K65341K093527N59177j443290o40023J344731J402119j1742
$$ 2267004 1049 266390 2359917 2919094 1475804 835781 2180512 3582631 3570889
36932C570889q57100j330355k063142j494697J104987K694887O95411k117782
$$ 3570889 2713789 1383434 -679708 -2174405 -1069418 1625469 2320880 203098
36924B03098j380866J892094K733488k84260l452785l660102j691644M68889K043164
$$ 203098 -1177768 714326 3447814 3163554 -289231 -3949333 -5640977 -5172088 -3128924
36915c128924K545065J513099p9469n31548P3540K35520j53399J06465O98744
$$ -3128924 -583859 929240 849771 318223 391763 627283 473884 580349 1279093
36906A279093K688j503631j157437J566895L519532K186871q30052k395324j941502
$$ 1279093 1281781 -221850 -1379287 187608 3707140 5894011 5063959 2668635 727133
36897G27133j072311n96063j03189L18848k5483r60343j330435n34495P64573
$$ 727133 -345178 -941241 -1044430 -725582 -751065 -1711408 -3041843 -3576338 -2811765
36888b811765J560954J465551P03784k56183r01905q92109l49789J64870K11345
$$ -2811765 -1250811 214740 918524 662341 -239564 -1131673 -1481462 -1316592 -1105247
36879a105247N0610L90296J297584J735184Q03004q16251j578838j181683p96290
$$ -1105247 -1054637 -664341 633243 2368427 3171431 2355180 776342 -405341 -1201631
36870a201631j080008j334253j039701o80723l58741P13734K314037K633470J060964
$$ -1201631 -2281639 -3615892 -4655593 -5336316 -5695057 -4981323 -2667286 -33816 1027148
36861A027148k88485K67599J101910M2398j611948j065156R82055J077246j261857
$$ 1027148 738663 1006262 2108172 2150570 538622 -526534 455521 1532767 270910
36852B70910k428865l82176K036556J378686j434015k794855j424555O80197J511170
$$ 270910 -2157955 -2540131 -503575 875111 -558904 -3353759 -4778314 -4098117 -2586947
36843b586947J162619P07321M39496k14530j465474k301065j405974P90726J943792
$$ -2586947 -1424328 -717007 -277511 -492041 -1957515 -4258580 -5664554 -4873828 -2930036
36834b930036P47303q64152k41201J901546K313748Q5130j954896j407477O28437
$$ -2930036 -2182733 -3046885 -3288086 -1386540 927208 1012338 -942558 -2350035 -1721598
36825a721598J849979J842012J298343J62898j447980j976428l21852J841038
$$ -1721598 128381 1970393 3268736 3431634 1983654 7226 -314626 1526412
36817A526412J789809m95228k174917j288507Q29587J413201k71235k009304j259549
$$ 1526412 3316221 2820993 646076 -642431 187156 1600357 1329122 -680182 -1939731
36808a939731J574647L234891J547327j610917k697010j193012K39151J61894
$$ -1939731 -365084 2869807 4417134 2806217 109207 -1083805 -844654 -682760
36800f82760J55715J349413J961037K29677k309071k842506j209194M92582J214329
$$ -682760 -527045 822368 2783405 3013082 704011 -2138495 -3347689 -2855107 -1640778
36791a640778J521437J471894L60279j399885k187267j353446j5459O25195N33670
$$ -1640778 -119341 1352553 1712832 312947 -1874320 -3227766 -3243225 -2618030 -2084360
36782b084360K00884j34090l32137k61946p6985k2675o754J40432K30326Q9959
$$ -2084360 -1883476 -2017566 -2349703 -2611649 -2688634 -2711309 -2718063 -2577631 -2347305 -2257346
36772b257346K2448L16843P01290Q40842Q74856Q94133N20557l28377r36710p87820
$$ -2257346 -2234898 -1918055 -1216765 -375923 498933 1393066 1913623 1585246 648536 -139284
36762a39284l81582l12709k84498J55752O83591Q50012Q67059R10006N39689l18329
$$ -139284 -520866 -833575 -1118073 -962321 -278730 571282 1438341 2348347 2888036 2569707
36752B569707q61589p94541r68621j571587j239449N11597J644483M93789j195303
$$ 2569707 1708118 913577 -55044 -1626631 -2866080 -2354483 -710000 -216211 -1411514
36743a411514p33050J154715J481479j23254j068832l49087J22072m74230o0347
$$ -1411514 -2144564 -989849 491630 368376 -700456 -1049543 -927471 -1401701 -1462048
36734a462048K307207L675585J264491k666221l247591L29561L563896K553359
$$ -1462048 845159 4520744 5785235 3119014 -128577 200984 3764880 6318239
36726F318239j176261l074123j406091J115115J334746m82115j770055j491018
$$ 6318239 5141978 2067855 661764 1776879 3111625 2629510 859455 -631563
36718f31563j021591j334006j353175q4825J285798J039709l40559q30340K39027
$$ -631563 -1653154 -2987160 -4340335 -4425160 -3139362 -2099653 -2440212 -3270552 -3031525
36709c031525J538745J750033Q23170n46927j432736r63517O32369J667513R94385
$$ -3031525 -1492780 257253 1080423 533496 -899240 -1862757 -1230388 437125 1431510
36700A431510j84061m4369R58997Q97598l69106j080003p01340o17533j171806
$$ 1431510 1247449 1203080 2162077 3059675 2690569 1610566 909226 291693 -880113
36691h80113o26703J644563L155608J439064k127481l630853j379391K131911
$$ -880113 -1506816 137747 3293355 4732419 2604938 -1025915 -2405306 -273395
36683b73395L141559P07042k386362k656062K31940L036624K682880k30168k483927
$$ -273395 2868164 3575206 1188844 -1467218 -1235278 1801346 4484226 4254058 1770131
36674A770131k175974l77813P89074M00998q82022j585570p01693R55864J267157
$$ 1770131 -405843 -783656 5418 406416 -475606 -2061176 -2762869 -1807005 -539848
36665e39848l18543j488828k28938J929113K065546K45358j097905j424524k276144
$$ -539848 -858391 -2347219 -2576157 -647044 1418502 1663860 565955 -858569 -3134713
36656c134713l274435j866408J903726M087187K230125r44996j544915K62518
$$ -3134713 -6409148 -8275556 -6371830 -2284643 -54518 -999514 -2544429 -2281911
36648b281911J516292J065293K66272K07898N81768Q23203P18796K36467k69209
$$ -2281911 -765619 299674 565946 773844 1355612 2178815 2897611 3134078 2864869
36639B864869l03563k13757q19622j669549j289466K45580R36476p4067j142132
$$ 2864869 2561306 2347549 1527927 -141622 -1431088 -1185508 -249032 -323099 -1465231
36630a465231r26272l36975l01349R9650J434193K050501O44249j111606r14474
$$ -1465231 -2391503 -2728478 -3029827 -2930177 -1495984 554517 1198766 87160 -827314
36621h27314N79953R13585m17504j563834j056913P69563K501906K617242O73549
$$ -827314 -247361 666224 248720 -1315114 -2372027 -1602464 899442 3516684 4190233
36612D190233j594074j786578k06277L29684j052422j758418k06574J277851M41588
$$ 4190233 2596159 809581 603304 932988 -119434 -1877852 -2084426 -806575 -364987
36603c64987j008341n21172R62874J191581O91169R78784R55208p97962k138115
$$ -364987 -1373328 -1894500 -931626 259955 951124 1929908 2885116 2087154 -50961
36594e0961l82120K361913J871702j171616k100683J10218J523665P4714j464634
$$ -50961 -433081 1928832 3800534 2628918 528235 638453 2162118 2236832 772198
36585G72198o82842R17773J313373R45666N11498p04261k465373k706824p88748
$$ 772198 89356 1007129 2320502 3266168 3777666 3073405 608032 -2098792 -2887540
36576b887540J122400J358005P62333L05409l86666j007056k05799J479261J518861
$$ -2887540 -1765140 -407135 355198 660607 273941 -733115 -938914 540347 2059208
36567B059208m16266j479582l81608M50012o33758j488393j72714J444251J094730
$$ 2059208 1642942 163360 -218248 231764 -401994 -1890387 -2063101 -618850 475880
36558D75880J76493J053687K684422K440006N41230o73802o61789p81252j379463
$$ 475880 652373 1706060 4390482 6830488 7371718 6697916 6036127 5254875 3875412
36549C875412j513556j017197o55945p46370j193587j981255k350715r81365J628956
$$ 3875412 2361856 1344659 688714 -57656 -1251243 -3232498 -5583213 -6564578 -4935622
36540d935622K849786J606289K03139N11105Q21057q49341k687413j695446J346255
$$ -4935622 -2085836 -479547 -276408 234697 1055754 206413 -2481000 -4176446 -2830191
36531b830191L055757K432515J276667N64138j80597n46913L08092J217140L07097
$$ -2830191 225566 2658081 3934748 4498886 4318289 3771376 4079468 5296608 5603705
36522E603705j483036j535778j42464l28044k569948l401417p51137K484410K414371
$$ 5603705 4120669 2584891 2442427 2114383 -455565 -3856982 -4608119 -2123709 290662
36513B90662m30106k080071n32265K005385K349949L78427j097649k49871J205840
$$ 290662 -139444 -2219515 -2751780 -746395 1603554 1981981 884332 634461 1840301
36504A840301N65140j545321j855579K55567J295444q43057l057732j699374J505575
$$ 1840301 2405441 860120 -995459 -739892 555552 -287505 -3345237 -5044611 -3539036
36495c539036K142975L3829j070873j9628L97608q75746r70787J619815L673721
$$ -3539036 -1396061 -1362232 -2433105 -2452733 -2055125 -2930871 -3901658 -2281843 1391878
36486A391878J971413j503099k290435K39525K375200J394362j125410j898164
$$ 1391878 3363291 1860192 -430243 -190718 2184482 3578844 2453434 555270
36478E55270l15613R83868j22666k021710j303580K195467M450326K500681j470252
$$ 555270 239657 1223525 1100859 -920851 -2224431 -28964 4421362 6922043 5451791
36469E451791l345655k461466j078660j69950P78933R17878r34507k805640j448291
$$ 5451791 2106136 -355330 -1433990 -1603940 -825007 92871 -841636 -3647276 -5095567
36460e095567K013987K806989j53677k232538k34445K812771K799581O23955l18858
$$ -5095567 -3081580 -274591 -428268 -2660806 -2895251 -82480 2717101 3341056 3022198
36451C022198K68934L26481k94668r7314P07055M89199p77114j558412j333355
$$ 3022198 3291132 3617613 3322945 3225631 3932686 4421885 3644771 2086359 753004
36442G53004q28390l06641L05410L56060m78070j006758l72364J12587p83290
$$ 753004 -75386 -382027 -76617 279443 -198627 -1205385 -1577749 -1465162 -2248452
36433b248452j495337k6786K110483J712015q68540j936942j75692J499708Q40939
$$ -2248452 -3743789 -3770575 -1660092 51923 -816617 -2753559 -2929251 -1429543 -588604
36424e88604l75215K31293J608052J161117j037234k479475j831103j07574J381311
$$ -588604 -963819 -732526 875526 2036643 999409 -1480066 -3311169 -3418743 -2037432
36415b037432K268341K261708Q90127j224303k187215r59765J041027J502090
$$ -2037432 230909 2492617 3382744 2158441 -28774 -988539 52488 1554578
36407A554578P0766j363694j232974l8894Q47028J027138Q40737K05585r58077
$$ 1554578 1625344 261650 -971324 -1010218 -163190 863948 1704685 1910270 952193
36398I52193j646594o89489J274168K226218J374068r9066j102495j790015k146950
$$ 952193 -694401 -1383890 -109722 2116496 3490564 3391498 2289003 498988 -1647962
36389a647962j306519O41984J835211J084304k14555k37642M01094r6852j435250
$$ -1647962 -2954481 -2312497 -477286 607018 392463 154821 555915 459063 -976187
36380i76187j494461K27333J629149J025958n58848j045923q2714Q84248P02744
$$ -976187 -2470648 -2243315 -614166 411792 -147056 -1192979 -1275693 -391445 311299
36371C11299l06643j108702j115388m34872M85199J063416P72365k52020q85262
$$ 311299 4656 -1104046 -2219434 -2654306 -2169107 -1105691 -333326 -585346 -1470608
36362a470608j32430J267452J424559k0193j132944o04817J24743n73391j353705
$$ -1470608 -1603038 -335586 1088973 1068780 -64164 -668981 -544238 -1117629 -2471334
36353b471334j7938K145521J637464j567828l312450j296889J632317K031849
$$ -2471334 -2489272 -343751 1293713 -274115 -3586565 -4883454 -3251137 -1219288
36345a219288N95013m9897L17307J92389m68722n51605m4283L79985Q99828J568781
$$ -1219288 -624275 -674172 -356865 -164476 -633198 -1184803 -1229086 -849101 50727 1619508
36335A619508J163732p74418k179540j187073O98732P64184p80618j552476q20193
$$ 1619508 2783240 2008822 -170718 -1357791 -659059 105125 -675493 -2227969 -3048162
36326c048162K40558J154636K057152J875704k05850k121312j141888J636980
$$ -3048162 -2807604 -1652968 404184 2279888 2074038 -47274 -1189162 447818
36318D47818K513204P78856n56262P2242P05501j47168j081788q39437n55706
$$ 447818 2961022 3739878 3183616 3255858 3961359 3814191 2732403 1892966 1337260
36309A337260j159710j267692L18127K198450K405245J103780l71896j531224
$$ 1337260 177550 -1090142 -772015 1426435 3831680 4935460 4563564 3032340
36301C032340k206135j589038M98933K483901K635601J036263r08116j992042
$$ 3032340 826205 -762833 -263900 2220001 4855602 5891865 4983749 2991707
36293B991707j674534k38250R36645N42682p26520q39127N65923J510121O36692
$$ 2991707 1317173 1078923 2015568 2558250 1831730 992603 1558526 3068647 3705339
36284C705339q63616j147839j21484Q50406N38536j175113k817874k106065J189296
$$ 3705339 2841723 1693884 1572400 2422806 2961342 1786229 -1031645 -3137710 -1948414
36275a948414L770001K542243p64414j772876P4297J075166l44583j235397M02196
$$ -1948414 1821587 4363830 3599416 1826540 1900837 2976003 2631420 1396023 1798219
36266A798219K085104J241064o22648j034581o07112r26692j316122q57894r18886
$$ 1798219 3883323 5124387 4501739 3467158 2860046 1933354 617232 -240662 -1159548
36257a159548k350050k798184m11855K210462J700715n89369r63171N95101J280097
$$ -1159548 -3509598 -6307782 -6719637 -4509175 -2808460 -3397829 -4361000 -3765899 -2485802
36248b485802R30999J741758L171644K142574j406913l715613k782061p85737
$$ -2485802 -1554803 186955 3358599 5501173 4094260 378647 -2403414 -3189151
36240c189151Q8112N84444J776580K671760K054243M70821q53928j360609q92498
$$ -3189151 -3101039 -2516595 -740015 1931745 3985988 4456809 3602881 2242272 1349774
36231A349774J42869L35223r77223j864927k19760K435915K631795K41111j416580
$$ 1349774 1492643 1827866 850643 -1014284 -1234044 1201871 3833666 4074777 2658197
36222B658197r70911o60138j745723k169802m63217J397779J146097m10445j136521
$$ 2658197 1687286 1027148 -718575 -2888377 -3351594 -1953815 -807718 -1218163 -2354684
36213b354684m98507Q15981K082394K117531L8137k428113k087360R81995K802008
$$ -2354684 -2853191 -2037210 45184 2162715 2200852 -227261 -2314621 -1332626 1469382
36204A469382J176945j193423j317057l15150m95388j063840j37771J308315J072375
$$ 1469382 2646327 1452904 135847 -179303 -674691 -1738531 -1876302 -567987 504388
36195E04388l62857q71587k90069Q8016K88210Q89773Q42700p42646j897608l63781
$$ 504388 141531 -730056 -1020125 -932109 -643899 245874 1088574 345928 -1551680 -1915461
36185a915461K138656J895295j129807l295663k704430r58432M80223J901400
$$ -1915461 223195 2118490 988683 -2306980 -5011410 -5969842 -5489619 -3588219
36177c588219K886966J983755j91705q82062O12090J727542Q00047o14235q93645
$$ -3588219 -701253 1282502 1090797 208735 820825 2548367 3348414 2734179 1840534
36168A840534p40480p83847J48908K269860L133936J197439j259280j387016M6401
$$ 1840534 1100054 316207 465115 2734975 5868911 7066350 5807070 4420054 4466455
36159D466455M27492m85755r95513p64838p80576r71738n89188j50345m39432
$$ 4466455 4893947 4408192 3412679 2647841 1867265 895527 306339 155994 -283438
36150b83438n16937N64333J183891m65590k432327j385808J526421J760292j265312
$$ -283438 -800375 -236042 947849 482259 -1950068 -3335876 -1809455 -49163 -1314475
36141a314475k812276l94870K187192J181231j184700r95927P18300L88657j502916
$$ -1314475 -4126751 -4521621 -2334429 -1153198 -2337898 -3333825 -2615525 -2226868 -3729784
36132c729784j352836J236995K930534K094443M05621q30019j784211j651521
$$ -3729784 -5082620 -3845625 -915091 1179352 1584973 754954 -1029257 -2680778
36124b680778N15914K455079R46136k206689j813991K080249L321654l82565l151896
$$ -2680778 -2164864 290215 1236351 -970338 -2784329 -704080 2617574 2235009 -916887
36115i16887n65056K680694O02369l759585l256826J534244L523823P04417j570833
$$ -916887 -1481943 1198751 1801120 -1958465 -5215291 -3681047 -157224 547193 -1023640
36106a023640j66633J567186P56093m72227L787M36755o23613j071904O54093
$$ -1023640 -1190273 376913 1133006 660779 664566 1101321 477708 -594196 59897
36097E9897K220446J303991n48904r56310n69494j049084j828006j527971l29685
$$ 59897 2280343 3584334 3035430 2079120 1509626 460542 -1367464 -2895435 -3225120
36088c225120J076830K465302K592302n12l251072k755555J275569K963217m01279
$$ -3225120 -2148290 317012 2909314 2908802 -342270 -3097825 -1822256 1140961 739682
36079G39682l566425j557173K279954K031199j169920j885678K24386Q34566q38801
$$ 739682 -2826743 -4383916 -2103962 -72763 -1242683 -3128361 -2903975 -2069409 -2908210
36070b908210j264895M75636J493415R37280J040748J919314J028306j524862
$$ -2908210 -4173105 -3697469 -2204054 -1266774 -226026 1693288 2721594 1196732
36062A196732k545298j346056n11568m90981R60448L147294K323549j309018k668181
$$ 1196732 -1348566 -2694622 -3206190 -3697171 -2736723 410571 2734120 1425102 -1243079
36053a243079P573K145827P29828r60353J3573R14176q83573k272822P4216L188261
$$ -1243079 -1235506 910321 1640149 679796 693369 1607545 723972 -1548850 -1474634 1713627
36043A713627K587185j78501p48397M04080j48736j661713o45536J917663J540484
$$ 1713627 4300812 4122311 3373914 3777994 3629258 1967545 1322009 3239672 4780156
36034D780156j752617k840909R8273K472960N47371l022365l608088j010236J393253
$$ 4780156 3027539 186630 284903 2757863 3305234 282869 -3325219 -4335455 -2942202
36025b942202J599733N36477j49189J7615L39034P7598l70593J14124J330398
$$ -2942202 -1342469 -805992 -955181 -937566 -598532 -520934 -891527 -777403 552995
36016E52995J378852m38616j852272o93897J652735K239222P99883o14033j195315
$$ 552995 1931847 1493231 -359041 -1052938 599797 2839019 3638902 3024869 1829554
36007A829554j670110j819024p68345P01892J052791P26754J124838J529394K67209
$$ 1829554 159444 -1659580 -2427925 -1726033 -673242 53512 1178350 2707744 2974953
35998B974953j681047j797366l39711K15985k75016K49153J491833R35927j069248
$$ 2974953 1293906 -503460 -843171 -627186 -902202 -653049 838784 1774711 705463
35989G05463j221345Q13379J442656m47633j442583p4552K52425k003826k493871
$$ 705463 -515882 297497 1740153 1292520 -150063 -224615 27810 -1976016 -4469887
35980d469887J703742N659481L358358k696029n070588k322526L05108N4364k54773
$$ -4469887 -2766145 2893336 6251694 3555665 -1514923 -3837449 -3532341 -3477977 -3732750
35971c732750J188966J796892k10528k215939j557007K21388L12041q36678p93551
$$ -3732750 -2543784 -746892 -957420 -3173359 -4730366 -4508978 -4196937 -5033615 -5827166
35962e827166P53668J785259J135792q1384k31860P22303J165355j01725j788279
$$ -5827166 -5073498 -3288239 -2152447 -2233831 -2465691 -1743388 -578033 -679758 -2468037
35953b468037j098774K361343M962257L191240j492940m337792l373521j088949
$$ -2468037 -3566811 -1205468 3756789 6948029 5455089 1117297 -2256224 -3345173
35945c345173j0982L28219J110100J763982J447835Q83425R06899P57166m50625
$$ -3345173 -3356155 -3027936 -1917836 -153854 1293981 2177406 3084305 3841471 3390846
35936C390846j793287j794267o91738J34472L07116N27367R81781J083925O43650
$$ 3390846 1597559 -196708 -888446 -753974 -446858 80509 1062290 2146215 2789865
35927B789865J54313j08535m52033j107354j651336j226897N40368K575250K756557
$$ 2789865 2944178 2835643 2383610 1276256 -375080 -1601977 -1061609 1513641 4270198
35918D270198K62888k722623l057546n24404J885326J931058N55968l88840q08148
$$ 4270198 4533086 1810463 -1247083 -1771487 113839 2044897 2600865 2212025 1403877
35909A403877j281555j139188K89846J709687J388386l5538m50803M54091J011540
$$ 1403877 122322 -1016866 -727020 982667 2371053 2335515 1884712 2338803 3350343
35900C350343M95082m4265m2929k76829q77404o25814Q00028J722303Q54332o84857
$$ 3350343 3845425 3801160 3758231 3481402 2603998 1978184 2778212 4500515 5354847 4669990
35890D669990j077460l37211K07419k0602o32648j316195j788716j416634j58261
$$ 4669990 3592530 3255319 3462738 3442136 2809488 1493293 -295423 -1712057 -1870318
35881a870318P78790N04590n7797L14407R30516L48612q12882n14350J237391
$$ -1870318 -1091528 -586938 -644735 -330328 600188 948800 135918 -378432 858959
35872H58959J955362L66156j619598j717401k41820J001106J222844O39160o43193
$$ 858959 2814321 3180477 1560879 -156522 -398342 602764 1825608 2464768 1821575
35863A821575k089538k221744m20722J544610J512840j54264j309955j096422
$$ 1821575 -267963 -2489707 -2910429 -1365819 147021 -7243 -1317198 -2413620
35855b413620m99783k58375j19393m8118l41815m74178M80744K138356L041809
$$ -2413620 -2913403 -3171778 -3291171 -3339289 -3681104 -4155282 -3674538 -1536182 1505627
35846A505627K610815J365647m58609k595091l397489j350200J912374K818962
$$ 1505627 4116442 5482089 5023480 2428389 -969100 -2319300 -406926 2412036
35838B412036P05315j283250r77520J03756J64377R7083R16292J121181o07044
$$ 2412036 3117351 1834101 856581 960337 1124714 1221797 2138089 3259270 2652226
35829B652226k424536k059225n58107j46940j81797J171062K710379J766463p89152
$$ 2652226 227690 -1831535 -2389642 -2536582 -2718379 -1547317 1163062 2929525 2140373
35820B140373j379657N10876J637847N35438m56009J91566O20920n62951j552025
$$ 2140373 760716 1271592 2909439 3444877 2988868 3180434 3801354 3238403 1686378
35811A686378p97189m6867j156377k433185j261249J412833K307285N24658j612123
$$ 1686378 889189 842322 -314055 -2747240 -4008489 -2595656 -288371 236287 -1375836
35802a375836j885790k45378J939085K960860J763879o57253j727889n77017M58880
$$ -1375836 -3261626 -3507004 -1567919 1392941 3156820 2499567 771678 194661 653541
35793F53541o09674j940604n47967K600917L372463L34301l112617l244086m01668
$$ 653541 43867 -1896737 -2444704 156213 3528676 3862977 750360 -2493726 -2895394
35784b895394K161588K212290K75056j557179j746572o53870J19295m0178J2944
$$ -2895394 -733806 1478484 1753540 196361 -1550211 -2204081 -2084786 -2124964 -2112020
35775b112020R49832J321957j12013j652381q32695J360247J557853o48937j834205
$$ -2112020 -1162188 159769 47756 -1604625 -2437320 -1077073 480780 -168157 -2002362
35766b002362j47424J716147Q21303j519350k073104n04965Q50630P85934J89037
$$ -2002362 -2149786 -433639 387664 -1131686 -3204790 -3709755 -2859125 -2073191 -1884154
35757a884154q8658n5355L14251Q93996Q18821j75057n80141P24667K003238Q24612
$$ -1884154 -1972812 -2028167 -1713916 -819920 -1099 -176156 -756297 -31630 1971608 2796220
35747B796220j901437k930340j570035l87711o28336l52117J613983L183346K537455
$$ 2796220 894783 -2035557 -3605592 -3993303 -4621639 -4973756 -3359773 -176427 2361028
35738B361028J290575J498592J873222J33672k555690k989624r21055P46585N46147
$$ 2361028 3651603 5150195 7023417 7157089 4601399 1611775 690720 1437305 1983452
35729A983452J6098M20460Q72013M43507l53668r97162j703140k113308j344706
$$ 1983452 1999550 2420010 3292023 3735530 3381862 2384700 681560 -1431748 -2776454
35720b776454J07404O83506L93773P15275J501191R68718n41295l03632J913314
$$ -2776454 -2669050 -1985544 -1591771 -876496 624695 1593413 1052118 748486 2661800
35711B661800K489080k82871k811140j718281O84457L64338j854980k241287n46783
$$ 2661800 5150880 4868009 2056869 338588 1023045 1387383 -467597 -2708884 -3255667
35702c255667M50825L59525J047095J970706Q75635j156626p77509J290630O97672
$$ -3255667 -2804842 -2445317 -1398222 572484 1448119 291493 -486016 804614 1502286
35693A502286k756634l741040O3134L730665K653714o70722j439857N7610M60391
$$ 1502286 -1254348 -4995388 -4932254 -1201589 1452125 781403 -658454 -600844 -140453
35684a40453m21575k78525P82125O15976p16736j044100J75853J418361J799041
$$ -140453 -562028 -840553 -58428 557548 -159188 -1203288 -1027435 390926 2189967
35675B189967J528675N05420j078222j780201q85346Q531l69814n93701O40009
$$ 2189967 3718642 4224062 3145840 1365639 480293 488824 119010 -474691 165318
35666A65318J610939O95712o4929J483766K846180O09045k880880k416527J289203
$$ 165318 1776257 2471969 2407040 3890806 6736986 7346031 4465151 2048624 3337827
35657C337827K108845j677193m465984k186737J723706K256953J244j251843m77597
$$ 3337827 5446672 3769479 -696505 -2883242 -1159536 1097417 1098661 -153182 -630779
35648f30779O59681J229431J090413l98675k837248l770178j798490R75099J878261
$$ -630779 28902 1258333 2348746 1950071 -887177 -4657355 -6455845 -5480746 -3602485
35639c602485J233895P70667M80364l69324q97850r2764Q02961J49010j055203
$$ -3602485 -2368590 -1597923 -1117559 -1486883 -2384733 -2477497 -1674536 -1525526 -2580729
35630b580729p33326P14304J222983O22357N30166J173051J123288Q2768o70718
$$ -2580729 -3314055 -2599751 -1376768 -754411 -224245 948806 2072094 2154862 1484144
35621A484144o87770p94896j002311l47847Q28833Q07801o43318j469002l45993
$$ 1484144 796374 1478 -1000833 -1348680 -519847 287954 -355364 -1824366 -2170359
35612b170359J331101J602190N59791l93773o76913o39406m68874k73057n98749
$$ -2170359 -839258 762932 1322723 928950 252037 -387369 -856243 -1129300 -1728049
35603a728049j589334k053939p18710J704135L041333K461642J398341J093411
$$ -1728049 -3317383 -5371322 -6090032 -4385897 -1344564 1117078 2515419 3608830
35595C608830O89718r02579k448701j862439J78292P04034r31161j673994M33996
$$ 3608830 4298548 3395969 947268 -915171 -736879 -32845 -964006 -2638000 -2204004
35586b204004K684102J561441j735367l017453j347717J93752p3116j45788J471088
$$ -2204004 480098 2041539 306172 -2711281 -4058998 -3865246 -3938362 -4084150 -2613062
35577b613062K809528J666391q12796k026419j573905q88807n62687q0935N84822
$$ -2613062 196466 1862857 1050061 -976358 -2550263 -3439070 -4001757 -4082692 -3497870
35568c497870Q30461M51979k49848r06889j009851j79360J062352J754916J884371
$$ -3497870 -2667409 -2215430 -2465278 -3372167 -4382018 -4561378 -3499026 -1744110 140261
35559A40261K000622J582231k20764k191728k016506j10199N41228p01399q09084
$$ 140261 2140883 3723114 3502350 1310622 -705884 -816083 -274855 -976254 -1785338
35550a785338J606135L262749J250122k031643k432399j53702J419450J170221
$$ -1785338 -179203 3083546 4333668 2302025 -130374 -284076 1135374 2305595
35542B305595O77225M39099m21793j278629m94797J281566J528843l00951k080387
$$ 2305595 2982820 3421919 3000126 1721497 1226700 2508266 4037109 3736158 1655771
35533A655771k242658j309513k52309M45515L22370l98954k31239J419393K465716
$$ 1655771 -586887 -1896400 -2148709 -1703194 -1380824 -1779778 -2011017 -591624 1874092
35524A874092R29625j586503k043008n09785N73053O45706R72747J179201j46109
$$ 1874092 2803717 1217214 -825794 -1335579 -762526 -116820 855927 2035128 1889019
35515A889019j785024j057488J305782J764521j86084j228478o3217N94470p20836
$$ 1889019 103995 -953493 352289 2116810 1930726 702248 639031 1233501 512665
35506E12665j521853l4575J581564J194957J83221K43246J25853j451292k630589
$$ 512665 -1009188 -1043763 537801 1732758 1915979 2159225 2285078 833786 -1796803
35497a796803j371172Q53167J433371O46761L47564N15323M7930n92987l48541
$$ -1796803 -3167975 -2314808 -881437 -234676 112888 628211 676141 83154 -265387
35488b65387J50799k11644q34659o56463j62584J2308P20509K200028K369438
$$ -265387 -114588 -326232 -1160891 -1817354 -1979938 -1967630 -1247121 952907 3322345
35479C322345N4561k072469j146170J023576O41740j713078j850189J130443L210038
$$ 3322345 3376906 1304437 158267 1181843 1823583 110505 -1739684 -609241 2600797
35470B600797J676407r90824j303176K30474O38712r19706k493032k417747j133156
$$ 2600797 4277204 3286380 1983204 2213678 2852390 1932684 -560348 -2978095 -4111251
35461d111251o347L96688N28183Q71170J172388Q16007k20852j221618j517066
$$ -4111251 -4117598 -3720910 -3192727 -2321557 -1149169 -333162 -554014 -1775632 -3292698
35452c292698r16838M60433J953274K229289P18532r50975o61610J005788J404585
$$ -3292698 -4209536 -3749103 -1795829 433460 1151992 201017 -460593 545195 1949780
35443A949780p1799j096211l77241M01519R317j3073J421434K259298N44831k046876
$$ 1949780 1877981 781770 404529 806048 815365 802292 2223726 4483024 5027855 2980979
35433B980979k760826j724894n85865N35172J714149J332914r80599k043054K12094
$$ 2980979 220153 -1504741 -2090606 -1555434 158715 1491629 511030 -1532024 -1319930
35424a319930K320774L60716l011151k460262R36570J393676j541581k252208
$$ -1319930 1000844 1361560 -1649591 -4109853 -3173283 -1779607 -3321188 -5573396
35416e573396R28529K752665L72184j809800j63648K044253J110590n05650N95657
$$ -5573396 -4644867 -1892202 -1520018 -3329818 -3493466 -1449213 -338623 -844273 -248616
35407b48616K078821M40257j958443r32219J706748J220456j459369j362385J485036
$$ -248616 1830205 2270462 312019 -620200 1086548 2307004 847635 -514750 970286
35398I70286J972044j024033k582835k44919J859259N1926l020595k959884j56490
$$ 970286 2942330 1918297 -664538 -909457 949802 1001728 -2018867 -4978751 -5135241
35389e135241J710463J066417o51634j635835r90037J089210K853677K390420
$$ -5135241 -3424778 -2358361 -3009995 -4645830 -5635867 -4546657 -1692980 697440
35381F97440N06654O4560J515716J941166p0245j836890j047624M00703k8845
$$ 697440 1204094 1268654 2784370 4725536 4655291 2818401 1770777 2171480 2142635
35372B142635j007036p7775J412369M35144k086992k386221j59033Q63258p67920
$$ 2142635 1135599 1057824 2470193 2905337 818345 -1567876 -1726909 -863651 -1631571
35363a631571j725969O12697L848073M121320J445819j065215j663770j270167
$$ -1631571 -3357540 -2744843 1103230 5224550 6670369 5605154 3941384 2671217
35355B671217j171453j417809j324106l96357J096802K030275J505653K42355
$$ 2671217 1499764 81955 -1242151 -1638508 -541706 1488569 2994222 3236577
35347C236577j61936M16187M62472n64497j244284o55049M7745k46663p22656
$$ 3236577 3074641 3490828 3953300 3388803 2144519 1489470 1537215 1290552 567896
35338E67896m51037l17292j152949j530277J15165K295991K157258j77686j655633
$$ 567896 116859 -200433 -1353382 -2883659 -2768494 -472503 1684755 1507069 -148564
35329a48564o43832J281094K138710J770078P29032q46685k357207k492998r00188
$$ -148564 -792396 488698 2627408 4397486 5126518 4279833 1922626 -570372 -1470560
35320a470560J051511J819128J111239l45597j350529p09145J376301K638389
$$ -1470560 -419049 1400079 2511318 2165721 815192 106047 1482348 4120737
35312D120737J235527j333060j948474l74633N64626m50045j456728q60691J42148
$$ 4120737 5356264 4023204 2074730 1700097 2264723 1814678 357950 -502741 -360593
35303c60593K40359K88361J009291R79447p76848k334898j570592L78757R44504
$$ -360593 -120234 168127 1177418 2156865 1380017 -954881 -2525473 -2146716 -1202212
35294a202212P5899k44631N27064J036027N40778k22783m14575J41951J020834
$$ -1202212 -1126313 -1370944 -843880 192147 732925 510142 95567 237518 1258352
35285A258352J045199o85644k668108j923884J468000L300163R68957k369609
$$ 1258352 2303551 1617907 -1050201 -2974085 -1506085 1794078 2763035 393426
35277C93426k459716k51011L80513q29288r31117N12116J051552L21318M86534
$$ 393426 -2066290 -2317301 -1936788 -2766076 -3697193 -3185077 -2133525 -1812207 -1325673
35268a325673J554229J072377q79850j245045M33769Q94360q51090j439432O50903
$$ -1325673 228556 1300933 421083 -823962 -390193 504167 -346923 -1786355 -1135452
35259a135452J848803l17656k386547n35931K765826K575414o95862k393857j043180
$$ -1135452 713351 395695 -1990852 -2526783 239043 2814457 2118595 -275262 -1318442
35250a318442L71166N0565l64770L57035R23151L44673k16527K57501Q27921L74411
$$ -1318442 -947276 -896711 -1261481 -904446 18705 363378 146851 404352 1232273 1606684
35240A606684n34285p19025j34360M26937N52016L95479J57303j10666l60501
$$ 1606684 1072399 353374 219014 645951 1197967 1593446 1750749 1640083 1279582
35231A279582m12448m6155N47497N85761l98894j607965j845594j182315n41322
$$ 1279582 867134 820979 1368476 1954237 1555343 -52622 -1898216 -3080531 -3621853
35222c621853J23173J471309K684802K053030M8886p83139J48917M02257j229443
$$ -3621853 -3498680 -2027371 657431 2710461 2759347 1976208 2125125 2527382 1297939
35213A297939k384781j092169Q39085R73869J77491M04185R34754J93131p41718
$$ 1297939 -1086842 -2179011 -1339926 -366057 -188566 215619 1150373 1343504 601786
35204F01786j20332P43684k98000j737279n33558K229930K501212k04730k127428
$$ 601786 481454 1225138 927138 -810141 -1343699 886231 3387443 3182713 1055285
35195A055285j405845k48592j71247K89710J646451J642178n47382k152373j223629
$$ 1055285 -350560 -599152 -770399 -480689 1165762 2807940 2260558 108185 -1115444
35186a115444J99957j53935j028275m21791O57619L00965o90675m31356N76713
$$ -1115444 -915487 -1069422 -2097697 -2519488 -1861869 -1560904 -2251579 -2682935 -2106222
35177b106222O35695R5107M19531J124215O04197o88195p28461P25076J789266
$$ -2106222 -1470527 -1375420 -955889 168326 772523 84328 -644133 80943 1870209
35168A870209J403664M18291k96321q43315j231267j018614l21992J10847L0830
$$ 1870209 3273873 3692164 3395843 2552528 1321261 302647 -19345 91502 122332
35159A22332n2130L13532J144362K048576K030468J92072k503323l415409j497090
$$ 122332 70202 383734 1528096 3576672 5607140 5799212 3295889 -119520 -1616610
35150a616610Q78649J017702m34093r94776l32087j00602m88537M1004J489392
$$ -1616610 -737961 279741 -154352 -1149128 -1481215 -1581817 -2070354 -2029350 -539958
35141e39958J793392L16989p61122K30386J891770J927117K14571j673403k644783
$$ -539958 1253434 1570423 809301 1039687 2931457 4858574 5073145 3399742 754959
35132G54959k484208j276199K96463J061560Q18593O54743R24512M02938j244474
$$ 754959 -1729249 -3005448 -2708985 -1647425 -828832 -174089 750423 1153361 -91113
35123i1113j848368K88646L057909K864159k28454k507193j919949m37199j79740
$$ -91113 -1939481 -1650835 1407074 4271233 4042779 1535586 -384363 -821562 -1001302
35114a001302j03354J425508K990344J933083j201999k916863j465539J084073
$$ -1001302 -1104656 320852 3311196 5244279 4042280 1125417 -340122 743951
35106G43951J963711Q74457o74187j468649j109849J60109J192462P02721q22403
$$ 743951 2707662 3582119 2907932 1439283 329434 489543 1682005 2384726 1562323
35097A562323j247530K65270J846990J629452L53862k98694n04299j319565k075498
$$ 1562323 314793 580063 2427053 4056505 4410367 4111673 3607374 2287809 212311
35088B12311j292324M21731J058762N84066Q16986J751306J057456j756834l600364
$$ 212311 -1080013 -658282 400480 984546 1801532 3552838 4610294 2853460 -746904
35079g46904k016344J101328K168468P03443p97983p87431j96659l05204r38553
$$ -746904 -2763248 -1661920 506548 1209991 412008 -375423 -572082 -877286 -1815839
35070a815839j090102k72310J017251J759944J463463Q12678O77222N68850o65575
$$ -1815839 -2905941 -3178251 -2161000 -401056 1062407 1875085 2552307 3121157 2455582
35061B455582k467117k643869n70897J496583J498108K45615m42687n68936r91736
$$ 2455582 -11535 -2655404 -3226301 -1729718 -231610 14005 -428682 -997618 -1989354
35052a989354j136658j7335J481220J773845J300951J550635J869180J38108l207571
$$ -1989354 -3126012 -3143347 -1662127 111718 1412669 2963304 4832484 4970592 1763021
35043A763021m756574k717870M22543J277560j36165j089834n5612J714380K199884
$$ 1763021 -2993553 -5711423 -5288880 -4011320 -4147485 -5237319 -5292931 -3578551 -1378667
35034a378667R53511p66921j540269j037693J53746J428520K306812K033291K71148
$$ -1378667 -425156 -1192077 -2732346 -3770039 -3616293 -2187773 119039 2152330 2423478
35025B423478j590003j352986R53001K493014J308977r37333j527938n10352J44124
$$ 2423478 833475 -519511 433490 2926504 4235481 3298148 1770210 1259858 1403982
35016A403982p0353j57126m9931l58844l43885R04570J711154l63761l859982
$$ 1403982 1333629 1176503 1126572 767728 423843 1328413 3039567 2675806 -1184176
35007a184176m282521n45173L053338K922252R05251N79201J691758J397633p44442
$$ -1184176 -5466697 -6011870 -2958532 -36280 868971 1448172 3139930 4537563 3793121
$$ [...]
##END NTUPLES=NMR SPECTRUM
##END=
