##TITLE=31Pdec_PhBDE3006-2
 CDCl3, 24 sc
 1.07.2021
##JCAMPDX= 6.0         $$ Bruker NMR JCAMP-DX V2.0
##DATA TYPE= NMR SPECTRUM
##DATA CLASS= NTUPLES
##ORIGIN= UXNMR, Bruker Analytische Messtechnik GmbH
##OWNER= root
$$ XWIN-NMR		Version 3.5
$$ Thu Jul  1 09:43:34 2021 Russian Standard Time (UT+4h)  she@DPX200
##.OBSERVE FREQUENCY= 81.013821
##.OBSERVE NUCLEUS= ^31P
##.ACQUISITION MODE= SIMULTANEOUS
##.ACQUISITION SCHEME= undefined
##.AVERAGES= 24
##.DIGITISER RES= 16
##SPECTROMETER/DATA SYSTEM= spect
##.PULSE SEQUENCE= zgpg30
##.SOLVENT NAME= DMSO
##.SHIFT REFERENCE= (INTERNAL, DMSO, 0, 248.564)
##AUDIT TRAIL= $$ (NUMBER, WHEN, WHO, WHERE, WHAT)
$$ ##TITLE= Audit trail, XWIN-NMR		Version 3.5
$$ ##JCAMPDX= 5.01
$$ ##ORIGIN= Bruker BioSpin GmbH
$$ ##OWNER= she
$$ F:/spectra/data/she/nmr/P31/1/pdata/1/auditp.txt
$$ ##AUDIT TRAIL=  $$ (NUMBER, WHEN, WHO, WHERE, WHAT)
(   1,<2021-07-01 09:42:12.26 +0400>,<she>,<DPX200>,
      <created by zg, POWCHK disabled, PULCHK disabled
       configuration hash MD5:
       00 E9 B6 7A A2 85 ED C7 34 08 36 98 17 FE 4E 26
       data hash MD5: 32K
       7F 87 67 E5 E1 93 10 32 1B F7 F4 71 CD C7 78 DE>)
(   2,<2021-07-01 09:42:15.25 +0400>,<she>,<DPX200>,
      <Start of raw data processing
       efp BC_mod = 2 LB = 1 FT_mod = 6 PKNL = 1 PHC0 = -7009.054 PHC1 = 64.68596 SI = 64K 
       data hash MD5: 64K
       FB A5 04 F3 23 D2 DC D3 A4 1A DA E4 2C 5B 08 C2>)
(   3,<2021-07-01 09:42:44.71 +0400>,<she>,<DPX200>,
      <pk PHC0 = -174.5765 PHC1 = 394.3998 
       data hash MD5: 64K
       4B 49 76 2E 00 E9 90 DB 38 8C 7D 6E CF DE 7B C8>)
(   4,<2021-07-01 09:42:47.96 +0400>,<she>,<DPX200>,
      <abs ABSG = 5 
       data hash MD5: 64K
       0C 3F BD B1 FB 20 5A 64 45 28 A1 4E 92 68 96 91>)
(   5,<2021-07-01 09:43:02.48 +0400>,<she>,<DPX200>,
      <abs ABSG = 5 
       data hash MD5: 64K
       60 B9 B5 2B B3 4B C6 42 88 25 2D 50 3A 7A 2B F1>)
$$ ##END=
$$ 
$$ hash MD5
$$ 3E C8 79 DB 74 C5 CF 0B 41 E5 9A 0B 53 79 7E AF
##$RELAX= 
##$RELAX= 
##$RELAX= 
##$RELAX= 
##$RELAX= 
##$RELAX= 
##$RELAX= 
##$RELAX= 
$$ Bruker specific parameters
$$ --------------------------
##$DU= <F:/spectra>
##$EXPNO= 1
##$NAME= <P31>
##$PROCNO= 1
##$TYPE= <nmr>
##$USER= <she>
##$AMP= (0..31)
100 100 100 100 100 100 100 100 100 100 100 100 100 100 100 100 100 100 
100 100 100 100 100 100 100 100 100 100 100 100 100 100 
##$AQSEQ= 0
##$AQ_mod= 1
##$AUNM= <au_zg>
##$AUTOPOS= <>
##$BF1= 81.014009
##$BF2= 200.13
##$BF3= 200.13
##$BF4= 200.13
##$BF5= 200.13
##$BF6= 200.13
##$BF7= 200.13
##$BF8= 200.13
##$BYTORDA= 1
##$CFDGTYP= 0
##$CFRGTYP= 5
##$CHEMSTR= <none>
##$CNST= (0..31)
1 1 145 1 1 1 1 1 1 1 1 1 1 1 1 1 1 1 1 1 1 1 1 1 1 1 1 1 1 1 1 1 
##$CPDPRG= <waltz16>
##$CPDPRG1= <>
##$CPDPRG2= <waltz16>
##$CPDPRG3= <>
##$CPDPRG4= <mlev>
##$CPDPRG5= <mlev>
##$CPDPRG6= <mlev>
##$CPDPRG7= <mlev>
##$CPDPRG8= <mlev>
##$CPDPRGB= <>
##$CPDPRGT= <>
##$D= (0..31)
0 1 0 0 0 0 0 0 0 0 0 0.03 2e-05 3e-06 0 0 0 0 0 0 0 0 0 0 0 0 0 0 0 0 
0 0 
$$ [...]
##$SUBNAM3= <"">
##$SUBNAM4= <"">
##$SUBNAM5= <"">
##$SUBNAM6= <"">
##$SUBNAM7= <"">
##$SUBNAM8= <"">
##$SUBNAM9= <"">
##$SW= 501.771253377433
##$SWIBOX= (0..15)
0 1 3 0 0 0 0 0 0 0 0 0 0 0 0 0 
##$SW_h= 40650.406504065
##$TD= 32768
##$TD0= 1
##$TE= 0
##$TE2= 300
##$TE3= 300
##$TEG= 300
##$TL= (0..7)
0 120 53 12 22 120 120 120 
##$TP= (0..7)
150 150 150 150 150 150 150 150 
##$TP07= 0
##$TPNAME0= <>
##$TPNAME1= <>
##$TPNAME2= <>
##$TPNAME3= <>
##$TPNAME4= <>
##$TPNAME5= <>
##$TPNAME6= <>
##$TPNAME7= <>
##$TPOAL= (0..7)
0.5 0.5 0.5 0.5 0.5 0.5 0.5 0.5 
##$TPOFFS= (0..7)
0 0 0 0 0 0 0 0 
##$TUNHIN= 0
##$TUNHOUT= 0
##$TUNXOUT= 0
##$USERA1= <user>
##$USERA2= <user>
##$USERA3= <user>
##$USERA4= <user>
##$USERA5= <user>
##$V9= 5
##$VALIST= <valist>
##$VCLIST= <CCCCCCCCCCCCCCC>
##$VD= 0
##$VDLIST= <DDDDDDDDDDDDDDD>
##$VPLIST= <PPPPPPPPPPPPPPP>
##$VTLIST= <TTTTTTTTTTTTTTT>
##$WBST= 1024
##$WBSW= 4
##$XGAIN= (0..3)
0 0 0 0 
##$XL= 0
##$YL= 0
##$YMAX_a= 2791
##$YMIN_a= -2655
##$ZGOPTNS= <>
##$ZL1= 120
##$ZL2= 120
##$ZL3= 120
##$ZL4= 120
##$ABSF1= 248.5645
##$ABSF2= -253.2056
##$ABSG= 5
##$ABSL= 3
##$ALPHA= 0
##$AQORDER= 0
##$ASSFAC= 0
##$ASSFACI= 0
##$ASSFACX= 0
##$ASSWID= 0
##$AUNMP= <proc_1d>
##$AZFE= 0.1
##$AZFW= 0.5
##$BCFW= 0
##$BC_mod= 2
##$BYTORDP= 0
##$COROFFS= 0
##$CY= -3
##$DATMOD= 1
##$DC= 0
##$DFILT= <>
##$DTYPP= 0
##$F1P= 0
##$F2P= 0
##$FCOR= 1
##$FTSIZE= 65536
##$FT_mod= 6
##$GAMMA= 0
##$GB= 0
##$INTBC= 1
##$INTSCL= 5.30512e-09
##$ISEN= 30
##$LB= 1
##$LEV0= 0
##$LPBIN= 0
##$MAXI= 10000
##$MC2= 0
##$MEAN= 0
##$ME_mod= 0
##$MI= 50
##$NCOEF= 0
##$NC_proc= -7
##$NLEV= 6
##$NOISF1= 182.463
##$NOISF2= 159.3651
##$NSP= 0
##$NTH_PI= 0
##$NZP= 0
##$OFFSET= 248.5645
##$PC= 4
##$PHC0= -7183.631
##$PHC1= 459.0858
##$PH_mod= 1
##$PKNL= yes
##$PPARMOD= 0
##$PSCAL= 0
##$PSIGN= 0
##$REVERSE= no
##$SF= 81.014009
##$SI= 65536
##$SIGF1= 159.3651
##$SIGF2= -187.1042
##$SINO= 113.3802
##$SIOLD= 16384
##$SREGLST= <1H.CDCl3>
##$SSB= 0
##$STSI= 65536
##$STSR= 0
##$SW_p= 40650.406504065
##$SYMM= 0
##$S_DEV= 0
##$TDeff= 32768
##$TDoff= 0
##$TI= <>
##$TILT= no
##$TM1= 0
##$TM2= 0
##$TOPLEV= 0
##$USERP1= <user>
##$USERP2= <user>
##$USERP3= <user>
##$USERP4= <user>
##$USERP5= <user>
##$WDW= 1
##$XDIM= 65536
##$YMAX_p= 418295437
##$YMIN_p= -10354127
$$ End of Bruker specific parameters
$$ ---------------------------------
##NTUPLES= NMR SPECTRUM
##VAR_NAME=  FREQUENCY,     SPECTRUM/REAL,   SPECTRUM/IMAG
##SYMBOL=    X,             R,               I
##VAR_TYPE=  INDEPENDENT,   DEPENDENT,       DEPENDENT
##VAR_FORM=  AFFN,          ASDF,            ASDF
##VAR_DIM=   65536,         65536,           65536
##UNITS=     HZ,            ARBITRARY UNITS, ARBITRARY UNITS
##FACTOR=    0.620285442955139, 1,           1
##FIRST=     20137.2065510759, 0,            0
##LAST=      -20513.1999529892, 0,           0
##MIN=       -20513.1999529892, -10354127,   0
##MAX=       20137.2065510759, 418295437,    0
$$ Real data points
##PAGE= N=1
##DATA TABLE= (X++(R..R)), XYDATA
$$ [...]
$$ plain form
38741 -7009200 -5850458 -6207056 -6210847 -4640038 -2914584 -2519973 -2763420 -2524775 -2218149
38732 -2218149 -2309611 -1634779 744318 3203953 3211111 718589 -1868525 -2705914 -1966931
38723 -1966931 -728195 74617 -135462 -1008341 -1151885 190941 1761810 1890990 922206
38714 922206 416218 442124 -282769 -1668432 -2003094 -931952 -415304 -1654244 -3083440
38705 -3083440 -2934226 -2098575 -2510461 -3863757 -4119052 -2701073 -1050581 -129397 540135
38696 540135 1112775 792918 -266395 -334455 1365570 3013470 2660278 1180567 857434
38687 857434 1712026 1446495 -887091 -3251607 -3409382 -1773008 -488121 -780832 -2172808
38678 -2172808 -3483308 -3742655 -2801744 -1703590 -1686785 -2334567 -1872142 46405 1439231
$$ packed form
38741g009200J158742l56598l791J570809J725454L94611k43447K38645L06626
38732b218149r1462O74832K379097K459635P158k492522k587114q37389P38983
38723a966931J238736Q02812k10079q72879j43544J342826J570869J29180r68784
38714I22206n05988K5906p24893j385663l34662J071142N16648j238940j429196
38705c083440J49214Q35651m11886j353296k55295J417979J650492R21184O69532
38696E40135N72640l19857j059313o8060J700025J647900l53192j479711l23133
38687H57434Q54592k65531k333586k364516j57775J636374J284887k92711j391976
38678b172808j310500k59347R40911J098154J6805o47782M62425J918547J392826
$$ plain form
38669 1439231 1074001 645295 1882614 3112993 1611757 -1524150 -2342373 -18211 1675992
38660 1675992 46121 -2590121 -2660008 -475482 948163 499120 -352083 -610412 -895183
38651 -895183 -1603113 -1943144 -1129427 628585 2350132 2773598 1203556 -1233830 -2049350
38642 -2049350 -323858 1701806 1413785 -687901 -2011881 -1549191 -395817 863145
38634 863145 2759445 4749681 4873539 2515593 -274948 -1194708 -107972 1633945 2962055
38625 2962055 3416115 2919694 2070042 1707955 1590928 528136 -1580663 -3046180 -2591670
38616 -2591670 -1174897 -523950 -678479 -275841 1045464 1786728 507136 -1982609 -2966807
38607 -2966807 -686803 3320114 5518022 4371435 2097656 1577536 2614076 2837848
$$ packed form
38669A439231l65230m28706J237319J230379j501236l135907q18223K324162J694203
38660A675992j629871k636242o9887K184526J423645m49043q51203k58329k84771
38651h95183p07930l40031Q13717J758012J721547M23466j570042k437386q15520
38642b049350J725492K025664k88021k101686j323980M62690J153374J258962
38634H63145J896300J990236J23858k357946k790541r19760J086736J741917J328110
38625B962055M54060m96421q49652l62087j17027j062792k108799j465517M54510
38616b591670J416773O50947j54529M02638J321305P41264j279592k489745r84198
38607b966807K280004M006917K197908j146587k273779n20120J036540K23772
$$ plain form
38599 2837848 1513626 291540 387293 1302735 2567412 4388168 5929621 5335258 2620881
38590 2620881 474780 834334 2510535 3524935 3788706 3806927 2804354 418881 -1404510
38581 -1404510 -825099 744374 594737 -962683 -1099772 947691 2673609 2141265 592225
38572 592225 315830 1705661 3354036 3781242 2377385 -277114 -2439766 -2439038 -354511
38563 -354511 2066263 3137612 2308713 64364 -2153113 -2493381 -651168 1106712 503758
38554 503758 -1461899 -1710827 514693 2632723 2528759 1215875 772912 1480756 2240544
38545 2240544 2443929 2134184 1225353 -332264 -2071154 -3197752 -2849699 -456273 3031178
38536 3031178 4799008 3097477 356732 684231 3755262 4428389 70146 -4906983
$$ packed form
38599B837848j324222j222086R5753R15442J264677J820756J541453n94363k714377
38590B620881k146101L59554J676201J014400K63771J8221j002573k385473j823391
38581a404510N79411J569473j49637j557420j37089K047463J725918n32344j549040
38572E92225k76395J389831J648375M27206j403857k654499k162652P28K084527
38563c54511K420774J071349q28899k244349k217477l40268J842213J757880o02954
38554E03758j965657k48928K225520K118030j03964j312884m42963P07844P59788
38545B240544K03385l09745r08831j557617j738890j126598L48053K393426L487451
38536C031178J767830j701531k740745L27499L071031O73127m358243m977129
$$ plain form
38528 -4906983 -4640716 399625 4631790 4863188 2863763 1078295 -309544 -1445672
38520 -1445672 -1342003 167104 1325804 787920 -612436 -1547844 -2029482 -2381844 -1977671
38511 -1977671 -472067 938390 1064691 631036 1051797 1957049 1636897 -227284 -1851124
38502 -1851124 -1638302 -17459 1415485 1748774 1322190 1020719 1390241 2163745 2529681
38493 2529681 2101202 1461687 1310929 1364859 909104 276412 589639 1767903 2120661
38484 2120661 775580 -639499 -55886 2078972 3513809 3474577 3380709 4149354 4726481
38475 4726481 4068562 2879891 2193685 1636331 574688 -146924 601222 1973408 1943816
38466 1943816 210194 -1326483 -1104235 378261 1515036 1246281 -171845 -1155282 7213
$$ packed form
38528d906983K66267N040341M232165K31398j999425j785468j387839j136128
38520a445672J03669J509107J158700n37884j400356r35408m81638l52362M04173
38511a977671J505604J410457J26301m33655M20761R05252l20152j864181j623840
38502a851124K12822J620843J432944L33289m26584l01471L69522P73504L65936
38493B529681m28479o39515j50758N3930m55755o32692L13227J178264L52758
38484B120661j345081j415079N83613K134858J434837l9232r3868P68645N77127
38475D726481o57919j188671o86206n57354j061643p21612P48146J372186k9592
38466A943816j733622j536677K22248J482496J136775k68755j418126r83437J162495
$$ plain form
38457 7213 2872052 4545175 3178084 785288 415342 1454094 776608 -1831273 -3176439
38448 -3176439 -2138135 -1552719 -2955429 -3485225 -908936 1752072 474339 -3380443
38440 -3380443 -5219347 -4175493 -3393708 -4058216 -3802468 -1569194 131875 -785476 -2948828
38431 -2948828 -3990695 -3514490 -2287490 -723546 628884 1107223 1354107 2576207 3704891
38422 3704891 2061558 -1949656 -3890793 -1122005 3142883 4293441 2559913 1587926
38414 1587926 2408449 2507550 419455 -2155126 -3168734 -2487689 -851269 1097309 2163598
38405 2163598 1166737 -1012022 -1816728 -383963 1149165 743374 -705095 -978778 243739
38396 243739 1399900 1575799 1379539 1400639 1240634 495368 -257668 -134047 763167 1307879
$$ packed form
38457G213K864839J673123j367091k392796l69946J038752o77486k607881j345166
38448c176439J038304N85416j402710n29796K576289K661008j277733l854782
38440c380443j838904J043854P81785o64508K55748K233274J701069r17351k163352
38431b948828j041867M76205J227000J563944J352430M78339K46884J222100J128684
38422C704891j643333m011214j941137K768788M264888J150558j733528r71987
38414A587926Q20523R9101k088095k574581j013608O81045J636420J948578J066289
38405B163598r96861k178759q04706J432765J533128m05791j448469k73683J222517
38396B43739J156161J75899j96260K1100j60005p45266p53036J23621Q97214N44712
$$ plain form
38386 1307879 665403 -672259 -1397324 -847544 320425 935098 374667 -1359118 -4003815
38377 -4003815 -6753613 -7988968 -6404691 -2703989 653867 1888213 1523800 1184309
38369 1184309 1447190 1615765 1125441 227227 -617166 -1185093 -1315162 -1038512 -899133
38360 -899133 -1272579 -1328450 120389 2362395 2888706 788335 -1453910 -1362611 -477192
38351 -477192 -2253004 -6283726 -7925359 -4776216 -486755 139729 -2462305 -4086761
38343 -4086761 -3138108 -2070399 -2793430 -4108803 -4448954 -4227083 -4144247 -3562646 -2215265
38334 -2215265 -1579628 -2610237 -3551509 -2138330 871924 2462285 1365575 -558887
38326 -558887 -1112508 -335797 309742 275806 479760 1630943 2653911 1511377 -2031540
$$ packed form
38386A307879o42476j337662p25065N49780J167969O14673n60431j733785k644697
38377d003815k749798j235355J584277L700702L357856J234346l64413l39491
38369A184309K62881J68575m90324q98214q44393n67927j30069K76650J39379
38360h99133l73446n5871J448839K242006N26311k100371k242245R1299Q85419
38351d77192j775812m030722j641633L149143M289461O26484k602034j624456
38343d086761R48653J067709p23031j315373l40151K21871Q2836N81601J347381
38334b215265O35637j030609r41272J413179L010254J590361j096710j924462
38326e58887n53621P76711O45539l3936K03954J151183J022968j142534l542917
$$ plain form
38317 -2031540 -5183728 -4892602 -1658995 959527 905327 -177440 -126415 432438 -211245
38308 -211245 -1407358 -917291 1431561 3266063 2945555 1306441 -208407 -1332393 -2249053
38299 -2249053 -2616825 -2190699 -1395385 -626597 146675 658212 277356 -757938 -1095566
38290 -1095566 -69080 1103547 841772 -681160 -1884913 -1875809 -1276362 -1061273 -1346005
38281 -1346005 -1489838 -944746 155884 1039244 941450 -27121 -667427 327960 2924153
38272 2924153 5354634 5532201 3157517 330202 -352062 1555171 3924041 4455200 3094969
38263 3094969 1734141 1880376 3152132 3956526 3221754 1426594 98963 228935 1166562
38254 1166562 1401199 446602 -600377 -540071 575962 1905947 2884501 3300736 3041936
$$ packed form
38317b031540l152188K91126L233607K618522n4200j082767N1025N58853o43683
38308b11245j196113M90067K348852J834502l20508j639114j514848j123986r16660
38299b249053l67772M26126P95314P68788P73272N11537l80856j035294l37628
38290a095566J026486J172627k61775j522932j203753R104N99447K15089k84732
38281a346005j43833N45092J100630Q83360r7794r68571o40306R95387K596193
38272B924153K430481J77567k374684k827315o82264J907233K368870N31159j360231
38263C094969j360828J46235J271756Q04394p34772j795160j327631J29972R37627
38254A166562K34637r54597j046979O0306J116033J329985R78554M16235k58800
$$ plain form
38245 3041936 2444592 2236926 2367185 1565914 -946974 -3794316 -4506379 -2103009 1972266
38236 1972266 5059644 4988172 1574439 -2668137 -4340797 -2848519 -1224303 -1980291 -3636467
38227 -3636467 -3464452 -2157721 -2539378 -4309516 -3999851 -754576 1701617 566109 -1908125
38218 -1908125 -2190201 -604930 313040 471533 1649934 3380629 3127344 597930 -1434095
38209 -1434095 -1365558 -995439 -2229767 -3880336 -3628584 -1707768 -516865 -1061965 -1657343
38200 -1657343 -473999 1933788 3417906 2915084 1458303 600714 699328 1178477 1710227
38191 1710227 2131692 1599438 -692920 -3627031 -4450633 -1959488 1586064 2882742 1280026
38182 1280026 -1056881 -2070699 -1565960 -413705 477593 320068 -1037796 -2370488 -1968371
$$ packed form
38245C041936n97344k07666J30259q01271k512888k847342p12063K403370M075275
38236A972266L087378p1472l413733m242576j672660J492278J624216p55988j656176
38227c636467J72015J306731l81657j770138L09665L245275K456193j135508k474234
38218a908125k82076J585271R17970J58493J178401J730695k53285k529414k032025
38209a434095O8537L70119j234328j650569K51752J920816J190903n45100n95378
38200a657343J183344K407787J484118n02822j456781q57589R8614M79149N31750
38191A710227M21465n32254k292358k934111q23602K491145L545552J296678j602716
38182A280026k336907j013818N04739J152255Q91298j57525j357864j332692M02117
$$ plain form
38173 -1968371 265572 2544149 3445202 3447552 3593195 3572381 2221693 -457928 -2849772
38164 -2849772 -3478105 -2631553 -1937864 -2538140 -3934838 -4718001 -4279532 -3416707 -3054618
38155 -3054618 -2916933 -2163466 -1022276 -696962 -1467719 -2015192 -1293928 -123201 118704
38146 118704 -309796 -17318 1056742 1326116 177545 -615762 739492 3295354 4483243
38137 4483243 3517895 2015960 1234283 565271 -510251 -766313 924860 3257581 3948426
38128 3948426 3040877 2696415 3619479 3885826 2180381 197846 176877 1432823 1456051
38119 1456051 -197749 -1460269 -1332271 -1539152 -3494770 -5538140 -5114663 -2625223 -846386
38110 -846386 -804833 -643043 850643 1985714 1002663 -744255 -770960 515308 560191
$$ packed form
38173a968371K233943K278577R01053K350J45643k0814j350688k679621k391844
38164b849772o28333Q46552O93689o00276j396698p83163M38469Q62825L62089
38155c054618J37685P53467J141190L25314p70757n47473P21264J170727K41905
38146A18704m28500K92478J074060K69374j148571p93307J355254K555862J187889
38137D483243r65348j501935p81677o69012j075522k56062J691173K332721O90845
38128C948426r07549l44462R23064K66347j705445j982535k0969J255946K3228
38119A456051j653800j262520J27998k06881j955618k043370M23477K489440J778837
38110h46386M1553J61790J493686J135071r83051j746918k6705J286268M4883
$$ plain form
38101 560191 -929063 -1394476 186203 1401215 384224 -1095564 -810884 -25975 -1273980
38092 -1273980 -3780505 -4539704 -3173215 -2111518 -1992268 -636213 2501146 4389706
38084 4389706 2768958 -300642 -1391007 -168740 1240372 1645769 1261402 61509
38076 61509 -1914671 -3273765 -2482223 -178451 1478636 1680415 1704309 2796653 4598244
38067 4598244 5829400 5682184 4453755 3259619 2944716 3159182 3131864 3222425 4290824
38058 4290824 5423788 4486774 1842005 1016026 3787300 6855088 6009070 1892685 -1390497
38049 -1390497 -2148105 -2194171 -2707471 -2583098 -1195737 303704 1070966 1348052 774799
38040 774799 -1347091 -3643961 -3516611 -1264207 -340639 -2214379 -3970715 -2838609 -336539
$$ packed form
38101E60191j489254m65413J580679J215012j016991j479788K84680P84909j248005
38092a273980k506525p59199J366489J061697J19250J356055L137359J888560
38084D389706j620748l069600j090365J222267J409112M05397l84367j199893
38076F1509j976180j359094P91542K303772J657087K01779K3894J092344J801591
38067D598244J231156j47216j228429j194136l14903K14466k7318R0561J068399
38058D290824J132964r37014k644769q25979K771274L067788q46018m116385l283182
38049a390497p57608m6066n13300J24373J387361J499441P67262K77086n73253
38040G74799k121890k296870J27350K252404R23568j873740j756336J132106K502070
$$ plain form
38031 -336539 390479 -923959 -2320758 -2882797 -2775183 -1649324 248417 715393 -1676726
38022 -1676726 -4398823 -3669803 92 2135292 400208 -2628917 -3539150 -2112612
38014 -2112612 6223 2159031 4218591 5040853 3672421 1328493 166680 348273
38006 348273 34045 -1637110 -3151692 -2746503 -764318 931896 1217771 531979 -216940
37997 -216940 -681082 -927261 -967084 -819988 -693532 -735143 -780467 -634275 -471525 -701478
37987 -701478 -1489913 -2533399 -3178116 -2794938 -1471389 -401767 -852264 -2324789 -2614676
37978 -2614676 -559403 2043490 2564303 1099003 221324 1160887 2119837 1167155 -838771
37969 -838771 -1598993 -592210 660802 1114524 1397436 2321994 3456307 3775687 3011806
$$ packed form
38031c36539P27018j314438j396799n62039J07614J125859J897741M66976k392119
38022a676726k722097P29020L669895K135200j735084l029125r10233J426538
38014b112612K118835K152808K059560Q22262j368432k343928j161813J81593
38006C48273l14228j671155j514582M05189J982185J696214K85875o85792p48919
37997b16940m64142k46179l9823J47096J26456m1611m5324J46192J62750k29953
37987g01478p88435j043486o44717L83178J323549J069622m50497j472525k89887
37978b614676K055273K602893N20813j465300q77679R39563R58950r52682k005926
37969h38771p60222J006783J253012M53722K82912R24558J134313L19380p63881
$$ plain form
37960 3011806 1726992 437902 -706316 -1491518 -1545228 -939928 -393523 -361280 -304473
37951 -304473 357944 846153 -150453 -2021547 -2222130 274939 2952368 2790953 251960
37942 251960 -1782457 -2235558 -2473006 -2970565 -2340136 -436364 421748 -1037116 -2616400
37933 -2616400 -1873393 -12195 -34460 -2016896 -2924598 -1041421 1755594 2734634 1642958
37924 1642958 415403 482499 1217975 921869 -920355 -2570302 -1780407 1287382 3866474
37915 3866474 3873513 2268569 1144706 690158 -259350 -1486116 -1451380 -81739 710244
37906 710244 4953 -479797 1020613 3370437 3752464 1316985 -1802104 -3112055 -2275056
37897 -2275056 -737597 170525 101477 -718224 -1787943 -2294775 -1697709 -651832 -557054
$$ packed form
37960C011806j284814j289090j144218p85202n3710O05300N46405L2243N6807
37951c04473O62417M88209r96606j871094k00583K497069K677429j61415k538993
37942B51960k034417m53101k37448m97559O30429J903772Q58112j458864j579284
37933b616400P43007J861198k2265j982436r07702J883177K797015R79040j091676
37924A642958j227555O7096P35476k96106j842224j649947P89895L067789K579092
37915C866474P039j604944j123863m54548r49508j226766L4736J369641P91983
37906G10244p05291m84750J500410K349824L82027k435479l119089j309951Q36999
37897b275056J537459R08122o9048q19701j069719n06832N97066J045877R4778
$$ plain form
37888 -557054 -1690680 -2583333 -2021553 -899694 -951196 -2230461 -3270629 -3384309 -3149920
37879 -3149920 -2682713 -1295797 738484 1889896 1487102 507936 -353867 -1569264 -2904295
37870 -2904295 -2783211 -906960 472125 -301387 -1596571 -1040282 753669 1375188 374603
37861 374603 -722552 -1360336 -2274413 -3267983 -3240062 -2389810 -2066678 -2396022 -2267448 -1675504
37851 -1675504 -1715435 -2092876 -1136076 1157035 2425642 1148205 -1401018 -3115439 -3157711
37842 -3157711 -1613551 850718 2343570 1054018 -1817510 -2671507 -228105 2624447
37834 2624447 3100738 2198047 2051892 1876067 -495273 -4202179 -5566253 -2687936 2371492
37825 2371492 6169784 6969538 5186043 2369154 180925 -609419 -483315 -222959 -10913
$$ packed form
37888e57054j133626q92653N61780J121859n1502j279265j040168j13680K34389
37879c149920M67207J386916K034281J151412m02794r79166q61803j215397j335031
37870b904295J21084J876251J379085p73512j295184N56289J793951O21519j000585
37861C74603j097155o37784r14077r93570K7921Q50252L23132l29344J28574N91944
37851a675504l9931l77441R56800K293111J268607j277437k549223j714421m2272
37842c157711J544160K464269J492852j289552k871528q53997K443402K852552
37834B624447M76291r02691j46155j75825k371340l706906j364074K878317N059428
37825B371492L798292P99754j783495k816889k188229p90344J26104K60356K12046
$$ plain form
37816 -10913 92064 -314313 -1030240 -785668 1012212 2820575 2723042 1110249 64927
37807 64927 455643 1261015 1609236 1815342 2243489 2616499 2743512 2733537 2381680 1565649
37797 1565649 1161976 1985285 2777232 1260089 -2228569 -4303444 -3005733 -748131 -816531
37788 -816531 -2416830 -1876047 1712654 4900215 4574781 1848953 -118568 -364882 -252072
37779 -252072 -449140 -108669 1005399 1668567 1145397 380502 265260 19541 -1399844
37770 -1399844 -3223285 -3777797 -3014892 -2469581 -2685045 -2332219 -454252 1767563 2408465
37761 2408465 1081915 -1056013 -2866210 -3787110 -3347671 -1377599 1189379 2723355
37753 2723355 2613806 2046350 2514953 3797014 4070393 2281673 -138799 -682775 1118482
$$ packed form
37816a0913J02977m06377p15927K44572J797880J808363r7533j612793j045322
37807F4927L90716Q05372L48221K06106M28147L73010J27013r975l51857q16031
37797A565649m03673Q23309P91947j517143l488658k074875J297711K257602o8400
37788h16531j600299N40783L588701L187561l25434k725828j967521k46314J12810
37779b52072j97068L40471J114068O63168n23170p64895j15242k45719j419385
37770a399844j823441n54512P62905N45311k15464L52826J877967K221815O40902
37761B408465j326550k137928j810197r20900M39439J970072K566978J533976
37753B723355j09549n67456M68603J282061K73379j788720k420472n43976J801257
$$ plain form
37744 1118482 2898891 2384141 367330 -382172 1074608 2578024 1912040 -130062 -900084
37735 -900084 459091 1950472 1575658 87869 -74110 1868739 3987490 4245130 3052300
37726 3052300 2286438 2473276 2354798 1157609 -217010 -692266 -390061 108465 623001
37717 623001 747534 -319855 -2322193 -3577341 -3170132 -2170667 -1477365 -220187 1860326
37708 1860326 2390578 -433420 -3986821 -3984031 -486682 2445654 2961466 3298378 4789625
37699 4789625 5135129 2523750 -998473 -2748546 -3291560 -4486512 -5766871 -5070397 -2103409
37690 -2103409 1501950 4061133 4237761 1347041 -2830779 -4433429 -1959873 1401886
37682 1401886 2150555 1191287 1429521 2650580 2373349 514010 -673059 -762541 -1493546
$$ packed form
37744A118482J780409n14750k016811p49502J456780J503416o65984k042102p70022
37735i00084J359175J491381l74814j487789j61979J942849K118751K57640j192830
37726C052300p65862J86838j18478j197189j374619m75256L02205M98526N14536
37717F23001J24533j067389k002338j255148M07209R99465O93302J257178K080513
37708A860326N30252k823998l553401K790L497349K932336N15812L36912J491247
37699D789625L45504k611379l522223j750073n43014j194952j280359O96474K966988
37690b103409L605359K559183J76628k890720m177820j602650K473556L361759
37682A401886P48669r59268K38234J221059k77231j859339j187069q9482p31005
$$ plain form
37673 -1493546 -2996483 -3357235 -2362043 -2167458 -3367938 -3658174 -1740721 257465 -75540
37664 -75540 -2052301 -3219336 -2406030 -176259 2258181 3487205 2639760 579402 -860194
37655 -860194 -1310445 -1998796 -3094518 -2981098 -1016262 1005808 1335320 442925 -518505
37646 -518505 -1688728 -3409809 -4598147 -3946372 -1960449 -453934 -543117 -1941383 -3500453
37637 -3500453 -3874647 -2591973 -896718 -380868 -573056 440996 2684009 3803086 2739279
37628 2739279 1418364 1420483 1536724 629282 368140 2292462 4212843 3012889 -217997
37619 -217997 -1529126 -36477 1248736 652418 63180 854966 1149640 -740926 -2818283
37610 -2818283 -2012301 1261643 3748946 3797740 2790867 2314831 2104200 1406472 761166
$$ packed form
37673a493546j502937l60752R95192J94585j200480k90236J917453J998186l33005
37664g5540j976761j167035Q13306K229771K434440J229024q47445k060358j439596
37655h60194m50251o88351j095722J13420J964836K022070L29512q92395r61430
37646e18505j170223j721081j188338O51775J985923J506515q9183j398266j559070
37637c500453l74194J282674J695255N15850j92188J014052K243013J119077j063807
37628B739279j320915K119J16241r07442k61142J924322J920381j199954l230886
37619b17997j311129J492649J285213n96318n89238P91786K94674j890566k077357
37610b818283Q05982L273944K487303M8794j006873m76036k10631o97728o45306
$$ plain form
37601 761166 1269805 2801212 3980220 3883723 2999464 2279807 1817009 1041944 20707
37592 20707 -266770 726900 2120966 2567922 1848553 862790 316458 213412 518331 1308772
37582 1308772 1980994 1284413 -1043797 -3175670 -2701785 632324 4337833 5656239 4270910
37573 4270910 2214560 1351339 1517776 1261675 -118537 -1805029 -2639987 -2567684 -2569130
37564 -2569130 -3208820 -3544470 -1920936 1864995 5530190 6184189 3399786 -270752 -2134634
37555 -2134634 -1938191 -1135767 -592264 -121511 349891 595789 933088 1929864 3153328
37546 3153328 3374848 2215223 497330 -1196551 -3074680 -4899057 -5540932 -4538299
37538 -4538299 -3086787 -2628401 -3154612 -3607829 -3325948 -2432315 -1344467 -492867 -114176
$$ packed form
37601G61166N08639J531407J179008r6497q84259p19657m62798p75065j021237
37592B0707k87477R93670J394066M46956p19369r85763n46332j03046L04919P90441
37582A308772O72222o96581k328210k131873M73885L334109L705509J318406j385329
37573D270910k056350q63221J66437k56101j380212j686492q34958P2303j446
37564b569130o39690l35650J623534L785931L665195O53999k784403l670538j863882
37555b134634J96443Q02424N43503M70753M71402K45898L37299R96776J223464
37546C153328K21520j159625j717893j693881j878129j824377o41875J002633
37538d538299J451512M58386n26211m53217K81881Q93633J087848Q51600L78691
$$ plain form
37529 -114176 38122 325068 473989 -39109 -788291 -679231 251338 541776 -601848
37520 -601848 -2103353 -2677605 -2604039 -2955189 -4013093 -5330319 -6445138 -6690694 -5306952
37511 -5306952 -2695002 -532406 364512 1126601 2565310 3153327 1110477 -2378146 -4147836
37502 -4147836 -3013493 -851984 296582 431326 551696 981090 1433169 1725769 1744011
37493 1744011 1277176 370546 -447659 -490741 595193 2415594 3770508 3589057 2271910
37484 2271910 1406804 1677866 1930197 1019271 -362328 -740927 -5059 609124 153044
37475 153044 -1323846 -3108292 -4068362 -3337872 -1557063 -473314 -527959 -203789 1193152
37466 1193152 1892216 479100 -1439545 -1662836 -873888 -930251 -1084339 666172 3236809
$$ packed form
37529a14176J52298K86946J48921n13098p49182J09060R30569K90438j143624
37520f01848j501505n74252P3566l51150j057904j317226j114819k45556J383742
37511e306952K611950K162596Q96918P62089J438709N88017k042850l488623j769690
37502d147836J134343K161509J148566J34744J20370M29394M52079K92600J8242
37493A744011m66835r06630q18205m3082J085934J820401J354914j81451j317147
37484B271910q65106K71062K52331r10926j381599l78599P35868O14183m56080
37475A53044j476890j784446r60070P30490J780809J083749n4645L24170J396941
37466A193152O99064j413116j918645k23291P88948n6363j54088J750511K570637
$$ plain form
37457 3236809 3304796 609252 -1314832 -432796 1259128 1692306 1861734 3148793 4315290
37448 4315290 3477399 1165563 -669399 -1295070 -1165197 -588471 26083 -198604 -1314516
37439 -1314516 -1928871 -1025870 619258 1698667 1813082 957723 -860093 -2632288 -2675580
37430 -2675580 -973633 451806 471305 315967 1081604 1852880 1695795 1464936 2018083
37421 2018083 2562861 2427521 2530287 3402541 3811554 3107806 2644912 2915274 1959921
37412 1959921 -849898 -2335128 -167846 2630844 1911246 -1074637 -1998913 -674485
37404 -674485 -732843 -2855218 -3798557 -2391061 -1178882 -1177628 -160744 2205490 2487722
37395 2487722 -861147 -4369120 -4885331 -4115959 -4629082 -4939564 -2506546 1051172 1987666
$$ packed form
37457C236809O7987k695544j924084Q82036J691924M33178J69428J287059J166497
37448D315290q37891k311836j834962o25671J29873N76726O14554k24687j115912
37439a314516o14355R03001J645128J079409J14415q55359j817816j772195m3292
37430b675580J701947J425439J9499j55338P65637P71276j57085k30859N53147
37421B018083N44778j35340J02766Q72254M09013p03748m62894K70362r55353
37412A959921k809819j485230K167282K798690p19598k985883r24276J324428
37404f74485n8358k122375r43339J407496J212179J254J016884K366234K82232
37395B487722l348869l507973n16211P69372n13123l10482K433018L557718R36494
$$ plain form
37386 1987666 177595 -1022066 87345 1824863 2208002 1031175 -974396 -2853861
37378 -2853861 -3443720 -2394856 -879761 -20577 550901 1304757 1307881 -217929 -2135051
37369 -2135051 -3004428 -3126793 -3097494 -1968919 740812 2769485 1770559 -861222 -1862498
37360 -1862498 -924358 -453579 -1194938 -1587440 -1253525 -1492553 -2026865 -886126 1691364
37351 1691364 2719969 1055049 -636667 -5483 1698119 2118816 1054291 -464917
37343 -464917 -2011713 -2950748 -2001203 570976 2319237 1894775 967570 1229234 1758997
37334 1758997 1391797 1380914 3150595 5355509 5917877 5306603 4963029 4110028 1387200
37325 1387200 -1606498 -2004243 -262382 497534 -499289 -911750 260125 1065631 318782
$$ packed form
37386A987666j810071j199661J109411J737518L83139j176827k005571j879465
37378b853861n89859J048864J515095Q59184N71478P53856L124j525810j917122
37369b135051q69377j22365K9299J128575K709731K028673r98926k631781j001276
37360a862498R38140M70779p41359l92502L33915k39028n34312J140739K577490
37351A691364J028605j664920j691716O31184J703602M20697j064525j519208
37343d64917j546796r39035R49545K572179J748261m24462r27205K61664N29763
37334A758997l67200j0883J769681K204914N62368o11274l43574q53001k722828
37325A387200k993698l97745J741861P59916r96823m12461J171875Q05506p46849
$$ plain form
37316 318782 -414275 31323 121786 -1726873 -4395983 -5772495 -5543560 -4661001 -3433585
37307 -3433585 -1743008 -109298 852900 1314866 1636592 1699666 1532948 1624384 1945241
37298 1945241 1698212 650348 -363724 -780877 -928055 -849190 -1465 1251172 1439710
37289 1439710 95132 -1518812 -2544258 -3543811 -4395075 -3385066 -85081 2899456
37281 2899456 3258789 2448358 3347635 5675071 6522901 4884156 2862301 2271231 2444471
37272 2444471 1965384 710953 -485133 -899136 -246499 969696 1303081 -311361 -2922781
37263 -2922781 -4271808 -3280075 -1053288 521674 469072 -688963 -1339750 -291757 1447273
37254 1447273 1325832 -1380395 -4070796 -4060405 -1990258 -186855 979785 2589457 4092830
$$ packed form
37316C18782p33057M45598R0463j848659k669110j376512K28935Q82559J227416
37307c433585J690577J633710R62198M61966L21726O3074j66718R1436L20857
37298A945241k47029j047864j014072m17153j47178P8865Q47725J252637J88538
37289A439710j344578j613944j025446r99553q51264J010009L299985K984537
37281B899456L59333q10431Q99277K327436Q47830j638745k021855n91070J73240
37272B444471m79087j254431j196086m14003O52637J216195L33385j614442k611420
37263b922781j349027R91733K226787J574962n2602j158035o50787J047993J739030
37254A447273j21441k706227k690401J0391K070147J803403J166640J609672J503373
$$ plain form
37245 4092830 3847451 2439253 2343467 3981293 4997652 3978148 2098842 452677 -1330897
37236 -1330897 -2828541 -2220939 477933 2291447 1302312 -484437 -320703 1283857 1921244
37227 1921244 950544 -397978 -1221468 -1209722 30718 1975363 2733965 1490852 103030
37218 103030 361677 1173539 730083 -80063 716484 2321374 2199459 491609 79492
37209 79492 2073246 4286915 4765956 4032991 3029167 1524367 -205595 -510695 1240885
37200 1240885 3217039 3588595 2930455 2730789 2943715 2637218 1926076 1559357 1359727
37191 1359727 642333 -403886 -1212416 -2152501 -3787631 -5252553 -5129966 -3835315 -3208790
37182 -3208790 -3394328 -2208254 1232483 4072478 2949257 -1206088 -3858706 -2350851
$$ packed form
37245D092830k45379j408198r5786J637826J016359j019504j879306j646165j783574
37236a330897j497644O07602K698872J813514r89135j786749J63734J604560O37387
37227A921244r70700j348522q23490J1746J240440J944645P58602j243113j387822
37218A03030K58647Q11862m43456q10146P96547J604890j21915j707850m12117
37209G9492J993754K213669M79041p32965j003824j504800j729962l05100J751580
37200A240885J976154L71556o58140j99666K12926l06497p11142l66719j99630
37191A359727p17394j046219q08530r40085j635130j464922J22587J294651O26525
37182c208790j85538J186074L440737K839995j123221m155345k652618J507855
$$ plain form
37174 -2350851 1387232 4053355 4758253 4451574 3553179 2126332 1126951 1251023 1294103
37165 1294103 -68421 -1442125 -306350 2676050 3919715 2080538 -3813 260089
37157 260089 1691012 2017369 1521047 1639174 1957369 1257115 171893 230857 1219707
37148 1219707 1752748 1541574 1018779 -131868 -1802648 -2084984 306331 3294364 3889448
37139 3889448 2415700 1425811 1484765 1372067 1490005 3074746 4503050 2872669 -476434
37130 -476434 -722981 3061890 5921443 4273481 873733 25828 1665337 3140735 3510925
37121 3510925 2856927 334249 -3515670 -5037475 -1878095 2760199 4054001 2202001
37113 2202001 1268106 2548349 3258451 1606306 -674493 -1421823 -705805 268064 665337
$$ packed form
37174b350851L738083K666123P04898l06679q98395j426847r99381J24072M3080
37165A294103j362524j373704J135775K982400J243665j839177k084351K63902
37157B60089J430923L26357m96322J18127L18195p00254j085222N8964R88850
37148A219707N33041k11174n22795j150647j670780k82336K391315K988033N95084
37139C889448j473748r89889N8954j12698J17938J584741J428304j630381l349103
37130d76434k46547L784871K859553j647962l399748q47905J639509J475398L70190
37121C510925o53998k522678l849919j521805L159380M638294J293802j852000
37113B202001r33895J280243P10102j652145k280799p47330P16018R73869L97273
$$ plain form
37104 665337 33279 -1384374 -2348610 -2204304 -2126299 -3010240 -3301142 -1421913 838670
37095 838670 615095 -1130206 -744944 2185013 4031704 2879148 1127146 978105 1043570
37086 1043570 -395414 -1830967 -908417 1759619 3725672 4193780 4110639 3858862 2926986
37077 2926986 1303625 -286792 -1109143 -626807 1068129 2438868 1563368 -1138957 -2828319
37068 -2828319 -1910490 -56250 662897 713135 1415876 2115523 1311709 -588260 -1981959
37059 -1981959 -2744224 -3917146 -5197935 -4960179 -2797667 -271465 1011373 770555 -312940
37050 -312940 -1098185 -515958 1064770 1510937 -496911 -3045564 -2933077 207836 3562692
37041 3562692 4829487 4310425 3125241 1430569 -747332 -2549937 -3253128 -3148181 -2629651
$$ packed form
37104F65337o32058j417653r64236J44306P8005q83941k90902J879229K260583
37095H38670k23575j745301L85262K929957J846691j152556j752002j49041O5465
37086A043570j438984j435553R22550K668036J966053M68108q3141k51777r31876
37077B926986j623361j590417q22351M82336J694936J370739q75500k702325j689362
37068b828319R17829J854240P19147N0238P02741O99647q03814j899969j393699
37059a981959p62265j172922j280789K37756K162512K526202J282838k40818j083495
37050c12940p85245N82227J580728M46167k007848k548653J12487L140913L354856
37041C562692J266795n19062j185184j694672k177901j802605p03191J04947N18530
$$ plain form
37032 -2629651 -1391424 597689 2186881 2204205 1147191 748238 1792435 3013593 2564355
37023 2564355 426527 -1250492 -754182 730366 557555 -1385219 -1952476 897108 4757871
37014 4757871 5783577 3822366 2019148 1897674 1820458 662893 -24437 1096101 2547462
37005 2547462 2320690 1078543 847642 1514714 1025649 -1034236 -2234344 -473065 2969122
36996 2969122 4675858 2961916 -449338 -2727105 -3107205 -3011360 -3395989 -3390577 -2165206
36987 -2165206 -797657 -832894 -1761875 -1682011 -163216 1366618 2074303 2596557 3127336
36978 3127336 2669004 991794 -521324 -1040149 -1564381 -2779108 -3351253 -2083943 -390671
36969 -390671 -534115 -2140118 -2531451 -415636 2425680 3348911 1667232 -898921 -1967304
$$ packed form
37032b629651J238227J989113J589192J7324j057014l98953J044197J221158m49238
37023B564355k137828j677019M96310J484548j72811j942774n67257K849584L860763
37014D757871J025706j961211j803218j21474p7216j157565o87330J120538J451361
37005B547462k26772j242147k30901O67072m89065k059885j200108J761279L442187
36996B969122J706736j713942l411254k277767l80100R5845l84629N412J225371
36987b165206J367549l5237r28981P9864J518795J529834P07685N22254N30779
36978C127336m58332j677210j513118n18825n24232j214727n72145J267310J693272
36969c90671j43444j606003l91333K115815K841316R23231j681679k566153j068383
$$ plain form
36960 -1967304 -818994 700284 198123 -2088887 -3324538 -1887938 409670 1113561
36952 1113561 484320 236013 316585 -661863 -2574565 -3876673 -4262529 -4854556 -5748793
36943 -5748793 -5686293 -4425179 -3236470 -2579334 -1388756 650030 2085512 1864705 884969
36934 884969 512435 967395 1895667 3084299 3860786 3236944 1501088 354959 665087
36925 665087 1323116 1050609 60108 -729672 -799748 178127 2066978 3201861 1534265
36916 1534265 -2216237 -4560934 -3638296 -1563521 -860624 -807928 390853 1801326 1195849
36907 1195849 -806513 -1289926 425182 1711966 592295 -1576326 -2191719 -539362
36899 -539362 1891829 3083773 2093134 -71292 -1111105 122156 2139256 2824968 2311700
$$ packed form
36960a967304J148310J519278n02161k287010j235651J436600K297608P03891
36952A113561o29241k48307Q0572r78448j912702j302108l85856n92027q94237
36943e748793O2500J261114J188709O57136J190578K038786J435482k20807r79736
36934H84969l72534M54960R28272J188632P76487o23842j735856j146129L10128
36925F65087O58029k72507r90501p89780p0076R77875J888851J134883j667596
36916A534265l750502k344697R22638K074775P02897N2696J198781J410473o05477
36907A195849k002362m83413J715108J286784j119671k168621o15393J652357
36899e39362K431191J191944r90639k164426j039813J233261K017100O85712n13268
$$ plain form
36890 2311700 2247342 2706537 1953617 -581474 -3096933 -3731998 -2511621 -581383 930391
36881 930391 934822 -968713 -3239516 -3490378 -1633572 -294586 -1128956 -2389158 -1530260
36872 -1530260 1111336 2872399 2157302 -241077 -2658565 -3950201 -3632949 -1977655
36864 -1977655 -66293 1146751 1909009 3123005 4768263 5648182 4939175 3400410 2550318
36855 2550318 2802919 2976666 2002676 695480 870457 2579219 3513469 2056032 -240548
36846 -240548 -729259 604141 1436481 761050 -18731 90501 77578 -861269 -1428549 20643
36836 20643 3009614 5449895 5851771 4333661 2375366 1994288 3819206 5506273 3829572
36827 3829572 -847851 -4196457 -3269926 -164308 1396776 1047871 933563 1574102 1582744
$$ packed form
36890B311700o4358M59195p52920k535091k515459o35065J220377J930238J511774
36881I30391M431j903535k270803k50862J856806J338986q34370j260202Q58898
36872a530260K641596J761063p15097k398379k417488j291636L17252J655294
36864a977655J911362J213044P62258J213996J645258Q79919p09007j538765q50092
36855B550318K52601J73747r73990j307196J74977J708762R34250j457437k296580
36846b40548m88711J333400Q32340o75431p79781J09232j2923r38847n67280J449192
36836B0643K988971K440281M01876j518110j958295l81078J824918J687067j676701
36827C829572m677423l348606R26531L105618J561084l48905j14308O40539Q642
$$ plain form
36818 1582744 644633 -165538 -676519 -1490578 -1786422 -129529 2366754 2639524 141037
36809 141037 -2014045 -1427357 553607 1542962 1509128 1615246 1580169 470535 -997677
36800 -997677 -1187103 -147607 358542 -584726 -1902170 -2135237 -1177128 -108659 130594
36791 130594 -331791 -611959 -375884 -555717 -2073791 -4052875 -4500380 -2940154 -936313
36782 -936313 454773 2013154 4130552 5142645 3764648 1776228 1825357 3275632 2949684
36773 2949684 15841 -2629429 -2631210 -1261146 -750136 -752365 255321 1485726 594917
36764 594917 -2276339 -3852129 -1933241 1636321 3413578 2487123 865591 609650 1987806
36755 1987806 4070349 5748239 6084598 4764221 2519427 462476 -1043239 -2175036
$$ packed form
36818A582744r38111q10171n10981q14059k95844J656893K496283K72770k498487
36809A41037k155082N86688J980964R89355l3834J06118l5077j109634j468212
36800i97677j89426J039496N06149r43268j317444k33067R58109J068469K39253
36791A30594m62385k80168K36075j79833j518074j979084m47505J560226K003841
36782i36313J391086J558381K117398J012093j377997j988420M9129J450275l25948
36773B949684k933843k645270j781J370064N11010k229J007686J230405q90809
36764E94917k871256j575790J918888L569562J777257r26455j621532k55941J378156
36755A987806K082543J677890L36359j320377k244794k056951j505715j131797
$$ plain form
36747 -2175036 -2507668 -1185086 1554368 4027635 4670184 3253380 565928 -2023975
36739 -2023975 -2749001 -882991 1545009 1377306 -1392482 -2977052 -898208 2345756
36731 2345756 2877296 783722 -1051662 -1935166 -3427895 -5050102 -4150877 -670709 1949250
36722 1949250 1989098 1887220 3532115 4719868 3123546 735415 851500 2900624 4056207
36713 4056207 4273171 5494651 6769751 4770942 -452391 -4404915 -4068044 -1481560
36705 -1481560 89601 482057 1149952 1913381 1623497 467271 -586884 -1556832 -2801580
36696 -2801580 -3510945 -2570149 -330380 1848328 3170263 3368581 2051441 -454067 -2404334
36687 -2404334 -2411350 -1414072 -1356965 -2335386 -2656867 -1497636 158541 1290072 2007462
$$ packed form
36747b175036l32632J322582K739454K473267O42549j416804k687452k589903
36739b023975p25026J866010K428000j67703k769788j584570K078844L243964
36731B345756N31540k093574j835384q83504j492729j622207Q99225L480168K619959
36722A949250L9848j01878J644895J187753j596322k388131J16085K049124J155583
36713D056207K16964J221480J275100j998809n223333l952524L36871K586484
36705a481560J571161L92456O67895P63429k89884j156226j054155r69948j244748
36696b801580p09365R40796K239769K178708J321935J98318j317140k505508j950267
36687b404334p016R97278N7107r78421l21481J159231J656177J131531P17390
$$ plain form
36678 2007462 2636185 2923135 2640754 2064889 1500284 1045976 917568 1172377 1068525
36669 1068525 -353366 -2867188 -5069777 -5894202 -5292753 -3499717 -803703 1763340
36661 1763340 2813308 2245818 1478778 1499998 1715670 1338953 807159 923407 1526463
36652 1526463 2024401 2447968 2872693 2520184 751954 -1488451 -2561096 -2191129 -1322048
36643 -1322048 -179208 1814153 3987569 4196252 1693436 -1160425 -1509345 432201
36635 432201 1850892 968077 -1244465 -2882422 -3089621 -1858405 570289 3062525 3568742
36626 3568742 1369138 -1176406 -927348 1850246 3416285 1480825 -1513370 -1648974
36618 -1648974 1101777 3039782 1994146 -94789 -597804 135244 298700 127100 1279371
$$ packed form
36678B007462O28723K86950k82381n75865n64605m54308j28408K54809j03852
36669A068525j421891k513822k202589q24425O01449J793036K696014K567043
36661A763340J049968n67490p67040K1220K15672l76717n31794J16248O03056
36652A526463M97938M23567M24725l52509j768230k240405j072645L69967Q69081
36643a322048J142840J993361K173416K08683k502816k853861l48920J941546
36635D32201J418691q82815k212542j637957k07199J231216K428694K492236N06217
36626C568742k199604k545544K49058K777594J566039j935460k994195j35604
36618a648974K750751J938005j045636k088935n03015P33048J63456j71600J152271
$$ plain form
36609 1279371 3261740 3239143 154786 -3155126 -3439646 -1214625 278852 -483742 -1863383
36600 -1863383 -2046374 -1586204 -2056016 -3384453 -3890415 -2684662 -945356 -565961 -2104318
36591 -2104318 -4274616 -5099789 -3489232 -170755 2657890 3014520 959623 -1357295
36583 -1357295 -1822578 -466453 827929 544675 -1036052 -2620296 -3450194 -3658593 -3511985
36574 -3511985 -2988525 -2167691 -1518271 -1447016 -1730576 -1723462 -1162416 -504808 -301487 -438596
36564 -438596 -350110 37746 4511 -1090012 -2913453 -4408189 -4716641 -3663099 -1667501
36555 -1667501 466637 1991064 2810450 3294270 3233842 1830604 -524283 -1563431 85942
36546 85942 2090428 714220 -3852252 -6997956 -5615437 -2152005 -894201 -2239115
$$ packed form
36609A279371J982369k2597l084357l309912k84520K225021J493477p62594j379641
36600a863383j82991M60170m69812j328437n05962J205753J739306L79395j538357
36591b104318k170298q25173J610557L318477K828645L56630k054897k316918
36583a357295m65283J356125J294382k83254j580727j584244q29898k08399J46608
36574c511985N23460Q20834O49420P1255k83560P114N61046O57608K03321j37109
36564d38596Q8486L87856l3235j094523j823441j494736l08452J053542J995598
36555a667501K134138J524427Q19386M83820o0428j403238k354887j039148J649373
36546H5942K004486j376208m566472l145704J382519L463432J257804j344914
$$ plain form
36538 -2239115 -3280172 -2743199 -2145946 -2348099 -2169020 -1152360 -951697 -2571180 -4273352
36529 -4273352 -3878788 -1794890 -253364 -476436 -1816901 -2842727 -2215843 520609 3857744
36520 3857744 5028044 3168323 839736 781536 2019531 1344342 -1684112 -3757363 -2525840
36511 -2525840 -26448 208462 -1936913 -3188722 -1471957 1446627 2478529 1046605
36503 1046605 -683658 -771130 555516 1936385 2659937 2767150 2266995 1347397 1023518
36494 1023518 2332967 4631177 5677747 4039485 923255 -886966 269725 3442090
36486 3442090 5971601 5833722 3442099 1108183 409614 533203 -22265 -706815 551372
36477 551372 4039371 7246790 7876775 6395012 4610878 3074278 1231770 -776733
$$ packed form
36538b239115j041057N36973N97253k02153J79079J016660K00663j619483j702172
36529d273352L94564K083898J541526k23072j340465j025826O26884K736452L337135
36520C857744J170300j859721k328587n8200J237995o75189l028454k073251J231523
36511b525840K499392K34910k145375j251809J716765K918584J031902j431924
36503A046605j730263q7472J326646J380869P23552J07213n00155r19598l23879
36494A023518J309449K298210J046570j638262l116230j810221J156691L172365
36486C442090K529511j37879k391623k333916o98569J23589n55468o84550J258187
36477E51372L487999L207419O29985j481763j784134j536600j842508k008503
$$ plain form
36469 -776733 -1983347 -1916511 -1034709 -126508 129227 -347069 -467527 1055431 3495673
36460 3495673 4307370 2661850 1156300 2227997 4392038 4478583 2525329 1489832 2438082
36451 2438082 3132921 1891442 13442 -681563 -366005 41258 626363 1512202 1751154
36442 1751154 713731 -620224 -1067658 -804111 -319935 869734 2892766 3986334 2271437
36433 2271437 -1288960 -3441672 -2287409 844729 3299231 3838393 3223103 2850346 3281747
36424 3281747 3885284 3686085 2438222 682901 -1034419 -2427005 -3030694 -2357164 -723785
36415 -723785 825167 1683524 2004500 1703566 249892 -2033552 -3569080 -3299953 -2111041
36406 -2111041 -1634639 -2207812 -2742603 -2121179 -98687 2684503 5055018 6152313 6290572
$$ packed form
36469g76733j206614O6836Q81802R08201K55735m76296j20458J522958K440242
36460C495673Q11697j645520j505550J071697K164041Q6545j953254j035497R48250
36451B438082O94839j241479j878000o95005L15558M07263N85105Q85839K38952
36442A751154j037423j333955m47434K63547M84176J189669K023032J093568j714897
36433B271437l560397k152712J154263L132138K454502N39162o15290l72757M31401
36424C281747O03537j99199j247863j755321j717320j392586o03689O73530J633379
36415g23785J548952Q58357L20976l00934j453674k283444j535528K69127J188912
36406b111041M76402n73173n34791O21424K022492K783190K370515J097295J38259
$$ plain form
36397 6290572 6418441 6603384 6004767 4533209 3229445 2544945 1730369 629618 392705
36388 392705 1285472 1505978 -231379 -2440356 -3046439 -2453389 -2233818 -1945575 15446
36379 15446 2911617 3890615 1979221 -588042 -1542632 -936028 251752 1708047 3031658
36370 3031658 3201713 2007088 768753 723823 1730018 3094004 4383371 4944003 4224620
36361 4224620 3271851 4083380 6420609 7200127 4682465 1516087 1413150 4054158 5872476
36352 5872476 5254960 4128012 4203206 4447278 3412829 1864595 1346412 1535846 913692
36343 913692 -647177 -1767523 -1799919 -1473953 -1138219 -44199 1857915 2819917 1342106
36334 1342106 -1396718 -2613772 -1318395 624521 1020138 -200350 -1531523 -1944384
$$ packed form
36397F290572J27869J84943n98617j471558j303764o84500q14576j100751k36913
36388C92705Q92767K20506j737357k208977o06083N93050K19571K88243J961021
36379A5446K896171R78998j911394k567263r54590O06604J187780J456295J323611
36370C031658J70055j194625j238335m4930J006195J363986J289367N60632p19383
36361D224620r52769Q11529K337229P79518k517662l166378j02937K641008J818318
36352E872476o17516j126948P5194K44072j034449j548234n18183J89434o22154
36343I13692j560869j120346l2396L25966L35734J094020J902114R62002j477811
36334A342106k738824j217054J295377J942916L95617j220488j331173m12861
$$ plain form
36326 -1944384 -1602280 -1091007 -767212 -743847 -982369 -1363876 -1784422 -1968670 -1247829 846751
36316 846751 3570053 5270975 5164724 4189475 3616765 3439327 2746116 1152575 -803653
36307 -803653 -2277624 -2586163 -1540613 141321 1214301 1154071 536287 -58213 -644840
36298 -644840 -1050112 -771518 -188566 -423002 -1127164 -215741 2752569 4822043 3451781
36289 3451781 514087 -210552 1592703 2933804 2349571 1209660 314820 -1226752 -3075691
36280 -3075691 -3068214 -902497 552224 -677696 -2795668 -3176746 -1925998 -644770 293276
36271 293276 1190193 1451680 620923 -310653 -343441 35399 179663 497447 902850 26115
36261 26115 -2201923 -3236362 -1438601 1052209 1528736 879724 1557470 3165464 3647848
$$ packed form
36326a944384L42104N11273L23795K3365k38522l81507m20546j84248P20841K094580
36316H46751K723302J700922j06251r75249n72710j77438o93211j593541j956228
36307h03653j473971l08539J045550J681934J072980o0230o17784n94500n86627
36298f44840m05272K78594N82952k34436p04162R11423K968310K069474j370262
36289C451781k937694p24639J803255J341101n84233j139911q94840j541572j848939
36280c075691P477K165717J454721j229920k117972l81078J250748J281228R38046
36271B93276Q96917K61487q30757r31576l2788L78840J44264L17784M05403q76735
36261B6115k228038j034439J797761K490810M76527o49012O77746J607994M82384
$$ plain form
36252 3647848 3561450 5124800 7624883 7992141 6094074 5335305 7188168 8962746 8310489
36243 8310489 6492131 5611914 5769036 6666585 8953777 11883263 12530400 9852474 7031627
36234 7031627 7054661 8202835 7035388 3981983 2347927 2847545 2979676 1726727 1187739
36225 1187739 2693611 4392361 4207047 2944204 2761872 4103847 5817700 7205995
36217 7205995 8238932 8353254 6830715 4447238 3214556 3808539 4310994 2583503 -606558
36208 -606558 -2161645 -532910 2311784 3649967 3594733 4362898 6488082 7744502 6248004
36199 6248004 2965749 297822 -564361 42067 1384685 2653196 3070005 2864751 3382059
36190 3382059 5067890 6175804 4928817 2335084 1112918 2029108 3154323 3031959
$$ packed form
36252C647848q6398J563350K500083L67258j898067p58769J852863J774578o52257
36243H310489j818358q80217J57122Q97549K287192K929486O47137k677926k820847
36234G031627K3034J148174j167447l053405j634056M99618J32131j252949n38988
36225A187739J505872J698750j85314j262843j82332J341975J713853J388295
36217G205995J032937J14322j522539k383477j232682N93983N02455j727491l190061
36208f06558j555087J628735K844694J338183n5234P68165K125184J256420j496498
36199F248004l282255k667927q62183O06428J342618J268511M16809k05254N17308
36190C382059J685831J107914j246987k593733j222166R16190J125215j22364
$$ plain form
36182 3031959 2733494 3785897 5471746 5754352 4377117 3461756 4654994 6815838 7486358
36173 7486358 6143111 4708968 4644431 4946424 4109478 2943822 3540216 5757189 6950075
36164 6950075 5750141 4101787 4423491 6434577 8247441 9194059 9842346 10279253 10267097
36155 10267097 10448056 11630226 13380888 14949692 16902342 19888836 22363299 21915210
36147 21915210 18856872 16104738 15089287 14101436 11526317 8547991 7290823 7865563
36139 7865563 8673473 8539002 7384945 5798888 4974491 6060551 8462363 9762059 8559952
36130 8559952 6568616 6526737 8639447 10584710 10841766 10505760 11416358 13593559 15362777
36121 15362777 15675727 15499094 16535454 19004797 21573026 23594062 26198769 30253185
$$ packed form
36182C031959k98465J052403J685849K82606j377235r15361J193238K160844O70520
36173G486358j343247j434143o4537L01993q36946j165656N96394K216973J192886
36164F950075j199934j648354L21704K011086J812864R46618O48287M36907j2156
36155A0267097J80959J182170J750662J568804J952650K986494K474463m48089
36147B1915210l058338k752134j015451r87851k575119k978326j257168N74740
36139G865563Q07910j34471j154057j586057q24397J086060K401812J299696j202107
36130H559952j991336m1879K112710J945263K57056l36006R10598K177201J769218
36121A5362777L12950j76633J036360K469343K568229K021036K604707M054416
$$ plain form
36113 30253185 34400737 36812961 38212415 41096308 46181061 51979153 58206791 66986168
36105 66986168 79497900 93756783 107523676 121837178 139873608 163521991 192744722
36098 192744722 227186814 266489359 309275634 352540747 390860739 415679485 418295437
36091 418295437 396724573 358838076 316346865 276210290 239467855 206265082 178003592
36084 178003592 154844949 135096208 118188763 105379140 96429649 88408561 79413290
36077 79413290 71224750 66387789 64307692 62057339 57802111 51751067 44830142 38241783
36069 38241783 33621339 31751722 31248136 30001135 27938778 26947878 27712393 28027426 25444665
36060 25444665 21013853 18765135 20813830 24273599 24652070 21670716 19334313 19933909
$$ packed form
36113C0253185M147552K412224J399454K883893N084753N798092O227638Q779377
36105F6986168J2511732J4258883J3766893J4313502J8036430K3648383K9222731
36098A92744722L4442092L9302545M2786275M3265113L8319992K4818746K615952
36091D18295437k1570864l7886497m2491211m0136575l6742435l3202773k8261490
36084A78003592k3158643j9748741j6907445j2809623q949491q021088q995271
36077G9413290q188540m836961k080097k250353m255228o051044o920925o588359
36069C8241783m620444j869617n03586j247001k062357r90900P64515L15033k582761
36060B5444665m430812k248718K048695L459769L78471k981354k336403N99596
$$ plain form
36052 19933909 20947102 19613810 17712459 18505518 20805679 20351616 16726409 14534382
36044 14534382 16695068 20390813 21524582 20079694 18713343 18409963 18122954 17237271
36036 17237271 16061268 14720441 13232866 11941569 10849147 9662937 9202749 10915632
36028 10915632 14008658 15375343 13868925 12124519 12119665 11732058 8717066 5524073 5998910
36019 5998910 8832073 8988536 5411017 2697624 4208836 7547721 8627010 7005052
36011 7005052 5038657 4163524 4326828 5462404 7253218 8275797 7245846 4804695
36003 4804695 2833224 2251231 2412372 2465451 2518769 3266047 4648539 5197495 3427621
35994 3427621 200448 -1439106 96143 2513857 2585181 688898 111381 2096644 4257766
$$ packed form
36052A9933909J013193j333292j901351P93059K300161m54063l625207k192027
36044A4534382K160686L695745J133769j444888j366351l03380k87009q85683
36036A7237271j176003j340827j487575j291297j092422j186210m60188J712883
36028A0915632L093026J366685j506418j744406m854l87607l014992l192993M74837
36019E998910K833163J56463l577519k713393J511212L338885J079289j621958
36011G005052j966395q75133J63304J135576J790814J022579j029951k441151
36003D804695j971471n81993J61141N3079N3318P47278J382492N48956j769874
35994C427621l227173j639554J535249K417714P1324j896283n77517J985263K161122
$$ plain form
35985 4257766 4393414 3281212 2525778 1894771 485619 -1058296 -1289466 7816 1882998
35976 1882998 3512976 4334936 3823501 2343901 1461424 2248601 3903616 4990877 5275911
35967 5275911 5305986 5013370 4020871 2752477 1945134 1427184 583315 -274968 -277563 333906
35957 333906 155200 -1450906 -3292261 -3678145 -2274715 -226065 1262268 2035079 2657148
35948 2657148 3289562 3352593 2468809 1221933 383162 -276248 -1567329 -3388674 -4554001
35939 -4554001 -4212670 -2657997 -705568 832586 1069608 -370995 -2411131 -3320367 -2880428
35930 -2880428 -2616515 -3423847 -4273262 -4006624 -3066074 -2311250 -1289709 800508 3137995
35921 3137995 3924854 2861799 1504023 897205 138360 -1956559 -4537042 -5239792 -3209413
$$ packed form
35985D257766J35648j112202p55434o31007j409152j543915k31170J297282J875182
35976A882998J629978Q21960n11435j479600q82477P87177J655015J087261K85034
35967E275911L0075k92616r92499j268394q07343n17950q43869q58283k595O11469
35957C33906j78706j606106j841355l85884J403430K048650J488333P72811O22069
35948B657148O32414O3031q83784j246876q38771o59410j291081j821345j165327
35939d554001L41331J554673J952429J538154K37022j440603k040136r09236M39939
35930b880428K63913q07332q49415K66638R40550P54824J021541K090217K337487
35921C137995P86859j063055j357776o06818p58845k094919k580483p02750K030379
$$ plain form
35912 -3209413 -687383 -634180 -3024119 -4797829 -3868065 -1682640 -713158 -873054 -375869
35903 -375869 830025 988233 -339975 -1591102 -1863646 -1845683 -1696699 -601118 879584
35894 879584 831300 -480432 -80717 2893314 4774904 2417768 -1767247 -3056597 -990037
35885 -990037 790315 296679 -807854 -865523 -593835 -1131833 -2155361 -2708081 -2221885
35876 -2221885 -416299 2244235 4039586 3698577 2513839 2836359 4526472 5052892 3320289
35867 3320289 1153831 390522 579849 460090 -71243 -517099 -909568 -1337818 -1318076
35858 -1318076 -395542 1304976 3341888 4927160 4837757 2720949 366659 -186 1237989
35849 1237989 1594917 191300 -1187412 -1252276 -1053547 -1565224 -1699986 -421360 990099
$$ packed form
35912c209413K522030N3203k389939j773710R29764K185425R69482j59896M97185
35903c75869J205894J58208j328208j251127k72544J7963J48984J095581J480702
35894H79584m8284j311732L99715K974031J881590k357136m185015j289350K066560
35885i90037J780352m93636j104533n7669K71688n37998j023528n52720M86196
35876b221885J805586K660534J795351l41009j184738L22520J690113N26420j732603
35867C320289k166458p63309J89327j19759n31333m45856l92469m28250J9742
35858a318076R22534J700518K036912J585272q9403k116808k354290l66845J238175
35849A237989L56928j403617j378712o4864J98729n11677j34762J278626J411459
$$ plain form
35840 990099 794889 -335633 -333930 1155500 2554394 2794901 2323555 1874345 1666444
35831 1666444 1765026 2091830 2139004 1600126 1059387 1106113 1091462 -40220 -1766680 -2139465
35821 -2139465 -317184 2073786 2829676 1846577 1045383 1677992 2610266 1983447 95155
35812 95155 -714181 568674 1868456 982901 -849792 -512215 2281110 4434621 4076299
35803 4076299 2992151 3128024 3271343 1611628 -326693 482205 3543545 4946829 2797400
35794 2797400 -419847 -1886900 -2133420 -2893529 -3567169 -2555492 -960560 -1785442 -5207379
35785 -5207379 -7472156 -5800200 -2276755 -910791 -2192098 -2966724 -1230557 1491121
35777 1491121 2930492 2889994 2174047 720402 -1476732 -2988303 -2538820 -1233684 -1235956
$$ packed form
35840I90099j95210j130522J703J489430J398894K40507m71346m49210k07901
35831A666444R8582L26804M7174n38878n40739M6726j4651j131682j726460l72785
35821b139465J822281K390970P55890r83099q01194O32609R32274o26819j888292
35812I5155q09336J282855J299782q85555j832693L37577K793325K153511l58322
35803D076299j084148J35873J43319j659715j938321Q08898L061340J403284k149429
35794B797400l217247j467053k46520p60109o73640J011677J594932q24882l421937
35785e207379k264777J671956L523445J365964j281307p74626J736167K721678
35777A491121J439371m0498p15947j453645k197134j511571M49483J305136k272
$$ plain form
35768 -1235956 -2583992 -3211521 -2021456 -76729 1399223 2358607 2856174 2429508 1339915
35759 1339915 980669 2122139 3801996 4652201 4282061 2774332 101148 -3050442 -4997325
35750 -4997325 -4718363 -3082066 -1602034 -773649 -439202 -810256 -1959600 -3002113 -3041987
35741 -3041987 -2564151 -2760343 -3695309 -4199988 -3554208 -2337654 -1432419 -895674 -176103
35732 -176103 905779 1770748 1732985 871074 -69781 -688403 -1263370 -1731670 -1184828 652168
35722 652168 2163780 1547200 -529804 -1630883 -943856 -234584 -1066716 -2807148 -4045193
35713 -4045193 -4377696 -3956315 -2753215 -1236636 -491303 -784598 -1201587 -1310326 -1667178
35704 -1667178 -2051256 -1199760 651556 1219124 -184058 -699189 2017430 5630902 5941945
$$ packed form
35768a235956j348036o27529J190065J944727J475952R59384M97567m26666j089593
35759A339915l59246J141470J679857Q50205l70140j507729k673184l151590j946883
35750d997325K78962J636297J480032Q28385L34447l71054j149344j042513l9874
35741c041987M77836j96192r34966n04679O45780J216554R05235N36745P19571
35732a76103J081882Q64969l7763q61911r40855o18622n74967m68300N46842J836996
35722F52168J511612o16580k077004j101079O87027P09272q32132j740432j238045
35713d045193l32503M21381J203100J516579P45333k93295m16989j08739l56852
35704a667178l84078Q51496J851316N67568j403182n15131K716619L613472L11043
$$ plain form
35695 5941945 2730499 -242072 -532842 661762 1461738 1714691 1855732 1700606 1237892
35686 1237892 919440 561340 -504984 -1782438 -1766728 -329700 587246 -595111 -3132803
35677 -3132803 -4992060 -4861023 -2879919 -488614 292355 -1295024 -3434436 -3617966 -1958409
35668 -1958409 -962132 -1711981 -2351785 -1352175 -270936 -1455213 -4270631 -5736440 -4539852
35659 -4539852 -2523201 -1896751 -2464107 -2419045 -1016434 648889 1407577 1529778 1899992
35650 1899992 2350278 1898107 544951 -406640 -240219 137970 -252829 -1008720 -1373885
35641 -1373885 -1624615 -2188129 -2379257 -1479604 -207101 506925 1344374 3244083 4893594
35632 4893594 3921141 457965 -2766492 -4015946 -4014124 -3590086 -2303493 -182784 1395907
$$ packed form
35695E941945l211446k972571k90770J194604P99976K52953J41041j55126m62714
35686A237892l18452l58100j066324j277454J5710J437028R16946j182357k537692
35677c132803j859257J31037J981104K391305P80969j587379k139412j83530J659557
35668a958409R96277p49849o39804R99610J081239j184277k815418j465809J196588
35659d539852K016651O26450n67356M5062J402611J665323P58688J22201L70214
35650A899992M50286m52171j353156r51591J66421L78189l90799p55891l65165
35641a373885k50730n63514j91128Q99653J272503P14026Q37449J899709J649511
35632D893594r72453l463176l224457j249454J822M24038J286593K120709J578691
$$ plain form
35623 1395907 1663126 1476388 1428760 796893 -528660 -958207 482922 2295283 2484213
35614 2484213 1160620 -195916 -833677 -701756 421905 2187482 3081870 2195236 768342
35605 768342 486830 1079384 1206409 905867 1244689 1993389 1683389 94198 -1075196
35596 -1075196 -498206 1145422 2410112 2927486 3259094 3521231 3057598 1605554 206356
35587 206356 218620 1336088 1587403 141481 -917760 699942 3679837 4434671 2327248
35578 2327248 733732 1947968 3946215 4091098 3352397 4052445 5429491 4809809 2122948
35569 2122948 -94502 -744632 -1015497 -1271848 -340325 1604289 2437508 1292723 -205241
35560 -205241 -834645 -1337363 -2009121 -1494650 309766 726394 -1982520 -5352972 -5800172
$$ packed form
35623A395907K67219j86738m7628o31867j325553m29547J441129J812361J88930
35614B484213j323593j356536o37761J31921J123661J765577Q94388q86634j426894
35605G68342k81512N92554J27025l00542L38822P48700l10000j589191j169394
35596a075196N76990J643628J264690N17374L31608K62137m63633j452044j399198
35587B06356J2264J117468K51315j445922j059241J617702K979895P54834k107423
35578B327248j593516J214236J998247J44883p38701P00048J377046o19682k686861
35569B122948k217450o50130k70865k56351R31523J944614Q33219j144785j497964
35560b05241o29404n02718o71758N14471J804416M16628k708914l370452m47200
$$ plain form
35551 -5800172 -3461739 -1143735 432865 2988058 6495309 8123926 6404924 3662197
35543 3662197 2600684 2542281 1135622 -1546208 -2977719 -1844914 334742 1464513
35535 1464513 1147832 334239 13530 708311 2045226 2367473 157576 -3403673 -4800929
35526 -4800929 -2352202 1367072 2931359 2572775 2907947 4084821 3452104 369066 -1981473
35517 -1981473 -1097508 1208318 1787306 687630 194200 771069 753753 -479327 -1589544
35508 -1589544 -1562355 -856236 -75038 823811 1767580 2347363 2418790 1871362 245354 -2117286
35498 -2117286 -3282300 -1926712 252737 511631 -951475 -1488422 -398358 84688 -1176562
35489 -1176562 -2099517 -663284 2025222 3539997 3172380 1718004 -34716 -1163881
$$ packed form
35551e800172K338433K318004J576600K555193L507251J628617j719002k742727
35543C662197j061513n8403j406659k681830j431511J132805K179656J129771
35535A464513l16681q13593l20709O94781J336915L22247k209897l561249j397256
35526d800929K448727L719274J564287l58584L35172J176874o32717l083038k350539
35517a981473Q83965K305826N78988j099676m93430N76869j7316j233080j110217
35508a589544K7189P06119P81198Q98849R43769N79783P1427n47428j626008k362640
35498b117286j165014J355588K179449K58894j463106n36947J090064M83046j261250
35489a176562r22955J436233K688506J514775l67617j454376j752720j129165
$$ plain form
35481 -1163881 -649094 934803 1329036 -330956 -1989019 -1754925 -683307 -586520 -940916
35472 -940916 -368505 369474 -388651 -2088705 -2882634 -2796499 -3066978 -3032366 -997477 1975819
35462 1975819 2662207 606687 -913368 -7035 931686 -696832 -3359098 -3570674 -753252
35453 -753252 2449675 3747289 3046028 1302146 -627023 -2060811 -2713945 -2941234 -3151974
35444 -3151974 -3233468 -2948171 -2345161 -1443433 -317975 184066 -1007588 -3325253 -4569120
35435 -4569120 -3682768 -2220923 -1906708 -2082276 -1198178 277111 505440 -626784 -1148641
35426 -1148641 35545 1475070 1063178 -1386280 -3938002 -4404718 -2328178 516731
35418 516731 1799998 1139459 348297 786419 1561300 1327616 653467 935585 1792362
$$ packed form
35481a163881N14787J583897L94233j659992j658063K34094J071618R6787l54396
35472i40916N72411P37979p58125j700054p93929Q6135k70479L4612K034889K973296
35462A975819O86388k055520j520055R06333R38721j628518k662266k11576K817422
35453g53252L202927J297614p01261j743882j929169j433788o53134k27289k10740
35444c151974q1494K85297O03010R01728J125458N02041j191654k317665j243867
35435d569120Q86352J461845L14215j75568Q84098J475289K28329j132224n21857
35426a148641J184186J439525m11892k449458k551722m66716K076540K844909
35418E16731J283267o60539p91162M38122P74881k33684o74149K82118Q56777
$$ plain form
35409 1792362 1546048 -15465 -1347941 -1589702 -1343106 -893058 278402 1727440 1913241
35400 1913241 786542 645088 3051375 6285747 7313097 5346262 2186604 -199411
35392 -199411 -1204664 -1240150 -1039741 -1134383 -1354998 -1126112 -541902 -459151 -1148079 -1742451
35382 -1742451 -1554999 -1013580 -740719 -740380 -1062917 -1944588 -2439653 -508121 4005754 7756091
35372 7756091 7224375 3054150 -746282 -1566883 -436785 281320 -390185 -1910976 -3314170
35363 -3314170 -3845391 -3379550 -2571486 -2138023 -2115811 -2263750 -2617020 -2938696 -2436819 -1044429
35353 -1044429 -84336 -393543 -804722 -110575 591000 -295440 -1693348 -1308619 251567
35344 251567 96799 -2031822 -2973695 -1210905 788648 952920 916413 2416830 3387249
$$ packed form
35409A792362k46314j561513j332476k41761K46596M50048J171460J449038J85801
35400A913241j126699j41454K406287L234372J027350j966835l159658k386015
35392a99411j005253l5486K00409r4642k20615K28886N84210Q2751o88928n94372
35382a742451J87452N41419K72861L39l22537q81671m95065J931532M513875L750337
35372G756091n31716m170225l800432q20601J130098P18105o71505j520791j403194
35363c314170n31221M65841Q08064M33463K2212j47939l53270l21676N01877J392390
35353a044429R60093l09207m11179O94147P01575q86440j397908L84729J560186
35344B51567j54768k128621r41873J762790J999553J64272l6507J500417R70419
$$ plain form
35335 3387249 1091774 -2843324 -4283108 -2434151 -251943 521980 1117336 2305533
35327 2305533 2711417 1654733 838323 1672557 3020638 3106951 1978894 659532 -627748
35318 -627748 -1891488 -2317429 -1361516 41663 746893 914147 872105 -319020 -3159774
35309 -3159774 -5474169 -4519108 -1282267 112809 -1848457 -3574667 -1464596 2596499
35301 2596499 3618175 426578 -2938625 -3092613 -1643014 -2085802 -4452347 -5437989 -3137288
35292 -3137288 563106 2551159 1916567 284851 -324402 540794 1489138 812973 -1433791
35283 -1433791 -3241538 -3096316 -1978356 -1781474 -2294400 -1508032 1019416 3048427 2677914
35274 2677914 831801 -458623 -966047 -1928524 -3491702 -4057426 -2259131 1294756 4367891
$$ packed form
35335C387249k295475l935098j439784J848957K182208P73923N95356J188197
35327B305533M05884j056684q16410Q34234J348081Q6313j128057j319362j287280
35318f27748j263740m25941R55913J403179P05230J67254m2042j191125k840754
35309c159774k314395R55061L236841J395076j961266j726210K110071M061095
35301B596499J021676l191597l365203j53988J449599m42788k366545r85642K300701
35292c137288L700394J988053o34592j631716o09253Q65196R48344o76165k246764
35283a433791j807747J45222J117960J96882n12926P86368K527448K029011l70513
35274B677914j846113j290424n07424r62477j563178n65724J798295L553887L073135
$$ plain form
35265 4367891 4876973 2652567 -262361 -1541369 -1043983 -672503 -1559333 -2516019 -1938341
35256 -1938341 -159069 1111701 931102 -230829 -1336024 -1474572 -449702 616669
35248 616669 179566 -1515546 -2348551 -1383973 -465446 -1319531 -2686806 -2400751 -997507
35239 -997507 -751384 -1974034 -2914242 -2813242 -2350813 -1424426 514641 1957281 516633
35230 516633 -2777154 -3725122 -754403 2674758 3139070 1715388 1140052 1284222 441659
35221 441659 -884165 -792677 514324 1105496 565915 70252 -332263 -1652425 -3282495
35212 -3282495 -3272252 -1703796 -1095716 -2570936 -4010266 -3228461 -923389 1032490 2502497
35203 2502497 4416406 6294797 6425582 4217859 897434 -2043371 -3907737 -4452739
$$ packed form
35265D367891N09082k224406k914928j279008M97386L71480q86830r56686N77678
35256a938341J779272J270770j80599j161931j105195j38548J024870J066371
35248F16669m37103j695112q33005R64578R18527q54085j367275K86055J403244
35239i97507K46123j222650r40208J01000M62429R26387J939067J442640j440648
35230E16633l293787r47968K970719L429161M64312j423682n75336J44170q42563
35221D41659j325824R1488J307001N91172n39581m95663m02515j320162j630070
35212c282495J0243J568456O08080j475220j439330P81805K305072J955879J470007
35203B502497J913909J878391J30785k207723l320425k940805j864366n45002
$$ plain form
35195 -4452739 -3799754 -2930487 -3128963 -4356248 -4974273 -3715912 -1299792 631716 1599763
35186 1599763 2291712 2838730 2513921 1389151 813604 1422314 1989124 1492106 1059371
35177 1059371 2003846 2871733 1022260 -2970231 -5332443 -4310764 -2692491 -3550402 -5795302
35168 -5795302 -6207226 -4229092 -2171743 -1593859 -1992555 -2632922 -3284051 -3230435 -1787119
35159 -1787119 6934 206978 -1236495 -2359442 -2191372 -1962793 -2744170 -3732994 -3762171
35150 -3762171 -2958139 -1974178 -923612 21048 212469 -382300 -826232 -784763 -1206774
35141 -1206774 -2431585 -2905771 -1234338 1322155 1952236 -337087 -3609936 -5244677
35133 -5244677 -4543014 -3113434 -3054451 -4657935 -5914837 -4778949 -1767373 626403 1039715
$$ packed form
35195d452739O52985Q69267j98476j227285o18025J258361K416120J931508R68047
35186A599763O91949N47018l24809j124770n75547O08710N66810m97018m32735
35177A059371R44475Q67887j849473l992491k362212J021679J618273q57911k244900
35168e795302m11924J978134K057349N77884l98696o40367o51129N3616J443316
35159a787119J794053K00044j443473j122947J68070K28579p81377r88824k9177
35150c762171Q04032R83961J050566R44660J91421n94769m43932M1469m22011
35141a206774j224811m74186J671433K556493O30081k289323l272849j634741
35133e244677P01663J429580N8983j603484j256902J135888L011576K393776M13312
$$ plain form
35124 1039715 415750 -117488 -839371 -2142545 -3252411 -3389650 -2917812 -2207691 -691352
35115 -691352 1678121 3398582 3397915 2788092 2943216 3074481 1756789 -187457 -682629
35106 -682629 400950 1437499 1932395 2629257 2984980 1462152 -1266281 -2293941 -677663
35097 -677663 895725 34082 -1992047 -2529816 -1363145 -230389 210070 779570 1674955
35088 1674955 1828342 433324 -2040195 -4361292 -5324943 -4317781 -1961861 -80931
35080 -80931 -258914 -2232956 -3981677 -3545705 -969599 1385996 977262 -1889049 -3843400
35071 -3843400 -2357361 879674 2172237 849435 -259718 590833 1742501 1275498
35063 1275498 -99616 -781794 -769756 -765308 -699202 -836051 -2403057 -5199042 -6542564
$$ packed form
35124A039715o23965n33238p21883j303174j109866j37239M71838P10121J516339
35115f91352K369473J720461o67o09823J55124J31265j317692j944246m95172
35106f82629J083579J036549M94896O96862L55723j522828k728433j027660J616278
35097f77663J573388q61643k026129n37769J166671J132756M40459N69500Q95385
35088A674955J53387j395018k473519k321097r63651J007162K355920J880930
35080h0931j77983j974042j748721M35972K576106K355595m08734k866311j954351
35071c843400J486039L237035J292563j322802j109153Q50551J151668m67003
35063A275498j375114o82178J2038M448O6106j36849j567006k795985j343522
$$ plain form
35054 -6542564 -4882211 -2586979 -2501927 -3504149 -2685585 -545393 -225740 -2169496 -3413228
35045 -3413228 -2379739 -775941 -116387 253552 736839 329351 -827739 -759432 878200
35036 878200 1428859 -743374 -3321988 -3317498 -1248164 238042 230941 -315422 -983454 -1965304
35026 -1965304 -2551914 -1794743 -251699 743033 1098480 1588838 1950120 1110881 -858354
35017 -858354 -2529364 -2817671 -1827561 -296886 816379 725326 -129298 -46244 1734374
35008 1734374 3520915 3251030 1403451 221043 509527 956717 474491 -455290 -863854
34999 -863854 -321287 1178568 3077923 4029994 3118291 1281129 259537 280975 231149
34990 231149 -67000 402080 1625158 2057986 1063135 89630 364092 899417 154232
$$ packed form
35054f542564J660353K295232Q5052j002222Q18564K140192L19653j943756j243732
35045c413228J033489J603798O59554L69939M83287m07488j157090O8307J637632
35036H78200N50659k172233k578614M490K069334J486206p101n46363o68032r81850
35026a965304n86610P57171J543044R94732L55447M90358L61282q39239j969235
35017h58354j671010k88307R90110J530675J113265r1053q54624Q3054J780618
35008A734374J786541k69885j847579j182408K88484M47190m82226r29781m08564
34999h63854N42567J499855J899355R52071r11703j837162j021592K1438m9826
34990B31149k98149M69080J223078M32828r94851r73505K74462N35325p45185
$$ plain form
34981 154232 -1426749 -2060220 -1217256 -97952 329409 434538 768200 809427 -366286
34972 -366286 -2460240 -3766094 -3064542 -1435265 -1382428 -3748000 -6151366 -5397946 -1259149
34963 -1259149 3069433 4422086 2803879 817589 662607 2207953 3645013 3490381
34955 3490381 1921615 373206 -36959 439947 680856 -44199 -1437909 -2500218 -2323157
34946 -2323157 -946210 401805 461282 -367499 -222443 1744050 3809930 3524272 684914
34937 684914 -2430121 -3531433 -2183616 474740 2838664 3686577 2888524 1596863 1279343
34928 1279343 2386687 4053859 4833376 3668223 871199 -1565414 -1638984 86653 743755
34919 743755 -1066298 -3087572 -2485060 68114 1422022 444219 -736198 13517 2270995
$$ packed form
34981A54232j580981o33471Q42964J119304M27361J05129L33662M1227j175713
34972c66286k093954j305854P01552J629277N2837k365572k403366P53420M138797
34963a259149M328582J352653j618207j986290j54982J545346J437060j54632
34955C490381j568766j548409m10165M76906K40909p25055j393710j062309J77061
34946b323157J376947J348015N9477q28781J45056J966493K065880k85658k839358
34937F84914l115035j101312J347817K658356K363924Q47913p98053j291661l17520
34928A279343J107344J667172P79517j165153k797024k436613p3570J725637O57102
34919G43755j810053k021274O02512K553174J353908r77803j180417P49715K257478
$$ plain form
34910 2270995 4101177 4179693 2633520 973522 1129331 3313566 5170844 4484100 2164376
34901 2164376 701056 324739 -686900 -2142726 -1624002 1218441 3225727 2221889
34893 2221889 285721 375513 1771168 1491220 -950579 -2869329 -2298930 -475447 35579
34884 35579 -1463809 -3059878 -2457590 218412 2273820 1617076 -585385 -1676635 -1291560
34875 -1291560 -1335414 -2365817 -2613764 -1291346 -300146 -1290412 -3154298 -3938397 -3315442
34866 -3315442 -1650912 1297035 4789979 6131696 3696683 -334532 -2522057 -2389576
34858 -2389576 -1961538 -2177360 -2218987 -1754665 -1403362 -1143092 -345701 654271 837079 287979
34848 287979 75065 420463 536433 233876 250121 934188 1807828 2434281 2778499 2888203
$$ packed form
34910B270995J830182P8516j546173j659998J55809K184235J857278o86744k319724
34901B164376j463320l76317j011639j455826N18724K842443K007286j003838
34893B221889j936168Q9792J395655k79948k441799j918750N70399J823483N11026
34884C5579j499388j596069O02288K676002K055408o56744k202461j091250L85075
34875a291560m3854j030403k47947J322418R91200r90266j863886p84099O22955
34866c315442J664530K947947L492944J341717k435013m031215k187525J32481
34858b389576M28038k15822m1627M64322L51303K60270P97391R99972J82808n49100
34848B87979k12914L45398J15970l02557J6245O84067Q73640O26453L44218J09704
$$ plain form
34838 2888203 2990486 3473259 4102799 4026865 3263663 3076055 3940817 4463881 3476508 1770017
34828 1770017 401632 -1073169 -2971079 -3802201 -2357210 899 1310156 1729790
34820 1729790 1987042 1023841 -1746952 -3576171 -1578183 2236780 3124793 311065 -2477255
34811 -2477255 -2991342 -2720689 -2794297 -1989857 -71175 760218 -570716 -2159889 -2295332
34802 -2295332 -1513076 -294073 1987674 4337957 3846206 189720 -2743544 -2127611 -230472
34793 -230472 -555969 -2538294 -3052575 -1259100 994934 2214155 2118606 667901 -1446927
34784 -1446927 -2385670 -1306351 36663 -423966 -2310216 -3851735 -4272269 -3552139 -1481000
34775 -1481000 1242505 2661189 2240281 2128223 3662574 4604112 2493171 -989972 -2130683
$$ packed form
34838B888203J02283M82773O29540p5934p63202j87608Q64762N23064r87373j706491
34828A770017j368385j474801j897910q31122J444991K358109J309257M19634
34820A729790K57252r63201k770793j829219J997988L814963Q88013k813728k788320
34811b477255n14087K70653p3608Q04440J918682Q31393j330934j589173j35443
34802b295332P82256J219003K281747K350283m91751l656486k933264O15933J897139
34793b30472l25497j982325n14281J793475K254034J219221r5549j450705k114828
34784a446927r38743J079319J343014m60629j886250j541519m20534P20130K071139
34775a481000K723505J418684m20908j12058J534351R41538k110941l483143j140711
$$ plain form
34766 -2130683 -511702 870661 204495 -1300264 -1924329 -1329380 -58679 899721 419854
34757 419854 -1241915 -2039331 -853570 709286 1098315 1527503 3278047 4222123 1616453
34748 1616453 -2864961 -4765616 -2963563 -467476 531504 642821 443448 -461886 -1283392
34739 -1283392 -645168 335261 -761519 -3203728 -3926240 -3053102 -3777409 -5826939 -4556228
34730 -4556228 1212225 5880556 5121271 2413667 3084928 5891654 5898219 2822866 643211
34721 643211 464022 -369859 -2449352 -3113039 -1649223 -734428 -1471795 -1461738 422533
34712 422533 1389224 -708334 -3483524 -3547699 -1414186 109095 480620 1106701 1642216
34703 1642216 124636 -3187214 -5166037 -3848723 -839753 1343028 2341613 2957432
$$ packed form
34766b130683J618981J382363o66166j504759o24065N94949J270701R58400m79867
34757D19854j661769p97416J185761J562856L89029M29188J750544R44076k605670
34748A616453m481414j900655J802053K496087R98980J11317j99373r05334q21506
34739a283392O38224R80429j096780k442209p22512Q73138p24307k049530J270711
34730d556228N768453M668331p59285k707604O71261K806726O565l075353k179655
34721F43211j79189q33881k079493o63687J463816R14795p37367J0057J884271
34712D22533R66691k097558k775190o4175K133513J523281L71525O26081N35515
34703A642216j517580l311850j978823J317314L008970K182781R98585O15819
$$ plain form
34695 2957432 2781092 959388 -1452315 -2201223 -1003896 3507 -533003 -1559352 -2175892
34686 -2175892 -3606959 -6533779 -8225460 -5504284 -66420 2607922 366373 -2771899
34678 -2771899 -2439284 305890 1525722 487917 -139610 834733 1572663 781767 -142832
34669 -142832 409432 1850718 2703061 2682107 2207875 1169607 -402974 -1375666 -734855
34660 -734855 664442 988385 37511 -278248 1494741 4177612 5104209 3191328 176016
34651 176016 -1419135 -1079598 -525405 -1322962 -3044790 -4114450 -3794536 -2657620 -1476475
34642 -1476475 -478476 308632 651443 288797 -760018 -2110514 -3132061 -3412273 -3286762
34633 -3286762 -3450990 -3758337 -3118815 -1205382 547999 689472 -139583 -129896 1086734
$$ packed form
34695B957432j76340j821704k411703p48908J197327J007403n36510j026349o16540
34686b175892j431067k926820j691681K721176N437864K674342k241549l138272
34678b771899L32615K745174J219832j037805o27527R74343P37930p90896r24599
34669a42832N52264J441286Q52343k0954m74232j038268j572581r72692O40811
34660g34855J399297L23943r50874l15759J772989K682871R26597j912881l015312
34651A76016j595151L39537N54193p97557j721828j069660L19914J136916J181145
34642a476475R97999P87108L42811l62646j048815j350496j021547k80212J25511
34633c286762j64228l07347O39522J913433J753381J41473q29055R687J216630
$$ plain form
34624 1086734 2242292 2612048 2655028 2372732 942649 -1387189 -2829102 -2477670 -1649569
34615 -1649569 -1651333 -1718385 -683751 604269 417956 -1094561 -2175080 -2029849 -1380044
34606 -1380044 -756497 -4740 665554 855702 1086267 1960742 2396573 859178 -1506223
34597 -1506223 -1503754 1557160 4386937 4099169 1795316 85875 -765571 -1908090 -2902266
34588 -2902266 -2482648 -1276540 -927813 -1101561 -176690 1402869 1474358 -1342 -504927
34579 -504927 957527 2295235 1981021 1404798 1938595 2258275 788551 -1222068 -1475300
34570 -1475300 -5118 1446201 2131603 2186029 1129848 -1047081 -2415348 -1439138 -6488
34561 -6488 -1258752 -4798034 -7001927 -6088330 -3938142 -2600291 -1959609 -1582661 -1991659
$$ packed form
34624A086734J155558L69756M2980k82296j430083k329838j441913L51432Q28101
34615a649569j764o7052J034634J288020j86313j512517j080519J45231O49805
34606a380044O23547P51757O70294J90148K30565Q74475M35831j537395k365401
34597a506223K469L060914K829777k87768k303853j709441q51446j142519r94176
34588b902266M19618J206108L48727j73748R24871J579559P1489j475700n03585
34579e04927J462454J337708l14214n76223N33797L19680j469724k010619k53232
34570a475300J470182J451319O85402N4426j056181k176929j368267R76210J432650
34561f488j252264l539282k203893R13597K150188J337851O40682L76948m08998
$$ plain form
34552 -1991659 -2923600 -2811196 -1280078 21907 171866 186892 346989 -953129 -3939874
34543 -3939874 -5788534 -4596161 -2626078 -2793876 -4027518 -3422639 -1369302 -700979 -1543665
34534 -1543665 -1037466 1609470 3496020 2421365 -149276 -1748337 -1943138 -1340838 88935
34525 88935 1959585 2557562 892295 -1487610 -2374984 -1792993 -1564399 -2571704 -3806207
34516 -3806207 -4023803 -3373037 -3112363 -3897954 -4506836 -2901117 872016 3841759 3648766
34507 3648766 2018411 2322798 4103141 3346137 -1001928 -4439902 -3127077 327007
34499 327007 688192 -2249294 -3877521 -1998781 317936 -100022 -2030179 -2355628 -622509
34490 -622509 1138864 1751973 1835682 1898079 1396898 9243 -1340316 -1336163 208028 2018915
$$ packed form
34552a991659r31941J12404J531118J301985J49959J5026J60097j300118k986745
34543c939874j848660J192373J970083j67798j233642O04879K053337O68323q42686
34534a543665N06199K646936J886550j074655k570641j599061j94801O02300J429773
34525H8935J870650N97977j665267k379905q87374N81991K28594j007305j234503
34516c806207k17596O50766K60674p85591o08882J605719L773133K969743j92993
34507C648766j630355L04387J780343p57004m348065l437974J312825L454084
34499C27007L61185k937486j628227J878740K316717m17958j930157l25449J733119
34490f22509J761373O13109Q3709O2397n01181j387655j349559M153J544191J810887
$$ plain form
34480 2018915 2547678 1488472 103376 -84952 1110612 2427993 2562942 1425064 14512
34471 14512 -667266 -487003 -72272 79346 183306 576456 798237 44479 -1362099 -1948026
34461 -1948026 -1075812 -39026 -335569 -1588985 -2179690 -1377052 163893 1480080 1779605
34452 1779605 434855 -2127708 -3904449 -3173629 -749898 1023655 1356698 1476726 2106511
34443 2106511 2448929 2111712 2096744 2974160 3696812 3282703 2296205 1599232 950092 4667
34433 4667 -546479 -164031 312342 -5436 -514983 -360740 -155068 -709199 -967438 596134
34423 596134 2934666 3196613 828787 -1333449 -958091 708585 1061565 38606 -118967
34414 -118967 1410629 2509434 1080271 -1708438 -2621670 -659726 1441780 925634 -1073014
$$ packed form
34480B018915N28763j059206j385096j88328J195564J317381J34949j137878j410552
34471A4512o81778J80263M14731J51618J03960L93150K21781p53758j406578n85927
34461a948026Q72214J036786k96543j253416n90705Q02638J540945J316187K99525
34452A779605j344750k562563j776741P30820K423731J773553L33043J20028O29785
34443B106511L42418l37217j4968Q77416P22652m14109r86498o96973o49140r45425
34433D667n51146L82448M76373l17778n09547J54243K05672n54131k58239J563572
34423E96134K338532K61947k367826k162236L75358J666676L52980j022959j57573
34414a18967J529596J098805j429163k788709r13232J961944K101506n16146j998648
$$ plain form
34405 -1073014 -1166481 1333160 3574836 3627486 3037723 3528112 3786279 2087433 120425
34396 120425 800477 3184452 3213801 -341948 -4076875 -4857568 -3430847 -1883158 -451277
34387 -451277 1201748 1953058 881760 -614592 -656738 258259 294815 -730188 -1379416
34378 -1379416 -934915 128599 1417265 2649327 3044171 2421641 2235596 3612824 5039985
34369 5039985 4221825 1769882 504668 1157887 1524604 384604 -519399 424500 2100242
34360 2100242 2778338 2763318 3016140 2835686 1175046 -843573 -1073973 526862 2058654
34351 2058654 2688021 3349248 4352640 4475031 3134553 1644845 1202964 990816 -414242
34342 -414242 -2638468 -3926163 -3591696 -2816036 -2963706 -4052042 -5104191 -5304753 -4469767
$$ packed form
34405a073014r3467K499641K241676N2650n89763M90389K58167j698846j967008
34396A20425O80052K383975K9349l555749l734927p80693J426721J547689J431881
34387d51277J653025P51310j071298j496352m2146R14997L6556j025003o49228
34378a379416M44501J063514J288666J232062L94844o22530j86045J377228J427161
34369E039985q18160k451943j265214O53219L66717j140000r04003R43899J675742
34360B100242O78096j5020K52822j80454j660640k018619k30400J600835J531792
34351B058654O29367O61227J003392J22391j340478j489708m41881k12148j405058
34342d14242k224226j287695L34467P75660j47670j088336j052149k00562Q34986
$$ plain form
34333 -4469767 -2872926 -1075372 196018 347113 -692442 -2242027 -3082107 -2307065 -354134
34324 -354134 1049549 532921 -1312396 -2518187 -2037373 -810471 -213464 -161607 458717
34315 458717 1837736 2685173 1760060 -684882 -3148815 -4102785 -3008530 -825800 431269
34306 431269 -452373 -2134410 -1782596 1368315 4381707 3704862 -472288 -4149039 -3877275
34297 -3877275 -212328 3411447 4328908 2662024 369004 -917090 -1076166 -938461 -914454
34288 -914454 -551026 482952 1567056 1856483 1430632 958773 512849 -343348 -1405023
34279 -1405023 -1857041 -1562899 -1209063 -927621 -44665 1277822 1535588 36420 -1598911
34270 -1598911 -1441543 68076 952785 634186 334588 745354 1090531 775759 294315
$$ packed form
34333d469767J596841J797554J271390J51095j039555j549585q40080P75042J952931
34324c54134J403683n16628j845317j205791M80814J226902N97007N1857O20324
34315D58717J379019Q47437r25113k444942k463933r53970J094255K182730J257069
34306D31269q83642j682037L51814L150911L013392o76845m177150l676751K71764
34297c877275L664947L623775R17461j666884k293020j286094j59076J37705K4007
34288i14454L63428J033978J084104K89427m25851m71859m45924q56197j061675
34279a405023m52018K94142L53836K81442Q82956J322487K57766j499168j635331
34270a598911J57368J509619Q84709l18599k99598M10766L45177l14772m81444
$$ plain form
34261 294315 -93438 -1049527 -2683549 -3793533 -3699967 -3577336 -4502683 -5229884 -3837087
34252 -3837087 -1090842 41974 -1482840 -3242425 -2871750 -1335731 -1064645 -2015293 -1716249
34243 -1716249 956752 4072419 5332291 4919431 4568301 4850724 4854519 4164178 3575132
34234 3575132 3500607 3036218 1574405 449592 1515966 4159629 5178699 2396272 -2458833
34225 -2458833 -5465323 -4760365 -2169657 -700037 -1326535 -2476096 -1971114 819382 4208424
34216 4208424 5391149 3096843 -749116 -2840761 -2242500 -1208097 -1708213 -2670353 -2079415
34207 -2079415 -468094 -40983 -924730 -974673 409303 1016951 -475240 -2010948 -1290924
34198 -1290924 466524 333445 -1863579 -3446859 -2863660 -1387807 -780151 -1332853 -2495278
$$ packed form
34261B94315l87753r56089j634022j109984R3566J22631r25347p27201J392797
34252c837087K746245J132816j524814j759585L70675J536019K71086r50648K99044
34243a716249K673001L115667J259872m12860l51130K82423L795o90341n89046
34234C575132p4525m64389j461813j124813J066374K643663J019070k782427m855105
34225b458833l006490P04958K590708J469620o26498j149561N04982K790496L389042
34216D208424J182725k294306l845959k091645N98261J034403n00116r62140N90938
34207b079415J611321M27111q83747m9943J383976O07648j492191j535708P20024
34198a290924J757448j33079k197024j583280N83199J475853O07656n52702j162425
$$ plain form
34189 -2495278 -3511508 -3093458 -438924 2844433 3795603 1912981 14961 294349 1536830
34180 1536830 1684815 1074171 978845 683241 -1185044 -3415096 -3422407 -1494912 -695107
34171 -695107 -1977963 -2439907 177764 3803213 4868295 2994137 615142 -791175
34163 -791175 -1652205 -2109084 -1394240 355750 1609659 1315960 -77748 -1753056 -3273181
34154 -3273181 -3939354 -3009572 -1202475 -445256 -1190361 -1423166 411358 2802862 3177510
34145 3177510 1600393 496622 1020529 1783949 1487533 863951 1055435 1514343 869226
34136 869226 -851920 -2172158 -2211134 -1792190 -2216096 -3424339 -3899166 -2620674 -841375
34127 -841375 -1006064 -3411384 -5025961 -3077241 840170 2351885 106898 -2435776
$$ packed form
34189b495278j016230M18050K654534L283357R51170j882622j898020K79388J242481
34180A536830J47985o10644r5326k95604j868285k230052p311J927495P99805
34171f95107j282856m61944K617671L625449J065082j874158k378995j406317
34163g91175q61030m56879P14844J749990J253909k93699j393708j675308j520125
34154c273181o66173R29782J807097P57219p45105k32805J834524K391504L74648
34145C177510j577117j103771N23907P63420k96416o23582J91484M58908o45117
34136H69226j721146j320238l8976M18944m23906j208243m74827J278492J779299
34127h41375j64689k405320j614577J948720L917411J511715k244987k542674
$$ plain form
34119 -2435776 -2045396 -142243 -129087 -2123268 -3196201 -2081100 -604905 -226479 4430
34110 4430 972144 1334101 -405650 -3118258 -4253563 -3204170 -1829256 -1715562 -2242469
34101 -2242469 -1759409 65938 1668803 1357608 -604653 -2167094 -2018390 -1297839 -1849397
34092 -1849397 -3234296 -3052040 -465974 2239340 2477916 423297 -1786244 -2701655 -2164644
34083 -2164644 -416077 1683959 2322281 581257 -1693075 -1840938 -126546 652276 -420967
34074 -420967 -916291 778785 2271754 432163 -3758886 -6439052 -6230634 -5338887 -5168656
34065 -5168656 -4128572 -1216948 1071402 27913 -2817386 -3554591 -1488949 246210
34057 246210 -164772 -614848 1105521 3482457 3387331 427374 -2976827 -4890588 -5126835
$$ packed form
34119b435776L90380J903153J3156j994181j072933J115101J476195L78426K30909
34110D430R67714L61957j739751k712608j135305J049393J374914J13694n26907
34101b242469M83060J825347J602865l11195j962261j562441J48704P20551n51558
34092a849397j384899J82256K586066K705314K38576k054619k209541r15411N37011
34083b164644J748567K100036O38322j741024k274332j47863J714392P78822j073243
34074d20967m95324J695076J492969j839591m191049k680166K08418Q91747J70231
34065e168656J040084K911624K288350j043489k845299p37205K065642J735159
34057B46210m10982m50076J720369K376936r5126k959957l404201j913761k36247
$$ plain form
34048 -5126835 -3808371 -959902 2259334 3751034 2564413 -205264 -2780936 -4003537
34040 -4003537 -3393238 -1271664 934680 1714854 1161873 715588 1118041 1710258 1854997
34031 1854997 1784606 1734520 1456568 983553 759494 692052 214018 -499670 -676613 -470650
34021 -470650 -762760 -1200448 -395068 1348999 1764634 228807 -663541 1073561 3446128
34012 3446128 3226305 485419 -2156037 -3564344 -4527120 -4914806 -3532938 -854948 932529
34003 932529 1073100 916474 949760 -134881 -2342950 -3012478 -448475 3010134 3760931
33994 3760931 1576601 -660696 -1079273 -446135 97152 668991 1430352 1528916 405344
33985 405344 -934378 -1208304 -828836 -1281696 -2718702 -3570549 -2909914 -1840058 -1612490
$$ packed form
34048e126835J318464K848469L219236J491700j186621k769677k575672j222601
34040d003537O10299K121574K206344P80174n52981m46285M02453N92217J44739
34031A854997p0391n0086k77952m73015k24059o7442m78034p13688j76943K05963
34021d70650k92110m37688Q05380J744067M15635j535827q92348J737102K372567
34012C446128k19823k740886k641456j408307r62776l87686J381868K677990J787477
34003I32529J40571j56626L3286j084641k208069o69528K564003L458609P50797
33994C760931k184330k237297m18577O33138N43287N71839P61361R8564j123572
33985D05344j339722k73926L79468m52860j437006q51847O60635J069856K27568
$$ plain form
33976 -1612490 -1533982 -272639 1465520 1570826 -141626 -1336359 -587654 553115 181529
33967 181529 -963354 -908318 357395 1207033 1320337 2107550 4006220 5168606 3630053
33958 3630053 -119284 -3335285 -3566332 -1056969 1264585 789115 -1591101 -2453255 -486778
33949 -486778 1595782 1070553 -831887 -1242305 -339110 -625171 -2311922 -2917004 -1658603
33940 -1658603 -901264 -2269232 -4227289 -4877470 -4641617 -4538883 -3947816 -1980585 471739
33931 471739 1862658 2062807 1896474 1661138 1363055 1392204 1778857 1733946 933814 222489
33921 222489 121638 -147629 -1154167 -2047408 -2001939 -1679297 -2089218 -3107195 -4160847
33912 -4160847 -5139419 -5594724 -4542656 -2342334 -1204940 -2270142 -3657810 -3158008 -1405016
$$ packed form
33976a612490P8508J261343J738159J05306j712452j194733P48705J140769l71586
33967A81529j144883N5036J265713Q49638J13304P87213J898670J162386j538553
33958C630053l749337l216001k31047K509363K321554m75470k380216q62154J966477
33949d86778K082560n25229j902440m10418R03195k86061j686751o05082J258401
33940a658603P57339j367968j958057o50181K35853J02734N91067J967231K452324
33931D71739J390919K00149j66333k35336k98083K9149L86653m4911q00132p11325
33921B22489j00851k69267j006538q93241M5469L22642m09921j017977j053652
33912d160847r78572m55305J052068K200322J137394j065202j387668M99802J752992
$$ plain form
33903 -1405016 -394922 -191010 594298 2012569 2838039 2797527 2577834 2138560 1070770
33894 1070770 80157 57998 284018 -312522 -839843 141429 1574658 1208540 -375139
33885 -375139 -342269 1494500 1869592 -698173 -3182496 -2577012 -466042 -455638 -2788523
33876 -2788523 -4332519 -3207125 -882983 425608 496229 579309 1350435 2261279 2568985
33867 2568985 2324197 2090211 1984987 1574794 758292 -17536 -707269 -1781658 -2768619
33858 -2768619 -2062511 519150 2370511 1268204 -1149060 -1538178 168346 856345 -729112
33849 -729112 -2205693 -1629638 -414102 -691541 -2101593 -2895100 -2458871 -1258344 132268
33840 132268 673701 -740211 -3238402 -4150499 -2579295 -764791 -326342 443919 3205383
$$ packed form
33903a405016J010094K03912P85308J418271Q25470m0512k19693m39274j067790
33894A070770r90613k2159K26020n96540n27321R81272J433229l66118j583679
33885c75139L2870J836769L75092k567765k484323O05484K110970J0404k332885
33876b788523j543996J125394K324142J308591P0621Q3080P71126R10844L07706
33867B568985k44788k33986j05224m10193q16502p75828o89733j074389r86961
33858b768619P06108K581661J851361j102307k417264l89118J706524O87999j585457
33849g29112j476581N76055J215536k77439j410052p93507M36229J200527J390612
33840A32268N41433j413912k498191r12097J571204J814504M38449P70261K761464
$$ plain form
33831 3205383 5775658 4925977 1503027 -716488 -571025 -462794 -1906097 -3539243 -4093946
33822 -4093946 -4208382 -4233207 -2998246 -280537 1718924 1154207 -753619 -1475625 -535216
33813 -535216 469730 458982 43423 434742 2172698 4618261 6019601 4657387 811534
33804 811534 -2835233 -3677294 -1867752 253944 1191750 1753381 3244832 5101314 5250030
33795 5250030 2844407 -183940 -1058858 564240 2211393 1752159 -104701 -1289250
33787 -1289250 -1355057 -1500961 -2057725 -1816003 -257547 1181742 1066714 76377 -2870
33778 -2870 1245701 2549472 2810996 2216096 1456231 783444 181855 -181818 -259835 -626511
33768 -626511 -2022586 -4114418 -5126743 -3452221 158094 2669775 1719017 -1750064
$$ packed form
33831C205383K570275q49681l422950k219515J45463J08231j443303j633146n54703
33822d093946j14436k4825J234961K717709J999461n64717j907826p22006R40409
33813e35216J004946j0748m15559L91319J737956K445563J401340j362214l845853
33804H11534l646767q42061J809542K121696R37806N61631J491451J856482J48716
33795E250030k405623l028347q74918J623098J647153m59234j856860j184549
33787a289250o5807j45904n56764K41722J558456J439289j15028r90337p9247
33778b870J248571J303771K61524n94900p59865o72787o01589l63673p8017l66676
33768f26511j396075k091832j012325J674522L610315K511681r50758l469081
$$ plain form
33760 -1750064 -4487244 -4461255 -2624123 -1159078 -952100 -1271605 -1167177 -397109 684344
33751 684344 1463373 1411551 610115 -183015 -430803 -571756 -1258674 -1958023 -1199338 1400192
33741 1400192 4110841 4876002 3766475 2699705 2679429 2397427 232198 -3159907 -5338043
33732 -5338043 -4923846 -2890484 -946597 260978 884518 843224 22505 -898609 -710110
33723 -710110 1140664 3922035 6043515 6022915 3617115 450995 -981890 402211 3188033
33714 3188033 4997259 4730651 2999652 1075080 76321 509966 1692882 2134080 1397031
33705 1397031 1003613 2370171 4431895 4825884 3167633 1441324 988677 855687 -260538
33696 -260538 -1961680 -2986097 -2944419 -2258682 -1311374 -610271 -951635 -2344100 -3391816
$$ packed form
33760a750064k737180K5989J837132J465045K06978l19505J04428P70068J081453
33751F84344P79029n1822q01436p93130k47788j40953o86918o99349P58685K599530
33741A400192K710649P65161j109527j066770k0276k82002k165229l392105k178136
33732e338043M14197K033362J943887J207575O23540m1294q20719r21114J88499
33723g10110J850774K781371K121480k0600k405800l166120j432885J384101K785822
33714C188033J809226k66608j730999j924572r98759M33645J182916M41198p37049
33705A397031l93418J366558K061724L93989j658251j726309m52647j32990j116225
33696b60538j701142j024417M1678O85737R47308P01103l41364j392465j047716
$$ plain form
33687 -3391816 -2811430 -1107778 249300 833086 1240029 1347813 126502 -2340127 -3884668
33678 -3884668 -2438313 1173754 3688998 2967923 379052 -1048072 -400626 377409 -266496
33669 -266496 -994371 325755 2895610 3392105 373038 -3469405 -4431626 -2073792 698100
33660 698100 1156330 -666560 -2594435 -2631525 -677555 1584678 2445275 1832517 1005964
33651 1005964 836799 1123927 1495763 1863974 1734208 343208 -1810091 -2675949 -925129
33642 -925129 2149759 3894453 3011339 453673 -1757870 -2061565 -459146 1287295 1290406
33633 1290406 -196450 -1143433 -722485 -337273 -870303 -842370 1057558 3309275 3610438
33624 3610438 2354147 1662126 1837917 1387117 80060 -724862 -778207 -1334123 -2557739
$$ packed form
33687c391816N80386J703652J357078N83786M06943J07784j221311k466629j544541
33678c884668J446355L612067K515244p21075k588871j427124O47446P78035o43905
33669b66496p27875J320126K569855M96495l019067l842443r62221K357834K771892
33660F98100M58230j822890j927875l7090J953970K262233Q60597o12758q26553
33651A005964j69165K87128L71836L68211j29766j391000k153299q65858J750820
33642i25129L074888J744694q83114k557666k211543l03695J602419J746441L111
33633A290406j486856r46983M20948L85212n33030K7933J899928K251717L01163
33624C610438j256291o92021J75791m50800j307057q04922n3345n55916j223616
$$ plain form
33615 -2557739 -2986915 -2048994 -823161 162895 1488204 2588131 1578621 -1537606 -3902405
33606 -3902405 -3508183 -1844054 -1378151 -2284855 -3181670 -3333764 -2567091 -680000 1508152
33597 1508152 2196976 1188050 580912 1338364 1407052 -656935 -2598766 -1869772 -27490
33588 -27490 -215012 -1753718 -1223264 1782522 4061679 3982738 3305767 3211123 2274778 -337158
33578 -337158 -2907801 -3912040 -3925167 -3386149 -1348401 1742440 2821306 174667 -3471155
33569 -3471155 -4305915 -2255003 -108379 671477 715993 400645 -595236 -1763050 -2069622
33560 -2069622 -1725469 -1868369 -2590649 -2844324 -2185438 -1223390 -495630 -111101 -204990 -579301
33550 -579301 -360235 726792 1285242 -130398 -2774304 -4527095 -4516414 -3475767 -2051087
$$ packed form
33615b557739m29176R37921J225833R86056J325309J099927j009510l116227k364799
33606c902405L94222J664129M65903r06704q96815j52094P66673J887091K188152
33597A508152O88824j008926o07138P57452O8688k063987j941831P28994J842282
33588b7490j87522j538706N30454L005786K279157p8941o76971r4644r36345k611936
33578c37158k570643j004239j3127N39018K037748L090841J078866k646639l645822
33569c471155q34760K050912K146624P79856M4516l15348r95881j167814l06572
33560b069622L44153j42900p22280k53675O58886R62048P27760L84529r3889l74311
33550e79301K19066J087027N58450j415640k643906j752791J0681J040647J424680
$$ plain form
33541 -2051087 -501324 289462 -538491 -2137428 -2702664 -2045771 -1758343 -2661711 -3766720
33532 -3766720 -4024900 -3508150 -2566462 -1382250 -615915 -871118 -1263871 -258620 1780873
33523 1780873 2798183 2224448 1785073 2353072 2309284 395292 -1876435 -2425616 -1550299
33514 -1550299 -781083 -188657 1071982 2500625 2683333 1560875 475691 181556 230761
33505 230761 34786 -714386 -2216604 -3931286 -4401244 -3055545 -1466102 -1246717 -1472960
33496 -1472960 -168047 2172131 2914322 1246443 -552327 -513063 365756 11958 -1644043
33487 -1644043 -2824227 -2339997 -795368 283234 -98355 -1532223 -2538691 -2120431 -938486
33478 -938486 -364717 -594321 -647979 -152786 40632 -798241 -2367211 -3957898 -4969494
$$ packed form
33541b051087J549763P90786q27953j598937n65236O56893K87428r03368j105009
33532c766720k58180N16750R41688J184212P66335k55203l92753J005251K039493
33523A780873J017310n73735m39375N67999m3788j913992k271727n49181Q75317
33514a550299P69216N92426J260639J428643J82708j122458j085184k94135M9205
33505B30761j95975p49172j502218j714682m69958J345699J589443K19385k26243
33496a472960J304913K340178P42191j667879j798770L9264Q78819l53798j656001
33487a644043j180184M84230J544629J078602l81589j433868j006468M18260J181945
33478i38486N73769k29604n3658M95193J93418q38873j568970j590687j011596
$$ plain form
33469 -4969494 -4680434 -2739770 -188274 1276404 1500203 2060779 3684108 4857156 4001526
33460 4001526 1906516 740496 1248582 2066598 1614609 -95132 -1516360 -1188129 511700
33451 511700 1429881 132683 -1985268 -2305315 -512037 1192162 1525767 1568116 1969944
33442 1969944 1222465 -1449140 -3556955 -2372061 720930 1749598 -373502 -2664352
33434 -2664352 -2537264 -827098 472233 1144733 1913254 2309470 1330531 -385881 -787078
33425 -787078 994516 3416637 4405476 3715084 2641099 1775000 292724 -2069889 -3632751
33416 -3632751 -2783321 -629784 278417 -328015 -283579 1140315 1956647 1255687 1388514
$$ packed form
33469d969494K89060J940664K551496J464678K23799N60576J623329J173048q55630
33460D001526k095010j166020N08086Q18016m51989j709741j421228L28231J699829
33451E11700R18181j297198k117951l20047J793278J704199L33605M2349M01828
33442A969944p47479k671605k107815J184894L092991J028668k123100k290850
33434b664352J27088J710166J299331O72500P68521L96216r78939j716412m01197
33425g87078J781594K422121R88839o90392j073985q66099j482276k362613j562862
33416c632751Q49430K153537R08201o06432M4436J423894Q16332p00960J32827
$$ [...]
##END NTUPLES=NMR SPECTRUM
##END=
