##TITLE=31Pdec_PhAcBF
 , 48 sc
 10.2.2021
##JCAMPDX= 6.0         $$ Bruker NMR JCAMP-DX V2.0
##DATA TYPE= NMR SPECTRUM
##DATA CLASS= NTUPLES
##ORIGIN= UXNMR, Bruker Analytische Messtechnik GmbH
##OWNER= root
$$ XWIN-NMR		Version 3.5
$$ Wed Feb 10 13:54:52 2021 Russian Standard Time (UT+4h)  she@DPX200
##.OBSERVE FREQUENCY= 81.013821
##.OBSERVE NUCLEUS= ^31P
##.ACQUISITION MODE= SIMULTANEOUS
##.ACQUISITION SCHEME= undefined
##.AVERAGES= 48
##.DIGITISER RES= 16
##SPECTROMETER/DATA SYSTEM= spect
##.PULSE SEQUENCE= zgpg30
##.SOLVENT NAME= CDCl3
##.SHIFT REFERENCE= (INTERNAL, CDCl3, 0, 298.009)
##AUDIT TRAIL= $$ (NUMBER, WHEN, WHO, WHERE, WHAT)
$$ ##TITLE= Audit trail, XWIN-NMR		Version 3.5
$$ ##JCAMPDX= 5.01
$$ ##ORIGIN= Bruker BioSpin GmbH
$$ ##OWNER= she
$$ F:/spectra/data/she/nmr/P31/1/pdata/1/auditp.txt
$$ ##AUDIT TRAIL=  $$ (NUMBER, WHEN, WHO, WHERE, WHAT)
(   1,<2021-02-10 13:54:26.60 +0400>,<she>,<DPX200>,
      <continue with go, POWCHK disabled, PULCHK disabled
       configuration hash MD5:
       00 E9 B6 7A A2 85 ED C7 34 08 36 98 17 FE 4E 26
       data hash MD5: 32K
       57 F7 67 79 C2 B0 C9 9C 35 1E C4 06 9F 2A D8 18>)
(   2,<2021-02-10 13:54:28.07 +0400>,<she>,<DPX200>,
      <Start of raw data processing
       efp BC_mod = 2 LB = 1 FT_mod = 6 PKNL = 1 PHC0 = -1919.834 PHC1 = 110.0023 SI = 64K 
       data hash MD5: 64K
       07 12 B9 95 19 C5 B1 14 AD 5A 66 64 87 E3 7C 1D>)
$$ ##END=
$$ 
$$ hash MD5
$$ 0E 12 7D 61 5A F0 26 A1 4F 5D 83 29 EC 43 17 B4
##$RELAX= 
##$RELAX= 
##$RELAX= 
##$RELAX= 
##$RELAX= 
##$RELAX= 
##$RELAX= 
##$RELAX= 
$$ Bruker specific parameters
$$ --------------------------
##$DU= <F:/spectra>
##$EXPNO= 1
##$NAME= <P31>
##$PROCNO= 1
##$TYPE= <nmr>
##$USER= <she>
##$AMP= (0..31)
100 100 100 100 100 100 100 100 100 100 100 100 100 100 100 100 100 100 
100 100 100 100 100 100 100 100 100 100 100 100 100 100 
##$AQSEQ= 0
##$AQ_mod= 1
##$AUNM= <au_zg>
##$AUTOPOS= <>
##$BF1= 81.014009
##$BF2= 200.13
##$BF3= 200.13
##$BF4= 200.13
##$BF5= 200.13
##$BF6= 200.13
##$BF7= 200.13
##$BF8= 200.13
##$BYTORDA= 1
##$CFDGTYP= 0
##$CFRGTYP= 5
##$CHEMSTR= <none>
##$CNST= (0..31)
1 1 145 1 1 1 1 1 1 1 1 1 1 1 1 1 1 1 1 1 1 1 1 1 1 1 1 1 1 1 1 1 
##$CPDPRG= <waltz16>
##$CPDPRG1= <>
##$CPDPRG2= <waltz16>
##$CPDPRG3= <>
##$CPDPRG4= <mlev>
##$CPDPRG5= <mlev>
##$CPDPRG6= <mlev>
##$CPDPRG7= <mlev>
##$CPDPRG8= <mlev>
##$CPDPRGB= <>
##$CPDPRGT= <>
##$D= (0..31)
0 1 0 0 0 0 0 0 0 0 0 0.03 2e-05 3e-06 0 0 0 0 0 0 0 0 0 0 0 0 0 0 0 0 
0 0 
##$DATE= 1612950792
##$DBL= (0..7)
120 120 120 11 120 120 24 19 
##$DBP= (0..7)
150 150 150 150 150 150 150 150 
##$DBP07= 0
##$DBPNAM0= <>
##$DBPNAM1= <>
##$DBPNAM2= <>
##$DBPNAM3= <>
##$DBPNAM4= <>
##$DBPNAM5= <>
##$DBPNAM6= <>
##$DBPNAM7= <>
##$DBPOAL= (0..7)
0.5 0.5 0.5 0.5 0.5 0.5 0.5 0.5 
##$DBPOFFS= (0..7)
0 0 0 0 0 0 0 0 
##$DE= 6
##$DECBNUC= <off>
##$DECIM= 3
##$DECNUC= <off>
##$DECSTAT= 4
##$DIGMOD= 1
##$DIGTYP= 9
##$DL= (0..7)
0 0 52 120 120 21 21 25 
##$DP= (0..7)
$$ [...]
##$SUBNAM2= <"">
##$SUBNAM3= <"">
##$SUBNAM4= <"">
##$SUBNAM5= <"">
##$SUBNAM6= <"">
##$SUBNAM7= <"">
##$SUBNAM8= <"">
##$SUBNAM9= <"">
##$SW= 600.660478495614
##$SWIBOX= (0..15)
0 1 3 0 0 0 0 0 0 0 0 0 0 0 0 0 
##$SW_h= 48661.800486618
##$TD= 32768
##$TD0= 1
##$TE= 0
##$TE2= 300
##$TE3= 300
##$TEG= 300
##$TL= (0..7)
0 120 53 12 22 120 120 120 
##$TP= (0..7)
150 150 150 150 150 150 150 150 
##$TP07= 0
##$TPNAME0= <>
##$TPNAME1= <>
##$TPNAME2= <>
##$TPNAME3= <>
##$TPNAME4= <>
##$TPNAME5= <>
##$TPNAME6= <>
##$TPNAME7= <>
##$TPOAL= (0..7)
0.5 0.5 0.5 0.5 0.5 0.5 0.5 0.5 
##$TPOFFS= (0..7)
0 0 0 0 0 0 0 0 
##$TUNHIN= 0
##$TUNHOUT= 0
##$TUNXOUT= 0
##$USERA1= <user>
##$USERA2= <user>
##$USERA3= <user>
##$USERA4= <user>
##$USERA5= <user>
##$V9= 5
##$VALIST= <valist>
##$VCLIST= <CCCCCCCCCCCCCCC>
##$VD= 0
##$VDLIST= <DDDDDDDDDDDDDDD>
##$VPLIST= <PPPPPPPPPPPPPPP>
##$VTLIST= <TTTTTTTTTTTTTTT>
##$WBST= 1024
##$WBSW= 4
##$XGAIN= (0..3)
0 0 0 0 
##$XL= 0
##$YL= 0
##$YMAX_a= 9561
##$YMIN_a= -15262
##$ZGOPTNS= <>
##$ZL1= 120
##$ZL2= 120
##$ZL3= 120
##$ZL4= 120
##$ABSF1= 0
##$ABSF2= 0
##$ABSG= 0
##$ABSL= 0
##$ALPHA= 0
##$AQORDER= 0
##$ASSFAC= 0
##$ASSFACI= 0
##$ASSFACX= 0
##$ASSWID= 0
##$AUNMP= <proc_1d>
##$AZFE= 0.1
##$AZFW= 0.5
##$BCFW= 0
##$BC_mod= 2
##$BYTORDP= 0
##$COROFFS= 0
##$CY= -3
##$DATMOD= 1
##$DC= 0
##$DFILT= <>
##$DTYPP= 0
##$F1P= 0
##$F2P= 0
##$FCOR= 1
##$FTSIZE= 65536
##$FT_mod= 6
##$GAMMA= 0
##$GB= 0
##$INTBC= 1
##$INTSCL= 5.30512e-09
##$ISEN= 30
##$LB= 1
##$LEV0= 0
##$LPBIN= 0
##$MAXI= 10000
##$MC2= 0
##$MEAN= 0
##$ME_mod= 0
##$MI= 50
##$NCOEF= 0
##$NC_proc= -6
##$NLEV= 6
##$NOISF1= 182.463
##$NOISF2= 159.3651
##$NSP= 0
##$NTH_PI= 0
##$NZP= 0
##$OFFSET= 298.0089
##$PC= 4
##$PHC0= -1919.834
##$PHC1= 110.0023
##$PH_mod= 1
##$PKNL= yes
##$PPARMOD= 0
##$PSCAL= 0
##$PSIGN= 0
##$REVERSE= no
##$SF= 81.014009
##$SI= 65536
##$SIGF1= 159.3651
##$SIGF2= -187.1042
##$SINO= 113.3802
##$SIOLD= 16384
##$SREGLST= <1H.CDCl3>
##$SSB= 0
##$STSI= 65536
##$STSR= 0
##$SW_p= 48661.800486618
##$SYMM= 0
##$S_DEV= 0
##$TDeff= 32768
##$TDoff= 0
##$TI= <>
##$TILT= no
##$TM1= 0
##$TM2= 0
##$TOPLEV= 0
##$USERP1= <user>
##$USERP2= <user>
##$USERP3= <user>
##$USERP4= <user>
##$USERP5= <user>
##$WDW= 1
##$XDIM= 65536
##$YMAX_p= 516667966
##$YMIN_p= -28774806
$$ End of Bruker specific parameters
$$ ---------------------------------
##NTUPLES= NMR SPECTRUM
##VAR_NAME=  FREQUENCY,     SPECTRUM/REAL,   SPECTRUM/IMAG
##SYMBOL=    X,             R,               I
##VAR_TYPE=  INDEPENDENT,   DEPENDENT,       DEPENDENT
##VAR_FORM=  AFFN,          ASDF,            ASDF
##VAR_DIM=   65536,         65536,           65536
##UNITS=     HZ,            ARBITRARY UNITS, ARBITRARY UNITS
##FACTOR=    0.742531479157977, 1,           1
##FIRST=     24142.8966085939, 0,            0
##LAST=      -24518.9038780241, 0,           0
##MIN=       -24518.9038780241, -28774806,   0
##MAX=       24142.8966085939, 516667966,    0
$$ Real data points
##PAGE= N=1
##DATA TABLE= (X++(R..R)), XYDATA
$$ [...]
44524a101702l77399K774708J783236j945122k756092p43488p22249k940515k993353
44515i021976m84766K06199j524848q17104L871771P141692M782747j45287k696583
44506A311845k612509j872790p8362L233828M893814J758144l435480m559346
44498a360856l99015L382321J662640l488818n612578k253379J869476J216448
44490d983761k747165l304053J620897N641825L041645k228971k272981K395288
44482b837276L612825j231617m844516j730661L159531K618079j775075l256426
44474f285136o45468J409251Q62361K85069J137647J970864K391419L547805M366193
44465I040005K313513j532527l095006j791420j341111k764474k067861K398899
$$ plain form
44524 -1101702 -1479101 1295607 3078843 1133721 -1622371 -2365859 -3088108 -6028623 -9021976
44515 -9021976 -9506742 -9300543 -10825391 -11642495 -7770724 -629032 4153715 4008428 1311845
44506 1311845 -1300664 -3173454 -3251816 -17988 4875826 6633970 3198490 -1360856
44498 -1360856 -1759871 1622450 3285090 -203728 -5816306 -8069685 -6200209 -4983761
44490 -4983761 -7730926 -11034979 -9414082 -3772257 -730612 -2959583 -5232564 -2837276
44482 -2837276 775549 -456068 -5300584 -7031245 -3871714 -1253635 -3028710 -6285136
44474 -6285136 -6930604 -5521353 -4658992 -4373923 -3236276 -1265412 1126007 4673812 9040005
44465 9040005 11353518 9820991 6725985 4934565 3593454 828980 -1238881 1160018
44457A160018N428725K069740m410803o587054k828445J660607K881418K281553
44449A655759K326552K157497k1149k924067l539090j549639L01982M13074L97770
44440g81311J763704K699516P58382k368178k305725J270797L061132n40247n594365
44431b036295n504152N6967M978314M861698J522398j032269j619439j482721
44423b55499j376353q52867N93681K623820L813656K595879n79217k850403k306347
44414A406350o89491n67191j066987L83283K889684K726181o08020l099439k144557
44405g70187O3899P55362N64041R96604J113331l72772k036727j767201l14109
44396a767759j31313j616096k660650j418861J776203M541879M004540k03439
$$ plain form
44457 1160018 6588743 8658483 4247680 -2339374 -5167819 -3507212 -625794 1655759
44449 1655759 3982311 6139808 6118659 3194592 -344498 -1894137 -1592155 -1179081 -781311
44440 -781311 982393 3681909 4440291 2072113 -233612 1037185 4098317 3558070 -2036295
44431 -2036295 -7540447 -7483480 -2505166 2356532 3878930 2846661 1227222 -255499
44423 -255499 -1631852 -2484719 -1891038 732782 4546438 7142317 6563100 3712697 1406350
44414 1406350 716859 149668 -917319 -534036 2355648 5081829 4473809 1374370 -770187
44405 -770187 -706288 49074 613115 1609719 2723050 2350278 313551 -1453650 -1767759
44396 -1767759 -1899072 -3515168 -6175818 -7594679 -5818476 -1276597 2727943 2524504
44388B524504m133524l124748J990445N192061L093412q06770j698426J06668
44380C143622J197770M94541q20714k325652l619295k680471J133053M259492
44372G82346L218904J60243k79690J670150J689919j150729l069651k091985o37986
44363B91521m54298J608J281431Q76321j907237l297598o73449K670187K180241
44354I68727j214094l059144k177229j267435j585337j160145J302433L939174
44346d253050M167554J745946j214107k186424l25957K373414K774462N77992
44338C659830q37697O97459K381247N39825l156082l709931m21663K154825J339820
44329B647633l88045o95640j130194k901284l386233n62037K694605K915416J577800
$$ plain form
44388 2524504 -1609020 -4733768 -2743323 2448738 5542150 4735380 3036954 3143622
44380 3143622 4341392 4835933 4015219 1689567 -1929728 -4610199 -3477146 782346
44372 782346 4001250 4161493 3881803 5551953 7241872 6091143 3021492 929507 291521
44363 291521 -162777 -161169 1120262 1996583 89346 -3208252 -3881701 -1211514 968727
44354 968727 -245367 -3304511 -5481740 -6749175 -8334512 -9494657 -8192224 -4253050
44346 -4253050 -85496 1660450 446343 -1740081 -2066038 307376 3081838 3659830
44338 3659830 2822133 3519592 5900839 6440664 3284582 -425349 -847012 1307813 2647633
44329 2647633 2259588 1563948 433754 -2467530 -5853763 -6415800 -3721195 -805779 772021
44320G72021J767419K109866n13617m156659l817163M67754L515630K967832J487549
44311D600632O67642r75480k796720j336602K954264M508511J035614k748246
44303E909615k933120j870485k031301q94749K874689M334963j16392n245708
44295B7512m370429J15842J406134k79017L71520K983332K130932k050881l194087
44286b859142N13974L236425J022182k744745l611826j734455O51645K243619
44278c282323J884798m64814j658899P81331L454698J636443k221359j906493
44270a776618J711679K048826j263600j780406J474926J875534k250226l968404
44262c928289m35417J835986n80255j459037K766457N115297N21791m071864j416694
$$ plain form
44320 772021 2539440 4649306 4135689 -20970 -3838133 -3370379 145251 3113083 4600632
44311 4600632 5268274 4292794 1496074 159472 3113736 7622247 8657861 5909615
44303 5909615 2976495 1106010 -925291 -1820040 1054649 5389612 5273220 27512
44295 27512 -4342917 -4227075 -2820941 -3099958 -2728438 254894 2385826 334945 -2859142
44286 -2859142 -2345168 891257 1913439 -831306 -4443132 -6177587 -5525942 -3282323
44278 -3282323 -1397525 -1862339 -3521238 -2739907 714791 2351234 129875 -1776618
44270 -1776618 -64939 1983887 720287 -1060119 414807 2290341 40115 -3928289
44262 -3928289 -4363706 -2527720 -3107975 -4567012 -1800555 3314742 3836533 -235331 -1652025
44253a652025L551806L103364J0465L98478J274705k532166n951131j654959N091420
44244A639957L907340k421768k287715M327182N599648j682136o962322l944703
44236a824517N98346M93288m59300J349192J484034l018395o019108k013085M131784
44227e277761M844634J240549m46469Q70574J350808l93243j996369j627166M06554
44218a027889K660665K881659j45644l637923l209074N77901K432335L94578j534691
44209f08083o23920N28854j56862k24609J917970L100079J079342q61333M46621
44200D598059K321787R55702k099694l134752k466246k312917j612058J511331
44192b238788M408063K861324j639809l040738O72374M602525L784017n85111
$$ plain form
44253 -1652025 1899781 5003145 5013610 5412088 6686793 4154627 -1796504 -3451463 1639957
44244 1639957 5547297 3125529 837814 5164996 10764644 9082508 2120186 -1824517
44236 -1824517 -1226171 -732883 -1192183 157009 1641043 -1377352 -7396460 -9409545 -5277761
44227 -5277761 -433127 807422 360953 1231527 2582335 2189092 192723 -1434443 -1027889
44218 -1027889 1632776 4514435 4368791 730868 -2478206 -1900305 532030 926608 -608083
44209 -608083 -1232003 -703149 -860011 -1084620 833350 3933429 5012771 4151438 4598059
44200 4598059 6919846 7875548 5775854 2641102 174856 -2138061 -3750119 -2238788
44192 -2238788 2169275 5030599 3390790 350052 1022426 5624951 9408968 8823857
44184H823857l571698l131415k005457k976215m171851j536337M051980N998920
44176A481784J051078m586159l297788K397203L262957k557796o784963l636091
44168a2669775K526469N141501M049400K213199P3836k208241k182851N40243
44160b516219K084933P13827L02500K838067L294342j943614p089294n014940
44152g330398J034720K401581j172811j983979K361425N502431L384092L06949
44144D504010R28015L020199K165689j261769l814880m229702l397223j637774
44136c723435P13819J787210K98051j735980j016925K445766M754959K635083
44128F158548k548684n985917m393469P54890N103174N808706L341867k45748
$$ plain form
44184 8823857 5252159 2120744 115287 -2860928 -7032779 -8569116 -4517136 1481784
44176 1481784 2532862 -2053297 -5351085 -2953882 309075 -2248721 -9033684 -12669775
44168 -12669775 -10143306 -5001805 -952405 1260794 1334630 -873611 -3056462 -2516219
44160 -2516219 -431286 282541 585041 3423108 6717450 4773836 -2315458 -7330398
44152 -7330398 -6295678 -3894097 -5066908 -7050887 -4689462 812969 4197061 4504010
44144 4504010 5432025 8452224 10617913 9356144 5541264 1311562 -2085661 -3723435
44136 -3723435 -3009616 -1222406 -924355 -2660335 -3677260 -1231494 3523465 6158548
44128 6158548 3609864 -2376053 -6769522 -6014632 -911458 4897248 8239115 7993367
44120G993367l089548l782427k176713m88371j324930l648196l169921J616163
44112h070576O250118N633191P34678k960559k681626q97796o72838j539441j250961
44103e455810L48139J187841K83561n83919N97147K810698L028426N72750j608093
44094A180740j091536O83202J102500L87061K47449L21521n83902j032836J067278
44085B281477L650708K378470k262042m559144j729718J964151J546381j921071
44077A349212l729130k006980R31212K095464O77448j470468j309249J948807
44069a513684M701553K638516l141487o661200m515466K74297L078579L262457
44061a876435L005669K897715J270312k653399o482609o233871q59799N135312
$$ plain form
44120 7993367 4903819 1121392 -1055321 -1543692 -2868622 -6516818 -9686739 -8070576
44112 -8070576 -1820458 3812733 4547411 1586852 -1094774 -1992570 -2665408 -4204849 -5455810
44103 -5455810 -5107671 -3919830 -3636269 -4220188 -3623041 -812343 2216083 2788833 1180740
44094 1180740 89204 772406 1874906 2261967 2509416 2830937 2247035 1214199 2281477
44085 2281477 5932185 8310655 6048613 1489469 -240249 1723902 3270283 1349212
44077 1349212 -2379918 -4386898 -3455686 -1360222 -682774 -2153242 -3462491 -1513684
44069 -1513684 3187869 5826385 2684898 -3976302 -8491768 -8217471 -5138892 -1876435
44061 -1876435 1129234 4026949 5297261 2643862 -3838747 -10072618 -10932417 -5797105
44053e797105N933480J801509j208297k56166N71286j595319k802667q7371J603639
44044a837011k013432n134664r45685N057530K942171m143439m346901K575190
44036g846241M739817j055244m028403J252605N786665K591718k023013j214252
44028a796348J299268R58343R91650L084759J560849m434481n413083K181491
44020a567552P017964J173388n658858l030053K130247o73934n528799j365273
44012g502870O695881O019314j122602k919980J92305j343951n873661l392046
44004i247610M069038N014418m4239J49931N421185M142038l675332m965397J729057
43995B593089K406744o158351q829078P54463P390692M97325p238455k228301
$$ plain form
44053 -5797105 136375 1937884 729587 473421 1044707 -550612 -3353279 -3440650 -1837011
44044 -1837011 -3850443 -8985107 -9930792 -4873262 -1931091 -6074530 -10421431 -7846241
44036 -7846241 -3106424 -4161668 -8190071 -6937466 -1150801 1440917 -582096 -1796348
44028 -1796348 -497080 461263 1452913 4537672 6098521 1664040 -3749043 -1567552
44020 -1567552 5450412 6623800 964942 -2065111 65136 -608798 -6137597 -7502870
44012 -7502870 -806989 5212325 4089723 1169743 1362048 18097 -5855564 -9247610
44004 -9247610 -5178572 -164154 -208393 -58462 5362723 9504761 5829429 864032 2593089
43995 2593089 4999833 -1158518 -9987596 -9233133 -1842441 -1345116 -8583571 -10811872
43987a0811872O822790N374706j923649j579423M356910L768850k911519m573028
43979a476235J29522K010939n57885N26194O381496P468553j08643p441240o698257
43970B34444j842209J9663l06590J806509N242301M618168q01207n365566m656407
43961a050894j118223q4944k027291k096772J974736N337931K789280k774207
43953I49616l969798K36919L420217J651558j635015k106554q6865K212042L713562
43944D385682L009016q21936m440962l055182J588687K498292j607477m044921
43936b488801j331811J557624Q20595K01717K492880K958202j855315o060643
43928c705552l271157K428757L016580n51948j004006K668661M285258J072686
$$ plain form
43987 -10811872 -3989082 1385624 -538025 -2117448 2239462 6008312 3096793 -1476235
43979 -1476235 -1346713 664226 106341 632535 7014031 14482584 14373941 6932701 234444
43970 234444 -1607765 -1588102 -1894692 -88183 5154118 9772286 8971079 3605513 -1050894
43961 -1050894 -2169117 -2254061 -4281352 -6378124 -4403388 934543 3723823 949616
43953 949616 -3020182 -2783263 636954 2288512 653497 -1453057 -1539922 672120 4385682
43944 4385682 7394698 6572762 2131800 -923382 665305 3163597 1556120 -2488801
43936 -2488801 -3820612 -2262988 -1442393 -1240676 1252204 4210406 2355091 -3705552
43928 -3705552 -6976709 -4547952 -1531372 -2083320 -3087326 -418665 3866593 4939279
43920D939279k625249k475001Q65535M084257M274452M18381m619634n431492
43912e69472r88339K567540K83219l816036k789244K293523M136596N43039k780865
43903a120039j139796K990205M220325J059557k974278l390642L74869L704332
43895C724533K062907k392277l200406M79837J843579k748276p007283m004620
43887a1242006K968069N597653K909728R47782K167147K708690j6035l560930
43879B480098m964811l939651j020139L040919N647076M180514m3833k926316
43871B453857k715385j027473O83493K292273K990239J535162j267249l001559
43863A943358k690603j430344m00409l7958m79146j222038j225275m13483L42229
$$ plain form
43920 4939279 2314030 -160971 704564 4788821 9063273 9481654 4862020 -569472
43912 -569472 -1557811 1009729 1292948 -2523088 -5312332 -3018809 1117787 1660826 -1120039
43903 -1120039 -2259835 730370 4950695 6010252 3035974 -354668 20201 3724533
43895 3724533 5787440 3395163 194757 674594 2518173 -230103 -7237386 -11242006
43887 -11242006 -8273937 -2676284 233444 1181226 3348373 6057063 6041028 2480098
43879 2480098 -2484713 -6424364 -7444503 -4403584 1243492 5424006 5380173 2453857
43871 2453857 -261528 -1289001 -605508 1686765 4677004 6212166 4944917 1943358
43863 1943358 -747245 -2177589 -2577998 -2615956 -3095102 -4317140 -5542415 -5955898 -5613669
43854e613669J271559L141822M042424O88376n356345p269564j851546N208361
43846e738582O573660K233377k467932m275592l439475q83614J763402J944369
43838d290387k54725j068620J170258K910420J606825M55831K200597L121295
43830E851494n78785m741900l077925K127417L216770p28304l240308j480613
43822b652154K12347j133464k356338m12319K324395K104244o40803k467578j413819
43813f435489J312359K787989J114826k246941l575431j433833J448385K168960
43805d859175J173483N4477j161468k172200j173899J582804K402821l90523l090656
43796g634336k247059J00085Q06639J206663L526094N459615L663837l46038k783707
$$ plain form
43854 -5613669 -4342110 -1200288 2842136 3530512 -1825833 -9095397 -10946943 -5738582
43846 -5738582 835078 3068455 600523 -3675069 -7114544 -7998158 -6234756 -4290387
43838 -4290387 -4545112 -5613732 -4443474 -1533054 73771 529602 2730199 5851494
43830 5851494 5272709 530809 -2547116 -419699 2797071 2068767 -1171541 -2652154
43822 -2652154 -2439807 -3573271 -5929609 -6341928 -4017533 -1913289 -2554092 -5021670 -6435489
43813 -6435489 -5123130 -2335141 -1220315 -3467256 -7042687 -8476520 -7028135 -4859175
43805 -4859175 -3685692 -3631215 -4792683 -6964883 -8138782 -6555978 -4153157 -4543680 -7634336
43796 -7634336 -9881395 -9781310 -8974671 -7768008 -4241914 1217701 4881538 4535500 1751793
43787A751793l134103k572320m32432K975147M051915J500462k53559J420001
43779E306904J867338k342876n556015k020183L057442J469516l841822l913243
43771e972939O95244J960169l00306J256544O102708M909834l481800p698183
43763b528729j531760N786471L932145l371431n520196o29631M018966L358280
43755C514115l26391k275381j031942O31657m30854k625200o54459N659720P796755
43746A0258020l1720r695248q561523J798112P200402J717283m613963k421334
43738d349971L521015L704861j639600n035027l344552J65362K282425K684833
43730b010654J863170K05926j407113k031295j252345N63492J631296P0818k357777
$$ plain form
43787 1751793 -1382310 -3954630 -4387062 -1411915 2640000 4140462 3886903 5306904
43779 5306904 7174242 4831366 -724649 -2744832 312610 1782126 -2059696 -5972939
43771 -5972939 -5277695 -3317526 -3617832 -2361288 3741420 8651254 5169454 -2528729
43763 -2528729 -4060489 1725982 5658127 2286696 -3233500 -3863131 155835 3514115
43755 3514115 3187724 912343 -119599 512058 81204 -2543996 -3198455 2461265 10258020
43746 10258020 10226300 531052 -8030471 -6232359 968043 2685326 -1928637 -4349971
43738 -4349971 -828956 2875905 1236305 -3798722 -7143274 -6977912 -4695487 -2010654
43730 -2010654 -147484 58442 -1348671 -3379966 -4632311 -4068819 -2437523 -2366705 -4724482
43721d724482j106310L652157N151641L57352l751361j143693K539845k04587
43713G70562m586365j571241N107688M719248j220063k001129J853993k97635
43705B775058p307356n780935M804963P808689k383983r025258r32425Q390733
43697a650514M208904n020216m424868J447631k28793n502341j543829Q178799
43689d535227Q574870j071115o489302k773607M69l106463l964833K413531Q593984
43680b357693P036382M95353m401937n124472j952070L303835N735462K016189
43672D751049l106223k609028J689467K631310M94109J479154M418246J367340
43664A1115424p323943j0949886m723459L067746M393035J923077J390255K454284
$$ plain form
43721 -4724482 -5830792 -2178635 2973006 3330358 -421003 -1564696 975149 770562
43713 770562 -3815803 -5387044 -279356 4439892 3219829 1218700 3072693 2775058
43705 2775058 -4532298 -10313233 -5508270 2300419 -83564 -9108822 -10041247 -1650514
43697 -1650514 2558390 -2461826 -6886694 -5439063 -5667856 -11170197 -12714026 -4535227
43689 -4535227 4039643 2968528 -3520774 -6294381 -6293912 -9400375 -13365208 -10951677 -2357693
43680 -2357693 4678689 5174042 772105 -4352367 -6304437 -3000602 2734860 4751049
43672 4751049 1644826 -964202 725265 3356575 3850684 5329838 9748084 11115424
43664 11115424 3791481 -7158405 -11881864 -8814118 -4421083 -2498006 -1107751 1346533
43656A346533K342907J231489l92781l163356m643139j001142M597603L832446
43648D150560l292957o224753J78320P000905N032726j692891m128161k352543
43640a328794k126092l035204l01420M675354N337017P14255l048207k195646
43632a308737M26308J494230J687031K453892K792293J288374j339255l224850
43624D269286l387508k225613r70089n27806l16798Q47737K345485K053880j81314
43615A907260j664395o81318J143259J780619J590991J450025O85969r74862j824107
43606C413441q55487J85190k91011j039607n41473K72587M67735J470146L675359
43597F756880L549631j437539p085223o892885j308011K862568K350758J078291
$$ plain form
43656 1346533 3689440 4920929 4528148 1364792 -3278347 -4279489 318114 4150560
43648 4150560 857603 -5367150 -5188830 1812075 6844801 5151910 1023749 -1328794
43640 -1328794 -3454886 -6490090 -6791510 -2116156 3220861 3935116 886909 -1308737
43632 -1308737 -882429 611801 2298832 4752724 7545017 8833391 7494136 4269286
43624 4269286 881778 -1343835 -2313924 -2841730 -3158528 -2310791 34694 2088574 1907260
43615 1907260 242865 -438453 704806 2485425 4076416 5526441 6212410 5237548 3413441
43606 3413441 2557954 2743144 2452133 1412526 871053 1143640 1611375 3081521 6756880
43597 6756880 10306511 8868972 1783749 -5109136 -6417147 -3554579 -1203821 -125530
43589a25530K494552L879200J648114j971296k199706O98853J834135r21570m139277
43580A197475l976229q33839K180701K904309J076345k120004m129791k648903
43572f349936J242074L340166J434727j592519j813221L94498J721525J183883
43564d38803O91276J131583J376599R86349M88979q97877m002046o065882l005389
43555i735211L594327O615327K788340k636044l617749j372637p39082k291361
43547g394090k880504j388529Q09526L056840M600993K841071k584698o136760
43539i076151k736585L732173M963841N42380j885532O67269K197555r41958k955050
43530e492058J252210N909148K643301n483798p616666j282877M557891L658331
$$ plain form
43589 -125530 2369022 6248222 7896336 5925040 3725334 4424187 6258322 5336752 1197475
43580 1197475 -2778754 -3612593 -1431892 1472417 2548762 428758 -3701033 -6349936
43572 -6349936 -5107862 -1767696 -332969 -1925488 -3738709 -3344211 -1622686 -438803
43564 -438803 252473 1384056 2760655 3747004 4235983 3338106 -663940 -6729822 -9735211
43555 -9735211 -6140884 474443 3262783 626739 -2991010 -4363647 -5102729 -7394090
43547 -7394090 -10274594 -11663123 -10853597 -7796757 -3195764 -354693 -2939391 -9076151
43539 -9076151 -11812736 -8080563 -3116722 -2574342 -4459874 -3792605 -1595050 -2537008 -5492058
43530 -5492058 -4239848 1669300 4312601 -1171197 -8787863 -10070740 -5512849 -1854518
43522a854518M68538M36096Q49697k226674m585747k63157O564801O101451j538921
43513C951566n641002j481738K715044m6612m197442j966488L076480K763296
43505h26896j208356r16685L140904L239635r79278j793076J827624J740286l890074
43496C34084n692919N58709N158801M20237n641615k299032O058738P385013J130066
43487G412082k868180j074148O88501m89376q98764Q41146J275448l03782n19229
43478D063698P74415p8031k817814k833455M74965K455451J385455L66319M4531
43469C835534k565340o395056n665290N19766N556693N199539K726103J326096
43461D538045r84770m945847o008333j781199K754348K720400N45381N14419J354906
$$ plain form
43522 -1854518 -1385980 -949884 -100187 -2326861 -6912608 -7175765 -610964 5490487 3951566
43513 3951566 -1689436 -3171174 -456130 -502742 -4700184 -6666672 -3590192 -826896
43505 -826896 -2035252 -2951937 188967 3428602 2449324 656248 2483872 4224158 334084
43496 334084 -5358835 -4800126 358675 778912 -4862703 -7161735 -1102997 6282016 7412082
43487 7412082 4543902 3469754 4158255 3668879 2770115 3611261 4886709 4582927 4063698
43478 4063698 4838113 4760082 1942268 -891187 -416222 2039229 3424684 3791003 3835534
43469 3835534 1270194 -5124862 -10790152 -10270386 -4713693 485846 3211949 4538045
43461 4538045 3553275 -1392572 -7400905 -9182104 -6427756 -3707356 -3161975 -2647556 -1292650
43452a292650j0286j763697m00732K549345K873394O15911n17452P52002K225485
43443E031320K306564J571207R24404O28028L49382j014334l788292n340591k700292
43434b032604J928378K677725j405052m282256j922760J796875J656674j315798
43426b898818k971160k434125j023055J253521L760230L678428P05859q32584
43418g61704R91528J498291k356260m991768q21795M954000L369931l610772n652882
43409g381431k55996M090473K011975j580228j389499L02016O2429j9133K419168
43400a740226M238684K106398j207473j511308j37570n41703j577141k93154J525854
43391H62361L51897j650674L57369M240654K510662n067676q818810l045441M671179
$$ plain form
43452 -1292650 -1302936 -3066633 -3467365 -918020 1955374 2571285 2053833 2805835 5031320
43443 5031320 7337884 8909091 9833495 10461523 10810905 9796571 6008279 667688 -2032604
43434 -2032604 -104226 2573499 1168447 -3113809 -5036569 -3239694 -1583020 -2898818
43426 -2898818 -5869978 -8304103 -9327158 -8073637 -4313407 -634979 70880 -761704
43418 -761704 229824 1728115 -628145 -5619913 -6441708 -1487708 1882223 -1728549 -7381431
43409 -7381431 -7637427 -3546954 -1534979 -3115207 -4504706 -4202690 -4140261 -4159394 -1740226
43400 -1740226 2498458 4604856 3397383 1886075 1748505 1206802 -370339 -663493 862361
43391 862361 1214258 -436416 -79047 4161607 6672269 1604593 -7214217 -10259658 -5588479
43382e588479M281919j964782l583716J970079O114847K826125k751488l005386
43374a700881J090884K965503O67393j748645j511412m07622n26411j018163m01372
43365b590726P81421J164738P74297P73698J669807K410883J323465j680927m083090
43356E43566l387717q10338J1763j490459j862230M59767K262134J282257N90583
43347b400674L056070N303551K730948k415886m273445k498979j382128j401281
43339c281824P41836M173492L971563r677k175992l78558J536461J762930K829156
43330I169387L872901n1603p419624q763466j166362N269504K503519l003421
43322D10835j831855K770280J956571k459842j650469L948480N214718K63188
$$ plain form
43382 -5588479 -1306560 -3271342 -6855058 -4884979 1229868 4055993 1304505 -1700881
43374 -1700881 -609997 2355506 3022899 1274254 -237158 -644780 -1171191 -2189354 -2590726
43365 -2590726 -1809305 -644567 129730 903428 2573235 4984118 6307583 4626656 543566
43356 543566 -2844151 -3654489 -3642726 -5133185 -6995415 -6535648 -4273514 -2991257 -2400674
43347 -2400674 655396 5958947 8689895 6274009 2000564 -498415 -1880543 -3281824
43339 -3281824 -2539988 1633504 5605067 5595390 3419398 3040840 4577301 6340231 9169387
43330 9169387 13042288 12990685 5571061 -3192405 -4358767 910737 3414256 410835
43322 410835 -1421020 1349260 3305831 845989 -804480 3144000 8358718 8621906
43314H621906k838576l81292J738542j62516j334145J445263L168366m56902m975151
43305D825495m312925j57099J864243R46932K61452O01662K76020p59626j194917
43296B351237j355216k313476l230172k412019O8321K733100M202058L149250
43288C193083p78005m692969m325989J5033K886173J421142m39085J260065L701505
43279B240953K211250j410428j653854J323821J733249k288431n423643l269888
43271f536971J504786L840763L043437J567684J28978k096433m022142l226118
43263e796016J84186L126505L300259J378926p15089j795896j384862L19234J742015
43254C59262J012036j296488k207589l69210J705049J162263j070698k063927
$$ plain form
43314 8621906 5783330 5402038 7140580 6978064 5643919 7089182 10257548 9800646 4825495
43305 4825495 512570 355471 2219714 3166646 3428098 4029760 4305780 3546154 2351237
43296 2351237 996021 -1317455 -4547627 -6959646 -6891325 -4158225 43833 3193083
43288 3193083 2415078 -2277891 -6603880 -6588847 -3702674 -2281532 -2720617 -1460552 2240953
43279 2240953 4452203 3041775 1387921 2711742 4444991 2156560 -3267083 -6536971
43271 -6536971 -5032185 -1191422 1852015 3419699 3548677 1452244 -2569898 -5796016
43263 -5796016 -5611830 -2485325 814934 2193860 1478771 -317125 -1701987 -1382753 359262
43254 359262 1371298 74810 -2132779 -2501989 -796940 365323 -705375 -2769302
43246b769302j390194p74222j60207J961172M273265L172927j069405l204715
43238C9319o08249K338057J201982j219895Q3064L105293J562786m074951n841302
43229c413896j87927O084867N327489p21142m656329l685694j222948k49915n855
43220b731350R02019J787748J074497j583928m518973m771229r57342L762815
43212g035743M090207l17868l286823n76331L530401K672877j525486k284620
43204d733386R14259J568995k324120m281145l88456L362382Q85331l055949k3298
43195h075387P647372R170590J597569n654869m879755k56632O99429j062071
43187h13754K50278M101619M064599j452492o040718m422805N72842K827721R88086
$$ plain form
43246 -2769302 -4159496 -4933718 -5093925 -3132753 1140512 4313439 3244034 39319
43238 39319 -568930 1769127 2971109 1751214 1834278 4939571 6502357 2427406 -3413896
43229 -3413896 -3601823 2483044 7810533 7089391 2433062 -1252632 -2475580 -2725495 -2731350
43220 -2731350 -1829331 -41583 1032914 -551014 -5069987 -9841216 -10798558 -7035743
43212 -7035743 -2945536 -3263404 -6550227 -7126558 -3596157 -923280 -2448766 -4733386
43204 -4733386 -3819127 -2250132 -4574252 -8855397 -9243853 -5881471 -4996140 -8052089 -8075387
43195 -8075387 -428015 8742575 10340144 4685275 -194480 -451112 248317 -813754
43187 -813754 -563476 3538143 7602742 6150250 109532 -4313273 -3740431 -912710 75376
43178G5376j478622j964143j024306J76844J556322K694670K121003m70053k624753
43169i37662j746314J029246J838439l31305j572818J193852M452581K062798
43161E988817n269545r174892m251010M372744P474999L105931k470721l660989
43153c884666j001917K010698L300565K359671n24648l363589l198115K80819
43145d021182L410612K690764q06868k925375j742620M63763Q41699j40082J01703
43136b127586J855664K257463j68595k427119j192799J488475O73644l476402
43128c117255n017975j055310L675951M093688K054130J954417L019710J761651
43120G369007n75919K87333L577990L818051l45523l946267l678590k233877k469761
$$ plain form
43178 75376 -1403246 -3367389 -4391695 -4214851 -2658529 36141 2157144 1687091 -937662
43169 -937662 -2683976 -1654730 183709 -147596 -1720414 -526562 3926019 5988817
43161 5988817 719272 -8455620 -12706630 -8333886 -858887 2247044 -223677 -3884666
43153 -3884666 -4886583 -2875885 424680 2784351 2259703 -1103886 -4302001 -4021182
43145 -4021182 -610570 2080194 1273326 -1652049 -3394669 -2930906 -2089207 -2229289 -2127586
43136 -2127586 -271922 1985541 1816946 -610173 -1802972 -314497 359147 -3117255
43128 -3117255 -8135230 -9190540 -5514589 -1420901 633229 2587646 5607356 7369007
43120 7369007 6793088 7080421 10658411 14476462 14130939 10184672 6506082 4272205 1802444
43111A802444k622517n95438J285071j97154l505605m039882l57906M065233N069501
43102I03747K292420p02436n89636J572522J763572q80727k296085L4125K550748
43093D648250J570295j31450J308972K446463k167714q400768o547668K675565
43085d598055P202538J695984m412095k467942K146277N17445m470122l622168
43077h008138L054008O919308M319972Q2657j841342k773720l819290l151149
43069e217694l98143J495625M55118k105327l541602k374421J146903M611555
43061e927986M775421J446612j818249k687751k590682k237507O43664N519631
43053b876847O418925N77731n218289l714631J682402K717790l25177k29020M089882
$$ plain form
43111 1802444 -820073 -1415511 -130440 -327594 -3833199 -7873081 -8230987 -4165754 903747
43102 903747 3196167 2493731 1904095 3476617 5240189 4359462 2063377 2097502 4648250
43093 4648250 6218545 6087095 7396067 9842530 7674816 -725952 -7273620 -4598055
43085 -4598055 2604483 4300467 -111628 -2579570 -433293 84152 -4385970 -8008138
43077 -8008138 -4954130 1965178 6285150 6367807 4526465 1752745 -2066545 -5217694
43069 -5217694 -5615837 -4120212 -3665094 -5770421 -9312023 -11686444 -10539541 -5927986
43061 -5927986 -1152565 294047 -1524202 -4211953 -6802635 -9040142 -8396478 -2876847
43053 -2876847 3542078 4119809 -1098480 -4813111 -3130709 -412919 -738096 -967116 3122766
43044C122766N905929K238681k049654l173603l224698l894668k907171M19463
43036c562955K514856J489239J87948O29207O43118j260802k678684j834748q35425
43027d708246j556896k247397r34683J186680K043389J384382k38675k058173
43019g129619j977603J261868M350268K610106k292816l382569J294374N323345
43011E7354L615025l92238j117359O98534P90135j145698j937135p00067M45568
43002C14119K94931k89409m25698L664P85746J004052m50197k723063l054762
42993d540617k52731L537740N405020M220788L37579m647312p324700m766900
42985h031133J449057O108322O160785L259905K96830j504885j734117n18523
$$ plain form
43044 3122766 9028695 11267376 9217722 6044119 2819421 -1075247 -3982418 -3562955
43036 -3562955 -1048099 441140 629088 1258295 1901413 640611 -2038073 -3872821 -4708246
43027 -4708246 -6265142 -8512539 -9447222 -8260542 -6217153 -4832771 -5071446 -7129619
43019 -7129619 -9107222 -7845354 -3495086 -884980 -3177796 -6560365 -5265991 57354
43011 57354 3672379 3280141 2162782 2861316 3651451 2505753 568618 -131449 314119
43002 314119 609050 319641 -106057 -102393 683353 1687405 1237208 -1485855 -4540617
42993 -4540617 -4793348 -1255608 4149412 8370200 8707779 4060467 -3264233 -8031133
42985 -8031133 -6582076 -473754 5687031 8946936 9243766 7738881 6004764 5486241
42977E486241K83464j095435l060154k673528o59243j36020p98997L68880K668619
42968C83827K144261q68119j362710J657247L063872M18114k128439j577500n37712
42959A192841n42523J479679N634986N706722q61291o770190n258183j42356J642564
42950B082249J135452K716147M081504L92024n476831o384490k133842J528150
42942b059637K822635M124133M324175K68493n225047n814558j775019P26034
42934b608791K5193L7494J373357O49258j087604J063230N776261N892844P26052
42925A1847294k233312n50415q45637n339431n911849J492362P255575K400737
42917H115324o209189o269269O88801K978879j638104l194417L234026R474023
$$ plain form
42977 5486241 5769705 4674270 1614116 -1059412 -1718655 -1854675 -2653672 -2284792 383827
42968 383827 2528088 1659969 297259 1954506 5018378 5436492 3308053 1730553 1192841
42959 1192841 650318 2129997 7764983 13471705 12610414 5840224 582041 439685 2082249
42950 2082249 3217701 5933848 10015352 10407376 4930545 -1453945 -3587787 -2059637
42942 -2059637 762998 4887131 9211306 9479799 4254752 -1559806 -3334825 -2608791
42934 -2608791 -2583598 -2546104 -1172747 -523489 -1611093 -547863 5228398 11121242 11847294
42925 11847294 9613982 9063567 8217930 2878499 -3033350 -1540988 5714587 8115324
42917 8115324 1906135 -4363134 -3674333 -695454 -2333558 -5527975 -2293949 7180074
42909G180074P126659o35886n250512m386104k039114j144431j239733j462424
42901a851471j720763j507102k44706J442514K423453K586175K507450K141540
42893E777090R35496r86458k579082k937291k290715j657589j344023l32960J836321
42884c579211L130783J178386k389197k884010N63683K678124r9329k943015N54202
42875c789584P029350O428457k788725r631667n723536K618237M022598j378519
42867c213389l672940Q48345M991867K998838j283099k234882j068939j171274
42859c805473p20323L103546O438765L188269m365013p254620k646300K390647
42851c670502K030704k33522J321837N013769M834609k9590m587958n625604m512850
$$ plain form
42909 7180074 14306733 13670847 8420335 4034231 1995117 850686 -389047 -1851471
42901 -1851471 -3572234 -5079336 -5324042 -3881528 -1458075 1128100 3635550 5777090
42893 5777090 6712586 5726128 3147046 209755 -2080960 -3738549 -5082572 -5415532 -3579211
42884 -3579211 -448428 729958 -1659239 -4543249 -3979566 -1301442 -1400771 -4343786 -3789584
42875 -3789584 3239766 9668223 6879498 -2752169 -8475705 -5857468 -1834870 -3213389
42867 -3213389 -6886329 -6037984 -1046117 1952721 669622 -1565260 -2634199 -3805473
42859 -3805473 -4525796 -1422250 5016515 8204784 3839771 -3414849 -6061149 -3670502
42851 -3670502 -1639798 -1873320 -551483 4462286 9296895 9267305 4679347 -946257 -5459107
42842e459107k597091R09864M974234N337544L07957m999150m277541J247876
42834d555414M002340N50619l409035j334165M244082N037876q64962o077848
42826b406507m612425J34651J761152M57059O50021K279380J351929j855621k335146
42817d575507J078053L373223J697240k16375Q68528J918873o50727m188134l934109
42808d628935n67734J664085J890457K371217L000515J454653j805111l568207
42800a89060k866787j688795q06722Q17541K334390J310951j319093j127902L010972
42791e24505N958036L105208k727880m810747j523111J896657R32410k136447
42783A69621j889356K168879M523892J423024l336087l382266J139554L782417
$$ plain form
42842 -5459107 -8056198 -7146334 -2172100 3165444 3473401 -1525749 -5803290 -4555414
42834 -4555414 -553074 -2455 -3411490 -4745655 -501573 4536303 3671341 -2406507
42826 -2406507 -7018932 -6884281 -5123129 -4666070 -4016049 -1736669 -384740 -2240361 -4575507
42817 -4575507 -3497454 -124231 1573009 1356634 2225162 4144035 3493308 -694826 -4628935
42808 -4628935 -5196669 -3532584 -1642127 729090 3729605 5184258 3379147 -189060
42800 -189060 -3055847 -4744642 -5551364 -4733823 -2399433 -1088482 -2407575 -3535477 -524505
42791 -524505 5433531 8538739 5810859 1000112 -522999 1373658 2306068 169621
42783 169621 -1719735 449144 4973036 6396060 3059973 -322293 817261 4599678
42775D599678J287353j925922r82052J977149J526610k505600m930163k827928
42767c780875Q52860J763509p24863l579231l499218m6871L506427L174079p57016
42758c091199l289234j049693K909109L390889M03928j396943J95922K253635
42750C26414J433655j757310m241596l776202n91855K847292L847893K467417
42742E55708J469303J925738J049560k938065o244330m091184J607478M193325
42734b472467J613810j309995o53111J643048K278087J465732P59864j52771j508548
42725A663649j461233O93272J818113q00689m135858k580267L677684P466244
42717F340915L529167m159289o932084k314505L122413K857617j037056j849766
$$ plain form
42775 4599678 5887031 3961109 2979057 4956206 6482816 3977216 -952947 -3780875
42767 -3780875 -2928015 -1164506 -1889369 -5468600 -8967818 -9014689 -5508262 -2334183 -3091199
42758 -3091199 -6380433 -7430126 -4521017 -1130128 -726200 -2123143 -1927221 326414
42750 326414 1760069 2759 -4238837 -8015039 -8606894 -5759602 -1911709 555708
42742 555708 2025011 3950749 5000309 2062244 -4182086 -8273270 -6665792 -2472467
42734 -2472467 -858657 -2168652 -2821763 -1178715 1099372 2565104 3324968 3172197 1663649
42725 1663649 202416 895688 2713801 1913112 -2222746 -4803013 -1125329 6340915
42717 6340915 9870082 5710793 -1221291 -3535796 -413383 2444234 1407178 -442588
42709d42588J444627L175336N43340j793143M08096L718347K478714k122905m087359
42700C322465j684128J203845J916810J725282J683263P55128j191003k532033
42692E199629k637015k205703j084775Q61314J577074m44565k362276p19357K151253
42683C35579J198817k619233l434199m44951O73971k228655m090022j715291R63908
42674a1360076O74362P14784L909455O049703K721569k403789k994741m80Q21243
42665a867970j356913k204019l21403J123968N91861R6551M95454m7026j919800
42656e409297k627059p93093J597354K160178R73601l32825n65253L96423J624342
42647b975629J797780P51267k08151k40441M657N8079N02334J174259P17765q22869
$$ plain form
42709 -442588 1002039 4177375 4720715 2927572 3335668 7054015 9532729 7409824 3322465
42700 3322465 1638337 2842182 4758992 6484274 8167537 8922665 7731662 5199629
42692 5199629 2562614 356911 -727864 133450 1710524 1265959 -1096317 -1815674 335579
42683 335579 1534396 -1084837 -4519036 -4963987 -4290016 -6518671 -10608693 -12323984 -11360076
42674 -11360076 -10685714 -9970930 -6061475 -11772 2709797 306008 -2688733 -2689213 -1867970
42665 -1867970 -3224883 -5428902 -5750305 -4626337 -4034476 -3937925 -3442471 -3489497 -5409297
42656 -5409297 -8036356 -8829449 -7232095 -5071917 -4098316 -4431141 -4996394 -4599971 -2975629
42647 -2975629 -1177849 -426582 -634733 -875174 -870517 -812438 -310104 864155 1581920 759051
42637G59051j488619q65012j035526k379588k046449R39316L003220J759656L80272
42628i73679J952225L434994Q04921l018597k130921K280714L071947j707961
42620C713643n734418l955702P34439K843740J545700m24949j656590k514575
42612e448712k590276o82019K819482N102912L326536j779648n356854l408477
42604h017056J627427L405835N73700j266967J231611L381097N21865l256786
42596a799274j414078L697606M198900l99800k711145J4176K068799l8931j840610
42587A775643L67554K664450N43749l106847k851251N61109J898489n90298l578848
42578b316250l569912j26402M389298O160982L034632k042619l397735M802K976746
$$ plain form
42637 759051 -729568 -1594580 -2630106 -5009694 -7056143 -6116827 -3113607 -1353951 -973679
42628 -973679 978546 4413540 5218461 2199864 68943 2349657 5421604 3713643
42620 3713643 -2020775 -5976477 -5242038 -2398298 -852598 -1277547 -2934137 -5448712
42612 -5448712 -8038988 -8721007 -5901525 -798613 2527923 748275 -4608579 -8017056
42604 -8017056 -6389629 -2983794 -2410094 -3677061 -2445450 935647 1457512 -1799274
42596 -1799274 -3213352 484254 4683154 4283354 1572209 1586385 3655184 3616253 1775643
42587 1775643 2143197 4807647 5351396 2244549 -606702 -45593 1852896 1262598 -2316250
42578 -2316250 -5886162 -6012564 -1623266 4537716 7572348 5529729 2131994 2136796 5113542
42569E113542J679193j287575j930559p96714m99403j135269j830613l253849
42561c941247m767958k838062L297311P992759O279589J268584j068201j207641
42553E015134l370367o050100l561627L257577O322669K185016k764983k213409
42545a180090J370062K322824P86284M97912J105794r56023n085382o038555j818285
42536h995459K777369K854750J89690j14180K285093K608624j114402m206994
42528c715509k068483K495063K989389j107745l483303l48094M313687N051666
42520D126671K178980o60089k581504m693175n577988k633672K649207N293288
42512a898282L233006m31112k195497j951875j085055K36285K137547L316022
$$ plain form
42569 5113542 6792735 5505160 3574601 2777887 2278484 1143215 -687398 -3941247
42561 -3941247 -8709205 -11547267 -8249956 -257197 6022392 7290976 6222775 5015134
42553 5015134 1644767 -4405333 -7966960 -4709383 1613286 3798302 1033319 -1180090
42545 -1180090 189972 2512796 3299080 3796992 4902786 3946763 -1138619 -7177174 -8995459
42536 -8995459 -6218090 -3363340 -3173650 -3287830 -1002737 1605887 491485 -3715509
42528 -3715509 -5783992 -3288929 -299540 -1407285 -4890588 -5238682 -924995 4126671
42520 4126671 6305651 5645562 3064058 -1629117 -7207105 -9840777 -7191570 -1898282
42512 -1898282 1334724 903612 -1291885 -3243760 -4328815 -4092530 -1954983 1361039
42504A361039K129195j105653l865243l572122j58030L445245M126741K055068
42496D416240J1826p97551j852414l481834l190152Q9576L187576L030720R43556
42487B357543n71820k176454m726847n256392j333135L216707L234265Q24418
42479d431715J785079M794363K852074l953812o486364l85563O721741O596618
42471G492421J626717j105131p44676q79521j568306m30623J219241Q7291k942093
42462B755320m047851k391080J20860K986143N935191N900912J006823m287098
42454G979220m336886j183421j422464n109677n566001p54806L305847K712268
42446d375920J389622K824397L340765p46122n075249l352438K136408L534204
$$ plain form
42504 1361039 3490234 2384581 -1480662 -5052784 -5210814 -1765569 2361172 4416240
42496 4416240 4428066 3630515 1778101 -1703733 -4893885 -4804309 -1616733 1413987 2357543
42487 2357543 1785723 -390731 -5117578 -10373970 -11707105 -8490398 -5256133 -4431715
42479 -4431715 -2646636 2147727 4999801 1045989 -5440375 -5825938 895803 7492421
42471 7492421 9119138 8014007 7269331 6389810 4821504 4390881 5610122 5697413 2755320
42462 2755320 -1292531 -3683611 -3562751 -576608 5358583 11259495 12266318 7979220
42454 7979220 3642334 2458913 1036449 -4073228 -9639229 -10394035 -7088188 -4375920
42446 -4375920 -2986298 -161901 3178864 2432742 -2642507 -5994945 -3858537 -324333
42438c24333o69552l944768k150216J079926J404097M68135J778305L902800K647652
42429D192046j743295m362795k661755M47067J628849J532359J947972J855912
42421B836360j74564j917708k65108K930297K642333j537818m456085l411078
42413c353371j785604k227459j647379K742435O955580N384488m86677m201027
42405A380986l302128q10577P34400J241112K96895j961011k270212J543675M913280
42396A766420K033780l646256k838157M754217Q372299K355176m821727l640536
42388D335216K103738K178014m057130p515354l172612M095263P476349N741192
42380A1184676J922108r69246j853361j917963l098704m700769l450453J015240
$$ plain form
42438 -324333 -993885 -4938653 -7088869 -6008943 -4604846 -4136711 -2358406 1544394 4192046
42429 4192046 2448751 -1914044 -4575799 -4128732 -2499883 -967524 980448 2836360
42421 2836360 2661796 744088 478980 3409277 6051610 4513792 57707 -3353371
42413 -3353371 -5138975 -7366434 -9013813 -6271378 684202 6068690 5582013 1380986
42405 1380986 -1921142 -2731719 -1997319 -756207 -459312 -2420323 -4690535 -3146860 1766420
42396 1766420 3800200 153944 -2684213 2070004 10442303 12797479 7975752 4335216
42388 4335216 6438954 8616968 4559838 -2955516 -6128128 -2032865 5443484 11184676
42380 11184676 13106784 12137538 10284177 8366214 5267510 566741 -2883712 -1868472
42372a868472L925429K048942r15695k65619J826981M10868k983916k559511J396088
42363A015095K241563k188690n844781l715988J361591L885902K670787Q7986
42355d86535j420540j25498L559743N245452J075768m975299m624883K155213
42347D03421N721338J409794k827296L83996N088931J729224o325817p462905
42339a879314l65647M236007R03520l059905r53390K847516J746002j779987j265627
42330D29175K603188L688464M52685k656176k704627j297379m37443k24414o96345
42321h42872j919287k273563k32606K407353K563922O73203k33441K99745J39774
42312E82228n48416O95335L144819K611789j596805m355149k094769J718806J872587
$$ plain form
42372 -1868472 2056957 4105899 3190204 2924585 4751566 5162434 2178518 -380993 1015095
42363 1015095 3256658 1067968 -4776813 -8492801 -7131210 -3245308 -574521 -486535
42355 -486535 -1907075 -2032573 1527170 6772622 7848390 2873091 -1751792 403421
42347 403421 6124759 7534553 4707257 5091253 10180184 11909408 5583591 -1879314
42339 -1879314 -2244961 1991046 2894566 -165339 -1118729 1728787 3474789 1694802 429175
42330 429175 3032363 6720827 7173512 4517336 1812709 515330 77887 -146527 -842872
42321 -842872 -2762159 -5035722 -5268328 -2860975 -297053 376150 142709 442454 582228
42312 582228 33812 729147 3873966 6485755 4888950 533801 -1560968 157838 2030425
42303B030425j208027l054418j700723Q77345K174346J141578j637222l472971
42295d849667j368456L444720N389429J660930l423225m414488j989681k22278
42287e772716L04693J504196K243694j89192m025829m324091m69366K875851K824328
42278e028432J441744J129915J349158J076604P41799O48545M06479J99478P6248
42269B041538j020787k581771j184185L956718P073963L386807k408367k684601
42261F579315P44062J17116m205286m386027K36386J656939j634074j341513M569517
42252B336435O364670j59921m731012l48150L461463k500736r270508m301418
42244i149177N920981N940658k415767l504496M952977Q344877O01805o012614
$$ plain form
42303 2030425 822398 -2232020 -3932743 -3055398 -881052 260526 -1376696 -4849667
42295 -4849667 -6218123 -2773403 2616026 4276956 853731 -3560757 -5550438 -5772716
42287 -5772716 -5468023 -3963827 -1720133 -1909325 -5935154 -10259245 -10728611 -7852760 -5028432
42278 -5028432 -3586688 -2456773 -1107615 -31011 710788 1359333 1765812 1965290 2041538
42269 2041538 1020751 -1561020 -2745205 1211513 8285476 11672283 9263916 6579315
42261 6579315 7323377 7440493 3235207 -1150820 -914434 742505 -891569 -2233082 2336435
42252 2336435 8701105 8541184 3810172 3462022 6923485 4422749 -4847759 -9149177
42244 -9149177 -3228196 2712462 296695 -3207801 1745176 10090053 10691858 4679244
42236D679244k199074M053138K743436k431766l480031k093987l480972m573981
42228f783993L87333P752009Q487273J827832l938381l487150j28138Q02105j260777
42219C658113l159902k627924n10793O99527K25505J48904J877166K962200N79837
42210C852633l044118l098804M07952K710090J876984R63748J759620J883198
42202G311303k62875k549450k883526j680025M76305L259829M207760R01044l983858
42193D796507n113235k226431L01685J281201L042587M175009N85772n214030
42185A629065n400713L08487L026995o32580k720538K055155O873088M432038
42177I570997j237488k829685j569635k128360k777603Q867K920027J148334k387717
$$ plain form
42236 4679244 2480170 6533308 9276744 6844978 3364947 1270960 -2210012 -6783993
42228 -6783993 -6396660 1355349 9842622 11670454 7732073 4244923 4116785 4918890 3658113
42219 3658113 498211 -2129713 -2640506 -1940979 -1715474 -1566570 310596 3272796 3852633
42210 3852633 808515 -2290289 -1882337 827753 2704737 3668485 5428105 7311303
42202 7311303 7048428 4498978 1615452 -64573 411732 3671561 7879321 8780365 4796507
42193 4796507 -316728 -2543159 -2241474 -960273 2082314 6257323 6843095 1629065
42185 1629065 -3771648 -3463161 -436166 -1068746 -3789284 -1734129 5138959 9570997
42177 9570997 8333509 5503824 3934189 1805829 -971774 -962907 1957120 3105454 717737
42168G17737k067697N54621N70154q47400L91594K692427K203494R44260K420106
42159G579296L100161j787340p466691n524910J726378M107134k52043k953836
42151a471851P3815L036873J220099k288694l475730k737932q78999K838947O445227
42142B761755N778068J081421k887788m058484m146327k851723J540549N763173
42134B980644M161146j455270l085066R62062L586078Q93517k288520j787252
42126C967339k73067m71208l77079Q59473J73916k297658j391346L410718M887557
42117H488645K4754l453434O54929O103050L862769l670405p261506m888157j886696
42108b026051l48036K166292M853939L627643r85556l576224k339478j138139
$$ plain form
42168 717737 -1349960 -795339 -225185 -1072585 -680991 2011436 4214930 5159190 7579296
42159 7579296 10679457 8892117 1425426 -4099484 -2373106 1734028 1481985 -1471851
42151 -1471851 -1398036 1638837 2858936 570242 -2905488 -5643420 -6522419 -3683472 2761755
42142 2761755 8539823 9621244 6733456 2674972 -1471355 -4323078 -2782529 2980644
42134 2980644 7141790 5686520 2601454 3563516 7149594 8043111 5754591 3967339
42126 3967339 3694272 3223064 2845985 3705458 3879374 1581716 190370 3601088 8488645
42117 8488645 8513399 5059965 5714894 11817944 15680713 12010308 4748802 -139355 -2026051
42108 -2026051 -2374087 -207795 4646144 8273787 7288231 3712007 1372529 234390
42100B34390j925560j522481J811352M193227J982565k030103k248650J793101
42092B287841M711342K355293k976024n492845k871231J387210K658998N91688
42084B652272j471662j242707L43819J290339R19643N8902J63317J859725L382735
42075G956383J929816j924896l549395n93828K766458J806160j329396j461635
42067E599667P00615K02062k733808k564355J753437M411709K106411j233471
42059H242267j617524m93718k66262l21836l65198j846820l364383q76893M621065
42050C710698O410362K419745r74732L46625J610839j285298l649655q02270K339013
42041A0125327m90718n025195l049089L306448M667408l39836l685627j513897
$$ plain form
42100 234390 -1691170 -3213651 -1402299 2790928 4773493 2743390 494740 2287841
42092 2287841 6999183 9354476 6378452 885607 -1985624 -598414 2060584 2652272
42084 2652272 1180610 -62097 281722 1572061 2491704 2550606 2713923 4573648 7956383
42075 7956383 9886199 7961303 4411908 3818080 6584538 8390698 7061302 5599667
42067 5599667 6300282 6502344 3768536 1204181 2957618 7369327 9475738 8242267
42059 8242267 6624743 6131025 5864763 5542927 5177729 3330909 -33474 -910367 3710698
42050 3710698 10121060 12540805 11566073 11912698 13523537 12238239 8588584 7786314 10125327
42041 10125327 9634609 4609414 1560325 4866773 9534181 9194345 5508718 3994821
42033C994821J008772j34070j772394m66387J847867K431558K298146L032025
42025A2240338L437022K113458O8702j211808j596336j183678n4734M14047j124359
42016A3102652l164800k798897J9327K539423L167463K387068O11090j420895
42008A4442431j205867K388388N450835L252578k260305m340499j036294K431715
42000A9122982J927137k37455j70040K011775M045378N224739N575327M408508
41992D1908351K284790J815530L952700N667440L985651P63290O89453N086910
41984F6154115J0032217J1117132Q707351P270890R506262J2659436J2460265
41977A37907668R842121J0348456J6119704K2488752K4992729K5890093K9735419
$$ plain form
42033 3994821 5003593 4869523 3097129 2630742 4478609 6910167 9208313 12240338
42025 12240338 15677360 17790818 17859520 16647712 15051376 13867698 13812964 14227011 13102652
42016 13102652 9937852 7138955 7158282 9697705 12865168 15252236 15863326 14442431
42008 14442431 13236564 15624952 21075787 24328365 22068060 17727561 16691267 19122982
42000 19122982 21050119 20812664 20642624 22654399 26699777 31924516 37499843 41908351
41992 41908351 44193141 46008671 49961371 55628811 59614462 60377752 61067205 66154115
41984 66154115 76186332 87303464 96010815 103281705 112787967 125447403 137907668
41977 137907668 147749789 158098245 174217949 196706701 221699430 247589523 277324942
41970B77324942L5626427L8971456L8965952L8540044L7443788L1162654J7710128
41963E15745391R22575j4316402k6441770l5709043m1761320m4096633m2628237
41956C11714561l7301420k9393957k2725420k0402102k0579374j8898403j5006671
41949A47407214j2757339j3545150j3664681r898200m447528k158470m577257
41942H6358589q290923q617056m752487j245277k793550p438980q468802m348666
41934D0402848j450663l527678m871225k69814M372331P19746p119857p866646
41926B0389042j174269K132182j673505l900023M92337M404871J894684j716868
41918B0848451n55285J233441j570350m588551k007131J861002k25121n287250
$$ plain form
41970 277324942 312951369 351922825 390888777 429428821 466872609 498035263 515745391
41963 515745391 516667966 502351564 475909794 440200751 398439431 354342798 311714561
41956 311714561 274413141 245019184 222293764 201891662 181312288 162413885 147407214
41949 147407214 134649875 121104725 107440044 97541844 93094316 90935846 86358589
41942 86358589 78067666 69450610 64698123 63452846 60659296 53220316 44751514 40402848
41934 40402848 38952185 35424507 30553282 30283468 34655799 35375545 28255688 20389042
41926 20389042 19214773 21346955 19673450 15773427 16265764 20670635 22565319 20848451
41918 20848451 20293166 21526607 19956257 15367706 13360575 15221577 14996456 9709206
41910I709206n065385q713K547537J357962J523183L325275J698029l089818m496222
41901G501054q30726J938335N91311o68115J209664K668717M67175k399850j893457
41892H584108Q26264K133414J164732o92462k389563l060639k094997o94857m77155
41883C298845k14230K255751M924135L390506j719997m623270k811892O5545J151567
41874E716960J848392K271177n80526n506607n316724K150568P828814L406055
41866A1818109n665537p479707p07573M606138K228292k917935l780894l05717
41858b204824L117494M081311L049869J147504o10605j806137l144730m690743
41850a060861m196310j36980M360295M568615R61395j347187k90590O95322r14656
$$ plain form
41910 9709206 4643821 4635108 7182645 8540607 10063790 13389065 15087094 11997276 7501054
41901 7501054 6670328 8608663 9199974 8531859 9741523 12410240 12877415 10477565 8584108
41892 8584108 9410372 11543786 12708518 12016056 9626493 6565854 4470857 3776000 3298845
41883 3298845 3084615 5340366 10264501 13655007 11935010 7311740 4499848 4565393 5716960
41874 5716960 7565352 9836529 9256003 3749396 -1567328 583240 8412054 11818109
41866 11818109 6152572 -1327135 -2034708 2571430 4799722 1881787 -1899107 -2204824
41858 -2204824 912670 4993981 8043850 9191354 8580749 6774612 3629882 -1060861
41850 -1060861 -5257171 -5394151 -1033856 3534759 4496154 3148967 2858377 3553699 2639043
41841B639043k549835j107721J989273K990848O66496k871429m174770p27145
41833c145240N900397R147574M031240m952438p987977l241739P40558j353917
41825h61542l576375J60213M745965K421572l151750k294172M209757N899199
41817G552867j55176m811253k256930J178540j032565m376327j499591N238809
41809a61626P655161L869723j074846l820214m838652l945931m84552K812299
41801A1362K146934j295424k657329n32741J892782K498078K281157J772666Q5269
41792F202754j944968j911758Q6693J122541k52153k518952l942778l563468k67571
41783f989660M952852O793995J260394o554064o801230J469417P618069L620030
$$ plain form
41841 2639043 89208 -1018513 970760 3961608 4628104 1756675 -2418095 -3145240
41833 -3145240 2755157 11902731 15933971 10981533 2993556 -248183 492375 -861542
41825 -861542 -4437917 -4277704 468261 2889833 -261917 -2556089 1653668 7552867
41817 7552867 7397691 2586438 329508 1508048 475483 -3900844 -5400435 -161626
41809 -161626 7493535 11363258 10288412 6468198 1629546 -2316385 -2800937 11362
41801 11362 2158296 862872 -1794457 -2327198 -434416 2063662 4344819 6117485 6202754
41792 6202754 4257786 2346028 2432721 3555262 3303109 784157 -3158621 -6722089 -6989660
41783 -6989660 -2036808 4757187 6017581 -536483 -7337713 -5868296 1749773 5369803
41775E369803n026339p400151j613753M552243M873548R46680k026587j326854
41767a651410J638995L124950O88743l350483l552739J600835O441915M859126
41759I799932j462026n231002l135652O58107R71306j775249k993999k31576L694052
41750B93893M030949J20664l139127j385182K767029K890218j502923l421645
41742F53876R10874N162942J930745n278602o349271N81850O350894L997135k327925
41733E632518m792426k462581K948K63009o6538L61940J134474J926626K480340
41724D480310J465742j673934m441726l762129k87746K473767K852100K017530
41716C123914Q28405r03679j957680l45117K604584K580400j428490m702368l290845
$$ plain form
41775 5369803 343464 -7056687 -8670440 -4118197 755351 1702031 -324556 -1651410
41767 -1651410 -12415 3112535 3801278 450795 -3101944 -1501109 4940806 9799932
41759 9799932 8337906 3106904 -28748 629359 1600665 -174584 -3168583 -3400159 293893
41750 293893 4324842 4445506 1306379 -78803 2688226 5578444 4075521 653876
41742 653876 1564750 6727692 8658437 3379835 -2969436 -2387586 3963308 7960443 5632518
41733 5632518 840092 -1622489 -1619541 -1356532 -1423070 -1061130 73344 1999970 4480310
41724 4480310 5946052 4272118 -169608 -3931737 -4219483 -1745716 1106384 3123914
41716 3123914 3952319 3048640 1090960 745843 3350427 5930827 4502337 -200031 -3490876
41707c490876K22410R45944r42447j428994L89903J630256J441522K173655L846823
41698D788196K762424j984174n254836k762199K201753L119001q11136m269206
41690b210177l314373M58553L001205K146834j027520l134711j439130K481160
41682c038159L682846M50780k641436j336488J660017J257851j462870j445845
41674b873304J137156J172593j819180k184995J871739M366011J140759l366178
41666e55399l593741j140426j31224L94118K945202M607831J039988m929691o067493
41657g430835j282993L192650L117158P06798o66920p07011j34901Q10682Q68718
41648a526654r72584k244922L49616M673065M847530K29795l061300j547998O17219
$$ plain form
41707 -3490876 -3268466 -2322522 -3264969 -4693963 -4304060 -2673804 -1232282 941373 4788196
41698 4788196 7550620 5566446 311610 -2450589 -248836 2870165 2059029 -2210177
41690 -2210177 -5524550 -5065997 -2064792 82042 -945478 -4080189 -5519319 -3038159
41682 -3038159 644687 1095467 -1545969 -2882457 -1222440 35411 -1427459 -2873304
41674 -2873304 -1736148 -563555 -2382735 -4567730 -2695991 1670020 2810779 -555399
41666 -555399 -4149140 -5289566 -5420790 -5026672 -2081470 2526361 3566349 -1363342 -7430835
41657 -7430835 -8713828 -5521178 -2404020 -1697222 -2364142 -3071153 -3206054 -2395372 -1526654
41648 -1526654 -2499238 -4744160 -4394544 278521 5126051 5355846 2294546 746548 1363767
41639A363767p38202k921401j755503Q66632N21836j914785k069688K23782J118991
41630e304571j27781k43568J515995J694067r14948k315159M74291M330269M465738
41621C574333J052454j946093k439976j376836K17094J927167K479114Q04020
41613D291277j656656k462989j713645j341413j359204k15842J170713j03846
41605c391605l371843l676760J009340N725468N067652P26808j503946Q858J858944
41596B452916J604408J82754j125064j960925j247561J776245M769659M273435
41588A0725867O42135k542256l727471m034520l113864N03617M582040M379106
41580G414654Q817k927437j757042M2107R8182R50540L250991K233813l813348
$$ plain form
41639 1363767 625565 -2295836 -4051339 -3184707 -2662871 -4577656 -6647344 -6423562 -5304571
41630 -5304571 -5432352 -5675920 -4159925 -2465858 -3380806 -5695965 -5221674 -891405 3574333
41621 3574333 4626787 2680694 240718 -1136118 -919024 1008143 3487257 4291277
41613 4291277 2634621 171632 -1542013 -2883426 -4242630 -4458472 -3287759 -3391605
41605 -3391605 -6763448 -10440208 -9430868 -3705400 1362252 2089060 585114 593972 2452916
41596 2452916 4057324 4240078 3115014 1154089 -93472 1682773 6452432 10725867
41588 10725867 11368002 8825746 5098275 1063755 -2050109 -1546492 3035548 7414654
41580 7414654 7423471 4496034 2738992 2781099 2879281 3829821 7080812 9314625 5501277
41571E501277p966737m160561L005044N201239K626776J379840K294183J277897
41563I158958j501109j894556j86145l35521j331226J437104N911397M466605
41555A5725507k882728o525382k111527K432300J09504m055362k489921J968312
41547B170703J646647k615632l448949K88680K231738k14748j903408Q32702L964069
41538B951802K308593k416073m303774j731552R02384j15956k470431j236816
41530f111823L508856N826641K121410k982391k794032J502124K631269j378575
41522B323479m181125j390481K601965J983111j722658l260526j811360j26086
41514e583681J187598K826905K839620n28310l803189k142739K745474M462543
$$ plain form
41571 5501277 -2465460 -6626021 -3620977 1580262 4207038 5586878 7881061 9158958
41563 9158958 7657849 5763293 5577148 5241627 3910401 5347505 11258902 15725507
41555 15725507 12842779 6317397 4205870 6638170 6747674 2692312 202391 2170703
41547 2170703 3817350 1201718 -2247231 -1958551 273187 58439 -1844969 -1012267 2951802
41538 2951802 5260395 2844322 -1459452 -3191004 -2288620 -2404576 -4875007 -6111823
41530 -6111823 -2602967 3223674 5345084 2362693 -431339 1070785 3702054 2323479
41522 2323479 -1857646 -3248127 -646162 1336949 -385709 -3646235 -5457595 -5583681
41514 -5583681 -4396083 -1569178 1270442 742132 -3061057 -5203796 -2458322 2004221
41506B004221J368632j619221j018097J010075J536373R64561O38411M25283J66036
41497E476274J46997o30603l078755m656991j813438L513704M852207K84084m390802
41488b97323l977687o07059J031858P67802J168592K119697J679692J04087j068587
41479I21072k131616l602775l357124L89507M586519M471690P23992j130257J163135
41470B034143L573288K258450j017363k334841j366853o28560r10857p38443K64758
41461A133722M84415p46227j669169q11359L48539p69411l730248m698501j032481
41452a1490720M806828P337183L969446k229642n898377m601275l74401K953017
41444e527941L190403J147728m77524L56894K992867M536245K754313j447104
$$ plain form
41506 2004221 3372853 1753632 735535 1745610 3281983 4246544 4884955 5310238 5476274
41497 5476274 5623271 4992668 1913913 -2743078 -4556516 -1042812 3809395 4093479 -297323
41488 -297323 -4275010 -4882069 -3850211 -3082409 -1913817 205880 1885572 1989659 921072
41479 921072 -1210544 -4813319 -8170443 -7780936 -3194417 1277273 2001265 871008 2034143
41470 2034143 5607431 7865881 6848518 4513677 3146824 2518264 1607407 868964 1133722
41461 1133722 1618137 871910 -797259 -1608618 -1260079 -2029490 -5759738 -10458239 -11490720
41452 -11490720 -6683892 653291 4622737 2393095 -3505282 -8106557 -8480958 -5527941
41444 -5527941 -2337538 -1189810 -1667334 -1310440 1682427 6218672 8972985 7525881
41436G525881m670893m228861p27031K476585K547723N2507j800123j048457P27531
41427H54862R64766L1720M91329K508099K729545p54884m573140l879697R32007
41418f95393M299858K582664j622990l578664k625898j889413k709583k441980
41410h681399J110397N343263N510155J264306k256633j052815K311474K378770
41402E927518j370256l810406j644042K018323K552691L39463q78193k29425j20277
41393B785396r44709p0599K740024L384814l08574l975405k415361K432802L987010
41384G615398N36941k867853k530039r03584j166256j714552J70237K623728J960770
41375C724790p29250q78616K019258L191092k8622m049773m456380j986169j61007
$$ plain form
41436 7525881 2854988 -1373873 -2100904 375681 2923404 2975911 1175788 127331 854862
41427 854862 1819628 1851348 2342677 4850776 7580321 6825437 2252297 -1627400 -695393
41418 -695393 3604465 6187129 4564139 985475 -1640423 -3529836 -6239419 -8681399
41410 -8681399 -7571002 -2227739 3282416 4546722 2290089 1237274 3548748 5927518
41402 5927518 4557262 746856 -897186 1121137 3673828 4013291 3135098 2905673 2785396
41393 2785396 1840687 1770088 4510112 7894926 7586352 3610947 1195586 3628388 7615398
41384 7615398 8152339 5284486 2754447 1850863 684607 -1029945 -859708 1764020 3724790
41375 3724790 2995540 2116924 4136182 7327274 7298652 3248879 -1207501 -3193670 -3354677
41366c354677L13847J182282K247113J323876j417840k542073k0455L527718L980211
41357E240002Q33234k464848k783898m63431J855221K313946J160044j80892m01999
41348E107379R17999K732434K832551J05141l312596l834341j069369J340045
41340D819243Q60042l06407P95892K478433Q85254l247510m914935k190556J238952
41331D18408J997157J138607O05673j25183j352944j183010O45102Q31161j934190
41322A040781l392331l45305K785880J32000n357828n056754K290781P832037
41314g0739M669755l162245o630749k560047M177203O645093K189167n074959
41306A82479p449413j839713N431734N623616q73049n008713j823573L224048
$$ plain form
41366 -3354677 -3040830 -1858548 388565 1712441 294601 -2247472 -2267927 1259791 5240002
41357 5240002 6073236 3608388 824490 361059 2216280 4530226 5690270 5509378 5107379
41348 5107379 6025378 8757812 11590363 11695504 8382908 4548567 3479198 4819243
41340 4819243 5679285 5372878 6168770 8647203 9532457 6284947 1370012 -820544 418408
41331 418408 2415565 3554172 4159845 4034662 2681718 1498708 2143810 2974971 1040781
41322 1040781 -2351550 -2696855 89025 221025 -5136803 -10193557 -7902776 -70739
41314 -70739 4599016 1436771 -5193978 -7754025 -3576822 3068271 5257438 182479
41306 182479 -7266934 -9106647 -3674913 1948703 1075654 -3933059 -5756632 -2532584
41298b532584L167207r20544l307002j983937R38360L688400M999625K759558
41290F809083k640427n922374k827562L296119N561213K682260q38298k312057
41282C807957l120620l815042k704931j15056J097199N94222J418438M159983
41274A322150M914369J542349k152474j759166J340399K410250O4848k843025
41266D839700l650044k099482R48746M058245M840284J808072l081148n830143
41258A834230m766538j859024N04821K061882L252681L316569J637240j78426
41250E803435J08540J831823J819802r70769l539125l121516j205744p24916j088634
41241a087104K49301K198704P55291m047845o767656m118283N23252K842066L396995
$$ plain form
41298 -2532584 634623 -285921 -3592923 -5576860 -4638500 -950100 4049525 6809083
41290 6809083 4168656 -1753718 -4581280 -1285161 4276052 6958312 6120014 3807957
41282 3807957 687337 -3127705 -5832636 -5947692 -4850493 -4256271 -2837833 1322150
41274 1322150 6236519 7778868 5626394 3867228 5207627 7617877 7682725 4839700
41266 4839700 1189656 -909826 38920 4097165 8937449 10745521 7664373 1834230
41258 1834230 -2932308 -4791332 -4286511 -2224629 1028052 4344621 5981861 5803435
41250 5803435 5911975 7743798 9563600 8592831 5053706 1932190 726446 1530 -1087104
41241 -1087104 -837803 1360901 2116192 -1931653 -8699309 -12817592 -12294340 -9452274 -6055279
41232f055279M212383M063431J892508P54760K486659K326393l704505r211626
41224c235276m758388O215240R645528J030979p411061m710041L419654M662554
41216D859189j842013o724971n104499p87896K117100L375880K948037L03603
41208h55570k337444j882488N35492J429313J050182J990541K877012K34580l821078
41199g79460l376966J083000K318965j781676m193606l43149M160214K861318
41191e1360j219679j388215J828542L044454J537722P36491O99526j103194k968544
41182A115743r29834K760914J376958m851495p258806j711849M498496L498581
41174a501292j753661l106544L64254K825247K054733J699712L373130L674553
$$ plain form
41232 -6055279 -1842896 2220535 4113043 4867803 7354462 9680855 5976350 -3235276
41224 -3235276 -7993664 -1778424 7867104 8898083 1487022 -3223019 196635 4859189
41216 4859189 3017176 -3707795 -8812294 -9600190 -7483090 -4107210 -1159173 -855570
41208 -855570 -3193014 -5075502 -4540010 -3110697 -2060515 -69974 2807038 3041618 -779460
41199 -779460 -4156426 -3073426 -754461 -2536137 -6729743 -7072892 -2912678 -51360
41191 -51360 -1271039 -2659254 -830712 2213742 3751464 4487955 5187481 4084287 1115743
41182 1115743 185909 2946823 4323781 -527714 -7786520 -9498369 -4999873 -1501292
41174 -1501292 -3254953 -6361497 -5997243 -3171996 -1117263 582449 3955579 7630132
41166G630132R26082j200364k1774J117605j432417m538651k607647K734076L743403
41157F350445j858978o587205l733665K715752L995458n20612k932395Q76254
41149a694946N329212M122540n63978k496993j260797j705021m858549n649122
41141h777654j028796M615685N201100J057647k163800j299567J040380J182433
41133a72572m86387q51055Q79770J986197N53633j363555r59229N00421n47389
41124d60166l599198l733389P93920M750572K966093k122552m153202j712619
41116g270541J154395J768687J201546O23420J19562O62174K478788K266479k371255
41107F33255o553388l298603M751264P170236J243555l460973j25236M839389
$$ plain form
41166 7630132 8556214 7355850 7334076 8451681 7019264 2480613 -127034 2607042 6350445
41157 6350445 4491467 -2095738 -5829403 -3113651 881807 361195 -2571200 -1694946
41149 -1694946 3634266 7756806 7192828 4695835 3435038 1730017 -3128532 -8777654
41141 -8777654 -9806450 -5190765 10335 1067982 -1095818 -2395385 -1355005 -172572
41133 -172572 -658959 -1510014 -630244 1355953 1909586 546031 -413198 87223 -460166
41124 -460166 -4059364 -7792753 -6998833 -2248261 717832 -1404720 -5557922 -7270541
41116 -7270541 -6116146 -4347459 -3145913 -2522493 -2402931 -1740757 738031 3004510 633255
41107 633255 -5920133 -9218736 -4467472 2702764 3946319 485346 360110 5199499
41099E199499K970245k629256l586981j23185J203380l88311j91755J725961N50704
41090D730301l490448m662171j594785Q31502M14070L48439J712004J211088j610806
41081b110806k556921n85639r5428k576650l119884J240410O155819O663462L595289
41072F609652R7821k585695l067540J90809L879605J670987n498439q329514k580747
41063i613061M156580M371392J345059J288753K503386O29811j930147r69453
41055A782320O79978j275753l103321P17719N944337M293058k202680m103077
41047B732581k55098J306452j908528l204286L96440K934728O24938j856927m88674
41038B81626J466854O19427n33131L32075K01961l175236n937348m076129O0194
$$ plain form
41099 5199499 8169744 5540488 1953507 1830322 3033702 2645391 2453636 4179597 4730301
41090 4730301 1239853 -3422318 -5017103 -4185601 -3771531 -3423092 -1711088 -500000 -2110806
41081 -2110806 -4667727 -5253366 -5348794 -7925444 -11045328 -9804918 -3649099 3014363 6609652
41072 6609652 6707473 4121778 1054238 1245047 5124652 6795639 1297200 -7032314 -9613061
41063 -9613061 -5456481 -1085089 259970 1548723 4052109 4681920 2751773 1782320
41055 1782320 2462298 1186545 -1916776 -1199057 4745280 9038338 6835658 2732581
41047 2732581 2477483 3783935 1875407 -1328879 -932439 2002289 2627227 770300 281626
41038 281626 1748480 2367907 1834776 2166851 2368812 -806424 -6743772 -10819901 -10759707
41029a0759707J992605J684799J608910J979772J898195K095571L139655L559001
41021G198801K189420j88142k769463n005254m652336k20526M268507K827674
41013C648681l212197n995677k708526R43875J091907J383847M434349N702852
41005E289111J521825l635438m083343j381225M7758L49857J437146J991983J112930
40996B650604J701965M402804L927631k106092o775878l877016J527838J269442
40988B721298k568658k334429J452789J935306j187132j791276O57632J59307
40980i55163m301104o467795l555798j32260O17416J041907K368272J995244r6241
40971i485522J16373K965344L185353j080279m232883j915980K318998L089060
$$ plain form
41029 -10759707 -8767102 -7082303 -5473393 -3493621 -1595426 500145 3639800 7198801
41021 7198801 9388221 9200079 6430616 1425362 -3226974 -3447500 821007 3648681
41013 3648681 436484 -5559193 -8267719 -7323844 -6231937 -4848090 -413741 5289111
41005 5289111 6810936 3175498 -907845 -2289070 -2241312 -1891455 -454309 1537674 2650604
40996 2650604 4352569 8755373 12683004 10576912 3801034 -75982 1451856 2721298
40988 2721298 152640 -2181789 -729000 1206306 19174 -1772102 -1114470 -955163
40980 -955163 -5256267 -11724062 -15279860 -15412120 -14794704 -13752797 -11384525 -9389281 -9485522
40971 -9485522 -9369149 -6403805 -3218452 -4298731 -8531614 -10447594 -8128596 -5039536
40963e039536Q21835o27571J71187K210055M344739M903474K378875j427391k514646
40954E221021n65433K82500j853655l582723k065074M88264Q05630n92246j161957
40945c023673j29191J469514K179308P01912k288400l085340O60156N061440M252828
40936E798554r07915m046548k993617j603313j433057N25919L923313L214702
40928B478038k551647n929101k029133L646978M056985J126678R26053L424971
40920E149822M008201J580913j314871l653887n422530m694009p41145K586688
40912b500818J993298M25377J974625M094224J617944l621619m669916l04156
40904i91041L324228K562669Q32013J361052J672307j040343l745099j641628
$$ plain form
40963 -5039536 -4217701 -4845272 -4674085 -2464030 1880709 6784183 9163058 7735667 5221021
40954 5221021 4655588 4938088 3084433 -498290 -2563364 -2075100 -1269470 -1861716 -3023673
40945 -3023673 -3152864 -1683350 495958 1197870 -1090530 -4175870 -3515714 1545726 5798554
40936 5798554 4890639 844091 -2149526 -3752839 -5185896 -4659977 -736664 2478038
40928 2478038 -73609 -6002710 -8031843 -4384865 -327880 798798 1724851 5149822
40920 5149822 9158023 10738936 9424065 5770178 347648 -4346361 -5087506 -2500818
40912 -2500818 -507520 -82143 1892482 5986706 7604650 3983031 -686885 -991041
40904 -991041 2333187 4895856 5727869 7088921 8761228 7720885 3975786 2334158
40896B334158L815017N798887J269889m535459m862776l93005K060412o45677
40888D841446l975128l350591j035178j038808j360862J886128N322071K057429
40880C346507n686768p342024L15595P497958N693307q19436l403511j505235
40872a903607J41528N56296J447020J881633Q03593N42750J719448k04109o600064
40863a615512r756076l615908M941042N355753m02568j844331K748764N030108
40855H41272J833842l87605K012909L997159J540571k169471l843182n100815
40847a275320o581528m736093J105353N147444L316090m45445n23346K391146
40839a601699L932161K826573J064231R9327n7201m4781j096069l518735m848597
$$ plain form
40896 2334158 6149175 11948062 13217951 8682492 3819716 3426711 5487123 4841446
40888 4841446 866318 -2484273 -3519451 -4558259 -5919121 -4032993 1289078 3346507
40880 3346507 -2340261 -9682285 -9366690 -1868732 3824575 3005139 -398372 -1903607
40872 -1903607 -1762079 -1205783 241237 2122870 2926463 3469213 5188661 4984552 -1615512
40863 -1615512 -11371588 -14987496 -10046454 -4690701 -5093269 -6937600 -4188836 841272
40855 841272 2675114 2287509 4300418 8297577 9838148 7668677 3825495 -1275320
40847 -1275320 -7856848 -12592941 -11487588 -6340144 -3024054 -3469499 -3992845 -1601699
40839 -1601699 2330462 5157035 6221266 6320593 6263392 6218611 5122542 1603807 -3244790
40830c244790k618803J254068K810519K169261K372723K892195N46565l283634
40822B898104l559988l76956Q00622j066681r30231K118915K197323k136846l557773
40813c613511J583325N666024J982521l726068k792414K176474K723263r39675
40805C059939j741089R33602Q17221l155326m772408j556546J437446R97615O82263
40796c297283L169855M783433J933301k325017k855657r3589J201340j070051
40788A446332m158796m554473j832834J539180K978395K146341P19877L2771q2450
40779a765657J91280J473923L304046L430502R23191j793746k174981j025565
40771B562993m85890o86388j071951k540267m805391m283391Q52450N751693M496661
$$ plain form
40830 -3244790 -5863593 -4609525 -1799006 370255 2742978 5635173 6181738 2898104
40822 2898104 -661884 -1038840 -238218 -1304899 -2235130 -116215 2081108 -55738 -3613511
40813 -3613511 -2030186 3635838 5618359 1892291 -900123 1276351 3999614 3059939
40805 3059939 1318850 2252452 3069673 -85653 -4858061 -6414607 -4977161 -3979546 -3297283
40796 -3297283 -127428 4656005 6589306 4264289 1408632 1315043 2516383 1446332
40788 1446332 -2712464 -7266937 -9099771 -7560591 -4582196 -2435855 -1715978 -1683207 -1765657
40779 -1765657 -1574377 -100454 3203592 6634094 7557285 5763539 3588558 2562993
40771 2562993 2077103 1390715 318764 -2221503 -7026894 -11310285 -10457835 -4706142 -209481
40762b09481q67358l034385l90725J645522N25578N0946J833791J271339l501547
40753b676320n806251j56706P552027P546073P23976k862160P55187M357212J395278
40744A0828316m670913o736605m008543p20348J146467K518031K924531R53340
40736B234276j722252j632752R25028J936355M5874j353255p383J332609k20021
40727A538479k300039p57282L324537M447475M86924m034410l679987J236160
40719B61857N276079M164975p03076m021124k485156J647865L712273K516415
40711A0370108P33439l57710k587817n801683n610298q4752N087294L579791j917075
40702C411297l305808R25283M234891K632353n02716j754755k634902m176432
$$ plain form
40762 -209481 -1076839 -4111224 -4501949 -2856427 -2330849 -2279903 -446112 825227 -2676320
40753 -2676320 -8482571 -8639277 -1087250 6458823 7182799 4320639 5075826 9433038 10828316
40744 10828316 6157403 -579202 -4587745 -5308093 -4161626 -1643595 1280936 2234276
40736 2234276 512024 -1120728 -195700 1740655 1786529 433274 425891 1758500 1538479
40727 1538479 -761560 -1518842 1805695 6253170 6740094 2705684 -974303 261857
40719 261857 5537936 9702911 8999835 4978711 2493555 4141420 7853693 10370108
40711 10370108 11103547 10745837 8158020 2356337 -3253961 -3338713 1748581 5328372 3411297
40702 3411297 105489 1030772 5265663 7898016 7395300 5640545 3005643 -1170789
40694a170789l257300J289020M534367K536337j092612j086142J084557O41997
40686C479435j985494k493542l41381J238821J377548J597846R24215k613068
40678A184380o187522m616565J101816M318722K699041Q84569J589546J272628
40670B246615k153342m275138j623908J780339J141326q13488R62075M173789
40662A438268K663657k492461l893492Q6433K526867n83479l994130k439012N42409
40653f144940r03340m508487l318855K782615O498052M021835k22404j272936
40645c068460j94886j70372p44829L06873K506759L706403L516165K617285N76213
40636I051151k533022m057764j770070K145714L428995J383636q91564j280369
$$ plain form
40694 -1170789 -4428089 -3139069 1395298 3931635 2839023 1752881 2837438 3479435
40686 3479435 1493941 -999601 -1340982 -102161 1275387 2873233 3797448 1184380
40678 1184380 -5003142 -9619707 -8517891 -4199169 -1500128 -615559 973987 2246615
40670 2246615 93273 -4181865 -5805773 -4025434 -2884108 -3697596 -2735521 1438268
40662 1438268 4101925 1609464 -2284028 -2197595 329272 -254207 -4248337 -6687349 -6144940
40653 -6144940 -7048280 -11556767 -14875622 -12093007 -5594955 -1573120 -1795524 -3068460
40645 -3068460 -3263346 -3433718 -4178547 -3871674 -1364915 2341488 5857653 8474938 9051151
40636 9051151 6518129 2460365 690295 2836009 6265004 7648640 6757076 5476707
40628E476707n10060K99402O84074l14200k935573m398825j652675L003408L268410
40619B920668k379380p126525m215994L714213P629414L633949k374502k748021
40611i46178K092174M814374J383165l664997m115979j004551j30593k176164
40603c748749j677247L014085N676004J952951l132800l212040p92396k012556
40595c932748n263928l942207J651348M545384K635143P09498O85393n81172k537078
40586f030367k12169N078353M804111k654526p281435k796676L254551K495472
40578c342686o95695J463429N251859K013301n558548o688730r3694M061917L68630
40569c220217m583933l610376J377125M512179M053552J926855L7376m10252O11683
$$ plain form
40628 5476707 4966647 5266049 5950123 5635923 2700350 -1698475 -3351150 -347742 2920668
40619 2920668 541288 -6585237 -10801231 -7087018 542396 4176345 1801843 -946178
40611 -946178 1145996 5960370 7343535 3678538 -437441 -1441992 -1572585 -3748749
40603 -3748749 -5425996 -2411911 3264093 5217044 2084244 -1127796 -1920192 -3932748
40595 -3932748 -9196676 -13138883 -11487535 -6942151 -4307008 -3597510 -2912117 -3493289 -6030367
40586 -6030367 -6242536 -1164183 3639928 985402 -6296033 -9092709 -5838158 -3342686
40578 -3342686 -4038381 -2574952 2676907 4690208 -868340 -7557070 -7650764 -3588847 -3220217
40569 -3220217 -7804150 -11414526 -10037401 -5525222 -1471670 455185 492561 82309 693992
40560F93992J164503J47688N5024K725600M162305k47397o587452o206072R63215
40551c128594N105153P95405n252991m595265J499324N963134O025622L927597
40543A0339385J274582j835397m110110m061966k570342j208650M97280L166354
40535A491136M656996K515947j675037l732428k390186n50522q08550k121525
40527b614169j773405Q51908L526862L747103J378692j378549k469287k003553
40519g34398j536871j765849j626855K01329L180366M638119K356565k103366
40511B609040l976825r16436L160695K726867j606978m003553k132839Q8142l4061
40502d085948M91781L869423N976772K609642k756132l612128k46716J386506
$$ plain form
40560 693992 1858495 2006183 2061207 4786807 8949112 8701715 2114263 -4091809 -3128594
40551 -3128594 1976559 2771964 -2481027 -7076292 -5576968 386166 6411788 10339385
40543 10339385 11613967 9778570 5668460 1606494 -963848 -2172498 -1675218 1491136
40535 1491136 6148132 8664079 6989042 3256614 866428 315906 -492644 -2614169
40527 -2614169 -4387574 -3535666 -8804 3738299 5116991 3738442 1269155 -734398
40519 -734398 -2271269 -4037118 -5663973 -5462644 -2282278 2355841 4712406 2609040
40511 2609040 -1367785 -2284221 876474 3603341 1996363 -2007190 -4140029 -4051887 -4085948
40502 -4085948 -3594167 275256 6252028 8861670 6105538 2493410 2246694 3633200
40494C633200q26945l033986k415697n45887O86484J485699J636056j27908l127523
40485b636507m422363k395707J586175N009222N797816L232021n24706j603672
40477D042279M91896J517793j101878l952384l292765j014933l19129K54800K738872
40468f35449M035616J188374j768953j34997K177235j167368o745219n868211
40460h918972P29812L846998Q15043j688678j59498J587232J753657K876356L566552
40451D408502m99506n840546l901278L349300M282465k522002m427138L426125
40443a724078Q340646J293776p099711m116158M425051N261699p52716l301211
40435B327298j153353q39606k211365o4309L511617K273975j436103l37393L631885
$$ plain form
40494 3633200 2806255 -227731 -2643428 -3189315 -2502831 -1017132 618924 491016 -2636507
40485 -2636507 -7058870 -9454577 -7868402 -2859180 2938636 6170657 5645951 4042279
40477 4042279 4534175 6051968 4950090 997706 -2295059 -3309992 -3629121 -3374321 -635449
40468 -635449 3400167 4588541 2819588 2684591 4861826 3694458 -3050761 -8918972
40460 -8918972 -8189160 -4342162 -3527119 -5215797 -5375295 -3788063 -2034406 841950 4408502
40451 4408502 3908996 -1931550 -5832828 -2483528 1798937 -723065 -5150203 -1724078
40443 -1724078 6616568 7910344 810633 -3305525 1119526 6381225 5628509 2327298
40435 2327298 1173945 334339 -1877026 -1941335 1570282 3844257 2408154 2070761 5702646
40426E702646K007434m595671o594672j146818M405682N335233M312470K689964
40418A2116268j646218o361391n500091o4173K405281L53547q7290K441196J613396
40409E270525m018898o727599k426160K363444J722380o41704N07003K974336
40401i76673K647157J088291J355056J980335Q33858j51401Q10256J419763J58521
40392I165163j92242J513336J061479l549866o418821k091016M880699N704416
40384A0073148k93545n713132n686888k407174K31915J381487K167328L082093
40376B835232L115664P57314l168654m254154M87680O561106O184039m68710m557842
40367G491675j480511K590012J263176k067511j136638K133637J344867l309013
$$ plain form
40426 5702646 7710080 3114409 -3480263 -4627081 -221399 5113834 9426304 12116268
40418 12116268 10470050 4108659 -1391432 -1455605 949676 1303223 1215933 3657129 5270525
40409 5270525 1251627 -5475972 -7902132 -5538688 -3816308 -4458012 -3951009 -976673
40401 -976673 1670484 2758775 4113831 6094166 6928024 6776623 7586879 9006642 9165163
40392 9165163 8972921 10486257 11547736 7997870 1579049 -511967 4368732 10073148
40384 10073148 9779603 4066471 -1620417 -4027591 -3795676 -2414189 -246861 2835232
40376 2835232 5950896 6708210 3539556 -714598 -226918 6334188 12518227 12049517 7491675
40367 7491675 6011164 8601176 9864352 7796841 6660203 8793840 10138707 6829694
40359F829694n591059k961010J149641L646126M343044L258700P47609p71349
40351A0651396m9950j32656l218878n083091j012509N019421M805181j479644
40343I499270n239108k440422J389225R23727j594867j696373O71455K987373
40335D500280L766997J883698k919301o790524m369967K924293O745663K960926
40327H702065k654975l466791r32883K20361K64850J759560K902381O12679k494725
40318D912522j346366K783028L580415m88785m158437l826702k082971k153382
40310b780678k913129j786967J107661L858781N022334L619113l61978m343944
40302A421193m857002j949471P37994J047983N01100P31550J146075J195956J436123
$$ plain form
40359 6829694 1238635 -1722375 -572734 3073392 7416436 10675136 11422745 10651396
40351 10651396 10601446 10468790 7249912 2166821 1154312 6173733 10978914 9499270
40343 9499270 4260162 1819740 3208965 4132692 2537825 841452 1512907 4500280
40335 4500280 8267277 10150975 7231674 441150 -3928817 -1004524 5741139 8702065
40327 8702065 6047090 2580299 1647416 1867777 2132627 3892187 6794568 7407247 4912522
40318 4912522 3566156 6349184 9929599 9440814 5282377 1455675 -627296 -2780678
40310 -2780678 -5693807 -7480774 -6373113 -2514332 2508002 6127115 5765137 1421193
40302 1421193 -3435809 -5385280 -4647286 -3599303 -3098203 -2366653 -1220578 -24622 1411501
40293A411501J080846j574462m663412l209358L151103P401117M189617k089095
40285E697857l306891R24437L473337L40902m441468n122840j099765L714370
40277A79939N372794K821527j466883l407232j570066R19692O14667j336959j206021
40268I21458J536103L761831L319567P78612k759130n909067n719745n79703N415735
40259G65661N621005m90487n889931m727945J078989N507471N273119J388708
40251H526590k961971m382443j798713J660334J956328j06498K1200L098577M328597
40242A0342001J066959k482217j563395K059242L215609O16456k814629m700092
40234E739934m691709k910670k50592J004350l27400k283132k338209o17416J249984
$$ plain form
40293 1411501 2492347 917885 -3745527 -6954885 -3803782 3597335 7786952 5697857
40285 5697857 2390966 3315403 6788740 7129642 2688174 -2434666 -3534431 179939
40277 179939 5552733 8374260 6907377 3500145 1930079 2849771 3464438 2127479 921458
40268 921458 2457561 6219392 9538959 10317571 7558441 1649374 -4070371 -4650074 765661
40259 765661 6386666 5896179 6248 -4721697 -3642708 1864763 7137882 8526590
40251 8526590 5564619 1182176 -616537 1043797 3000125 2893627 2914827 6013404 10342001
40242 10342001 11408960 8926743 7363348 9422590 12638199 13254655 10440026 5739934
40234 5739934 1048225 -1862445 -2113037 -1108687 -1436087 -3719219 -6057428 -6674844 -5424860
40225e424860K489043K485028J79528l392732m347675o38446M347777N611151
40217A308814K377817k140210m872211m467084r78503L304601M640277K080841
40209A254342q41594r27362M46948L69146q52869j048238k11224M064o45077j022296
40199c474160m38417J238938L494158M206306J631004j928867k467407r90686
40191A270869k203781n157890k958514M716330P691961L33227p928317o078429
40183a0314544J656319L501305p98674j458743L534894N690580J506698k060306
40175A257529m08458J634193j98844k092961Q5068L036920J651607k904550n493495
40166c432991l869146j42353J903405q1093l687616k625460M703876J0023182
$$ plain form
40225 -5424860 -2935817 -450789 -271261 -3663993 -8011668 -8650114 -4302337 1308814
40217 1308814 3686631 1546421 -3325790 -7792874 -8771377 -5466776 -826499 1254342
40209 1254342 412748 -514614 -67666 301480 -551389 -1599627 -1810851 -1806787 -2451864 -3474160
40199 -3474160 -3912577 -2673639 820519 5026825 6657829 4728962 2261555 1270869
40191 1270869 -932912 -6090802 -9049316 -4332986 3358975 3692202 -4236115 -10314544
40183 -10314544 -8658225 -5156920 -5955594 -7414337 -3879443 1811137 3317835 1257529
40175 1257529 849071 2483264 2284420 191459 276527 3313447 4965054 2060504 -3432991
40166 -3432991 -7302137 -7444490 -5541085 -5622178 -9309794 -11935254 -7231378 2791804
40158B791804N394659l885901n750220P59690M969709J985524j590605j351045
40150C323615j514911l505182j258542N658862P068848j182812p683124l012048
40142b105294M307160K093899m864073l546160M660290O594897l49997m875253
40134A915469j259269K720749N46908l140234k384392N67254J241904N80999J147860
40125A937248J764241P91055o7715O54600R55938p62816k332084j482763M55328
40116A913032J326468J515851J928977J502432n74665k445109j868564O53037
40108C951459K759311K830274O49752k848653n536627n369566k558174O48591
40100e473633K435208K474201J163714m06214n70952P14170R06138j408183l324547
$$ plain form
40158 2791804 8186463 4300562 -1449658 -689968 4279741 6265265 4674660 3323615
40150 3323615 1808704 -1696478 -2955020 2703842 9772690 8589878 906754 -2105294
40142 -2105294 2201866 4295765 -568308 -4114468 545822 7140719 6790722 1915469
40134 1915469 656200 3376949 3923857 783623 -1600769 -1033515 208389 789388 1937248
40125 1937248 3701489 4492544 4424829 5079429 6035367 5272551 2940467 1457704 1913032
40116 1913032 3239500 4755351 6684328 8186760 7612095 5166986 3298422 3951459
40108 3951459 6710770 9541044 10190796 7342143 1805516 -3564050 -6122224 -5473633
40100 -5473633 -3038425 -564224 599490 193276 -377676 336494 1242632 -165551 -3490098
40091c490098j471917K371007L633918J923175Q89698J564727J096190j399752
40083E116948l033550k352458j286707n61689J436407L463944J209361m673962
40075f81706o605596q60712N345965L734438k665043m436866j9471L325654J725786
40066a137551o68619k78053O33904r0171k83480J195277J165924j403831j564452
40057b431052L290667O618934J654732o748949p973454j448838K925574M84781
40049c627605k027556J023069M847604L072512j641881k924864j066522m07888
40041b753131m75272K089083N261789L685637j795346m389271j460366K484320
40033B647443L508926K393164J91770l715160p439158o634922j117860L702509
$$ plain form
40091 -3490098 -4962015 -2591008 1042910 2966085 3855783 5420510 6516700 5116948
40083 5116948 2083398 -269060 -1555767 -2117456 -681049 2782895 3992256 -681706
40075 -681706 -7287302 -8148014 -2802049 932389 -1732654 -6169520 -6188991 -2863337 -1137551
40066 -1137551 -1806170 -2084223 -1450319 -1540490 -1823970 -628693 537231 -866600 -2431052
40057 -2431052 859615 7478549 9133281 2384332 -5589122 -7037960 -4112386 -3627605
40049 -3627605 -5655161 -4632092 215512 3288024 1646143 -1278721 -2345243 -2753131
40041 -2753131 -3228403 -1139320 4122469 7808106 6012760 1623489 163123 2647443
40033 2647443 6156369 8549533 8741303 5026143 -2413015 -9047937 -10165797 -6463288
40025f463288M051161J776858k01528j263033o83778K367320M930055K531574
40017G045341k870560m030453K11505K343038j520995m884703j752018L375070
40009b083775L365244j448k85648K550869L425672J228657q60697j723165k312744
40000C302965j743452L97477O20346l118057n689631j666656M796796N061686
39992A961474p11938l873082n23714L766499L445135m2105k484447k372389n52988
39983a387555J170112N52838k175715k889455O53423L778833J281444l659594
39975b675669m033589k64954J495733P94698K669465O112958L857930l989150
39967C967422p205844j037555N579523L813096j937687k742859L07823j18884
$$ plain form
40025 -6463288 -2412127 -635269 -836797 -2099830 -2783608 -416288 4513767 7045341
40017 7045341 4174781 144328 355833 2698871 1177876 -3706827 -5458845 -2083775
40009 -2083775 1281469 1280021 994373 3545242 6970914 8199571 7338874 5615709 3302965
40000 3302965 1559513 1956990 2577336 -540721 -6230352 -7897008 -3100212 1961474
39992 1961474 1249536 -2623546 -3147260 619239 4064374 4022269 1537822 -834567 -1387555
39983 -1387555 -217443 335395 -1840320 -4729775 -4076352 -297519 983925 -2675669
39975 -2675669 -6709258 -6974212 -5478479 -4683781 -2014316 4098642 7956572 3967422
39967 3967422 -3238422 -4275977 1303546 5116642 3178955 436096 743919 625035
39959F25035l887779l725633K025460O177423L610405j584201k739498K23968
39951G25180J800925r91580m754825m350074L78446M362478L834004Q01736n72706
39942A233584K15906Q04270P72605J626591K770626J852763q16382k256769j511948
39933D691246n22615k19489K64143N01580p74926k111884q40811J805053K001501
39924D793798k49813j434285j195521k390280m101703j807215M027181O929814
39916D571976M295197R50514J93374r49940l971513m469256l31541L202331K101541
39907E592683n8079P0627q77910m819654n647444M66561N663789J838383m814526
39898b585570k991079M513440M821497l431148p367052q07508O095495L683216
$$ plain form
39959 625035 -3262744 -6988377 -4962917 1214506 4824911 3240710 501212 725180
39951 725180 2526105 1534525 -3220300 -7570374 -7191928 -2829450 1004554 1806290 1233584
39942 1233584 1449490 2253760 3026365 4652956 7423582 9276345 8459963 6203194 4691246
39933 4691246 4168631 3949142 4213285 4714865 3939939 1828055 987244 2792297 4793798
39924 4793798 4543985 3109700 1914179 -476101 -4577804 -6385019 -2357838 4571976
39916 4571976 8867173 9817687 10011061 9061121 5089608 620352 288811 3491142 5592683
39907 5592683 5534604 5605231 4727321 -92333 -5739777 -5273216 390573 2228956 -2585570
39898 -2585570 -5576649 -1063209 3758288 327140 -7039912 -7847420 -1751925 1931291
39890A931291k631006k758389J866483K243643k911232n560238j069525N199600
39882c689373N713301M00979m097069k790653K275283N037465K583758k052187
39874C381504m273081l081869n88604J584543L010675K993708J166511j139738
39866C053649k351231k564152k127086j52240L002821L994464P44726l471403
39858A29548m101838j705946j9068M33964J698928L053240K266172J065441K641865
39849E462306M262314K18904p117048q046877l19051N705144K052416m644771
39841b426663l679036L039332M573931j623079o208679k626337L734945M595494
39833f20092L72188k306182p21034J648000J547102L1947l68535O43532J639060
$$ plain form
39890 1931291 -699715 -3458104 -1591621 652022 -2259210 -7819448 -8888973 -3689373
39882 -3689373 2023928 2424907 -1672162 -4462815 -2187532 2849933 5433691 3381504
39874 3381504 -891577 -3973446 -4562050 -2977507 33168 3026876 4193387 3053649
39866 3053649 702418 -1861734 -3988820 -4141060 -1138239 2856225 3600951 129548
39858 129548 -3972290 -5678236 -5697304 -5263340 -3564412 -511172 1755000 2820441 5462306
39849 5462306 9724620 9943524 2826476 -5220401 -5539452 165692 2218108 -2426663
39841 -2426663 -6105699 -3066367 1507564 -115515 -6324194 -8950531 -5215586 -620092
39833 -620092 -247904 -2554086 -3275120 -1627120 -80018 -48071 -416606 226926 1865986
39824A865986J776080J086429m29565k345082l010318j108053J882602K731178
39816B449257O54136j515679j541182r30404j774012k634959r67755J732675J467612
39807c060311j672022k964350k78059K505240J617159q71071p94786J549048K580611
39798a388541J305383k11252j244583k844330l865387j196433M548358P610366
39790B713581M147037k069707m278813j312082J974820K014811L72459k37221
39782C324885m3660m15651p64609Q3278J191364R72115J40516L02191N13774j305023
39772C999180l814311l087289J176621M225417K876647n3367n75665M64350k49467
39763D962116k548915l314229j699346J33576R34148J366152J387693K68155p24596
$$ plain form
39824 1865986 3642066 4728495 4298930 1953848 -1056470 -2164523 -281921 2449257
39816 2449257 3103393 1587714 46532 -883872 -2657884 -5292843 -6260598 -4527923 -3060311
39807 -3060311 -4732333 -7696683 -7974742 -5469502 -3852343 -4723414 -5518200 -3969152 -1388541
39798 -1388541 -83158 -294410 -1538993 -4383323 -8248710 -9445143 -4896785 2713581
39790 2713581 6860618 4790911 512098 -799984 1174836 3189647 3562106 3324885
39782 3324885 3281225 2865574 2100965 2184243 3375607 4347722 4488238 4790429 5304203 3999180
39772 3999180 184869 -2902420 -1725799 2499618 5376265 5322898 4747233 5211583 4962116
39763 4962116 2413201 -901028 -2600374 -2466798 -1532650 -166498 1221195 1489350 764754
39754G64754O46602L314460L327649k45001l195348j837592J862760L022376k0661
39745G639999m265398n734019l227246R02745L000599J778436k56180m1466J993525
39736A790995K960911J900701M88541l01497j069036j459088l57972Q76925n79985
39727D250495l677871l601982P58747M066609K299311j220425j651653l11985
39719I11246j136458k752753p26173L827610M849900Q55143k582845j483876R93967
39710B755761L19288k535632l270345m72734L207877M403072J811344k710428
39702C508203m944792k314835K394850L968954J645162n16210n17788q06859k280273
39693A36412j607080K185635L991441L33444m039282l262524N1523m39750l545459
$$ plain form
39754 764754 1411356 4725816 8053465 7808464 4613116 2775524 4638284 7660660 7639999
39745 7639999 3374601 -2359418 -5586664 -4683919 -1683320 95116 -161064 -202530 1790995
39736 1790995 4751906 6652607 7141148 6839651 5770615 4311527 3953555 4830480 4250495
39727 4250495 572624 -3029358 -2270611 1795998 4095309 2874884 1223231 911246
39719 911246 -225212 -2977965 -3704138 123472 4973372 5828515 3245670 1761794 2755761
39710 2755761 3075049 539417 -2730928 -3203662 4215 4407287 6218631 3508203
39702 3508203 -1436589 -3751424 -1356574 2612380 4257542 3741332 3223544 2416685 136412
39693 136412 -1470668 714967 4706408 5039852 1000570 -2261954 -2210431 -2650181 -6195640
39684f195640k542119K829566N492826K899592P40358K291228K765689j287808
39676F993692m732971k123336K839731L093131q83295l040076j643756k08259
39668B94861l83666m90756j20303k25743M68986L338435N164167J966892l102965
39659F909908k880055K396509M454417l09205n143126l569068J216929K658563
39651E734872R26786N15556J614696M92724l273051n802303m780849j859133O78664
39642e752038K026615J839914L05046q75784k27332J062787P67345r45605j997879
39633c796931j526829k32023J421247K968637L105207J651892R38303K238806
39625F768309K511318j362351o359916o245116o17848M053570L495572Q24582
$$ plain form
39684 -6195640 -8737759 -5908193 -415367 2484225 3224583 5515811 8281500 6993692
39676 6993692 2260721 137385 2977116 6070247 5186952 2146876 503120 294861
39668 294861 -88805 -579561 -699864 -925607 -456621 2881814 8045981 10012873 6909908
39659 6909908 4029853 6426362 10880779 10571574 5428448 1859380 3076309 5734872
39651 5734872 6661658 7177214 8791910 9284634 6011583 209280 -4571569 -6430702 -5752038
39642 -5752038 -3725423 -1885509 -1580463 -2456247 -2683579 -1620792 -853447 -1799052 -3796931
39633 -3796931 -5323760 -5555783 -4134536 -1165899 1939308 3591200 4529503 6768309
39625 6768309 9279627 7917276 1557360 -4687756 -5305604 -1252034 2243538 3068120
39617C068120N46665J773863Q19453k373211m108319k055407K127272M675815
39609D474251K881317k411482o483231m844057J116277M960662L322913K59397
39601C276047P62294K949742J247200m217616o893175l199257K211455L018639
39593h44671l61165k224634L06043L993387M288079R47734k203137k066559L90219
39584B225296J813231P49888r09347r58420K79487J344971K152285K783883J328882
39575A0810156l340868p235015m622458L076758P004477K480599l913704l480704
39567G79241K370381N127676J814348k389923l318766k477550j894566j014444
39559a003603k08279j092982j687053K039872P608118O716877j734026p397889
$$ plain form
39617 3068120 3614785 5388648 6208101 3834890 -273429 -2328836 -201564 4474251
39609 4474251 7355568 4944086 -1539145 -6383202 -5266925 -306263 3016650 3276047
39601 3276047 4038341 6988083 8235283 4017667 -2875508 -6074765 -3863310 -844671
39593 -844671 -1205836 -3430470 -3124427 868960 5157039 6104773 3901636 1835077 2225296
39584 2225296 4038527 4788415 3879068 2920648 3200135 4545106 6697391 9481274 10810156
39575 10810156 7469288 234273 -4388185 -1311427 5693050 8173649 4259945 779241
39567 779241 3149622 8277298 10091646 7701723 4382957 1905407 10841 -1003603
39559 -1003603 -1211882 -2304864 -3991917 -1952045 5656073 12372950 10638924 3241035
39551C241035l104831L950787L536677j832426k454995J980940K951807j645274
39543F623720m403590j347636K422391K266025K20573r84712k068150k636606
39535I2015k11163L392596K446280k863632m934924o72057L317741J904018o04384
39526A866490O51928K443793P18549j009925J335931L580318M80044l812018k213603
39517D041507K672111K658287k248809m542646k027349K61684L16492J312147
39509B443424L159320J710733k217853k399691K023570M190404Q41207k484227
39501G266887j228717J180195N58090j074094q24132p33684k727017l507108m08877
39492a498457K691345J578793o34737J079566M181758K173380m253616p494948
$$ plain form
39551 3241035 136204 4086991 7623668 5791242 3336247 5317187 8268994 6623720
39543 6623720 2220130 872494 3294885 5560910 5781483 4796771 2728621 92015
39535 92015 -119148 3273448 5719728 2856096 -2078828 -2750885 566856 2470874 1866490
39526 1866490 2518418 4962211 5680760 4670835 6006766 9587084 10067128 6255110 4041507
39517 4041507 6713618 9371905 7123096 2580450 553101 814785 1131277 2443424
39509 2443424 5602744 7313477 5095624 2695933 4719503 8909907 9751114 7266887
39501 7266887 6038170 7218365 7776455 6702361 5878229 5144545 2417528 -1089580 -1498457
39492 -1498457 1192888 2771681 2136944 3216510 7398268 9571648 5318032 -2176916
39484b176916m316346K96448J673078J323125J903417K010396k03466k251727
39476a741991o79733K946054L828354J009553j443780q11393N17453n01318k412577
39467G10622j720924J157402K164844k80644k972201k654934q0909K055683K577771
39458I56710J658099k30393j513265l79481J768360J007107k670062l692042O58199
39449b436768M522618J767971l638449k963711L499022O452482J764092l825633
39441E141624l579210K47946K165233J722854J192038K26119j774636k058840
39433C283128J128011L790665J553080k646785k394282K039005L873041L12269
39425A0938132l435500k413949J198160K477508R27808m60910n41826l84439P0473
$$ plain form
39484 -2176916 -6493262 -6196814 -4523736 -3200611 -1297194 713202 509736 -1741991
39476 -1741991 -2421724 524330 4352684 5362237 3918457 3107064 3624517 3123199 710622
39467 710622 -1010302 147100 2311944 2031300 -940901 -3595835 -3676744 -1621061 956710
39458 956710 2614809 2384416 871151 491670 2260030 3267137 597075 -3094967 -2436768
39449 -2436768 2085850 3853821 215372 -2748339 750683 7203165 8967257 5141624
39441 5141624 1562414 1810360 3975593 5698447 6890485 7116604 5341968 3283128
39433 3283128 4411139 8201804 9754884 7108099 4713817 6752822 10625863 10938132
39425 10938132 7502632 5088683 6286843 8764351 9692159 9231249 8689423 8304984 8375457
39416H375457J613287K611056M70397l259029l552914N15708L049083m28421n487936
39407C906688m613877J531700M902067K072315j275869r3000K172112j4480m724441
39398C863215n420164j020739K801916K051228p55573j071132J733465M248850
39390F431066L300100l51811k507291o35935K039302N19434l941375m676583k8497
$$ plain form
39416 8375457 9988744 12599800 13070197 9811168 6258254 6773962 9823045 9394624 3906688
39407 3906688 -707189 824511 5726578 7798893 6523024 6430024 8602136 8587656 3863215
39398 3863215 -1556949 -2577688 224228 2275456 1519883 448751 2182216 6431066
39390 6431066 9731166 9379355 6872064 6236129 8275431 8794865 4853490 176907 148410
$$ [...]
##END NTUPLES=NMR SPECTRUM
##END=
