##TITLE=31Pdec_PhAc
 , 48 sc
 10.2.2021
##JCAMPDX= 6.0         $$ Bruker NMR JCAMP-DX V2.0
##DATA TYPE= NMR SPECTRUM
##DATA CLASS= NTUPLES
##ORIGIN= UXNMR, Bruker Analytische Messtechnik GmbH
##OWNER= root
$$ XWIN-NMR		Version 3.5
$$ Wed Feb 10 13:36:51 2021 Russian Standard Time (UT+4h)  she@DPX200
##.OBSERVE FREQUENCY= 81.013821
##.OBSERVE NUCLEUS= ^31P
##.ACQUISITION MODE= SIMULTANEOUS
##.ACQUISITION SCHEME= undefined
##.AVERAGES= 48
##.DIGITISER RES= 16
##SPECTROMETER/DATA SYSTEM= spect
##.PULSE SEQUENCE= zgpg30
##.SOLVENT NAME= CDCl3
##.SHIFT REFERENCE= (INTERNAL, CDCl3, 0, 298.009)
##AUDIT TRAIL= $$ (NUMBER, WHEN, WHO, WHERE, WHAT)
$$ ##TITLE= Audit trail, XWIN-NMR		Version 3.5
$$ ##JCAMPDX= 5.01
$$ ##ORIGIN= Bruker BioSpin GmbH
$$ ##OWNER= she
$$ F:/spectra/data/she/nmr/P31/1/pdata/1/auditp.txt
$$ ##AUDIT TRAIL=  $$ (NUMBER, WHEN, WHO, WHERE, WHAT)
(   1,<2021-02-10 13:35:31.40 +0400>,<she>,<DPX200>,
      <continue with go, POWCHK disabled, PULCHK disabled
       configuration hash MD5:
       00 E9 B6 7A A2 85 ED C7 34 08 36 98 17 FE 4E 26
       data hash MD5: 32K
       AA D0 1E 5A 54 4A 37 60 08 DA 7F E9 17 FB 55 AD>)
(   2,<2021-02-10 13:35:36.60 +0400>,<she>,<DPX200>,
      <Start of raw data processing
       efp BC_mod = 2 LB = 1 FT_mod = 6 PKNL = 1 PHC0 = -1990.979 PHC1 = 318.8023 SI = 64K 
       data hash MD5: 64K
       7E 04 D4 58 4C F8 A5 89 81 FF FD FF B2 B9 2C 94>)
(   3,<2021-02-10 13:36:28.87 +0400>,<she>,<DPX200>,
      <pk PHC0 = 79.48606 PHC1 = -219.6 
       data hash MD5: 64K
       02 11 D7 F1 A2 8E 84 19 D2 C1 46 BC 72 A0 65 F2>)
$$ ##END=
$$ 
$$ hash MD5
$$ D1 32 04 5B 0B 83 B7 B5 70 23 4A 15 83 C5 BF F7
##$RELAX= 
##$RELAX= 
##$RELAX= 
##$RELAX= 
##$RELAX= 
##$RELAX= 
##$RELAX= 
##$RELAX= 
$$ Bruker specific parameters
$$ --------------------------
##$DU= <F:/spectra>
##$EXPNO= 1
##$NAME= <P31>
##$PROCNO= 1
##$TYPE= <nmr>
##$USER= <she>
##$AMP= (0..31)
100 100 100 100 100 100 100 100 100 100 100 100 100 100 100 100 100 100 
100 100 100 100 100 100 100 100 100 100 100 100 100 100 
##$AQSEQ= 0
##$AQ_mod= 1
##$AUNM= <au_zg>
##$AUTOPOS= <>
##$BF1= 81.014009
##$BF2= 200.13
##$BF3= 200.13
##$BF4= 200.13
##$BF5= 200.13
##$BF6= 200.13
##$BF7= 200.13
##$BF8= 200.13
##$BYTORDA= 1
##$CFDGTYP= 0
##$CFRGTYP= 5
##$CHEMSTR= <none>
##$CNST= (0..31)
1 1 145 1 1 1 1 1 1 1 1 1 1 1 1 1 1 1 1 1 1 1 1 1 1 1 1 1 1 1 1 1 
##$CPDPRG= <waltz16>
##$CPDPRG1= <>
##$CPDPRG2= <waltz16>
##$CPDPRG3= <>
##$CPDPRG4= <mlev>
##$CPDPRG5= <mlev>
##$CPDPRG6= <mlev>
##$CPDPRG7= <mlev>
##$CPDPRG8= <mlev>
##$CPDPRGB= <>
##$CPDPRGT= <>
##$D= (0..31)
0 1 0 0 0 0 0 0 0 0 0 0.03 2e-05 3e-06 0 0 0 0 0 0 0 0 0 0 0 0 0 0 0 0 
0 0 
##$DATE= 1612949645
##$DBL= (0..7)
120 120 120 11 120 120 24 19 
##$DBP= (0..7)
150 150 150 150 150 150 150 150 
##$DBP07= 0
##$DBPNAM0= <>
##$DBPNAM1= <>
##$DBPNAM2= <>
##$DBPNAM3= <>
##$DBPNAM4= <>
##$DBPNAM5= <>
##$DBPNAM6= <>
##$DBPNAM7= <>
##$DBPOAL= (0..7)
0.5 0.5 0.5 0.5 0.5 0.5 0.5 0.5 
##$DBPOFFS= (0..7)
0 0 0 0 0 0 0 0 
$$ [...]
##$SUBNAM2= <"">
##$SUBNAM3= <"">
##$SUBNAM4= <"">
##$SUBNAM5= <"">
##$SUBNAM6= <"">
##$SUBNAM7= <"">
##$SUBNAM8= <"">
##$SUBNAM9= <"">
##$SW= 600.660478495614
##$SWIBOX= (0..15)
0 1 3 0 0 0 0 0 0 0 0 0 0 0 0 0 
##$SW_h= 48661.800486618
##$TD= 32768
##$TD0= 1
##$TE= 0
##$TE2= 300
##$TE3= 300
##$TEG= 300
##$TL= (0..7)
0 120 53 12 22 120 120 120 
##$TP= (0..7)
150 150 150 150 150 150 150 150 
##$TP07= 0
##$TPNAME0= <>
##$TPNAME1= <>
##$TPNAME2= <>
##$TPNAME3= <>
##$TPNAME4= <>
##$TPNAME5= <>
##$TPNAME6= <>
##$TPNAME7= <>
##$TPOAL= (0..7)
0.5 0.5 0.5 0.5 0.5 0.5 0.5 0.5 
##$TPOFFS= (0..7)
0 0 0 0 0 0 0 0 
##$TUNHIN= 0
##$TUNHOUT= 0
##$TUNXOUT= 0
##$USERA1= <user>
##$USERA2= <user>
##$USERA3= <user>
##$USERA4= <user>
##$USERA5= <user>
##$V9= 5
##$VALIST= <valist>
##$VCLIST= <CCCCCCCCCCCCCCC>
##$VD= 0
##$VDLIST= <DDDDDDDDDDDDDDD>
##$VPLIST= <PPPPPPPPPPPPPPP>
##$VTLIST= <TTTTTTTTTTTTTTT>
##$WBST= 1024
##$WBSW= 4
##$XGAIN= (0..3)
0 0 0 0 
##$XL= 0
##$YL= 0
##$YMAX_a= 8164
##$YMIN_a= -8373
##$ZGOPTNS= <>
##$ZL1= 120
##$ZL2= 120
##$ZL3= 120
##$ZL4= 120
##$ABSF1= 0
##$ABSF2= 0
##$ABSG= 0
##$ABSL= 0
##$ALPHA= 0
##$AQORDER= 0
##$ASSFAC= 0
##$ASSFACI= 0
##$ASSFACX= 0
##$ASSWID= 0
##$AUNMP= <proc_1d>
##$AZFE= 0.1
##$AZFW= 0.5
##$BCFW= 0
##$BC_mod= 2
##$BYTORDP= 0
##$COROFFS= 0
##$CY= -3
##$DATMOD= 1
##$DC= 0
##$DFILT= <>
##$DTYPP= 0
##$F1P= 0
##$F2P= 0
##$FCOR= 1
##$FTSIZE= 65536
##$FT_mod= 6
##$GAMMA= 0
##$GB= 0
##$INTBC= 1
##$INTSCL= 5.30512e-09
##$ISEN= 30
##$LB= 1
##$LEV0= 0
##$LPBIN= 0
##$MAXI= 10000
##$MC2= 0
##$MEAN= 0
##$ME_mod= 0
##$MI= 50
##$NCOEF= 0
##$NC_proc= -4
##$NLEV= 6
##$NOISF1= 182.463
##$NOISF2= 159.3651
##$NSP= 0
##$NTH_PI= 0
##$NZP= 0
##$OFFSET= 298.0089
##$PC= 4
##$PHC0= -1911.493
##$PHC1= 99.2023
##$PH_mod= 1
##$PKNL= yes
##$PPARMOD= 0
##$PSCAL= 0
##$PSIGN= 0
##$REVERSE= no
##$SF= 81.014009
##$SI= 65536
##$SIGF1= 159.3651
##$SIGF2= -187.1042
##$SINO= 113.3802
##$SIOLD= 16384
##$SREGLST= <1H.CDCl3>
##$SSB= 0
##$STSI= 65536
##$STSR= 0
##$SW_p= 48661.800486618
##$SYMM= 0
##$S_DEV= 0
##$TDeff= 32768
##$TDoff= 0
##$TI= <>
##$TILT= no
##$TM1= 0
##$TM2= 0
##$TOPLEV= 0
##$USERP1= <user>
##$USERP2= <user>
##$USERP3= <user>
##$USERP4= <user>
##$USERP5= <user>
##$WDW= 1
##$XDIM= 65536
##$YMAX_p= 268532849
##$YMIN_p= -4870646
$$ End of Bruker specific parameters
$$ ---------------------------------
##NTUPLES= NMR SPECTRUM
##VAR_NAME=  FREQUENCY,     SPECTRUM/REAL,   SPECTRUM/IMAG
##SYMBOL=    X,             R,               I
##VAR_TYPE=  INDEPENDENT,   DEPENDENT,       DEPENDENT
##VAR_FORM=  AFFN,          ASDF,            ASDF
##VAR_DIM=   65536,         65536,           65536
##UNITS=     HZ,            ARBITRARY UNITS, ARBITRARY UNITS
##FACTOR=    0.742531479157977, 1,           1
##FIRST=     24142.8966085939, 0,            0
##LAST=      -24518.9038780241, 0,           0
##MIN=       -24518.9038780241, -4870646,    0
##MAX=       24142.8966085939, 268532849,    0
$$ Real data points
##PAGE= N=1
##DATA TABLE= (X++(R..R)), XYDATA
$$ [...]
##PAGE= N=2
##DATA TABLE= (X++(I..I)), XYDATA
44749h1298p05497L45516Q49873K34907l74224P9383P69404K70496r52107r83899
$$ -81298 -786795 -441279 408594 643501 269277 348660 1118064 1388560 436453 -547446
44739e47446N86884J752367P93558j243958j856259l42693J402399J468972K68628
$$ -547446 39438 1791805 2585363 1341405 -514854 -857547 544852 2013824 2282452
44730B282452m36281j83672j98650j043628j379115p6811J574201J409900l82317
$$ 2282452 1846171 1662499 1463849 420221 -958894 -1035705 538496 1948396 1566079
44721A566079j434813o18313O00973P01289J54138n717r314m24923o91361j02008
$$ 1566079 131266 -487047 113926 815215 969353 963636 954322 529399 -161962 -263970
44711b63970O48885M26805m55500p50337k16617L33358N80346R02389J203329
$$ -263970 384915 811720 356220 -394117 -610734 -277376 302970 1205359 2408688
44702B408688Q82092K0987n43708m58946k01757j14996L519K45332L22231P8350
$$ 2408688 3290780 3311767 2768059 2309113 2107356 1992360 1995879 2241211 2563442 2641792
44692B641792l33429p60909j000926o62454K73855J033351R00725K12230k22931
$$ 2641792 2308363 1547454 546528 -115926 157929 1191280 2092005 2304235 2081304
44683B081304k91407l21482j50618M39754P37632j08414j414262j482405j2676
$$ 2081304 1789897 1468415 1317797 1757551 2495183 2386769 972507 -509898 -522574
44674e22574J300065J027689k16883q61578l99670L42948M82326L0695l21487
$$ -522574 777491 1805180 1588297 726719 327049 669997 1152323 1183018 861531
44665H61531j46919R5317l08837j021635p64670P34816J835255J056167p02076
$$ 861531 714612 809929 501092 -520543 -1285213 -550397 1284858 2341025 1638949
44656A638949j364404n51388L25047M91945N37574O80674K10950q52610j241577
$$ 1638949 274545 -276843 48204 540149 1077723 1758397 1969347 1116737 -124840
44647a24840l61982O44400O17317q566j89451J10988K05505j29789n35817o39663
$$ -124840 -486822 157578 774895 766329 576878 687866 893371 763582 227765 -411898
44637d11898k57714M66363R06058N86478R504l6721J10319m58858j287677q82040
$$ -411898 -669612 -203249 702809 1289287 1298791 1262070 1372389 913531 -374146 -1256186
44627a256186O67073J321419K01861q59727j77889J121827J013415k47837q40876
$$ -1256186 -589113 732306 934167 74440 -103449 1018378 2031793 1783956 943080
44618I43080l48102L1246k35230m11809o1180L76809N96734P39291P17781L19648
$$ 943080 594978 626224 390994 -20815 -81995 294814 891548 1630839 2348620 2668268
44608B668268j51026k89600l29440n26515l84150L57562O69298l36779j550741
$$ 2668268 2517242 2227642 1898202 1371687 987537 1345099 2014397 1677618 126877
44599A26877j234555J67141O15543k52228o74264J20772O64634l5733o65399J58816
$$ 126877 -1107678 -940537 -324994 -577222 -1251486 -1130714 -466080 -501813 -1167212 -1008396
44589a008396J494394J536754L20061o63094p84986o76286o93608m04549M06149
$$ -1008396 485998 2022752 2342813 1679719 894733 218447 -475161 -879710 -473561
44580d73561J236448J482976R57831j15799j127545j315807n00065N64764R20246
$$ -473561 762887 2245863 3203694 3087895 1960350 644543 144478 709242 1629488
44571A629488L07077p96071j583807j260222K91371J870527J870398L30500q63933
$$ 1629488 1936565 1140494 -443313 -1703535 -1412164 458363 2328761 2659261 1795328
44562A795328n06013K95469K9308p79245o08813L48335M77114m45549p84477J81799
$$ 1795328 1289315 1584784 1614092 834847 226034 574369 1051483 605934 -178543 3256
44552C256R31954J16511j237010j288223j17016O24391K64639j93114J13579P31740
$$ 3256 935210 1051721 -185289 -1473512 -1590528 -966137 -701498 -894612 -781033 -49293
44542d9293Q75371N62051K27381p2176m29956n16944O3779R89305J377050Q10948
$$ -49293 826078 1388129 1615510 1543334 1113378 596434 660213 1649518 3026568 3837516
44532C837516j90307q32479q45483m98814j46338l350j56911m98081p22997o28033
$$ 3837516 3647209 2814730 1969247 1470433 1324095 1320745 1163834 665753 -57244 -685277
44522f85277l50824j55573q5611l108J70740M46341P92457R49722N39412k80480
$$ -685277 -1036101 -1191674 -1277285 -1280393 -1109653 -663312 129145 1078867 1618279 1337799
44512A337799o76918k42685J91410k85535j046901o98381O03306J110485J48240
$$ 1337799 660881 418196 609606 324071 -722830 -1421211 -817905 292580 440820
44503D40820p71573l58221M54288K30536n38061m49809K96148L81070j68426j02565
$$ 440820 -330753 -688974 -234686 -4150 -542211 -992020 -695872 -314802 -483228 -585793
44493e85793N95477N41900m69159q35622K02168J211574Q81028k672j14822L00782
$$ -585793 9684 551584 82425 -753197 -551029 660545 1541573 1538901 1424079 1724861
44483A724861K54172k11707m58542n49067p75225p11378m8468M00356j21305q41356
$$ 1724861 1979033 1767326 1308784 759717 -15508 -726886 -775354 -374998 -496303 -1337659
44473a337659n73949L35506O57706L15799K15087M72480M32866J50476K18701
$$ -1337659 -1911608 -1576102 -918396 -602597 -387510 84970 517836 668312 887013
44464H87013L42855k17297r10971m34261R12291J296335J51077r10646n76961
$$ 887013 1229868 1012571 101600 -332661 579630 1875965 2027042 1116396 539435
44455E39435M08412O94292Q5185q47818j586594j473451p3198J640152J885864
$$ 539435 947847 1642139 1727324 879506 -707088 -2180539 -2253737 -613585 1272279
44446A272279N31443n58941l25374P1042m09087q06132o9363Q47398N81658k87760
$$ 1272279 1803722 1244781 919407 990449 581362 -224770 -294133 553265 1134923 847163
44436H47163l71052J37378J24492k65079r6583L82862K14872l19685j68215M30997
$$ 847163 476111 613489 737981 472902 376319 759181 974053 654368 486153 917150
44426I17150K91934n25674p75430j97302K15087J04237P5010J05270m68173j214932
$$ 917150 1209084 683410 -92020 -289322 -74235 30002 105012 210282 -257891 -1472823
44416a472823q09114O77194J553390J053503K77388P4131j11984n76411m69145
$$ -1472823 -2281937 -1604743 -51353 1002150 1279538 1353669 1241685 665274 196129
44407A96129M39209Q99767K54172k93740K34147P90702R1107j144102j367478
$$ 196129 635338 1535105 1789277 1495537 1729684 2520386 2611493 1467391 99913
44398I9913n59545K07082O37362J008839Q94330j61771j220692r26445L76952
$$ 99913 -459632 -252550 384812 1393651 2287981 2126210 905518 -20927 356025
44389C56025J082875O75466J12537k3782j75314m97891m24180J00908K59260k68390
$$ 356025 1438900 2114366 2226903 2203121 2027807 1529916 1105736 1206644 1465904 1197514
44379A197514o54507k01636N92205P80674J42202p94952j365212j154356l14073
$$ 1197514 543007 341371 933576 1714250 1856452 1061500 -303712 -1458068 -1772141
44370a772141L62431K48454j96156l3593O09426N99409l35973r11089j31362J108960
$$ -1772141 -1409710 -1161256 -1357412 -1391005 -781579 -182170 -518143 -1429232 -1560594 -451634
44360d51634J269973L74484j98582J21690L86643j86441r03978o45698M42389
$$ -451634 818339 1192823 994241 1115931 1502574 1316133 412155 -233543 208846
44351B08846J130193P06062l71579j337672j822191j560268l15988J351555J996728
$$ 208846 1339039 2045101 1673522 335850 -1486341 -3046609 -3362597 -2011042 -14314
44342a4314Q56275q77687j301249j51656J049191J167647O66703L80514K17653
$$ -14314 841961 -35726 -1336975 -1488631 -439440 728207 1394910 1775424 1993077
44333A993077k34675o63133m67560J91516N43989K08984m64510q65906o11621
$$ 1993077 1758402 1095269 627709 819225 1363214 1572198 1107688 241782 -369839
44324c69839J46177O72228L24150n25055p81558o3413Q08319R74673M12631n76682
$$ -369839 -223662 448566 772716 247661 -533897 -597310 211009 1185682 1598313 1021631
44314A021631j705989k147912r64261J152037J945457N33026j051677o72863Q30037
$$ 1021631 -684358 -2832270 -3796531 -2644494 -699037 -166011 -1217688 -1890551 -1060514
44305a060514J194253K59600k86826J2398K6437m80229m80894Q3294J24559k39592
$$ -1060514 133739 393339 106513 118911 145348 -334881 -815775 -732481 -607922 -847514
44295h47514L39723J574786J334940o92506j862854o17073R60662O59499k58313
$$ -847514 -507791 1066995 2401935 1709429 -153425 -770498 190164 849663 591350
44286E91350L58776J452151N62475j563531j828418J35797J323683J86827j210548
$$ 591350 950126 2402277 2964752 1401221 -427197 -291400 1032283 1219110 8562
44277H562r03708M8194m2214n47136K9903J292780J623359O34137o60728j371534
$$ 8562 -895146 -846952 -889166 -1436302 -1406399 -113619 1509740 2143877 1483149 111615
44267A11615j161579r346J250233J133890m16058j247792J10314J867177J337238
$$ 111615 -1049964 -1059310 190923 1324813 908755 -339037 -228723 1638454 2975692
44258B975692r29152j890668o20128N89991J50447n64332o7533O03006k8335j031815
$$ 2975692 2046540 155872 -464256 125735 276182 -288150 -355683 247323 218988 -812827
44248h12827n85940Q49756J224890J74681o31368k61117M30311O63195P16291
$$ -812827 -1398767 -549011 675879 850560 219192 -41925 388386 1051581 1767872
44239A767872O59928q7293j296239j640412o68799L71809N16362M27661P56821
$$ 1767872 2427800 2340507 1044268 -596144 -1264943 -893134 -376772 50889 807710
44230H07710O73329n22064j585720r36091P35308J342365M73915k88545k5691
$$ 807710 1481039 958975 -626745 -1562836 -827528 514837 988752 700207 674516
44221F74516L97412J44641l26873l92412k81572l03950j78496K06030L51815J06169
$$ 674516 1071928 1216569 889696 497284 215712 -88238 -266734 -60704 291111 397280
44211C97280J11151O38297Q96521K74788n46164n84880j356L13063O2085l47221
$$ 397280 508431 1146728 2043249 2318037 1771873 1186993 1185637 1498700 1560785 1213564
44201A213564n71073m64129R6878P97006P74997k69603j302844j144056n4886
$$ 1213564 642491 178362 275240 1072246 1847243 1577640 274796 -869260 -924146
44192i24146P34372P50117N69757O05143N89631K85370j24467m15849m95740k89364
$$ -924146 -189774 560343 1130100 1735243 2324874 2610244 2485777 2069928 1574188 1284824
44182A284824K1874k4521l66642j65682P88418J169205p8740j687717j579811
$$ 1284824 1306698 1282177 915535 749853 1538271 2707476 2628736 941019 -638792
44173f38792o2289N89518k31713o44675L00376R07849j10182j175065m27110J067302
$$ -638792 -701081 -111563 -343276 -987951 -687575 220274 110092 -1064973 -1492083 -424781
44163d24781J100941R340j09046Q75841R96738k80069j119486m41643M28671J69978
$$ -424781 676160 685500 576454 1452295 2449033 2168964 1049478 607835 1036506 1206484
44153A206484n15272m72086k2279j528j66059R0395M08861J47831l33971k58164
$$ 1206484 691212 219126 196847 195319 29260 119655 528516 676347 342376 84212
44143H4212K60355N23061M13965L27840L24889J73094j12701m27364q44458j175202
$$ 84212 344567 867628 1281593 1609433 1934322 2107416 1994715 1567351 722893 -452309
44133d52309q47232J70570R84964R66647N85862L91733P8484n53543p22143N7667
$$ -452309 -1299541 -1128971 -144007 822640 1408502 1800235 1878719 1325176 603033 660700
44123F60700P26739J28061j036048j227381m47928O6025N3378L08377P95287O12414
$$ 660700 1387439 1515500 479452 -747929 -1195857 -1129832 -1076454 -768077 27210 639624
44113F39624j08624j73267N21714O50335k45925r06450m86000J19908m6537m81341
$$ 639624 531000 357733 879447 1529782 1283857 377407 -108593 11315 -35222 -516563
44103e16563l51203J18683L68697N07106O76459M69385j49971l74104J41509N33377
$$ -516563 -867766 -749083 -380386 126720 803179 1272564 1122593 748489 889998 1423375
44093A423375J37866m30592m81190l69995m38189n3243J074032J755389R23750
$$ 1423375 1561241 1130649 649459 279464 -158725 -211968 862064 2617453 3541203
44084C541203n53868j088217n90710p3905J69297M41214L79763m97288j422297
$$ 3541203 2987335 1899118 1308408 1234503 1403800 1845014 2224777 1727489 305192
44075C05192j187163o6958N69528L30415k383j05131l58218n63245m5139Q48682
$$ 305192 -881971 -948929 -379401 -48986 -51369 -156500 -514718 -1077963 -1123102 -274420
44065b74420R03532j7123n84887K9849J021026J219096N03093m27000q55123m22978
$$ -274420 629112 611989 27102 56951 1077977 2297073 2800166 2373166 1518043 1095065
44055A095065N15404Q78323K6273j145754j216733j71065P32399Q04310M12975
$$ 1095065 1610469 2488792 2515065 1369311 152578 -18487 713912 1518222 1931197
44046A931197j62796r18753j207559k29262J339059J743052N57746p38668r81886
$$ 1931197 1768401 849648 -357911 -587173 751886 2494938 3052684 2314016 1332130
44037A332130o34808m06349j10009L58027L21495m62981j038256o00393L08530
$$ 1332130 697322 290973 180964 538991 860486 397505 -640751 -1241144 -932614
44028i32614P14872M55510r4733o21588o76546J19111J176644J304510M25989
$$ -932614 -217742 237768 143035 -478553 -1155099 -1035988 140656 1445166 1871155
44019A871155k42084j47522j20372n67828n85107K36049P40689J25586n90278
$$ 1871155 1629071 1481549 1361177 793349 208242 444291 1184980 1310566 720288
44010G20288l37863J99843M1514k32049K19194O08958j03344j010713n67924O77744
$$ 720288 382425 582268 623782 391733 610927 1219885 1116541 105828 -462096 215648
44000B15648R11641Q8710k08764K63179N6535j107652j534563l66604R01235Q00615
$$ 215648 1127289 1215999 1007235 1270414 1326949 219297 -1315266 -1681870 -780635 19980
43990A9980N1355O2404O44767O53192k5958n43170n76353m64233j87542N35740
$$ 19980 71335 133739 778506 1431698 1405740 862570 286217 -178016 -365558 170182
43980A70182J205404P99231o13623j527035q92986L54840N45899l51030p22085
$$ 170182 1375586 2174817 1561194 34159 -858827 -503987 41912 -309118 -1031203
43971a031203K22202J205647Q36525k47182m39433K66364L79559n21664j038571
$$ -1031203 -809001 396646 1233171 985989 546556 812920 1192479 670815 -367756
43962c67756k11887R97473J277785P56650K97596P0003j73472k56518p139J70985
$$ -367756 -579643 417830 1695615 2452265 2749861 2819864 2646392 2389874 2382735 2553720
43952B553720j2790j91502j72637l95208q36703o18248L74053P74815j44543j003317
$$ 2553720 2540930 2349428 2176791 1781583 944880 326632 700685 1475500 1330957 327640
43942C27640m90874L31832j31847j046233m21451J338876J805079L36359j005739
$$ 327640 -163234 168598 36751 -1009482 -1430933 -92057 1713022 2049381 1043642
43933A043642p18027K43987M71398L2491m06294p37270q76448m48272L13816N90335
$$ 1043642 325615 569602 1041000 1073491 667197 -70073 -946521 -1394793 -1080977 -490642
43923d90642L81670N70459J157794R40130m30158j539087j184309J6842P99393
$$ -490642 -108972 461487 1619281 2559411 2129253 590166 -594143 -577301 222092
43914B22092Q63190N31145p8302p01328p24816j03969L50075J58046k38779m53040
$$ 222092 1085282 1616427 1538125 836797 111981 8012 358087 516133 277354 -175686
43904a75686o06801m54520N75786J914151J930314L12123j093244q21270K09663
$$ -175686 -782487 -1237007 -661221 1252930 3183244 3495367 2402123 1580853 1790516
43895A790516L78511k87820p63570q35587q12077m11681N56037J204577P37913
$$ 1790516 2169027 1881207 1117637 282050 -530027 -941708 -385671 818906 1556819
43886A556819q1990p3270L98662J00603r08980j342187o65222L59394R79059J098738
$$ 1556819 1474829 1401559 1800221 1900824 991844 -350343 -1015565 -656171 322888 1421626
43876A421626P70178J30174l09490k63303k57198o96720q95734j76262O56792
$$ 1421626 2191804 2321978 2012488 1749185 1491987 795267 -100467 -276729 380063
43867C80063L58716o80028r72406k82275K38138J73881L22522Q38892P18727k85223
$$ 380063 738779 58751 -913655 -1195930 -957792 -783911 -461389 377503 1096230 811007
43857H11007q65276j28445R69855J092601L20570m45927r01646j139508q55502
$$ 811007 -54269 -182714 787141 1879742 2200312 1754385 852739 -286769 -1142271
43848a142271J37095J115082J179338M55187k61655o79823r70607r15882j47927
$$ -1142271 -1005176 109906 1289244 1744431 1482776 802953 -167654 -1083536 -1231463
43839a231463Q43129R92632J67900m97651j64620N66993O26042k635m48516l15444
$$ -1231463 -388334 604298 772198 274547 109927 676920 1302962 1300327 851811 536367
43829E36367l8370P0349K73952O49732O48713l9377p54359o99080j32906M0570
$$ 536367 497997 568346 842298 1492030 2140743 2101366 1347007 647927 515021 555591
43819E55591l36456n36506j58705L62838N75034N33295L24243j47409o20430n07710
$$ 555591 219135 -317371 -476076 -113238 461796 995091 1319334 1171925 551495 43785
43809D3785J65138N81689L01149j07594k9060L27249M98927M78003L16407k10943
$$ 43785 208923 790612 1091761 984167 955107 1282356 1781283 2259286 2575693 2364750
43799B364750r37569j073796l44857L91018M05149J76874L55354N02898l2055
$$ 2364750 1427181 353385 8528 399546 804695 981569 1336923 1839821 1807766
43790A807766p35926o81625q8900J59914Q0834K97885N88661K08662n45422o18937
$$ 1807766 1071840 390215 301315 461229 542063 839948 1428609 1637271 1091849 472912
43780D72912J1729L49706K03517L91517R19748O74350n29127j239050n60399L95894
$$ 472912 484641 834347 1037864 1429381 2349129 3023479 2494352 1255302 694903 1090797
43770A090797L18846k92420k07127L92238L09856n86145j094231m85834N16706
$$ 1090797 1409643 1117223 910096 1302334 1612190 1026045 -68186 -554020 -37314
43761c7314Q24607L12569k80173l84833j96076k61575o47276p58278j56641P29721
$$ -37314 787293 1099862 819689 434856 238780 -22795 -670071 -1428349 -1584990 -855269
43751h55269J146739J038777R11387Q07361K57150o32323r30196j51064R01259
$$ -855269 291470 1330247 2241634 3048995 3306145 2673822 1743626 1592562 2493821
43742B493821J068881J70410j005038j638052j464152p73309j44948M8514J699
$$ 2493821 3562702 3733112 2728074 1090022 -374130 -1147439 -1292387 -1243873 -1242174
43733a242174R5246K70990K67512K93877P12098J133995P89418j15594m71679
$$ -1242174 -1146928 -875938 -608426 -314549 397549 1531544 2320962 2205368 1733689
43724A733689K6250L55732j75522q51036p88907k42185J24299K99581M04128N4876
$$ 1733689 1759939 2115671 1940149 1089113 300206 58021 182320 481901 886029 940905
43714I40905p31101r16697O1068J003958N73504n00329n07573M01578M47040o70548
$$ 940905 209804 -706893 -645825 358133 931637 431308 -76265 325313 772353 101805
43704A01805j014172M77473J986285J314668q45614j811420n48917J181361J376584
$$ 101805 -912367 -434894 1551391 2866059 2020445 209025 -339892 841469 2218053
43695B218053J47779r73597j119404o71856k37095Q9483L93902N48445M60603
$$ 2218053 2365832 1392235 272831 -399025 -636120 -546637 -152735 395710 856313
43686H56313L24777K85582J55218j46011j90344L21639P45658J49144j153803
$$ 856313 1181090 1466672 1621890 1475879 1285535 1607174 2352832 2501976 1348173
43677A348173j659502o78454N84115O54789k03542n56990P8961P89760Q24389
$$ 1348173 -311329 -989783 -405668 249121 45579 -511411 -432450 357310 1181699
43668A181699M85294K15304j97138r25703j342840p36784N04157J155073O35874
$$ 1181699 1666993 1882297 1685159 759456 -583384 -1320168 -816011 339062 974936
43659I74936l03631n78579q2148L49292J46486k74465k10308K62717M07497n4463
$$ 974936 671305 92726 10578 359870 506356 231891 21583 284300 691797 637334
43649F37334m98396k80918L82628P73320N77674O1563m09052o08954m09879O1218
$$ 637334 138938 -141980 240648 1013968 1591642 1653205 1244153 635199 225320 286538
43639B86538L30801O7620m03359m69785m6841L88248N14098M46581L10346O0016
$$ 286538 617339 684959 281600 -188185 -235026 153222 667320 1113901 1424247 1484263
43629A484263j73838j23865J067m64545j553346k109485j067923R13898J963903
$$ 1484263 1310425 1186560 1187627 723082 -830264 -2939749 -4007672 -3093774 -1129871
43620a129871J296563J85123J36270Q16388P21807m45919j287694p85058K99219
$$ -1129871 166692 351815 488085 1304473 2026280 1580361 292667 -492391 -193172
43611a93172P45418O02001N76796M74934l74256j461007j409404j18022Q56142
$$ -193172 552246 1154247 1731043 2205977 1831721 370714 -1038690 -1156712 -300570
43602c00570N51577r2919K5886L58473j97977j238581j299512n4540J198220J281680
$$ -300570 251007 158088 183974 542447 344470 -894111 -2193623 -2248163 -1049943 231737
43592B31737M10921m06123m93920J01913P81580Q52134K27550l91859l92965m3322
$$ 231737 642658 236535 -257385 -155472 626108 1478242 1705792 1313933 920968 877646
43582H77646M5229j40744k63656m29207q59183j046571k87530R78875J435893
$$ 877646 922875 782131 518475 89268 -769915 -1816486 -2104016 -1125141 310752
43573C10752O77650k51968m01097n0212J04924K3484q563n0541j91652j14638
$$ 310752 988402 736434 335337 285125 390049 413533 404970 354429 162777 48139
43563D8139L67543P62542N33096k8603j92222J32475L05878r4943p32699r82255
$$ 48139 415682 1178224 1711320 1682717 1490495 1622970 1928848 1833905 1101206 118951
43553A18951o18632N2021N47515O14466L64751Q1649m5559J5498J68040J58255
$$ 118951 -499681 -447660 99855 714321 1079072 1160721 1115162 1130660 1298700 1456955
43543A456955k36633p76451q43297l05124J34311J084n4670O55965J337112O43054
$$ 1456955 1220322 443871 -399426 -704550 -570239 -569155 -623825 32140 1369252 2012306
43533B012306r38280j297375K14099J574352R83942n11650p83441J39556M88044
$$ 2012306 1074026 -223349 -9250 1565102 2549044 2037394 1253953 1393509 1881553
43524A881553j94086n22617J35051N42364k56899j277829j116917k3221O72017
$$ 1881553 1687467 1164850 1299901 1842265 1585366 307537 -809380 -832601 -160584
43515a60584M90273R9644P0761K92235M69182M48983J19295m27639p14604l89571
$$ -160584 329689 429333 500094 792329 1261511 1710494 1829789 1402150 687546 297975
43505B97975J89031L91366K10213J32154K13289O240m96020o18196p7215L70024
$$ 297975 487006 878372 1088585 1220739 1434028 1440268 944248 326052 248837 618861
43495F18861k2473p32853n70298N66470J355183P57978n62534j057977k00862
$$ 618861 596388 -136465 -706763 -140293 1214890 1972868 1410334 352357 151495
43486A51495R82721J193636J73135j283127k135186j779849l96040J075363J622941
$$ 151495 1134216 2327852 2500987 1217860 -917326 -2697175 -3093215 -2017852 -394911
43477c94911J163472N89019N43781N70586k4000q74344r61648j77785M82811M47994
$$ -394911 768561 1357580 1901361 2471947 2447947 1573603 611955 434170 916981 1364975
43467A364975K78233M22912L07186n11483j162553o30621M62759O49305n5980
$$ 1364975 1643208 2066120 2373306 1861823 699270 68649 531408 1180713 1124733
43458A124733j95174O10994Q96497j88026j262284q31964K55312J55477r59611
$$ 1124733 929559 1540553 2437050 2249024 986740 154776 410088 565565 -394046
43449c94046j181125L9826J046635O29930k29379j34198N98552P30999Q2430n02802
$$ -394046 -1575171 -1535345 -488710 141220 -88159 -222357 376195 1107194 1189624 686822
43439F86822n97418m50487j18105N73288J241675J077309l5907j151688j249914
$$ 686822 89404 -361083 -479188 94100 1335775 2413084 2377177 1225489 -24425
43430b4425k75730Q64582J135815L08965p49886r49102k59496L13166K26295J26978
$$ -24425 -300155 564427 1700242 2009207 1259321 310219 50723 363889 590184 717162
43420G17162N77788R05375K59035q17524j044960k91426L97126M59659K93988
$$ 717162 1294950 2200325 2459360 1641836 596876 305450 702576 1162235 1456223
43411A456223J47956j79172m61208j80789K93426M1967o37222l56816R55337J490714
$$ 1456223 1604179 1425007 963799 783010 1076436 1118403 481181 124365 1079702 2570416
43401B570416L18733r77978p68408Q0219j00244q19031l98033Q56986R61070l49019
$$ 2570416 2889149 1911171 1142763 1222982 1122738 303707 -94326 762660 1723730 1374711
43391A374711r75529K26165J648122J418105o5568j245738j605157j470066q11990
$$ 1374711 399182 625347 2273469 3691574 3626006 2380268 775111 -694955 -1506945
43382a506945L27377J070928P65240J77149L32533P76928M19503m12681m33921
$$ -1506945 -1179568 -108640 656600 833749 1166282 1943210 2362713 1950032 1516111
43373A516111K99899L49946o52025j283733o58719J63174M0582l85979M0191R41206
$$ 1516111 1816010 2165956 1513931 230198 -428521 -265347 -224765 -610744 -570553 370653
43363C70653J087425M48786O2424K08848J84229k19805m30324l71845o31395j064871
$$ 370653 1458078 1906864 1969288 2178136 2362365 2142560 1712236 1340391 708996 -355875
43353c55875o53995O82113J488965Q55747j12758l3630N76962L10571o65211q69149
$$ -355875 -1009870 -327757 1161208 2016955 1904197 1870567 2447529 2758100 2092889 1223740
43343A223740k5930M59441j43913p20892k63991M05884M9998q56863q56981J18620
$$ 1223740 1197810 1657251 1513338 792446 528455 934339 984337 127474 -729507 -610887
43333f10887O44716R9388l88686J77726J038667Q84315j05544o31399l49605k52239
$$ -610887 33829 133217 -255469 -77743 960924 1845239 1739695 1108296 758691 506452
43323E06452q01254j004787j11973Q26195L48445j002980j169559M50179J987545
$$ 506452 -294802 -1299589 -1411562 -585367 -236922 -1239902 -2409461 -1959282 28263
43314B8263J666332J36566p30326m32654L3158N9641K0183J00745q5708m80671
$$ 28263 1694595 1831161 1100835 668181 701339 760980 781163 881908 796200 315529
43304C15529l77790L04792N86612j13744r34472p40534L02436J102621J101794
$$ 315529 -62261 242531 829143 715399 -219073 -959607 -657171 445450 1547244
43295A547244N71540j52151q41836r89310j93486R62805J250643L27729o94687
$$ 1547244 2118784 1966633 1124797 135487 -57999 904806 2155449 2483178 1788491
43286A788491o48239J86664N32340j20805q22099m36050Q04950J503807Q31705
$$ 1788491 1140252 1326916 1859256 1738451 916352 480302 1285252 2789059 3620764
43277C620764m29825r01960l43203J88877j22300p87333q01394l5493O74329O46780
$$ 3620764 3190939 2288979 1945776 2134653 2012353 1225020 423626 388133 1062462 1709242
43267A709242P9443l56944k76060J70715N39870M69298k7003n22950n50554j00366
$$ 1709242 1788685 1431741 1155681 1326396 1866266 2335564 2308561 1785611 1235057 1134691
43257A134691L50606M18095K85851L66175N51183K34513o95223j339813q58266
$$ 1134691 1485297 1903392 2189243 2555418 3106601 3341114 2645891 1306078 447812
43248D47812K02732M80160k59316p28398p7449P84509O59775k8851j7066O67326
$$ 447812 650544 1130704 871388 142990 65541 850050 1509825 1480974 1463908 2131234
43238B131234P93673L363o68042n31842j40660l8796R3386M47718M26179k49500
$$ 2131234 2924907 2928270 2260228 1728386 1587726 1548930 1642316 2090034 2516213 2266713
43228B266713p73324m49369K08059L95205K01062J5228l53832r52155r45197J50335
$$ 2266713 1493389 1044020 1252079 1647284 1848346 1863574 1509742 557587 -387610 -237275
43218b37275J224838R65427o3787k67444M12687M91988m94292j190172o40236
$$ -237275 987563 1952990 1889203 1621759 2034446 2526434 2032142 841970 201734
43209B01734K44211K29205m40208p02108k67904L57100Q21320J053307Q76332
$$ 201734 445945 675150 234942 -467166 -735070 -377970 443350 1496657 2372989
43200B372989K58995l22033m00153k01403k82914o61155q01578m11850J69609
$$ 2372989 2631984 2309951 1909798 1708395 1425481 764326 -37252 -449102 -279493
43191b79493M23611K52517O0655K57767O66223N87329k89721j228011j186086
$$ -279493 144118 396635 457290 715057 1381280 1968609 1678888 450877 -735209
43182g35209j92746O27716N62131J93388L78967Q97066P69399k76672j319137
$$ -735209 -927955 -300239 261892 455280 834247 1731313 2500712 2224040 904903
43173I04903j327649l31463P04800R60225M85897q1995k80123j34644J20398L27918
$$ 904903 -422746 -754209 -49409 910816 1396713 1314718 1034595 899951 1020349 1348267
43163A348267L80889K16126l8612j59504j51693j77416j41274J49651L39078j92671
$$ 1348267 1729156 1945282 1906670 1747166 1595473 1418057 1276783 1426434 1765512 1572841
43153A572841j068340r01471O92546J988126J254255o68988j391409l05660P57459
$$ 1572841 504501 -396970 295576 2283702 3537957 2868969 1477560 1171900 1929359
43144A929359L90694n35611n74717J32750M53037Q9525l03610l25271j62200K1958
$$ 1929359 2320053 1784442 1209725 1342475 1795512 1885037 1581427 1256156 1093956 1115914
43134A115914K41899L61176K14582j0347L3297L21540M32879L2818p21037j174914
$$ 1115914 1357813 1718989 1933571 1923224 1956521 2278061 2710940 2743758 2022721 847807
43124H47807p00149M71332J147446M92750p30470j046291k99190K56156N707j86443
$$ 847807 147658 618990 1766436 2259186 1528716 482425 183235 439391 445098 258655
43114B58655L03371O44260K2068p81859n58153L30872N13910k08876o32019o9250
$$ 258655 562026 1206286 1228354 446495 -111658 219214 733124 524248 -107771 -177021
43104a77021P09347P29246Q3625m27477l52756L5822J36904l08005p92939n18230
$$ -177021 532326 1261572 1345197 917720 564964 600786 737690 429685 -363254 -881484
43094h81484M77089J085958N16628n35672p88416j22088L86191P1055m93208m22775
$$ -881484 -404395 681563 1198191 662519 -125897 -247985 138206 209261 -283947 -706722
43084g06722L06750Q86050O40232j33725l66235M57487J310784P63952p95195
$$ -706722 -399972 486078 1126310 992585 626350 1083837 2394621 3158573 2363378
43075B363378j306207k081J199581N22454q02374m41211J192544J482361j93409
$$ 2363378 1057171 1055090 2254671 2777125 1974751 1533540 2726084 4208445 4015036
43066D015036j491936r13314P905l89169j062450k93733J116863J034079n13709
$$ 4015036 2523100 1609786 1617691 1228522 166072 -127661 989202 2023281 1509572
43057A509572j372445n65407N90710Q78788P47365Q74507Q15955M2541q70547
$$ 1509572 137127 -428280 162430 1041218 1788583 2663090 3479045 3521586 2651039
43048B651039j119197q76093o57891k46982O66791J362789Q98098k15225m96941
$$ 2651039 1531842 655749 -2142 -249124 417667 1780456 2678554 2463329 1966388
43039A966388K52785N69744l43723j250539p93936L18664M34031m08321o21859
$$ 1966388 2219173 2788917 2445194 1194655 400719 719383 1153414 745093 123234
43030A23234K66941Q65233K83456l71638J34475J089583R69419j92034j017512
$$ 123234 390175 1255408 1538864 1167226 1301701 2391284 3360703 3168669 2151157
43021B151157r10456n28401l22315j7469L62716K59710l38205o72466l80293R1465
$$ 2151157 1240701 712300 389985 372516 735232 994942 656737 -15729 -396022 -304557
43011c04557M32759P55507P72782J0795q52100m35507R22403R81193j003847k510783
$$ -304557 128202 883709 1656491 1667286 815186 379679 1302082 2283275 1279428 -1231355
43001a231355j204782J364581J948138M59626k76696O52747R70693n07555j515585
$$ -1231355 -2436137 -1071556 876582 1336208 1059512 1712259 2682952 2175397 659812
42992F59812r7776J842043J345331r16779j681764o2200J436383R23506m91991
$$ 659812 562036 2404079 3749410 2832631 1150867 1088667 2525050 3448556 2956565
42983B956565j018340o68931l22081j4155M94213O67996N7825o14992m47084J81908
$$ 2956565 1938225 1269294 947213 933058 1427271 2095267 2153092 1538100 1091016 1272924
42973A272924K38305l45565p25467m93172l0612K67037L36780K07726L0718P4937
$$ 1272924 1511229 1165664 440197 -52975 -83587 183450 520230 727956 758674 833611
42963H33611K34644N1993l20775l4707Q94532J048964k40009j354802o27378Q82276
$$ 833611 1068255 1120248 799473 764766 1659298 2708262 2468253 1113451 486073 1368349
42953A368349R22056l20852o20961M30745P46739n74168j624391q95072L52086
$$ 1368349 2290405 1969553 1348592 1779337 2526076 1951908 327517 -567555 -215469
42944b15469N02355K29770P74417J345641N08288j035622j330774j49126R33998
$$ -215469 286886 516656 1291073 2636714 3145002 2109380 778606 629480 1563478
42935A563478R80758M22184k35443p78939p64158j53667M1930p26008j163362
$$ 1563478 2544236 2966420 2730977 1952038 1187880 1034213 1076143 350135 -813227
42926h13227o4872J255038P69110p01801n28672J310633J964593L43102j151731
$$ -813227 -878099 376939 1146049 444248 -84424 1226209 3190802 3533904 2382173
42917B382173p40675j01992j114361k295768j151746J547886K683383J270937
$$ 2382173 1641498 1539506 425145 -1870623 -3022369 -1474483 1208900 2479837
42909B479837n33328q18213r0847L07035J70911N8429Q5779o3546m26313o30329
$$ 2479837 1946509 1128296 1037449 1344484 1515395 1573824 1659603 1596057 1169744 539415
42899E39415l75700J56109M26859J90995q2026J58911N57649J92043r50332j649721
$$ 539415 163715 319824 746683 937678 855652 1014563 1572212 1764255 813923 -835798
42889h35798r99497M27336J380288J261785L11421q12257j272037o53676L19431
$$ -835798 -1835295 -1407959 -27671 1234114 1545535 733278 -538759 -1192435 -873004
42880h73004N08839L5256J05737Q76891J009770J5423o76113j09267M71469j46128
$$ -873004 -364165 -328909 -223172 653719 1663489 1678912 1002799 893532 1365001 1218873
42870A218873q41568j39741R34386M82687q11014p14572N83711O62108q65292
$$ 1218873 377305 237564 1171950 1654637 843623 129051 712762 1374870 509578
42861E09578j481335j0761J307692N09118r73580q91941K30937M55525j68840
$$ 509578 -971757 -982518 325174 834292 -139288 -1031229 -800292 -344767 -513607
42852e13607r3327P50683R72785L59900J58388O66788O63000l54918j188739q69884
$$ -513607 -606934 143749 1116534 1476434 1634822 2301610 2964610 2609692 1420953 551069
42842E51069p6641J53421q8257j95610j46641j45750K4945M72162O72175K70912
$$ 551069 474428 627849 539592 343982 197341 51591 76536 548698 1220873 1491785
42832A491785j86054j02057J63177j1509l50740k43211l1680m99915j228077q66684
$$ 1491785 1305731 1203674 1366851 1355342 1004602 761391 729711 229796 -998281 -1864965
42822a864965O80823J726886J142686M1341N4817Q24095O36019p90198j705823
$$ -1864965 -1184142 542744 1685430 1726771 1781588 2605683 3241702 2451504 745681
42813G45681q41081P46647J109706n0010j178004r38505L05695J184592R47273
$$ 745681 -95400 651247 1760953 1710943 532939 -405566 -99871 1084721 2031994
42804B031994P8991m97150m78815l03797l73423m87484k13255M02812P96276N48062
$$ 2031994 2110985 1613835 1135020 831223 457800 -29684 -242939 159873 956149 1504211
42794A504211j01472m33984O3131J062742J482985N74901r81556j592301o42014
$$ 1504211 1402739 968755 1031886 2094628 3577613 4152514 3170958 1578657 936643
42785I36643P25571J169562P75617L70297k5562q57184j652414j468009n87777
$$ 936643 1662214 2831776 3607393 3977690 3952128 3094944 1442530 -25479 -613256
42776f13256k17763l87965J35339J431683J790159M35663q61548l42734R98208
$$ -613256 -831019 -1218984 -1083645 348038 2138197 2573860 1712312 1369578 2367786
42767B367786J006890l17941j091503n82711L6839q4707l82559k96632j77714
$$ 2367786 3374676 3056735 1965232 1382521 1419360 1334653 952094 655462 477748
42758D77748k71325j30257L94593O97024M77246K27292J58065k67518j079466
$$ 477748 206423 76166 470759 1167783 1645029 1872321 2030386 1762868 683402
42749F83402j168367J40087J702379J851145N88037n89396p99206o23751p77206
$$ 683402 -484965 -344878 1357501 3208646 3796683 3207287 2408081 1784330 1007124
42740A007124r46294m80005L83681P14319K11984l02604n25P77763R95636M04158
$$ 1007124 60830 -419175 -35494 678825 890809 588205 587680 1365443 2361079 2765237
42730B765237j60792j04436R4763j44280m45916j88160K85140J74400l77894n18054
$$ 2765237 2604445 2500009 2594772 2450492 2004576 1816416 2101556 2275956 1898062 1380008
42720A380008j90456k11863p25828q30453j31316N23815M62603K34226M41028
$$ 1380008 1189552 977689 251861 -578592 -709908 -186093 276510 510736 951764
42711I51764N51628n5109o83522k58831Q07902J068823K14381n44682m14834l9292
$$ 951764 1503392 1448283 764761 505930 1313832 2382655 2597036 2052354 1637520 1598228
42701A598228j19646k09772K72272P09136Q6489j253394j782826p74274P74073
$$ 1598228 1478582 1268810 1541082 2250218 2336707 1083313 -699513 -1473787 -699714
42692f99714J456633J004184J54667m11110m82079r0160M99681P41250L06616
$$ -699714 756919 1761103 1915770 1504660 1022581 932421 1432102 2173352 2479968
42683B479968l97185o47003l02251J11560J39335k12813p14221j024786o85367
$$ 2479968 2082783 1435780 1133529 1245089 1384424 1171611 457390 -567396 -1252763
42674a252763L62397J278987J094538O1033n43742j23834N75252P60463N79017
$$ -1252763 -890366 388621 1483159 1544192 1000450 876616 1451868 2212331 2791348
42665B791348L81521N170n59657p26894l05084l2475k95923l05024M16558P67407
$$ 2791348 3172869 3178039 2618382 1891488 1586404 1553929 1258006 952982 1369540 2136947
42655B136947k83955j654149j463833J32602J250861J135939Q20832R24473P53491
$$ 2136947 1852992 198843 -1264990 -1132388 118473 1254412 2075244 2999717 3753208
42646C753208k411m83357k26950J7823k54603m43489j45693L5909k54324l90748
$$ 3753208 3750797 3267440 3040490 3058313 2803710 2360221 2214528 2250437 1996113 1605365
42636A605365q2291n5895n17515l71252Q48814J652045O93196r34137j211242
$$ 1605365 1523074 1467179 949664 578412 1427226 3079271 3772467 2838330 1627088
42627A627088j90586L29140l23342r49048n79644K61481O59914M53658k8590m43263
$$ 1627088 1436502 1765642 1442300 493252 -86392 175089 835003 1288661 1260071 816808
42617H16808m26022J29448O76425N71094J6911k16294O0336L07447K02790Q632
$$ 816808 390786 520234 1196659 1767753 1784664 1568370 1628706 1936153 2138943 2147575
42607B147575k4227P091m8322k24003m75435n62241k13995K72266K23502j79621
$$ 2147575 2123348 2130439 2082117 1858114 1382679 820438 606443 878709 1102211 922590
42597I22590J69415J337549J527299l27810k226518j460002J260407K496242R55194
$$ 922590 1092005 2429554 3956853 3629043 1402525 -57477 1202930 3699172 4654366
42588D654366r21322r39696j40048l43891r64077m35437O81402N38114p23075
$$ 4654366 3733044 2793348 2653300 2309409 1345332 909895 1591297 2129411 1406336
42579A406336r84856M76839J782073J235549l45148j064822n64631m1682k26614
$$ 1406336 421480 898319 2680392 3915941 3570793 2505971 1941340 1899658 1673044
42570A673044m95522o3168P46354R11662J50633o06689m23659L57802O10203L3741
$$ 1673044 1177522 1114354 1860708 2772370 2923003 2316314 1892655 2250457 2860660 2894401
42560B894401n36193n53909m99071o74297l29184R72166J936887R89564j172765
$$ 2894401 2358208 1804299 1305228 630931 301747 1273913 3210800 4200364 3027599
42551C027599k080978p47448J068194J371125L41584n95327q92718q92798n89600
$$ 3027599 946621 199173 1267367 2638492 2980076 2384749 1492031 599233 9633
42542I633K23546R85524Q72299J44772j82517L6284J009m10148k84679O18766
$$ 9633 233179 1218703 2091002 2235774 2053257 2089541 2090550 1680402 1395723 2014489
42532B014489J091510K10893j145652j498597p40611J08597N27268P27831O60738
$$ 2014489 3105999 3316892 2171240 672643 -67968 40629 567897 1295728 1956466
42523A956466M4654o85031o65388J9473L71158J16556J35721P84741J003714l1912
$$ 1956466 2001120 1316089 650701 670174 1041332 1157888 1293609 2078350 3082064 3050152
42513C050152j355766j461182m62490K68612K69979L76725Q99894Q87208j93247
$$ 3050152 1694386 233204 -229286 39326 309305 686030 1585924 2473132 2279885
42504B279885j222151q88077L53250R19300L62320k08137j9193K53990j74694
$$ 2279885 1057734 169657 522907 1442207 1804527 1596390 1577197 1831187 1656493
42495A656493p27452l20885P87108J172659L10747o08164l83457N26566Q02370
$$ 1656493 929041 608156 1395264 2567923 2878670 2270506 1887049 2413615 3215985
42486C215985J79926l89347l21886j30914l35631n35584j79804L40212K04359
$$ 3215985 3395911 3006564 2684678 2553764 2218133 1682549 1502745 1842957 2047316
42477B047316m38453m93374M41219J260932Q08225l82170p27761J07859O68258
$$ 2047316 1608863 1115489 1556708 2817640 3625865 3243695 2515934 2623793 3292051
42468C292051j09229j208476j032892J35691N78081k04446q63148m88540J00111
$$ 3292051 3182822 1974346 941454 1077145 1655226 1450780 587632 99092 199203
42459A99203Q5629J20458Q50818J317169M82626o28070l00543R07490P97450q75972
$$ 199203 284832 405290 1256108 2573277 3055903 2427833 2127290 3034780 3832230 2956258
42449B956258j745675m25782J314707J181952m39987j395984p86399M13484J100919
$$ 2956258 1210583 784801 2099508 3281460 2841473 1445489 659090 1072574 2173493
42440B173493J029941L92097m08634p02729j84718N06882N03110k11237r52289
$$ 2173493 3203434 3595531 3186897 2484168 2299450 2806332 3309442 3098205 2145916
42431B145916j183935o94622M70440J578637J430244n6285j165119m69217R81582
$$ 2145916 961981 267359 737799 2316436 3746680 3690395 2525276 2056059 3037641
42422C037641J011734m71533j331619m06412Q81947Q15475j84574n21801J47964
$$ 3037641 4049375 3577842 2246223 1839811 2721758 3537233 3352659 2830858 2978822
42413B978822P16557M18716k95013o32143l76992J62302N44306M14976k27336
$$ 2978822 3695379 4114095 3819082 3186939 2809947 2972249 3516555 3931531 3704195
42404C704195q65954q93925l16961K37747L00908O7145k3951P8138J15441N1330
$$ 3704195 2838241 1944316 1627355 1865102 2166010 2233155 2209204 2287342 2402783 2454113
42394B454113J05442K62056J91931j51363k72779J77067P76939Q45318L50081
$$ 2454113 2559555 2821611 3013542 2862179 2589400 2766467 3543406 4388724 4738805
42385D738805j86624n08677p64591r25353p34457k96479q2972k12513k79622j1548
$$ 4738805 4552181 4043504 3278913 2353560 1619103 1322624 1239652 1027139 747517 735969
42375G35969M40741Q91883J186152R31017j9692q56075o32188J34650p962j019462
$$ 735969 1176710 2068593 3254745 4185762 4166070 3309995 2677807 2812457 2804495 1785033
42365A785033j060548N83396J914427R76755j107652j681782l16647R49235Q06734
$$ 1785033 724485 1307881 3222308 4199063 3091411 1409629 1092982 2042217 2848951
42356B848951J28158M3169L29081L16333Q2419L3777J69927L05306L78724K34942
$$ 2848951 2977109 3020278 3349359 3665692 3748111 3781888 3951815 4257121 4635845 4870787
42346D870787k77195q17954q19158l26598Q4234K15940L10679K99460o3765l72580
$$ 4870787 4593592 3775638 2956480 2629882 2714116 2930056 3240735 3540195 3476430 3103850
42336C103850O071O17374L22171p14360q73284M41437J583147R75814m99164q06922
$$ 3103850 3109921 3727295 4049466 3335106 2461822 2903259 4486406 5462220 4963056 4156134
42326D156134K72686J010573L63158p06668q61132k34060L0447m83968r32680
$$ 4156134 4428820 5439393 5802551 5095883 4234751 4000691 4031138 3547170 2614490
42317B614490m12562P64004J326280N56056p73556j249612m49744O79403J042153
$$ 2614490 2201928 2965932 4292212 4848268 4074712 2825100 2375356 3054759 4096912
42308D096912N21020k26054o08819m64747L7690M70604L43932l77364j016337
$$ 4096912 4617932 4391878 3783059 3318312 3356002 3826606 4170538 3793174 2776837
42299B776837p76588L18650J265178J033478k92344j472343j379528k42865O58977
$$ 2776837 2000249 2318899 3584077 4617555 4325211 2852868 1473340 1230475 1889452
42290A889452N47596l3080j23953L84341P98771O22268M6710l90979k93044K97494
$$ 1889452 2437048 2403968 2280015 2664356 3463127 4085395 4132105 3741126 3448082 3745576
42280C745576Q11986O19012j73525p11506m57998J62856M86264M21598J50178
$$ 3745576 4557562 5176574 5003049 4291543 3833545 3996401 4482665 4904263 5054441
42271E054441l32483q18861p38701j08149J10257n39174r79867j55303J121049
$$ 5054441 4721958 3903097 3164396 3056247 3166504 2627330 1647463 1492160 2613209
42262B613209J277388M25152Q1900O83776J062973N07265k63309n16818m81530
$$ 2613209 3890597 4315749 4397649 5081425 6144398 6651663 6388354 5871536 5390006
42253E390006m64134k69783M2076j7428l74686l50330M6231j4693o29585p61472
$$ 5390006 4925872 4656089 4698165 4680737 4306051 3955721 4001952 3987259 3357674 2596202
42243B596202O9593R31514R34920L87741j07984n35585q01317m14764M25220O21580
$$ 2596202 2665795 3597309 4532229 4919970 4811986 4276401 3475084 3060320 3485540 4107120
42233D107120j41911p04104k53261M10038M14331K90231O54929O97398m33999
$$ 4107120 3965209 3261105 3007844 3417882 3832213 4122444 4777373 5474771 5040772
42224E040772j703747j427527J15020J030759N48005j84531p0737N43708P34913
$$ 5040772 3337025 1909498 2024518 3055277 3603282 3418751 3348014 3891722 4626635
42215D626635K40194m77762p68211k81708O21487J060089O24390j12705m50749
$$ 4626635 4866829 4389067 3620856 3339148 3960635 5020724 5645114 5532409 5081660
42206E081660m17414k98388J5295N37207P10868K29777k61358j00797L48268M06028
$$ 5081660 4664246 4365858 4381153 4918360 5629228 5859005 5597647 5496850 5845118 6251146
42196F251146J66441Q784k38949o64693o12581J90433P00316J17483m81378K33423
$$ 6251146 6417587 6426371 6187422 5522729 4910148 5100581 5800897 5918380 5437002 5670425
42186E670425J332146Q25357r73950j612158k28322J144146P25209n79408r92890
$$ 5670425 7002571 7827928 6853978 5241820 5013498 6157644 6882853 6303445 5310555
42177E310555m69244j29708k64381k87030n147K39293L17645L53279L26491K29128
$$ 5310555 4841311 4711603 4447222 4160192 4155045 4394338 4711983 5065262 5391753 5620881
42167E620881K34845K87183L2246m47999m83049J43789O93881N48381P5372j68309
$$ 5620881 5855726 6142909 6175155 5727156 5244107 5387896 6081777 6630158 6705530 6537221
42157F537221l27060n94082m67571L33909Q70812J50633j064845j007633N10498
$$ 6537221 6210161 5616079 5148508 5482417 6353229 6503862 5439017 4431384 4941882
42148D941882J618732R31167n85387j060006k18955N46764K49542n53570p82017
$$ 4941882 6560614 7491781 6906394 5846388 5627433 6174197 6423739 5870169 5088152
42139E088152k38973L84955N22824L17715K62077N14113O66474J99756q07883
$$ 5088152 4849179 5234134 5756958 6074673 6336750 6850863 7517337 7717093 6909210
42130F909210j533497j211651q5369P75507P33670K73502J49096K84435R1296
$$ 6909210 5375713 4164062 4078693 4854200 5587870 5861372 6010468 6294903 6386199
42121F386199m12335n86053k44271P5689J08180K75409P09171P24441j1614n32765
$$ 6386199 5973864 5387811 5143540 5219229 5327409 5602818 6311989 7036430 7024816 6492051
42111F492051J50671J264752J042349o84335j944348j203008N69726J280949M64108
$$ 6492051 6642722 7907474 8949823 8265488 6321140 5118132 5687858 6968807 7432915
42102G432915m62734m09922J40551L54792L98596Q13771J266863R44810n2503
$$ 7432915 6970181 6560259 6700810 7055602 7454198 8267969 9534832 10479642 10427139
42093A0427139p30652o74857n51594q44648j009792m64827L33004N62663K64453
$$ 10427139 9696487 9021630 8470036 7625388 6615596 6150769 6483773 7046436 7310889
42084G310889R3553K39842M05156N53153Q24239Q98475L20970o03614j049975
$$ 7310889 7404442 7644284 8049440 8602593 9426832 10325307 10646277 10042663 8992688
42075H992688p75672k55532J64552M38943L16251l40142p78879m4301J397368
$$ 8992688 8217016 7961484 8126036 8564979 8881230 8541088 7762209 7717908 9115276
42066I115276J861738O78652q06127j022081j19843N24797J50658o75613q88290
$$ 9115276 10977014 11655666 10849539 9827458 9707615 10232412 10383070 9707457 8819167
42057H819167r2827R51220J053233O5014p31910k95790O35054O46390j77093n10522
$$ 8819167 8726340 9677560 10730793 10795807 10063897 9768107 10403161 11049551 10872458 10361936
42047A0361936K7472M80993L58713K43764L89936K81644p3029L0063M96621L76589
$$ 10361936 10389408 10870401 11229114 11472878 11862814 12144458 12071429 12101492 12598113 12974702
42037A2974702l00105l79279K45537K73259n00738m76349Q83641J681116N98862
$$ 12974702 12674597 12295318 12540855 12814114 12313376 11837027 12720668 14401784 15000646
42028A5000646p55966m20309P79315Q31288j02178k91631M96547Q58000K42910
$$ 15000646 14244680 13824371 14603686 15434974 15332796 15041165 15537712 16395712 16638622
42019A6638622m18076m11323M6301O22973J087599R91823K62831l10443j63882
$$ 16638622 16220546 15809223 15855524 16478497 17566096 18557919 18820750 18510307 18346425
42010A8346425J30851J2747N6404P56473J186358L42265r65067j084704J53537
$$ 18346425 18477276 18490023 18546427 19302900 20489258 20831523 19866456 18781752 18935289
42001A8935289J424534J742054J208505M61982K57144R33856J672147J261223
$$ 18935289 20359823 22101877 23310382 23772364 24029508 24963364 26635511 27896734
41993B7896734R2103q8568R94110J479379M58525m31479J90407J229893J256063
$$ 27896734 27988837 27900269 28894379 30373758 30832283 30400804 30591211 31821104 33077167
41984C3077167P65196P23146R38827J305081K292286K981687J619390n63796Q7682
$$ 33077167 33842363 34565509 35504336 36809417 39101703 42083390 43702780 43138984 43226666
41975D3226666L554945N220725L401531K376857M650345O486172N669294O531788
$$ 43226666 46781611 52002336 55403867 57780724 62431069 68917241 74586535 81118323
41967H1118323J1004916J2734866Q756068P769880J3469308Q228599k6184034
$$ 81118323 92123239 104858105 113614173 121384053 134853361 143081960 116897926
41960A16897926p3405140r1047782o1521806j4957108R453473P916935L300596
$$ 116897926 43492786 -47554996 -109076802 -124033910 -114580437 -106663502 -103362906
41953a03362906O950677J0118285O789506L630911N528387P457585N224698K541437
$$ -103362906 -96412229 -86293944 -79504438 -75873527 -70345140 -62887555 -57662857 -55121420
41945e5121420K834901L265385J320988j61071J242756K931586K240317Q51773
$$ -55121420 -52286519 -49021134 -47700146 -47861217 -46618461 -43686875 -41446558 -40594785
41937d0594785R25554J356460Q61653P03397J648166J973258R23492N59971J888938
$$ -40594785 -39669231 -38312771 -37451118 -36747721 -35099555 -33126297 -32202805 -31642834 -29753896
41928b9753896K663733J354322n9263L31657J120279M39539p27157o47142J41831
$$ -29753896 -27090163 -25735841 -25795104 -25463447 -24343168 -23903629 -24630786 -25277928 -25136097
41919b5136097L74113N44837J501392K298539J664386K23278n85994n71951k89294
$$ -25136097 -24761984 -24217147 -22715755 -20417216 -18752830 -18529552 -19115546 -19687497 -19976791
41910a9976791K28948R15160J094155N85799J71178J78629K6880k45071K23212
$$ -19976791 -19747843 -18832683 -17738528 -17152729 -16981551 -16802922 -16776042 -17021113 -16797901
41901a6797901J146768R85769l59018r49615K2417P84530P5433o44247J29029
$$ -16797901 -15651133 -14665364 -15024382 -15973997 -15951580 -15167050 -15091617 -15735864 -15606835
41892a5606835J185122P09642n47090n74941O06995J273580Q58176L79193M12580
$$ -15606835 -14421713 -13712071 -14259161 -14834102 -14227107 -12953527 -12095351 -11716158 -11303578
41883a1303578M85664L35202K55438K30309j03993o66273r75518q53642m37298
$$ -11303578 -10817914 -10482712 -10227274 -9996965 -10100958 -10767231 -11742749 -12596391 -13033689
41874a3033689J95340Q36091J020391O45631K46483J73939P1679l43231o22385
$$ -13033689 -12838349 -12002258 -10981867 -10336236 -10089753 -9915814 -9844135 -10187366 -10809751
41865a0809751k81301M13491Q98978J053668J002851O73832K3170o35748q80198
$$ -10809751 -11091052 -10677561 -9778583 -8724915 -7722064 -7048232 -7025062 -7660810 -8541008
41856h541008n68487M0572L44368j11534q00012m83846R54567J766445O11948
$$ -8541008 -9109495 -9068923 -8724555 -8836089 -9636101 -10119947 -9165380 -7398935 -6786987
41847f786987j197596j364740N0146R02108L24152l44729j39035K00886M33k19237
$$ -6786987 -7984583 -9349323 -9299177 -8397069 -8072917 -8417646 -8556681 -8355795 -8355362 -8574599
41837h574599p9069o0976k18661J58405R62678J043922K08516k88469Q1572K74348
$$ -8574599 -8653668 -8714644 -8933305 -8774900 -7812222 -6768300 -6559784 -6848253 -6766681 -6492333
41827f492333k25484l61977M34198R83108L44508n58503n21864J68024O34471
$$ -6492333 -6717817 -7079794 -6645596 -5662488 -5317980 -5876483 -6398347 -6230323 -5595852
41818e595852P14242M61371j90129n41080L43762J513905P22017j859088l010938
$$ -5595852 -4881610 -4420239 -4610368 -5151448 -4807686 -3293781 -2571764 -4430852 -7441790
41809g441790j106725J174644Q88701p92744r00505N89125J390618R41322O31789
$$ -7441790 -8548515 -7373871 -6485170 -7277914 -8178419 -7589294 -6198676 -5257354 -4625565
41800d625565P58085K87517o05531n57098L76929N87779l92452j225515j048545
$$ -4625565 -3867480 -3579963 -4185494 -4742592 -4365663 -3777884 -4170336 -5395851 -6444396
41791f444396m64513j1047M97797Q13307K35811q23774r10082L19264J414062
$$ -6444396 -6908909 -6919956 -6422159 -5608852 -5373041 -6196815 -7106897 -6787633 -5373571
41782e373571J145717J280q11200q07969k79967K00170M1744p85673j333341o80239
$$ -5373571 -4227854 -4226574 -5037774 -5845743 -6125710 -5925540 -5883796 -6669469 -8002810 -8683049
41772h683049O50246J261033Q79476O52251J226369J690698R90330m73860j383515
$$ -8683049 -8032803 -6771770 -5892294 -5240043 -4013674 -2322976 -1332646 -1806506 -3190021
41763c190021j168263m58191j6077J88156N80419J003562P76101j18749o68006
$$ -3190021 -4358284 -4816475 -4832552 -4644396 -4063977 -3060415 -2284314 -2403063 -3071069
41754c071069k70193K20705j00429n32877k2955O49067M7882r90359l43106J384525
$$ -3071069 -3341262 -3120557 -3220986 -3753863 -3776818 -3127751 -3079869 -4070228 -4413334 -3028809
41744c028809J093409j617405k985279p54654J986787J476977j017143j674530
$$ -3028809 -1935400 -3552805 -6538084 -7292738 -5305951 -3828974 -4846117 -6520647
41736f520647j68924P31283L04380M60525J589148J745561L10366q94606p38325
$$ -6520647 -6689571 -5958288 -5653908 -5193383 -3604235 -1858674 -1548308 -2442914 -3181239
41727c181239j85603m4178Q8723J92620l43830r01464j89361J082702Q34564o92986
$$ -3181239 -3366842 -3411020 -3322297 -3129677 -3473507 -4374971 -4564332 -3481630 -2647066 -3340052
41717c340052r00219P68436J568817o3170j812346j181831O64831J030735k44382
$$ -3340052 -4240271 -3471835 -1903018 -1966188 -3778534 -4960365 -4295534 -3264799 -3509181
41708c509181j144276o52674M44778J124303R50866J2745q89640p53809J97589
$$ -3509181 -4653457 -5306131 -4861353 -3737050 -2786184 -2773439 -3663079 -4416888 -4219299
41699d219299O23593J29085j88815J49973J20019o75111q73703L23685J454759
$$ -4219299 -3595706 -3466621 -3655436 -3505463 -3385444 -4060555 -4934258 -4610573 -3155814
41690c155814J001852j87034l70207M18307Q51203M74166j75433p84281j199770
$$ -3155814 -2153962 -2340996 -2711203 -2292896 -1441693 -967527 -1142960 -1927241 -3127011
41681c127011r32950K9934P03553M65860M5290J81005M05327J78991j2586J93979
$$ -3127011 -4059961 -4030027 -3326474 -2860614 -2815324 -2634319 -2228992 -2050001 -2062587 -1868608
41671a868608J47660l87181m12179L76211N22906p09539j561184m68581J115554
$$ -1868608 -1720948 -2108129 -2520308 -2144097 -1621191 -2330730 -3891914 -4360495 -3244941
41662c244941R38438m24397p23862K79907R28514O24837J11122m56126j167673
$$ -3244941 -2306503 -2730900 -3454762 -3174855 -2246341 -1621504 -1510382 -1966508 -3134181
41653c134181r51681P50637J814666J13453k393960j942488J020058K251372M74708
$$ -3134181 -4085862 -3335225 -1520559 -1407106 -3801066 -5743554 -4723496 -2472124 -1997416
41644a997416p71862O70832K017191N56490j671569j453593L53686P72358k44448
$$ -1997416 -2769278 -2098446 -81255 475235 -1196334 -2649927 -2296241 -1523883 -1768331
41635a768331m54990L11286J46309j118920j502821l79569N51147K72446j01860
$$ -1768331 -2223321 -1912035 -1765726 -2884646 -4387467 -4767036 -4215889 -3943443 -4045303
41626d045303L71468Q59551M46917k19106r3121N67371O90920m5503q94974r84010
$$ -4045303 -3673835 -2814284 -2367367 -2586473 -2679594 -2112223 -1421303 -1466806 -2361780 -3345790
41616c345790k08815O38340O41606j30895o01917j17445O42940P74103M81103
$$ -3345790 -3554605 -2916265 -2274659 -2405554 -3007471 -3124916 -2481976 -1707873 -1226770
41607a226770M15826L54231k55683r20444o85536J50102L67963j77667m09874
$$ -1226770 -810944 -456713 -712396 -1632840 -2318376 -2168274 -1800311 -1977978 -2387852
41598b387852M789J20997m48655p07084j364P74667O31801K8079p9156J54423
$$ -2387852 -2383063 -2262066 -2710721 -3417805 -3419169 -2644502 -2012701 -1984622 -2063778 -1909355
41588a909355p1249o82769p78522L4969J176251J833410J605821O03210n98422
$$ -1909355 -1980604 -2663373 -3441895 -3406926 -2230675 -397265 1208556 1811766 1213344
41579A213344j279147j214550p95370l70618O8326L95324K33185l30904o30578
$$ 1213344 -65803 -1280353 -2075723 -2446341 -2378015 -1982691 -1749506 -2080410 -2710988
41570b710988m30887k68867l18086J12596J210326J809697R81509l95369q98058
$$ -2710988 -3141875 -3410742 -3728828 -3616232 -2405906 -596209 385300 -10069 -908127
41561i08127o34017o04170o60049J07847J256045J261986P0627n95905N563M77829
$$ -908127 -1542144 -2146314 -2806363 -2698516 -1442471 -180485 -109858 -705763 -700200 -222371
41551b22371k43295j062159o72333K06896J85564l82510k19542M28122K39978
$$ -222371 -465666 -1527825 -2200158 -1993262 -1807698 -2190208 -2409750 -1981628 -1741650
41542a741650n81177l50857J143079J809312L38982j559320j472185K46323J035231
$$ -1741650 -2322827 -2673684 -1530605 278707 617689 -941631 -2413816 -2167493 -1132262
41533a132262k05535j707120j447070J70668J147552O63291j03516J22315R63205
$$ -1132262 -1337797 -3044917 -4491987 -4321319 -3173767 -2510476 -2613992 -2491677 -1528472
41524a528472J067617N3034r59997q22039J80248P26120J45226p45172o77111
$$ -1528472 -460855 -407821 -1367818 -2189857 -2009609 -1283489 -1138263 -1883435 -2560546
41515b560546M21076J224954O34923p46095j298235n03353L83872J74089n42080
$$ -2560546 -2139470 -914516 -279593 -1025688 -2323923 -2827276 -2443404 -2269315 -2811395
41506b811395m32270L76147N13661k45779m38068O15361J347730K86569j325289
$$ -2811395 -3243665 -2867518 -2353857 -2599636 -3037704 -2422343 -1074613 -788044 -2113333
41497b113333j108003P96184J747870M76107j139104j004933K38718O28340n7193
$$ -2113333 -3221336 -2425152 -677282 -201175 -1340279 -2345212 -2106494 -1478154 -1535347
41488a535347m23104J6507L01050p9940m41815l26122j87888k18039J22639P63377
$$ -1535347 -1958451 -1941944 -1640894 -1720834 -2162649 -2488771 -2676659 -2894698 -2772059 -2008682
41478b008682O08606o12809j393588n93373O14072N17817l41438j21585J116746
$$ -2008682 -1400076 -2012885 -3406473 -3999846 -3385774 -2867957 -3209395 -3330980 -2214234
41469b214234J429264K71169n71984J0354P03611J66396p45620o76241j01992
$$ -2214234 -784970 -513801 -1085785 -1075431 -371820 -205424 -951044 -1627285 -1729277
41460a729277k06382o65421m31709K37546M40887M84408J066647J381955L19899
$$ -1729277 -1935659 -2601080 -3032789 -2795243 -2354356 -1869948 -803301 578654 898553
41451H98553j011988n74431R96282R53643j061560k138005p12909R00434L31664
$$ 898553 -113435 -687866 308416 1262059 200499 -1937506 -2650415 -1749981 -1418317
41442a418317j113957r00615N30024P36917o48801j504481n28214J204005K015224
$$ -1418317 -2532274 -3432889 -2902865 -2165948 -2814749 -4319230 -4847444 -3643439 -1628215
41433a628215J383243m5970j029352n99389O72569R49213l45198j362686n63962
$$ -1628215 -244972 -290942 -1320294 -1919683 -1247114 -297901 -643099 -2005785 -2569747
41424b569747P08503L56324r59423r46904M23156J003010K40713j01835O42642
$$ -2569747 -1861244 -1504920 -2464343 -3411247 -2988091 -1985081 -1744368 -1846203 -1203561
41415a203561Q31973l92289j430776r21562J47509M41770L98450Q11278J076719
$$ -1203561 -371588 -763877 -2194653 -3116215 -2968706 -2526936 -2128486 -1317208 -240489
41406b40489N08391j01676J14559M53451j0686o81306o55271m44913p73280q73463
$$ -240489 267902 166226 280785 734236 723550 42244 -613027 -1057940 -1831220 -2704683
41396b704683Q2818R76894L52661q44655n53074R22960J292839M4513p94935p3385
$$ -2704683 -2621865 -1644971 -1292310 -2136965 -2690039 -1767079 -474240 -429727 -1224662 -1298047
41386a298047P94459M28052m01703m74032j51657l01989n63957j63015N37464
$$ -1298047 -503588 -75536 -477239 -951271 -1102928 -1404917 -1968874 -2131889 -1594425
41377a594425O88860M26662M16115N23412J70016m25637n42997k13157r0726k73302
$$ -1594425 -905565 -478903 -62788 460624 630640 205003 -337994 -551151 -641877 -915179
41367i15179k89649j39345k97322o70303n63010J43085O84534N58824J80865Q3374
$$ -915179 -1204828 -1344173 -1641495 -2311798 -2874808 -2731723 -2047189 -1488365 -1307500 -1224126
41357a224126J77612J70767P2563r5858m76375q41926n39913M88424J248525R43155
$$ -1224126 -1046514 -875747 -803184 -899042 -1375417 -2217343 -2757256 -2268832 -1020307 -77152
41347g7152J52073n2554K90771L26863j6288L5123N08218L55541p84563j681436
$$ -77152 74921 22367 313138 640001 623713 658836 1167054 1522595 738032 -943404
41337i43404j206507k2549M56116J40823J17132P49100J182628P84613k1047o10596
$$ -943404 -2149911 -2172460 -1716344 -1575521 -1458389 -709289 473339 1257952 1236905 626309
41327F26309r17562r68219n05627L80663Q90707M13320n74096j025556n13487
$$ 626309 -291253 -1259472 -1765099 -1384436 -493729 -80409 -654505 -1680061 -2193548
41318b193548M77777J189737J167978M49826m45787q54602n82437q9464Q4828
$$ -2193548 -1715771 -526034 641944 1091770 645983 -208619 -791056 -880520 -795692
41309g95692j10760l55705l60709k7569M62338O04481N8598o58050n48199M72189
$$ -795692 -906452 -1262157 -1622866 -1650435 -1188097 -583616 -525018 -1183068 -1731267 -1259078
41299a259078J217292Q07549o4134k51943L9484k69777j111503j122472J76365
$$ -1259078 -41786 765763 701629 449686 489170 219393 -892110 -2014582 -1838217
41290a838217J348540R74423l27334q47018j87974M44190K07828k84895j48920
$$ -1838217 -489677 484746 157412 -689606 -877580 -433390 -225562 -510457 -659377
41281f59377M29885O37031K53222k31180m55067n28244o07562o37170n45722l25958
$$ -659377 -229492 407539 660761 429581 -25486 -553730 -1161292 -1798462 -2344184 -2670142
41271b670142Q7500O50449R37201N03477l83513q66942n78586j39194k38106o19440
$$ -2670142 -2582642 -1932193 -994992 -491515 -875028 -1741970 -2320556 -2459750 -2697856 -3317296
41261c317296m92690K69517R17533Q36906L07060L3356J80290J87979l81900j030423
$$ -3317296 -3809986 -3540469 -2622936 -1786030 -1478970 -1445614 -1265324 -1077345 -1459245 -2489668
41251b489668p42571O03766J700448J281013j19034p66175j45321L38086m02438
$$ -2489668 -3232239 -2628473 -928025 352988 233954 -532221 -677542 -339456 -741894
41242g41894j302477o60808J189091K102975R58507r35310j579643n95583O47290
$$ -741894 -2044371 -2705179 -1516088 586887 1545394 610084 -969559 -1565142 -917852
41233i17852P36004l21341j199698p58329N80673J314216Q09458K8840j12573
$$ -917852 -181848 -503189 -1702887 -2461216 -1880543 -566327 243131 271971 159398
41224A59398j04910o22876r65887k19791P56562M19672p05593n53462J023571
$$ 159398 54488 -568388 -1534275 -1754066 -997504 -577832 -1283425 -1836887 -813316
41215h13316J675396K33919j304574q89642M64269N85668l42567m78263L69550
$$ -813316 862080 1095999 -208575 -1098217 -633948 -48280 -390847 -869110 -499560
41206d99560N88113k74668p26974O6292Q80382M70089n19243p49249k06782J48334
$$ -499560 88553 -186115 -913089 -846797 33585 503674 -15569 -764818 -971600 -823266
41196h23266P9308K06388O66968P48342P3364o69744o72630j81773q5690n24913
$$ -823266 -743958 -537570 129398 877740 951104 281360 -391270 -573043 -658733 -1183646
41186a183646o70674m8738O70746P00171K99297J54031J22443l63077r58277p30831
$$ -1183646 -1854320 -1903058 -1232312 -532141 -232844 -78813 43630 -319447 -1277724 -2008555
41176b008555J83224N75142P4074k80318J45648N52160K28576k06237m7897K25130
$$ -2008555 -1825331 -1250189 -1176115 -1456433 -1310785 -758625 -530049 -736286 -784183 -559053
41166e59053O5052P5859P48255J036227j14950j599659j420584K53326J243320
$$ -559053 -494001 -418142 330113 1366340 1251390 -348269 -1768853 -1515527 -272207
41157b72207N61701m36452m34891P3133Q9205k62447l19509o6324J31760K44813
$$ -272207 289494 -146958 -581849 -508716 -419511 -681958 -1001467 -1067791 -936031 -691218
41147f91218L06308L0411o43663j095280o95498L62986J300703J540500J014100
$$ -691218 -384910 -354499 -998162 -2093442 -2788940 -2425954 -1125251 415249 1429349
41138A429349K0050r45860j431302j281866o13385L09970J000890R31446K04669
$$ 1429349 1449399 503539 -927763 -2209629 -2823014 -2513044 -1512154 -580708 -376039
41129c76039l41397k05842O5294j43694m50038k66131l029k79491n14493J63871
$$ -376039 -717436 -923278 -857984 -1001678 -1451716 -1717847 -1720876 -2000367 -2514860 -2350989
41119b350989J011826N25008q74042j088896L31646J297549M85817n60033p4153
$$ -2350989 -1339163 -814155 -1688197 -2777093 -2445447 -1147898 -662081 -1222114 -1296267
41110a296267J006422O98919p00290j124492J8288J174285J140014M35205o7364
$$ -1296267 -289845 409074 -291216 -1415708 -1397420 -223135 916879 1352084 1284720
41101A284720l77797p50969r37930o75019k11783R7382K34092K83334K08099O1443
$$ 1284720 906923 155954 -781976 -1456995 -1668778 -1571396 -1337304 -1053970 -845871 -784428
41091g84428N4078K55178M72903M50956P603q16463j469676j110992L41994J656205
$$ -784428 -730350 -475172 -2269 448687 456290 -360173 -1829849 -2940841 -2598847 -942642
41081i42642J468614k7219j235950j069637r8902L98738L4287m10333q8026Q32668
$$ -942642 525972 498753 -737197 -1806834 -1905736 -1506998 -1472711 -1883044 -1971070 -1138402
41071a138402J286740N22345r14732j662416j038251K72609J112450J020471L44807
$$ -1138402 148338 670683 -244049 -1906465 -2944716 -2672107 -1559657 -539186 -194379
41062a94379l14698m71605l1811M39179J81604o99502j192353p51755q75M25244
$$ -194379 -509077 -980682 -1012493 -573314 -391710 -1091212 -2283565 -3035320 -3036195 -2610951
41052b610951Q19173J362317J141847m50305k028748j603669N40364K020570J522629
$$ -2610951 -1791778 -429461 712386 262081 -1766667 -3370336 -2829972 -809402 713227
41043G13227J67779o09330q47579r95536o61958L80643J121754N86761n68141
$$ 713227 881006 271676 -575903 -1571439 -2233397 -1852754 -731000 -144239 -712380
41034g12380r62903m15143J93567M37739N31504M31740L1219q0506N89145J110825
$$ -712380 -1675283 -2090426 -1896859 -1459120 -927616 -495876 -464657 -545163 43982 1154807
41024A154807J69647j544881j758859O8091J615795R35682p49518j018710J39426
$$ 1154807 1324454 -220427 -1979286 -1911195 -295400 640282 -109236 -1127946 -988520
41015i88520O63917j66990q35806l25456K77791j63367q15956l27595P67476P92705
$$ -988520 -324603 -491593 -1327399 -1652855 -1375064 -1538431 -2354387 -2681982 -1914506 -1121801
41005a121801l38618q65118J32124J291971R57287m94160j311758p41497L30056
$$ -1121801 -1460419 -2325537 -2193413 -901442 55845 -438315 -1750073 -2491570 -2161514
40996b161514Q59921P52597L83430r0955n60011p17971m79175k52220l56833m64164
$$ -2161514 -1301593 -548996 -165566 -256521 -816532 -1534503 -2013678 -2265898 -2622731 -3086895
40986c086895p9447O44234J089716J051787Q78467P48281M10007j82554n50294
$$ -3086895 -3166342 -2522108 -1432392 -380605 497862 1246143 1656150 1473596 923302
40977I23302l70745n0801j68070o40486r28435q35868n76505j90659M65969J107697
$$ 923302 552557 501756 333686 -306800 -1235235 -2071103 -2647608 -2838267 -2372298 -1264601
40967a264601J045014J17994q70127j029403l89873L12857N98724N83994N04328
$$ -1264601 -219587 -101593 -971720 -2001123 -2390996 -2078139 -1479415 -895421 -391093
40958c91093L44513J9069l72957o24160o26278m16966j09106J44594J87678J2977
$$ -391093 -46580 -27511 -400468 -1024628 -1650906 -2067872 -2176978 -2032384 -1844706 -1831729
40948a831729q6632K73770R89388J274047N30156n84429o54661N66532J471287
$$ -1831729 -1918361 -1644591 -655203 618844 1149000 564571 -90090 476442 1947729
40939A947729O10814j172490j746454n88290O22142M72704m42020q14839m82030
$$ 1947729 2558543 1386053 -360401 -948691 -326549 146155 -295865 -1110704 -1592734
40930a592734j04648J16865L83948N30753K95060r172O7528L23900L13640J52905
$$ -1592734 -1697382 -1580517 -1196569 -665816 -370756 -379928 -312400 11500 325140 478045
40920D78045J51300P5410l38072n63362q804P66862O93386j43216o64236n70472
$$ 478045 629345 704755 366683 -196679 -205483 561379 1254765 1111549 447313 -123159
40910a23159o57297j172254j175069r3331J147240J313077N00371j44784M0041
$$ -123159 -780456 -1952710 -3127779 -3221110 -2073870 -760793 -260422 -405206 -365165
40901c65165N68033N42748k54987j036259q29312K88665J157135J007785L80876
$$ -365165 202868 745616 490629 -545630 -1374942 -1086277 70858 1078643 1459519
40892A459519L0124k87694r52258j209288k29225J067526R78188l60712j143783
$$ 1459519 1489643 1201949 249691 -959597 -1188822 -121296 856892 496180 -647603
40883f47603p25517l01327m62499k21759P89781J273481N22710k22300o112J41682
$$ -647603 -1373120 -1674447 -2136946 -2358705 -1568924 -295443 227267 4967 -1145 140537
40873A40537o71915j218850k82188Q26333K44979j141311r79164P05430J608955
$$ 140537 -531378 -1750228 -2032416 -1206083 -961104 -2102415 -3081579 -2376149 -767194
40864g67194Q37492j28296k96599m61439j058953j036420J38176J201559R96822
$$ -767194 70298 -57998 -354597 -816036 -1874989 -2911409 -2773233 -1571674 -574852
40855e74852K17573R8685M96339M35108k13435o69587m56473R0385L28773m3417
$$ -574852 -357279 -258594 237745 672853 459418 -210169 -666642 -576257 -247484 -290901
40845b90901o60554p99146l24176q063l19047m46294M29513J435100J058704l77932
$$ -290901 -951455 -1750601 -2074777 -2082840 -2401887 -2848181 -2418668 -983568 75136 -302796
40835c02796j049224m52250r125m98482q56796k67735M28155M06327K20496L72205
$$ -302796 -1352020 -1804270 -1813395 -2311877 -3168673 -3436408 -3008253 -2601926 -2381430 -2009225
40825b009225J99894n04406m51195R65715K001646J003577p78158r88007K22820
$$ -2009225 -1809331 -2313737 -2764932 -1799217 202429 1206006 427848 -560159 -337339
40816c37339P46410M1530m08869O476J80017l57111n44911P0794L65276k97849
$$ -337339 409071 450601 41732 48208 228225 -128886 -673797 -603003 -237727 -535576
40806e35576q23481k91054M45474K80640l22887l51191j812k5717j46280L47567
$$ -535576 -1359057 -1650111 -1204637 -923997 -1246884 -1598075 -1599887 -1625604 -1771884 -1424317
40796a424317R48170M48099r77202j655477o96783P47849J051576J62932n63422
$$ -1424317 -476147 -28048 -1005250 -2660727 -3357510 -2609661 -1558085 -1395153 -1958575
40787a958575k17139O02624O37104m10031j383893r93060N12356J455155P48890
$$ -1958575 -2175714 -1573090 -935986 -1346017 -2729910 -3722970 -3210614 -1755459 -1006569
40778a006569o82885j039428R5825J326750J269345J14895q76334q86597j33970
$$ -1006569 -1689454 -2728882 -2633057 -1306307 -36962 77933 -798401 -1684998 -1818968
40769a818968O72718R75835O23128n8307m48226k47667J01037k6277m74729m39002
$$ -1818968 -1146250 -170415 452713 394406 -53820 -301487 -200450 -226727 -701456 -1140458
40759a140458K69312O97067J5353j137419j345492l04516Q00110R22115L69836
$$ -1140458 -871146 -174079 -158726 -1296145 -2641637 -2946153 -2146043 -1223928 -854092
40750h54092M0840J42707K58690K14015K06634K89462K93928J78331K5175j89331
$$ -854092 -813252 -670545 -411855 -197840 8794 298256 592184 770515 795690 606359
40740F06359m46888m88199j80898Q8280j48912p25538r86058n50952M01595J377627
$$ 606359 159471 -328728 -509626 -421346 -570258 -1295796 -2281854 -2832806 -2431211 -1053584
40730a053584J702729Q33143q09514j705041q73171N52593N19764j094060k085807
$$ -1053584 649145 1482288 672774 -1032267 -1905438 -1352845 -833081 -1927141 -4012948
40721d012948q82029J279906K048381R97209k06257k75706L03162M82551J95714
$$ -4012948 -4894977 -3615071 -1566690 -569481 -775738 -1051444 -748282 -265731 -70017
40712g0017J02798L55251L42205l33871j134844j165328l26369M90075M82434
$$ -70017 32781 388032 730237 396366 -738478 -1903806 -2230175 -1740100 -1257666
40703a257666j08065m13473o1088N20551P66009M96855j23381o70471n62124L43914
$$ -1257666 -1365731 -1779204 -1840292 -1319741 -553732 -56877 -180258 -850729 -1412853 -1068939
40693a068939J225007R96828k86008j311605j042955J32135J028066R52620J13379
$$ -1068939 156068 1152896 866888 -444717 -1487672 -1355537 -327471 625149 738528
40684G38528p80808j006225l14425P52803J314651J055784L82941k49177o40532
$$ 738528 -42280 -1048505 -1362930 -610127 704524 1760308 2143249 1894072 1253540
40675A253540n78412l0062M00016Q6314n07740l84597K52944J78124o60942p77043
$$ 1253540 675128 645066 1045082 1131396 623656 239059 492003 670127 9185 -767858
40665g67858L06987R52126R4183p35080Q3562J249364M67543j575468j953122
$$ -767858 -460871 491255 585438 -149642 -66080 1183284 1650827 75359 -1877763
40656a877763k7207J533639P78037r34632j361250l98600N70830Q45177O25505
$$ -1877763 -1904970 -371331 406706 -527926 -1889176 -2287776 -1716946 -871769 -246264
40647b46264J39496l39631l66747L047J69516P6183L01858O47854N8083j322805
$$ -246264 -106768 -446399 -813146 -810099 -640583 -564400 -262542 385312 443395 -879410
40637h79410j611315R6913J933741J737034J18594p32600l63635j23252m58299
$$ -879410 -2490725 -2393812 -460071 1276963 1395557 662957 299322 176070 -282229
40628b82229l69556L86722O41367j07895p00501j94465O53546P06535J20845k90352
$$ -282229 -651785 -265063 376304 268409 -432092 -626557 26989 733524 854369 564017
40618E64017m49430o59885n46580L67144J328804R57098o52797j650507q52880
$$ 564017 114587 -545298 -1091878 -724734 604070 1561168 908371 -742136 -1595016
40609a595016N57370P29880j78030m41251L18875M45418q64624j719177j96844
$$ -1595016 -1037646 -307766 -485796 -927047 -608172 -162754 -1027378 -2746555 -2943399
40600b943399K281655K479319q583j994076j166656Q48877J188605k31894j201903
$$ -2943399 -661744 1817575 1808992 -185084 -1351740 -502863 685742 453848 -748055
40591g48055o56077L49585P36370O65449N43267K21410l30272n62027j34335M08906
$$ -748055 -1404132 -1054547 -318177 347272 890539 1111949 781677 219650 85315 494221
40581D94221K56827o02922j250811q41340K74742P24963j68074j176903o14633
$$ 494221 751048 148126 -1102685 -1944025 -1669283 -944320 -1112394 -2289297 -2903930
40572b903930J122918J848347P48734m00175j05393M78803l15288j583240j127326
$$ -2903930 -1781012 67335 816069 415894 310501 789304 474016 -1109224 -2236550
40563b236550R03834K038109J079627n07899j146963j067251j005166p38704O3115
$$ -2236550 -1332716 705393 1785020 1277121 130158 -937093 -1942259 -2680963 -2617848
40554b617848P97366P82076L22212R3630J22751N1142j47543k81287l15287k25160
$$ -2617848 -1820482 -1038406 -716194 -622564 -499813 -448671 -596214 -877501 -1192788 -1417948
40544a417948J02252N32471O55824K97439k85024p31318p53860j82355O64321
$$ -1417948 -1315696 -783225 -127401 170038 -114986 -846304 -1600164 -1782519 -1118198
40535a118198R49270K98373n38523p14407m76658m39815k95776N06959J325004
$$ -1118198 -168928 129445 -409078 -1123485 -1600143 -2039958 -2335734 -1828775 -503771
40526e03771J070249R7678k33888K76502N54041J79132k27665m51349p51619o33835
$$ -503771 566478 664156 430268 706770 1260811 1439943 1212278 760929 9310 -624525
40516f24525M48328J302642K99453j480183j208049J085836K006087M5601j861293
$$ -624525 -176197 1126445 1425898 -54285 -1262334 -176498 1829589 1875190 13897
40507A3897r55707J114447J241644l66316j285483r39127n20756j60206P90313
$$ 13897 -941810 172637 1414281 1047965 -237518 -1176645 -1697401 -1857607 -1067294
40498a067294J486115N38112j220461j572925k45125J007389J302255J225180
$$ -1067294 418821 956933 -263528 -1836453 -2081578 -1074189 228066 1453246
40490A453246Q46334l29311j515689j237246J20362O76759P1570k37291J93572
$$ 1453246 2299580 1970269 454580 -782666 -662304 14455 86025 -151266 42306
40481D2306J82915m98818n15712M22935Q15384P4280m06813J10853L66466l89748
$$ 42306 225221 -273597 -789309 -366374 449010 523290 116477 227330 593796 204048
40471B04048q30876K452Q01322K63376n99950l23297M69814M02360j50025n918
$$ 204048 -626828 -624376 176946 440322 -159628 -482925 -13111 389249 239224 233306
40461B33306M76753J92929m05482m8991Q27012N83964p34007j241661k28349O87484
$$ 233306 710059 902988 497506 448515 1275527 1859491 1125484 -116177 -344526 342958
40451C42958J10862j068222j145308o192R73901Q29652n1990o64669n01676O1559
$$ 342958 453820 -614402 -1759710 -1765902 -792001 37651 -14339 -679008 -1180684 -1119125
40441a119125L13695Q2622j16700P1084K44572r3480o41054o70936j08358L84963
$$ -1119125 -805430 -722808 -839508 -768424 -523852 -617332 -1258386 -1929322 -2037680 -1652717
40431a652717L42859j6259j95181J13403Q46990J455748J200774Q1957q11195
$$ -1652717 -1309858 -1326117 -1521298 -1407895 -560905 894843 2095617 2177574 1366379
40422A366379n47195K83288L03927o25257j154675m78728M15243K24383p24051
$$ 1366379 819184 1102472 1406399 781142 -373533 -852261 -437018 -212635 -936686
40413i36686j018930l04019K95346N1446j88537N40093J484344J050858o41249
$$ -936686 -1955616 -2259635 -1964289 -1912843 -2101380 -1561287 -76943 973915 332666
40404C32666j500286l03637J411597J384720k64193j385160q88410J02910L29438
$$ 332666 -1167620 -1471257 -59660 1325060 1060867 -324293 -1212703 -1109793 -780355
40395g80355P6071J66309N52337P60880P88713P09928K21561n96472r11781m25841
$$ -780355 -704284 -537975 14362 775242 1563955 2273883 2495444 1898972 987191 561350
40385E61350j32950p06499j063284p380J437303J196125o20013j637356o45157
$$ 561350 428400 -278099 -1341383 -1348763 88540 1284665 664652 -972704 -1617861
40376a617861P83495Q00129k38889q43171o17076j64099K89450Q63425J211521
$$ -1617861 -834366 -34237 -273126 -1116297 -1733373 -1897472 -1608022 -744597 466924
40367D66924R41801M44454K40391o5961j034146j963909j584596q1402R71888
$$ 466924 1408725 1853179 2093570 2027609 993463 -970446 -2555042 -2636444 -1664556
40358a664556Q83432O21426Q56777P03817n89965j888528j541029R3786J009490
$$ -1664556 -781124 -159698 697079 1400896 810931 -1077597 -2618626 -2524840 -1515350
40349a515350L58763m92987p3682J173417J673279Q20037m89195j122454q51680
$$ -1515350 -1156587 -1649574 -1723256 -549839 1123440 1943477 1454282 331828 -519852
40340e19852k56672M1103p4534k32350n1971L85555O32504M59370J53075J07496
$$ -519852 -776524 -735421 -809955 -1042305 -1094276 -708721 -76217 383153 536228 643724
40330F43724K88815L16278P475l75352m88923l70640l45587m69392l47213K36278
$$ 643724 932539 1248817 1256292 880940 392017 21377 -324210 -793602 -1140815 -904537
40320i04537P51632N05312k84877o72595l48311R019N2378L82881J130512J073282
$$ -904537 -152905 352407 67530 -605065 -953376 -944357 -891979 -509098 621414 1694696
40310A694696n27777k129444j680111L19356J476079J029505N35320Q45252Q25852
$$ 1694696 1166919 -962525 -2642636 -2323280 -847201 182304 717624 1562876 2388728
40301B388728j38289p71319l37203j94458j203493j687825j76590J655176J417778
$$ 2388728 2250439 1479120 1141917 947459 -256034 -1943859 -2120449 -465273 952505
40292I52505p3428k77273P14369O14870p24830r76793L93338J014029k73167j417422
$$ 952505 879077 601804 1316173 1931043 1206213 229420 622758 1636787 1363620 -53802
40282e3802p79253J49785l96381j340510q05629O27859J132233O91259N59115
$$ -53802 -833055 -683270 -1079651 -2420161 -3225790 -2597931 -1465698 -774439 -215324
40273b15324P12586K12182n90664m95291K78531L86497k51979l74800K91337N44582
$$ -215324 497262 709444 118780 -376511 -97980 288517 36538 -338262 -46925 497657
40263D97657j51666p47947l39669N52095R77722P62707K52329k72335n69443n24976
$$ 497657 345991 -401956 -741625 -189530 788192 1550899 1803228 1530893 961450 436474
40253D36474m19705m94680l89291K24160P56698M83126r7435M7333O34614M23965
$$ 436474 16769 -477911 -867202 -643042 113656 596782 499347 546680 1181294 1605259
40243A605259n49438q04534J10742O88772j57744j297830j135183O57N55659Q7170
$$ 1605259 1055821 251287 362029 1050801 893057 -404773 -1539956 -1539299 -983640 -896470
40233h96470m40956l22446J20328L46815K55820l1801m02382o57785n68351p2467
$$ -896470 -1337426 -1659872 -1539544 -1192729 -936909 -968710 -1371092 -2028877 -2597228 -2669695
40223b669695O64816J231513J089732J95572n65952l08022M68934M12289n57848
$$ -2669695 -2004879 -773366 316366 511938 -54014 -362036 106898 519187 -38661
40214c8661r26917M0577R86817N53847m72488n35422J90080L78956n5665o3379
$$ -38661 -965578 -925001 61816 615663 143175 -392247 -202167 176789 121124 57745
40204E7745L76468J74669p15252r87051j92993N25090M53922L17119N54681L57537
$$ 57745 434213 608882 -106370 -1093421 -1286414 -761324 -307402 9717 564398 921935
40194I21935n62267r15956R5791J112822O08121o25456p51456K11480O36853p3303
$$ 921935 359668 -556288 -460497 652325 1260446 634990 -116466 95014 731867 658564
40184F58564r14787j106365q13652j67266Q32986J441471P53954p11256j435783
$$ 658564 -256223 -1362588 -2176240 -2343506 -1510520 -69049 684905 -26351 -1462134
40175a462134r74695k20177L33294R50405J271272M73772q53496r63602L30981
$$ -1462134 -2436829 -2657006 -2323712 -1373307 -102035 371737 -481759 -1445361 -1114380
40166a114380J151449N47887n7179M45474Q01783l21835j783026j686558l42408
$$ -1114380 37069 584956 527777 973251 1775034 1453199 -329827 -2016385 -2358793
40157b358793N44213O24827P85774J044455O66109p7334k49299p1823n44173j427254
$$ -2358793 -1814580 -1189753 -403979 640476 1306585 1229251 979952 908129 363956 -1063298
40147a063298j426858l34290P20667J128675J261889J125783K93052p19046p38408
$$ -1063298 -2490156 -2824446 -2103779 -975104 286785 1412568 1705620 986574 248166
40138B48166J41661N33151r8590q10012r23663p82130n01387L13015J204616R71258
$$ 248166 389827 922978 824388 14376 -909287 -1691417 -2192804 -1879789 -675173 296085
40128B96085k99351r97756m52744R7807j98442l20647O57054J671184J189829
$$ 296085 -3266 -1001022 -1453766 -1355959 -1554401 -1875048 -1217994 453190 1643019
40119A643019m52351j589695j355761k21498R12790J289024O20507m37962q07238
$$ 1643019 1190668 -399027 -1754788 -1976286 -1063496 225528 846035 408073 -399165
40110c99165m12313j96229l87920o1109J007807J527519O69862n07678p21939
$$ -399165 -811478 -1007707 -1395627 -1456736 -448929 1078590 1748452 1240774 518835
40101E18835l11282k39596m03867k28128L3707j15186l40205j54401J15075O9229
$$ 518835 207553 -32043 -435910 -664038 -630331 -745517 -1085722 -1240123 -1125048 -1055819
40091a055819N1900K41019N605p43549p96400M37003J498238R42346l30978n73525
$$ -1055819 -1003919 -762900 -757295 -1500844 -2297244 -1860241 -362003 580343 249365 -324160
40081c24160L2173P7437m20124k49823N55907O75759j89208q65242o47258o1069
$$ -324160 -291987 -214550 -634674 -884497 -328590 347169 157961 -707281 -1354539 -1415608
40071a415608L71320O73254P39231M48144K85818N75806M98214o52227j748761
$$ -1415608 -1044288 -371034 368197 816341 1102159 1677965 2176179 1523952 -224809
40062b24809j168995N13054J146371J73241q53215r50566p86567p81684k47143
$$ -224809 -1393804 -880750 265621 438862 -414353 -1364919 -2151486 -2933170 -3180313
40053c180313R32262J599228J100793K63267n4823m318J24554L69256L16310n55744
$$ -3180313 -2248051 -648823 451970 715237 660414 656096 780650 1149906 1466216 910472
40043I10472j389132o38709J192849J571949l26659j955000r78815J219543J573716
$$ 910472 -478660 -1117369 75480 1647429 1320770 -634230 -1613045 -393502 1180214
40034A180214k89304j814974j233931L87374J026633K93914m66271j00776Q98461
$$ 1180214 890910 -924064 -2157995 -1770621 -743988 -450074 -916345 -1017121 -118660
40025a18660J073815K8927q83231m44725N92229O86087n9197k35342L67398N08115
$$ -118660 955155 984082 100851 -343874 248355 934442 875245 639903 1007301 1515416
40015A515416j31685l67459J99108L75705l21198o15903J46595N65793l98955
$$ 1515416 1383731 1016272 1215380 1591085 1269887 653984 800579 1366372 967417
40006I67417j414818r50172J34271J81980l87110k9445J017998J108124J1820
$$ 967417 -447401 -1397573 -1263302 -1081322 -1468432 -1497877 -479879 628245 640065
39997F40065p94787n57674l3936J92151M34113P53775O34241R4439j63156L6493
$$ 640065 -154722 -712396 -746332 -554181 -120068 633707 1267948 1362387 1199231 1235724
39987A235724J21174r3034j60732j9059j24589m28303l10771K46902M70673M3095
$$ 1235724 1356898 1263864 1103132 1084073 959484 531181 220410 467312 937985 981080
39977I81080m13145m07477k62185l66151m91194k33552L85263R93053J148334
$$ 981080 567935 160458 -101727 -467878 -959072 -1192624 -807361 185692 1334026
39968A334026N64204m71758j042372n66109L32419N63132q150n94675p24813o11597
$$ 1334026 1898230 1426472 384100 -182009 150410 713542 705392 110717 -614096 -1225693
39958a225693m46345k00081l5953p9497P0007P02921J108761M25215p66920r64171
$$ -1225693 -1672038 -1872119 -1908072 -1987569 -1917562 -1214641 -105880 319335 -447585 -1411756
39948a411756R0594J048394R53677L05283j76135m90259o05782j26747O40954
$$ -1411756 -1321162 -272768 680909 986192 810057 319798 -285984 -412731 228223
39939B28223N96296l90656q93770o8373Q85150O03822k55276k37073M16159K94632
$$ 228223 824519 433863 -459907 -528280 356870 960692 705416 468343 884502 1179134
39929A179134o23539q47095J52294J074941Q34213J5412l44864k59082k88370
$$ 1179134 555595 -291500 -139206 935735 1769948 1785360 1440496 1181414 893044
39920H93044m33533l60855j43870l4112R5699M41748P20869M92578j95044q97651
$$ 893044 459511 98656 -45214 -79326 16373 458121 1178990 1671568 1476524 578873
39910E78873j250541j023535j24811R73333J244827K18932j164932j500781o03599
$$ 578873 -671668 -1695203 -1820014 -846681 398146 617078 -547854 -2048635 -2652234
39901b652234M02900O27672L35841K41702N51867R54068J037370N02085n63164
$$ -2652234 -2249334 -1621662 -1285821 -1044119 -492252 461816 1499186 2001271 1438107
39892A438107j416683j222361j59102N75101K46934m53054m18556L90983J085858
$$ 1438107 21424 -1200937 -1360039 -784938 -538004 -991058 -1409614 -1018631 67227
39883F7227J091248N81668p2062n76998n86578k7638M79945K54352l77264m18207
$$ 67227 1158475 1740143 1668081 1091083 504505 476867 956812 1211164 833900 415693
39873D15693K58875N87283r4138r55907q73312o8324L42747R9218N7077O37378
$$ 415693 674568 1261851 1167713 211806 -661506 -729830 -387083 -287865 -230788 406590
39863D06590J012852L59816p63723j065446k79228N09596L73819l17316o08738
$$ 406590 1419442 1779258 1015535 -49911 -329139 180457 554276 236960 -371778
39854c71778k69206J41684J91255m2540l50592n47828l17088M42477J088364P95871
$$ -371778 -640984 -499300 -308045 -350585 -701177 -1249005 -1566093 -1123616 -35252 760619
39844G60619j95885p00203k55222J95392j59779o75488l45121M95772P10177K12700
$$ 760619 564734 -135469 -390691 -195299 -355078 -1030566 -1375687 -879915 -169738 42962
39834D2962L3493N60426Q96816K73169q17670j330409q98525j999O48497O58149
$$ 42962 76455 636881 1533697 1806866 989196 -341213 -1239738 -1241737 -593240 64909
39824F4909K26250m3306Q0368M3624o08552j221681p65770N06636J177656O54888
$$ 64909 291159 247853 328221 371845 -236707 -1458388 -2224158 -1717522 -539866 115022
39814A15022O160K95625R95587Q63675j52279q00593k47542P69603P97748n32011
$$ 115022 121182 416807 1412394 2276069 2123790 1323197 1075655 1845258 2643006 2110995
39804B110995j897011j750125k62893Q31166N46601q8039K10305Q85205N33441
$$ 2110995 213984 -1536141 -1799034 -967868 -421267 -509306 -299001 586204 1119645
39795A119645o14266r50219j44109L32059k50929o42476J79769J167349Q62203
$$ 1119645 505379 -444840 -588949 -256890 -507819 -1150295 -970526 196823 1059026
39786A059026k75375o51357O6151P06614M02068m82514j062765q10234O7499O30716
$$ 1059026 783651 132294 198445 905059 1307127 824613 -238152 -1048386 -980887 -350171
39776c50171P0747j016846j037274L43467J416279Q47064k76516k15306O12053
$$ -350171 -279424 -1296270 -2333544 -1990077 -573798 273266 -3250 -218556 393497
39767C93497M56303p06255j099393j52865N71723P2980m17754L90482J519489
$$ 393497 849800 143545 -955848 -1108713 -536990 -464010 -881764 -491282 1028207
39758A028207J135207n65805j541465p81120M66472O48570o5809m28076n4589
$$ 1028207 2163414 1597609 56144 -724976 -258504 390066 324257 -103819 -158408
39749a58408K57739M226k50128L4310K99606k55833j176186j165115j0742R82841
$$ -158408 99331 103557 -146571 -112261 187345 -68488 -1244674 -2409789 -2420531 -1437690
39739a437690Q34432J57363j0386K53629K53731K2893J15025M25965K89511l32770
$$ -1437690 -603258 -445895 -456281 -202652 51079 73972 188997 614962 904473 571703
39729E71703o78426k77874M84656R62863Q24799Q9871q00425j035053k56999O78535
$$ 571703 -106723 -384597 100059 1062922 1887721 1977592 1177167 142114 -114885 563650
39719E63650N17832p09992j564694r99759L70813J192330J004587M27599M0135
$$ 563650 1081482 371490 -1193204 -2192963 -1822150 -629820 374767 802366 842501
39710H42501k81768q05024j180018p20611N12583J391384R77803j34610m87165
$$ 842501 560733 -244291 -1424309 -2144920 -1632337 -240953 736850 602240 115075
39701A15075J94395N60014l01712j312893q66335P69548J692710Q82463o15377
$$ 115075 309470 869484 567772 -745121 -1611456 -841908 850802 1733265 1117888
39692A117888j190108m75839O50379J194453P83001k44396j085428j067443k58329
$$ 1117888 -72220 -548059 102320 1296773 2079774 1835378 749950 -317493 -575822
39683e75822O12158Q79496M56838k63381p41192o26133r8459K02740o7936l93459
$$ -575822 36336 915832 1372670 1109289 368097 -258036 -356495 -153755 -221691 -615150
39673f15150j7930Q97692J259051L55887j166844j916452j187515L74065J476363
$$ -615150 -633080 264612 1523663 1879550 712706 -1203746 -2391261 -2017196 -540833
39664e40833J423622O05777j63324n09995n12085k08742L26999N83226O0531p52505
$$ -540833 882789 1488566 1325242 815247 303162 94420 421419 1004645 1065176 312671
39654C12671o88394M49708J340874Q29258n06023j177783p10185J9316Q4699m95813
$$ 312671 -375723 73985 1414859 2244117 1738094 560311 -149874 -130558 -45859 -541672
39644e41672r58961n99191M51791J116874N27621o25969p52900L60934J087625
$$ -541672 -1500633 -2099824 -1648033 -531159 -3538 -629507 -1382407 -1021473 66152
39635F6152L95322n70878m45570J13087k43339r86919n26361R09789J398652L53939
$$ 66152 461474 -109404 -554974 -441887 -685226 -1672145 -2198506 -1288717 109935 463874
39625D63874o90894p18589n85204r59260q50116N16406J880374J603474J79520
$$ 463874 -227020 -945609 -1530813 -2490073 -3340189 -2823783 -943409 660065 839585
39616H39585n05149J07407P62278M52570l87363q98889q95306n58105J13615R71697
$$ 839585 334436 441843 1204121 1656691 1269328 370439 -524867 -1082972 -969357 2340
39606B340J335597O04843q11812j675540j219119j3952P14694M75862j42099m35388
$$ 2340 1337937 1942780 1130968 -544572 -1763691 -1777643 -1062949 -587087 -729186 -1164574
39596a164574l47108j01968L08274Q17122R59411M79131r4876j65468n1899m33300
$$ -1164574 -1511682 -1613650 -1305376 -488254 471157 950288 855412 689944 638045 204745
39586B04745j011981p63356L70295J097533N64250l61771l46451M64772P11576
$$ 204745 -807236 -1570592 -1200297 -102764 461486 99715 -246736 218036 929612
39577I29612j29691r24913m61304Q28988J413152O94060k83450l51440K85811
$$ 929612 799921 -124992 -586296 242692 1655844 2349904 2066454 1715014 2000825
39568B000825O23039L52866l0811k92655o20272q13323l90334L35694L58698n13953
$$ 2000825 2623864 2976730 2945919 2653264 2032992 1219669 829335 1165029 1523727 1009774
39558A009774j265627j156696n73084m790O19446J041608M85327q26921j354527
$$ 1009774 -255853 -1412549 -1985633 -1990423 -1370977 -329369 155958 -670963 -2025490
39549b025490m77636L64986O4273j56512J082143K485891J757038o81517k093870
$$ -2025490 -2503126 -2138140 -2073867 -2230379 -1148236 1337655 3094693 2413176 319306
39540C19306j324635N3475N77192O24560Q34762Q04306J75780m64400n37180k27949
$$ 319306 -1005329 -951854 -374662 249898 1084660 1888966 2064746 1600346 1063166 835217
39530H35217J45157M96834N17558m9334o18883m46976k6595m07284j220273j042775
$$ 835217 980374 1477208 1994766 1945432 1326549 879573 852978 445694 -774579 -1817354
39520a817354J95593R61709N50271m0665r3113k06131p30947r08630l33562K81871
$$ -1817354 -1621761 -660052 -109781 -150446 -243559 -449690 -1180637 -2089267 -2422829 -2140958
39510b140958N17653Q98767J476569J342423K78457o60329q81883r50538r60340
$$ -2140958 -1623305 -724538 752031 2094454 2372911 1712582 830699 -119839 -1080179
39501a080179j33431J174586J188094m29068j511937n90378Q62431R73327K84463
$$ -1080179 -1213610 -39024 1149070 720002 -791935 -1382313 -519882 453445 737908
39492G37908J57083K30232l39356p01452K07754J242009N85050j138392j678563
$$ 737908 894991 1125223 785867 84415 292169 1534178 2119228 980836 -697727
39483f97727n22444P43856R96601N01519l02346j071261j038461J8884Q30987
$$ -697727 -1220171 -476315 520286 1021805 719459 -351802 -1390263 -1371379 -540392
39474e40392L45655l94907M1287Q58839L95706p71634p23392L98340P31241J20018
$$ -540392 -194737 -589644 -548357 310482 706188 -65446 -788838 -390498 340743 460761
39464D60761J68018Q74538M45756j104919j461364k2509Q13044k47011j099287
$$ 460761 628779 1503317 1949073 844154 -617210 -639719 173325 -73686 -1172973
39455a172973O3240J584745J206742k52364o66584j58518j51195l50760M39345
$$ -1172973 -1109733 475012 1681754 1429390 762806 604288 453093 102333 541678
39446E41678J489043J047185m20022p12812M48503R25673l28018j690957j542977
$$ 541678 2030721 3077906 2657884 1945072 2393575 3319248 2991230 1300273 -242704
39437b42704m60089K18604L56499M88423N90171M08776J23880j00358m23647o35368
$$ -242704 -702793 -484189 -127690 360733 950904 1359680 1483560 1383202 959555 324187
39427C24187j06287R54909J237839J40193j105509j077367j25361L84292J12187
$$ 324187 217900 1172809 2410648 2550841 1445332 367965 242604 626896 739083
39418G39083j78084j44801j81506l42575j65263L28911M84826O6685m14844o07613
$$ 739083 560999 416198 234692 -107883 -273146 55765 540591 607276 192432 -415181
39408d15181o91240o55364j45247O20330P19822j10296p86384k56037J040065
$$ -415181 -1106421 -1761785 -1907032 -1286702 -566880 -677176 -1463560 -1719597 -679532
39399f79532J798838J463176N05776m53980j066344j112221o96575l67591m05412
$$ -679532 1119306 2582482 3088258 2634278 1567934 455713 -240862 -608453 -1013865
39390a013865k86641M40181J100141O57619o11559j254350n87164M40926O67037
$$ -1013865 -1300506 -860325 239816 897435 285876 -968474 -1555638 -1114712 -447675
39381d47675J71739k07625k09305k99830p04376r10788l67486N67399Q02479r6147
$$ -447675 -275936 -483561 -692866 -992696 -1697072 -2607860 -2975346 -2407947 -1605468 -1701615
39371a701615j027486n75888R33347J598908N25379q83385r94605j87100J92309
$$ -1701615 -2729101 -3304989 -2371642 -772734 -247355 -1130740 -2125345 -2312445 -2120136
39362b120136J21527N02665J112236Q56971j33815n79475k51101j84709m96920
$$ -2120136 -1998609 -1495944 -383708 473263 339448 -240027 -491128 -675837 -1172757
39353a172757p1565J049007J142216l47213j505363q44732L83793M43315k1959
$$ -1172757 -1244322 -195315 946901 599688 -905675 -1750407 -1366614 -923299 -945258
39344i45258N55217J634282J369416k35056j301730j024202n06461n39875n08459
$$ -945258 -390041 1244241 2613657 2378601 1076871 52669 -453792 -993667 -1502126
39335a502126L8028M09470O0545m49551m63647j56992J19385M67407Q30375O54051
$$ -1502126 -1464098 -1054628 -994083 -1443634 -1907281 -2064273 -1944888 -1477481 -647106 6945
39325F945j71585p97374n46016R4048L31428L05917N59505P60842J34716r17160
$$ 6945 -164640 -962014 -1508030 -1413982 -1082554 -776637 -217132 543710 678426 -238734
39315b38734r20970M72412J541530P26327r97453j362914j06436O68940k49600
$$ -238734 -1159704 -687292 854238 1580565 583112 -779802 -886238 -217298 -466898
39306d66898j310767o43491J055106J656238P05056l70039o44505n01225k66071
$$ -466898 -1777665 -2421156 -1366050 290188 995244 625205 -19300 -520525 -786596
39297g86596J79554M32689o0349o28454j58667P16896K94647j128580j281020
$$ -786596 -607042 -174353 -234702 -863156 -1021823 -304927 -10280 -1138860 -2419880
39288b419880L27006J269293N2534j442538j115503J08417L92707K60723J072436
$$ -2419880 -2092874 -823581 -771047 -2213585 -3329088 -3220671 -2827964 -2567241 -1494805
39279a494805J869814Q07171j236142j596143k0226J036234L80839m45958j57395
$$ -1494805 375009 1182180 -53962 -1650105 -1670331 -634097 -253258 -699216 -856611
39270h56611L88640J94336j18035K82711Q55953O78008r1572o61120p10882m04670
$$ -856611 -467971 -273635 -391670 -108959 746994 1425002 1333430 672310 -38572 -443242
39260d43242L965J75768m9293k27900J30715O15642M14020l04137n37336L017
$$ -443242 -439277 -263509 -312802 -540702 -409987 205655 619675 315538 -221798 -218781
39250b18781N60471N92178L23822K7395k28678j67452K89059L86165m48151j213146
$$ -218781 341690 933868 1257690 1285085 1056407 888955 1178014 1564179 1116028 -97118
39240i7118n13057J004133J224725k24551j310214o85421M92790P33405L57547
$$ -97118 -610175 393958 1618683 1394132 83918 -601503 -108713 624692 982239
39231I82239K46092Q3025o05806r71705j61679P86166K14710j448513k055897
$$ 982239 1228331 1311356 705550 -266155 -427834 358332 573042 -875471 -2931368
39222b931368p52929R90095J591022J137562M43826l37375j205806j376571j73630
$$ -2931368 -3684297 -2694202 -1103180 34382 478208 140833 -1064973 -2441544 -2615174
39213b615174J456173J657713J25514j324890j222736l60733k08540m15285L95794
$$ -2615174 -1159001 498712 624226 -700664 -1923400 -2284133 -2492673 -2907958 -2512164
39204b512164J815145J800298k5494j399872p41652N27534M56632l98492l56712
$$ -2512164 -697019 1103279 1077785 -322087 -1063739 -536205 -79573 -478065 -834777
39195h34777L79977M13355j05120Q3463O75620J89856j063559j063750M58892
$$ -834777 -454800 -41445 -146565 -63102 612518 802374 -261185 -1324935 -866043
39186h66043J215972p9164j640017j369028K13184J251032J205856O80042j28875
$$ -866043 349929 270765 -1369252 -2738280 -2525096 -1274064 -68208 611834 482959
$$ [...]
##END NTUPLES=NMR SPECTRUM
##END=
