##TITLE=31Pdec_PbPA2309M
 CDcl3, 8 sc
 24.9.2019
##JCAMPDX= 6.0         $$ Bruker NMR JCAMP-DX V2.0
##DATA TYPE= NMR SPECTRUM
##DATA CLASS= NTUPLES
##ORIGIN= UXNMR, Bruker Analytische Messtechnik GmbH
##OWNER= root
$$ XWIN-NMR		Version 3.5
$$ Tue Sep 24 14:27:34 2019 Russian Standard Time (UT+4h)  she@DPX200
##.OBSERVE FREQUENCY= 81.013821
##.OBSERVE NUCLEUS= ^31P
##.ACQUISITION MODE= SIMULTANEOUS
##.ACQUISITION SCHEME= undefined
##.AVERAGES= 24
##.DIGITISER RES= 17
##SPECTROMETER/DATA SYSTEM= spect
##.PULSE SEQUENCE= zgpg30
##.SOLVENT NAME= CDCl3
##.SHIFT REFERENCE= (INTERNAL, CDCl3, 0, 182.463)
##AUDIT TRAIL= $$ (NUMBER, WHEN, WHO, WHERE, WHAT)
$$ ##TITLE= Audit trail, XWIN-NMR		Version 3.5
$$ ##JCAMPDX= 5.01
$$ ##ORIGIN= Bruker BioSpin GmbH
$$ ##OWNER= she
$$ F:/spectra/data/she/nmr/P31/1/pdata/1/auditp.txt
$$ ##AUDIT TRAIL=  $$ (NUMBER, WHEN, WHO, WHERE, WHAT)
(   1,<2019-09-24 14:26:22.54 +0400>,<she>,<DPX200>,
      <created by zg, POWCHK disabled, PULCHK disabled
       configuration hash MD5:
       00 E9 B6 7A A2 85 ED C7 34 08 36 98 17 FE 4E 26
       data hash MD5: 32K
       85 2A 31 09 62 F4 9B A6 92 14 FA 4C FD 3D 26 38>)
(   2,<2019-09-24 14:26:25.01 +0400>,<she>,<DPX200>,
      <Start of raw data processing
       efp BC_mod = 2 LB = 1 FT_mod = 6 PKNL = 1 PHC0 = -203.1913 PHC1 = -389.3995 SI = 64K 
       data hash MD5: 64K
       4A 4A 3C 62 A8 B1 0C EA 19 D7 65 25 9F C4 F9 4C>)
(   3,<2019-09-24 14:26:49.50 +0400>,<she>,<DPX200>,
      <pk PHC0 = -87.62488 PHC1 = 229.7999 
       data hash MD5: 64K
       1B 73 17 3B A7 F4 B3 07 22 31 58 3B 7D 78 7F EF>)
(   4,<2019-09-24 14:26:55.87 +0400>,<she>,<DPX200>,
      <abs ABSG = 5 
       data hash MD5: 64K
       27 DE 5C 59 C4 46 37 AE 9A 70 93 B9 19 18 D4 EF>)
$$ ##END=
$$ 
$$ hash MD5
$$ E6 11 86 6D 86 D8 4E E3 C1 51 89 FB 44 6B 94 D3
##$RELAX= 
##$RELAX= 
##$RELAX= 
##$RELAX= 
##$RELAX= 
##$RELAX= 
##$RELAX= 
##$RELAX= 
$$ Bruker specific parameters
$$ --------------------------
##$DU= <F:/spectra>
##$EXPNO= 1
##$NAME= <P31>
##$PROCNO= 1
##$TYPE= <nmr>
##$USER= <she>
##$AMP= (0..31)
100 100 100 100 100 100 100 100 100 100 100 100 100 100 100 100 100 100 
100 100 100 100 100 100 100 100 100 100 100 100 100 100 
##$AQSEQ= 0
##$AQ_mod= 1
##$AUNM= <au_zg>
##$AUTOPOS= <>
##$BF1= 81.014009
##$BF2= 200.13
##$BF3= 200.13
##$BF4= 200.13
##$BF5= 200.13
##$BF6= 200.13
##$BF7= 200.13
##$BF8= 200.13
##$BYTORDA= 1
##$CFDGTYP= 0
##$CFRGTYP= 5
##$CHEMSTR= <none>
##$CNST= (0..31)
1 1 145 1 1 1 1 1 1 1 1 1 1 1 1 1 1 1 1 1 1 1 1 1 1 1 1 1 1 1 1 1 
##$CPDPRG= <waltz16>
##$CPDPRG1= <>
##$CPDPRG2= <waltz16>
##$CPDPRG3= <>
##$CPDPRG4= <mlev>
##$CPDPRG5= <mlev>
##$CPDPRG6= <mlev>
##$CPDPRG7= <mlev>
##$CPDPRG8= <mlev>
##$CPDPRGB= <>
##$CPDPRGT= <>
##$D= (0..31)
0 1 0 0 0 0 0 0 0 0 0 0.03 2e-05 3e-06 0 0 0 0 0 0 0 0 0 0 0 0 0 0 0 0 
0 0 
##$DATE= 1569320781
##$DBL= (0..7)
120 120 120 11 120 120 24 19 
##$DBP= (0..7)
150 150 150 150 150 150 150 150 
##$DBP07= 0
##$DBPNAM0= <>
##$DBPNAM1= <>
$$ [...]
##$SUBNAM3= <"">
##$SUBNAM4= <"">
##$SUBNAM5= <"">
##$SUBNAM6= <"">
##$SUBNAM7= <"">
##$SUBNAM8= <"">
##$SUBNAM9= <"">
##$SW= 369.568048894756
##$SWIBOX= (0..15)
0 1 3 0 0 0 0 0 0 0 0 0 0 0 0 0 
##$SW_h= 29940.119760479
##$TD= 32768
##$TD0= 1
##$TE= 0
##$TE2= 300
##$TE3= 300
##$TEG= 300
##$TL= (0..7)
0 120 53 12 22 120 120 120 
##$TP= (0..7)
150 150 150 150 150 150 150 150 
##$TP07= 0
##$TPNAME0= <>
##$TPNAME1= <>
##$TPNAME2= <>
##$TPNAME3= <>
##$TPNAME4= <>
##$TPNAME5= <>
##$TPNAME6= <>
##$TPNAME7= <>
##$TPOAL= (0..7)
0.5 0.5 0.5 0.5 0.5 0.5 0.5 0.5 
##$TPOFFS= (0..7)
0 0 0 0 0 0 0 0 
##$TUNHIN= 0
##$TUNHOUT= 0
##$TUNXOUT= 0
##$USERA1= <user>
##$USERA2= <user>
##$USERA3= <user>
##$USERA4= <user>
##$USERA5= <user>
##$V9= 5
##$VALIST= <valist>
##$VCLIST= <CCCCCCCCCCCCCCC>
##$VD= 0
##$VDLIST= <DDDDDDDDDDDDDDD>
##$VPLIST= <PPPPPPPPPPPPPPP>
##$VTLIST= <TTTTTTTTTTTTTTT>
##$WBST= 1024
##$WBSW= 4
##$XGAIN= (0..3)
0 0 0 0 
##$XL= 0
##$YL= 0
##$YMAX_a= 30106
##$YMIN_a= -37705
##$ZGOPTNS= <>
##$ZL1= 120
##$ZL2= 120
##$ZL3= 120
##$ZL4= 120
##$ABSF1= 182.463
##$ABSF2= -187.1042
##$ABSG= 5
##$ABSL= 3
##$ALPHA= 0
##$AQORDER= 0
##$ASSFAC= 0
##$ASSFACI= 0
##$ASSFACX= 0
##$ASSWID= 0
##$AUNMP= <proc_1d>
##$AZFE= 0.1
##$AZFW= 0.5
##$BCFW= 0
##$BC_mod= 2
##$BYTORDP= 0
##$COROFFS= 0
##$CY= -3
##$DATMOD= 1
##$DC= 0
##$DFILT= <>
##$DTYPP= 0
##$F1P= 0
##$F2P= 0
##$FCOR= 1
##$FTSIZE= 65536
##$FT_mod= 6
##$GAMMA= 0
##$GB= 0
##$INTBC= 1
##$INTSCL= 5.30512e-09
##$ISEN= 30
##$LB= 1
##$LEV0= 0
##$LPBIN= 0
##$MAXI= 10000
##$MC2= 0
##$MEAN= 0
##$ME_mod= 0
##$MI= 50
##$NCOEF= 0
##$NC_proc= -6
##$NLEV= 6
##$NOISF1= 182.463
##$NOISF2= 159.3651
##$NSP= 0
##$NTH_PI= 0
##$NZP= 0
##$OFFSET= 182.463
##$PC= 4
##$PHC0= -290.8162
##$PHC1= -159.5996
##$PH_mod= 1
##$PKNL= yes
##$PPARMOD= 0
##$PSCAL= 0
##$PSIGN= 0
##$REVERSE= no
##$SF= 81.0140089999434
##$SI= 65536
##$SIGF1= 159.3651
##$SIGF2= -187.1042
##$SINO= 113.3802
##$SIOLD= 16384
##$SREGLST= <1H.CDCl3>
##$SSB= 0
##$STSI= 65536
##$STSR= 0
##$SW_p= 29940.119760479
##$SYMM= 0
##$S_DEV= 0
##$TDeff= 32768
##$TDoff= 0
##$TI= <>
##$TILT= no
##$TM1= 0
##$TM2= 0
##$TOPLEV= 0
##$USERP1= <user>
##$USERP2= <user>
##$USERP3= <user>
##$USERP4= <user>
##$USERP5= <user>
##$WDW= 1
##$XDIM= 65536
##$YMAX_p= 325615325
##$YMIN_p= -27386363
$$ End of Bruker specific parameters
$$ ---------------------------------
##NTUPLES= NMR SPECTRUM
##VAR_NAME=  FREQUENCY,     SPECTRUM/REAL,   SPECTRUM/IMAG
##SYMBOL=    X,             R,               I
##VAR_TYPE=  INDEPENDENT,   DEPENDENT,       DEPENDENT
##VAR_FORM=  AFFN,          ASDF,            ASDF
##VAR_DIM=   65536,         65536,           65536
##UNITS=     HZ,            ARBITRARY UNITS, ARBITRARY UNITS
##FACTOR=    0.456856943014862, 1,           1
##FIRST=     14782.0589164792, 0,            0
##LAST=      -15158.0608439998, 0,           0
##MIN=       -15158.0608439998, -27386363,   0
##MAX=       14782.0589164792, 325615325,    0
$$ Real data points
##PAGE= N=1
##DATA TABLE= (X++(R..R)), XYDATA
$$ [...]
43874E50663q04039J219996J559120K52098q69189p76813j09111J53518j29682
43865A046561m70525n17835k83230J48064O71178Q52589J35307j198498j820862
43856a437251q95791O13421J161903P41637N28721P74036O75119K22279K43020
43847B627094M28494n09080k149029k203787j31393J463844O43784q91814p43056
43838a464943L13603O9527j031645p07281J015445J707605O00977l36906j746
43829A64636N9280j244285k122127n95502K021268K675955R29695n59036n2121
43820A277763R31669L78221q44068m24875J298018J338422j235834l187781j553895
43811b022360J797260K741040P61783j005938j069816j175842k143907j986714
$$ plain form
43874 550663 -253376 966620 2525740 2777838 1908649 1131836 1022725 1176243 1046561
43865 1046561 576036 58201 -225029 -76965 594213 1446802 1582109 383611 -1437251
43856 -1437251 -2333042 -1719621 -557718 183919 712640 1486676 2161795 2384074 2627094
43847 2627094 3055588 2546508 397479 -1806308 -1937701 -473857 169927 -721887 -1464943
43838 -1464943 -1151340 -1081813 -2113458 -2820739 -1805294 -97689 503288 166382 164636
43829 164636 223916 -1020369 -3142496 -3737998 -1716730 959225 1888920 1329884 1277763
43820 1277763 2209432 2587653 1743585 1318710 2616728 3955150 2719316 -468465 -2022360
43811 -2022360 -225100 2515940 3277723 2271785 1201969 26127 -2117780 -4104494
43803d104494K25897K079178J665684P56935J437015K221828P76546j616036j970970
43794A471583n75850k52351j407053j636974j78234R03791M79025K8239O20562
43785e47262J044933J90755r68638j033850j03595R27216J506891J204780j36410
43776B084820j485269j388300j02911O01627J11980l19394O9496M33999K14290
43767B20338J83353O97805P44672j59875p77817r5706R42244R04276r1325r65593
43757A602372j267237j102267m38614M78977Q28134K26315o39774j027192r72059
43748b311345o54884J4606O62862N06849k11515j09900J219493K231218J522283
43739B869667k03853j262590j091521k79909N62800J013845P31413k1872m78021
$$ plain form
43803 -4104494 -3878597 -1799419 -133735 623200 2060215 4282043 5058589 3442553 1471583
43794 1471583 895733 643382 -763671 -2400645 -2578879 -1675088 -1196063 -1167824 -547262
43785 -547262 497671 688426 -280212 -1314062 -1417657 -490441 1016450 2221230 2084820
43776 2084820 599551 -788749 -891660 -290033 -178053 -497447 -427951 6048 220338
43767 220338 403691 1101496 1846168 1686293 908476 812770 1755014 2659290 2567965 1602372
43757 1602372 335135 -767132 -1205746 -726769 101365 327680 -312094 -1339286 -2311345
43748 -2311345 -2966229 -2951623 -2288761 -1781912 -1993427 -2103327 -883834 1347384 2869667
43739 2869667 2665814 1403224 311703 31794 594594 1608439 2339852 2317980 1839959
43730A839959n07574o98581r50813m33063N21327L01258j221943j790132j05203
43721c044765J816091J603198J59555r7992P06898M98286q12462j089524K06915
43712e3800R13202k81342j664136j217778M10053J244877R35856O34534O94487
43703A615953K79350p86038j329545o04444K98487j33191j424787j456364M41286
43694c099293K091042J349483o51937j034804N16017J391181L33068o43014R4113
43685C45856Q44663m01035k085510j321762J199801J986746J40717j470202r47932
43676a708658K5545l92542j104517m01475Q50788P68690k72852l95545N63537
43667b067029R46474R0498q86182j154696j088908q35253J57722J565285J871168
$$ plain form
43730 1839959 1332385 633804 -317009 -750072 -228745 72513 -1149430 -2939562 -3044765
43721 -3044765 -1228674 374524 534079 436087 1142985 1641271 828809 -260715 -53800
43712 -53800 859402 578060 -1086076 -2303854 -1893801 -648924 286932 921466 1615953
43703 1615953 1895303 1109265 -220280 -824724 -526237 -659428 -2084215 -3540579 -3099293
43694 -3099293 -1008251 341232 -310705 -1345509 -829492 561689 894757 251743 345856
43685 345856 1190519 789484 -1296026 -2617788 -1417987 568759 709476 -760726 -1708658
43676 -1708658 -1683113 -2075655 -3180172 -3581647 -2730859 -1962169 -2235021 -2630566 -2067029
43667 -2067029 -1120555 -1030057 -1916239 -3070935 -4159843 -4995096 -4837374 -3272089 -1400921
43658a400921O05054n72078k52199N28903Q0025r55284m78461J505286K473588
43649A533913J033719j039769j473543n10656J97325L30894O66222J000152M31686
43640B169943o15563p49478l0835M5620o63102l92252J397420K441538P83224
43631D386515k129854l320334k210889p52667k27653P4909R56348J808967J595302
43622A80644L09187j069274j558476r13707K18344Q57959O98770L72705M47518
43613d56330O06064K92489k85948m24884R3714P70670Q86615R032j461558k101141
43603b071277p51637J614386K470158Q67994j204964j514605l33996O88941J053939
43594H18939J130974N29749j166703k720472k416231o10323Q23064J264062J541193
$$ plain form
43658 -1400921 -795867 -1367945 -1620144 -1091241 -1011216 -1966500 -2444961 -939675 1533913
43649 1533913 2567632 1527863 54320 -456336 -259011 71883 738105 1738257 2169943
43640 2169943 1554380 804902 774067 819687 156585 -235667 1161753 3603291 4386515
43631 4386515 2256661 -1063673 -3274562 -4027229 -4254882 -4179973 -3223625 -1414658 180644
43622 180644 489831 -579443 -2137919 -3051626 -2833282 -1975323 -1276553 -903848 -456330
43613 -456330 149734 442223 156275 -268609 -174895 595775 1482390 1491422 29864 -2071277
43603 -2071277 -2822914 -1208528 1261630 2129624 924660 -589945 -923941 -235000 818939
43594 818939 1949913 2479662 1312959 -1407513 -3823744 -4434067 -3611003 -2346941 -805748
43585h05748J655162O68347r96794j535635o01616J6134o51706j166368j28806
43576c547030J530319J974505Q99288n39642j214836o64434P22740J597953Q99804
43567A658667l86769j96425J444377K074594M72182j331571j098972L29581N89858
43558C555522o77980j749701j449089j93522J027395J382884M95057q99501j323052
43549A68013n28395q028n15159o15694P28295J794093O19875j378984j149512
43540h85496J206244K360292O68399j614236j802468j44996J379381J771276J247228
43531D185624J33243j171227j888632j488207k54547J062318J635129P70863j213912
43522A770652k492988j557209M31550Q55892n03168r22141J068577L107006K317416
$$ plain form
43585 -805748 849414 1517761 520967 -1014668 -1616284 -1600150 -2251856 -3418224 -3547030
43576 -3547030 -2016711 -42206 857082 317440 -897396 -1561830 -839090 758863 1658667
43567 1658667 1271898 1075473 2519850 4594444 5066626 3735055 2636083 2965664 3555522
43558 3555522 2877542 1127841 -321248 -514770 512625 1895509 2390566 1491065 168013
43549 168013 -360382 -368410 -883569 -1499263 -770968 1023125 1643000 264016 -885496
43540 -885496 320748 2681040 3349439 1735203 -67265 -212261 1167120 2938396 4185624
43531 4185624 4318867 3147640 1259008 -229199 -483746 578572 2213701 2984564 1770652
43522 1770652 -722336 -2279545 -1847995 -992103 -1495271 -2417412 -1348835 1758171 4075587
43513D075587m55523j919264r08994N80945O59811l07128j090671j312660j077555
43504a755452l02996O70920Q19937k04902j131885n58883R67104J502229L49230
43495C55302j022290j157360o01880o82043j122416m97188J092407J670174L58711
43486a606583j041152o98561N03782O24682j16153m4277P00043K67565j416208
43477b826862j980272k75933J679047J733303N47355l5512K18085N26766R33961
43468E19938J579975J410690k50162j824737j404198J96749O19934l53256q00517
43459c05584j18307J77100o10913j182908o99164q7878r865K77950R34025N80389
43449a045155j195631k337868j120166J104163J860936J014455K85591L00842
$$ plain form
43513 4075587 3620064 1700800 791806 1372751 2032562 1725434 634763 -677897 -1755452
43504 -1755452 -2058448 -1387528 -567591 -772493 -1904378 -2463261 -1496157 6072 355302
43495 355302 -666988 -1824348 -2426228 -3108271 -4230687 -4727875 -3635468 -1965294 -1606583
43486 -1606583 -2647735 -3346296 -2842514 -2217832 -2333985 -2378262 -1678219 -1410654 -2826862
43477 -2826862 -4807134 -5083067 -3404020 -1670717 -1123362 -1158874 -940789 -414023 519938
43468 519938 2099913 3510603 3260441 1435704 31506 228255 848189 494933 -305584
43459 -305584 -423891 -246791 -857704 -2040612 -2739776 -2827654 -2837519 -2559569 -1625544 -1045155
43449 -1045155 -2240786 -4578654 -5698820 -4594657 -2733721 -1719266 -1433675 -1132833
43441a132833K39441j42885j91331J29038J63778l5409J98399P17716O93268J21681
43431G60863k36658l46076p91604j192761m05518J397057K456144J773788L32606
43422C747841n98890j042377j497690j791955j612475j239462r15068k37220J077462
43413d109834K433003K948962K333900Q88084p15166j529225j126785m42434p41916
43404f1411j617193j410876N8093R35454K34256n59086j8543Q50764N04089l74198
43394a458651j42183P88589O09409o64313j015691M02212K010623K183658J152351
43385C866004k7706q85639j211311o12522P27171J678416J297467j29017j525593
43376C177270k079789j727121j038281o19260l27888M60668J405268J074867o66236
$$ plain form
43441 -1132833 -893392 -1036277 -1227608 -1098570 -934792 -970201 -771802 -54086 639182 760863
43431 760863 524205 178129 -613475 -1806236 -2211754 -814697 1641447 3415235 3747841
43422 3747841 3148951 2106574 608884 -1183071 -2795546 -4035008 -4950076 -5187296 -4109834
43413 -4109834 -1676831 1272131 3606031 4494115 3778949 2249724 1122939 680505 -61411
43404 -61411 -1678604 -3089480 -3031387 -2095933 -1861677 -2420763 -2439306 -1588542 -1084453 -1458651
43394 -1458651 -1600834 -812245 -202836 -867149 -1882840 -1480628 529995 2713653 3866004
43385 3866004 3838298 2952659 1741348 1128826 1855997 3534413 4831880 4702863 3177270
43376 3177270 1097481 -629640 -1667921 -2287181 -2615069 -2154401 -749133 325734 -340502
43367c40502j441250M96482K873556J914187j937925l962563j606791K068005
43359a936801K987062J380172J43034L2539m74130j618661j772247l89717R68680
43350f80069J047842M28980R4394K6116j10042j44822j245j75017q97988j448414
43340a860265r42404N06622J845621K133316J324934J38823p15114j107348j222824
43331A01361j004001m03634j1397m59968j090454m75100J202976J740842k2859
43322d22234k081711j803628M01294J862264J447530M35900j73777q61615j680838
43313b876815j400575L69083J887586J436320l41093j410888q49670N98219J744881
43304h42952J839883Q33454m24719p31593J12032J016542J095627O49216J70752
$$ plain form
43367 -340502 -1781752 -1285270 1588286 3502473 1564548 -2398015 -4004806 -1936801
43359 -1936801 1050261 2430433 2573467 2606006 2131876 513215 -1259032 -1648749 -680069
43350 -680069 367773 796753 891147 917263 807221 662399 661154 486137 -411851 -1860265
43340 -1860265 -2802669 -2296047 -450426 1682890 3007824 3146647 2431533 1324185 101361
43331 101361 -902640 -1306274 -1317671 -1777639 -2868093 -3343193 -2140217 -399375 -422234
43322 -422234 -2503945 -4307573 -3906279 -2044015 -596485 -160585 -334362 -1195977 -2876815
43313 -2876815 -4277390 -3908307 -2020721 -584401 -925494 -2336382 -3186052 -2587833 -842952
43304 -842952 996931 1830385 1405666 674073 786105 1802647 2898274 3547490 3718242
43295C718242n67364j605871k009183j117913K06506P65419P16947Q21908P70753
43286A699444j32242j179299j054910k15790l80082j428803j131115J124071K582018
43277a16708R00772j987213k199279O51223K902269J947546m66974j136445K03530
43268F98721J124908K88767r69056r69870m290N49715M47804O70378J495876J731657
43258E064610M22364j478786k087911r85586L41177N64742L4788k55939k69280
43249A350179n11377o73516l0784R31299P44028p84504j861789j098753M65981
43240a469236Q81228O2028l61648L45056J083939Q07369M462k89173K4984L38129
43230A427138L24568m5810r12856k090744k569702j394883Q95682K439955J961493
$$ plain form
43295 3718242 3150878 1545007 -464176 -1582089 -1375583 -610164 106783 928691 1699444
43286 1699444 1567202 387903 -667007 -882797 -1262879 -2691682 -3822797 -2698726 -116708
43277 -116708 784064 -1203149 -3402428 -2751205 151064 2098610 1631636 495191 698721
43268 698721 1823629 2112396 1143340 173470 169180 718895 1166699 1837077 3332953 5064610
43258 5064610 5486974 4008188 1920277 934691 1275868 1840610 1875398 1619459 1350179
43249 1350179 838802 165286 134502 1065801 1809829 1025325 -836464 -1935217 -1469236
43240 -1469236 -588008 -525980 -887628 -542572 541367 1348736 1353198 1064025 1089009 1427138
43230 1427138 1751706 1705896 793040 -1297704 -3867406 -5262289 -4366607 -1926652 34841
43221C4841J46036j125153p25135O87646J480751P71173o93021j392534o88981
43212a504377N95777J253696R92358M33967J16484m2510k93880n16096m17887
43203F17532r2864J6946k08366l07304J8308K00815n13065j725178k067566j040082
43193e100824K01651N41605N14349J139826J848889J164942o65300j468399j23301
43184a946562J710133J769814L9138j612820j850197q47447N87616J710222J887676
43175A447573J005452j21770n11159k37903k38861q31274j143189l72175Q85848
43166a17458J183390J11289r30592m04308J166386J647223K73476j010308k68937
43157A650161J397064J338842o31106j945281j161342K30330O62052P69036J354781
$$ plain form
43221 34841 180877 -944276 -1669411 -981765 498986 1270159 577138 -815396 -1504377
43212 -1504377 -908600 345096 1337454 1771421 1887905 1845395 1551515 1035419 617532
43203 617532 524668 541614 333248 25944 44252 245067 -267998 -1993176 -4060742 -5100824
43193 -5100824 -4899173 -4357568 -3843219 -2703393 -854504 310438 -354862 -1823261 -1946562
43184 -1946562 -236429 1533385 1572523 -40297 -1890494 -2737941 -2150325 -440103 1447573
43175 1447573 2453025 2331255 1820096 1582193 1343332 512058 -631131 -1003306 -117458
43166 -117458 1065932 1177221 246629 -157679 1008707 2655930 2929406 1919098 1650161
43157 1650161 3047225 4386067 3754961 1809680 648338 878668 1540720 2309756 3664537
43148C664537J254119o20295k682240k593107q19025J95501j76233l11676M48803
43139a639616P41664j99176j118761q20742Q6641M88793M24469N15357Q50014
43130f71357J274040J827738K126841J241253r00186k673857k326194j55787J597531
43121A340022J141177q94879k076754r04176J275748J799450K15979r62637J72824
43112A106754K005491J677934o67564k109908j131374O59998J271729P08874p6557
43103C445377p98815j390164j314239l82949O53316J065147Q91291L36146n40558
43094A964552j155917o55738O10032J076106J04590r87228p79734L87415J150814
43085A714892Q17649l46950j669730k290191j625918j34430J088528J661233J937176
$$ plain form
43148 3664537 4918656 4298361 1616121 -976986 -1796011 -1600510 -1776743 -2088419 -1639616
43139 -1639616 -897952 -1097128 -2215889 -3036631 -2949990 -2461197 -2036728 -1521371 -671357
43130 -671357 602683 2430421 4557262 5798515 4898329 2224472 -101722 -257509 1340022
43121 1340022 2481199 1586320 -490434 -1394610 -118862 1680588 1896567 933930 1106754
43112 1106754 3112245 4790179 4122615 2012707 881333 1541331 2813060 3521934 3445377
43103 3445377 2646562 1256398 -57841 -440790 212526 1277673 2168964 2505110 1964552
43094 1964552 808635 152897 762929 1839035 1943625 956397 176663 564078 1714892
43085 1714892 2532541 2185591 515861 -1774330 -3400248 -3534678 -2446150 -784917 1152259
43076A152259J702270L10774j601929k215408j013908L52612M99686J10605L58299
43067c44740R32694P79341k66936j526340k196041j469150P72304K851750K529553
43058B062435J05003j481626n67572J149623J584728J157211J093222R48723o1751
43049E989996j014861q40101m67051j107199j765984r45795L99791L27679o25644
43040d9169l31585J109618J383765k12788j661753j301111K23906J480398J797336
43031B438617R87380p28603k209409k250360j060611K59802J255630J806726J223989
43022A723161m55712j253629K82487K219165J642077o74159j242421O09434J742190
43013D592593L27541j541229j615737o96002l68210k94993K47152M08052n59244
$$ plain form
43076 1152259 2854529 3165303 1563374 -652034 -1665942 -1313330 -813644 -703039 -344740
43067 -344740 587954 1367295 1100359 -425981 -2622022 -4091172 -3318868 -467118 2062435
43058 2062435 2167438 685812 118240 1267863 2852591 4009802 5103024 6051747 5989996
43049 5989996 4975135 4135034 3667983 2560784 794800 -150995 248796 576475 -49169
43040 -49169 -380754 728864 2112629 1899841 238088 -1063023 -839117 641281 2438617
43031 2438617 3425997 2697394 487985 -1762375 -2822986 -2563184 -1307554 499172 1723161
43022 1723161 1267449 13820 296307 2515472 4157549 3483390 2240969 2850403 4592593
43013 4592593 4920134 3378905 1763168 1067166 698956 403963 651115 1059167 499923
43004D99923j473394j053298k0815M50326Q50617J937185K598931J337933r91433
42995D135975k081510j385934n12927n13909n13475N71468K131562K376592M70144
42986D677986k194989l177416j710554K55115N08642n12088o61535M53990R59491
42977a401358q0474j060285l94149J074181J493395N76844m73289p26611k23529
42968a215275M18208M80862j23396m28480L67249J410498J300692M35158L42957
42959B988473Q42130L23569r72730r04782O76319J216195r7906o26147R94754
42950D439875J878888m50976l482476l394506r25020M32733K86837J002055K519320
42941B306730K152461l79605j981528j054166L13954J66463n26718l25442J93916
$$ plain form
43004 499923 -973471 -2026769 -2047584 -1597258 -746641 1190544 3789475 5127408 4135975
42995 4135975 2054465 668531 155604 -358305 -871780 -300312 1831250 4207842 4677986
42986 4677986 2482997 -694419 -2404973 -2149858 -1641216 -2153304 -2814839 -2360849 -1401358
42977 -1401358 -1481832 -2542117 -2936266 -1862085 -368690 208154 -265135 -991746 -1215275
42968 -1215275 -797067 -316205 -439601 -868081 -500832 909666 2210358 2645516 2988473
42959 2988473 3830603 4154172 3181442 2276660 2952979 4169174 4071268 3445121 4439875
42950 4439875 6318763 5867787 2385311 -1009195 -1934215 -1501482 -1214645 -212590 2306730
42941 2306730 4459191 4079586 2098058 1043892 1357846 1524309 997591 672149 866065
42932H66065O6693j58769K00221M65873K2400l02974K08392N51817m66587k013842
42922e60711k147418n39116J058045J090451K8257m32064L81198J176465L90274
42913D45381j466918k175847q13015Q97383J122359M96254P05425J599395J620728
42904B431145M88468n18675o87049m84216k76401j18868m78458j399104j468919
42895b512077K88076K034752J210276j261413j817589M34382K375501J656016
42887B407924k44858j034700p90229m29942L25457J424198J298885m95833j579514
42878H81388j92156J567330Q04851j435534j753945K33829J543127O54805o11269
42869A692426n74245q2261l38204p49652l63082L59957O42073Q66997J496952
$$ plain form
42932 866065 932758 773989 974210 1440083 1462483 1159509 1367901 1919718 1453131 -560711
42922 -560711 -2708129 -3247245 -2189200 -1098749 -1070492 -1502556 -1121358 55107 445381
42913 445381 -1021537 -3197384 -4010399 -3113016 -1990657 -1494403 -788978 810417 2431145
42904 2431145 2919613 2400938 1713889 1229673 953272 834404 355946 -1043158 -2512077
42895 -2512077 -2224001 -189249 1021027 -240386 -2057975 -1623593 751908 2407924
42887 2407924 2163066 1128366 338137 -91805 233652 1657850 2956735 2460902 881388
42878 881388 689232 2256562 3061413 1625879 -128066 105763 1648890 2303695 1692426
42869 1692426 1118181 1035920 697716 -51936 -415018 -55061 587012 1454009 2950961
42860B950961J582307o1546k689836m039732k890804l23814J573042J632902L49847
42851a916673p16158l13619J243852K257000J493282k93943j232295n93809N17822
42842D45459Q05000K49426m45770j023571j469787j300542k14665Q33157N40892
42833a580401o91438j018490J64408J261588R35892J804l31439o23184j804714
42824c685974k745691j555281J088322K335230J136748m02185k84087Q27470J355478
42815a929970J296498J484734J650872Q66743o82210j749598j643741q57250k36498
42806a800420j42723k61607P1317J016118J648125R75422l77489o37172N57461
42797A049032J352679K70170j577831k031232p67605O53297J075236P71151M13263
$$ plain form
42860 2950961 4533268 4471722 1781886 -2257846 -5148650 -5472464 -3899422 -2266520 -1916673
42851 -1916673 -2632831 -2946450 -1702598 554402 2047684 1753741 521446 -72363 445459
42842 445459 1250459 1499885 1054115 30544 -1439243 -2739785 -2954450 -2121293 -1580401
42833 -1580401 -2271839 -3290329 -3125921 -1864333 -928441 -926637 -1258076 -1881260 -3685974
42824 -3685974 -6431665 -7986946 -6898624 -4563394 -3426646 -3828831 -4112918 -3285448 -1929970
42815 -1929970 -633472 851262 2502134 3368877 2686667 937069 -706672 -1563922 -1800420
42806 -1800420 -1943143 -2204750 -2133433 -1117315 530810 1506232 1128743 491571 1049032
42797 1049032 2401711 2671881 1094050 -937182 -1704787 -1051490 23746 794897 1208160
42788A208160J89299K7116j04255k46780l69875l14039j07438n4983k47844l97147
42778d17786l76866l55248j82381N37383J434538J433492L68844m98625k83849
42769A659502K99939L76348L41127O65541M69569j052312k627934k218807L0509
42760b056518J922773K143635J384954N64281l17001j222469j575076j250477
42752d05898q30874m54956L38702J229945R92840n53135j761250j238834L43216
42743b340244J441965J635225J372483P03928l77478r87522k75528R72319J136241
42734C281389J17944o22068n30674p44410j767230k146381q03060P91056O83571
42725a739863k98345K57807K221172K699824N13789j780419j718707m33213l09015
$$ plain form
42788 1208160 1397459 1424575 1320320 1073540 703665 389626 282188 227205 -20639 -417786
42778 -417786 -794652 -1149900 -1332281 -794898 639640 2073132 2441976 1943351 1659502
42769 1659502 1959441 2335789 2676916 3342457 3812026 2759714 131780 -2087027 -2056518
42760 -2056518 -133745 2009890 3394844 3959125 3642124 2419655 844579 -405898
42752 -405898 -1236772 -1691728 -1353026 -123081 869759 316624 -1444626 -2683460 -2340244
42743 -2340244 -898279 736946 2109429 2813357 2435879 1448357 1172829 2145148 3281389
42734 3281389 3399333 2777265 2246591 1502181 -265049 -2411430 -3214490 -2423434 -1739863
42725 -1739863 -2038208 -1780401 440771 3140595 3654384 1873965 155258 -277955 -586970
42716e86970j078721q51938K77813N79049j7489P1753R25282R12497j09428l32912
42706b11064O50349R61421j24136p56941Q5109O31585m33371j471383q55095R0811
42696a432715k84331p24272M73878J789733Q41479j082363q23475J146782J281937
42687A186653r76128k010735O0412K232613J322703j294214k123285n86591R10529
42678a278043P41410l18517p44529K393J192205J466607J73639j550211j840771
42669b155817n57442M89655K14831k76221K70870J177423J067244J32249k67298
42660I5494L20845J037441J082634M69511m02208j109760j278296r07960m95756
42651a188055m03620l60468O126M51913L98505k25101q01682p01785k6850L94104
$$ plain form
42716 -586970 -1665691 -2517629 -2239816 -1660767 -1678256 -1606503 -681221 231276 121848 -211064
42706 -211064 439285 1400706 1276570 519629 604738 1236323 802952 -668431 -1523526 -1432715
42696 -1432715 -1717046 -2441318 -1967440 -177707 663772 -418591 -1242066 -95284 1186653
42687 1186653 210525 -1800210 -1739798 492815 1815518 521304 -1601981 -2188572 -1278043
42678 -1278043 -536633 -855150 -1599679 -1597286 -405081 1061526 1235165 -315046 -2155817
42669 -2155817 -2713259 -2223604 -2008773 -2284994 -2014124 -836701 230543 362792 95494
42660 95494 416339 1453780 2536414 3005925 2603717 1493957 215661 -692299 -1188055
42651 -1188055 -1591675 -1952143 -1946017 -1494104 -1095599 -1320700 -2122382 -2824167 -2851017 -2456913
42641b456913k3173o38461j91431J304425K160408J263715k30802o50015k91183
42632B46570m81432r47536l57558Q44352P23928p51327j262793Q3186J131583
42623g71027K30128r73121k28666J697179K329351J106686m75050j388986j651684
42614a25190j109712K36242J134007L34193j257808j578741m72785J51688o00942
42605c289048j282874m62629J152723J849929J110803j60182r13733p54391J03174
42596b646228J109381J735141J745779J092359j70659j496127j825965p29060
42588a185379O99733R86052K25523j38320M08005N86389o37232k149310j939386
42579c143925J14967J898871J725631L71042k37386L34814Q23193N05486K24801
$$ plain form
42641 -2456913 -2480086 -3118547 -3309978 -2005553 154855 1418570 1187768 537753 246570
42632 246570 -234862 -1182398 -1539956 -695604 28324 -723003 -1985796 -1902610 -771027
42623 -771027 -540899 -1514020 -1742686 -45507 2283844 3390530 2915480 1526494 -125190
42614 -125190 -1234902 -998660 135347 469540 -788268 -2367009 -2839794 -2688106 -3289048
42605 -3289048 -4571922 -5034551 -3881828 -2031899 -921096 -1081278 -1995011 -2749402 -2646228
42596 -2646228 -1536847 198294 1944073 3036432 2865773 1369646 -456319 -1185379
42588 -1185379 -485646 500406 725929 587609 995614 1582003 944771 -1204539 -3143925
42579 -3143925 -3028958 -1130087 595544 966586 729200 1064014 1887207 2392693 2617494
42570B617494O61213R40582J13231j015514j077232m67248o38234j420902j189174
42561a475784J81632Q42740J13812k69021P22876J337558J610j596256r07490
42552a048323J276949J891287L48596o92404L80007J747094J135175q85653k077022
42543B075706j693258q90709o25537n95848k42111K86046N32777N29892P12929
42534H9887J190853J509667J273402O81202J44471l46535r76062j440389j236408
42525H90088n67647j85200k57860k21903J21867K72529J2383k01896r2632J19991
42515a10280M15739Q93917Q88859l99082k104300k213917m49149J156815J296298
42506f25100J000370J193620R08106m36303j165156M6004J516663R53820r62911
$$ plain form
42570 2617494 3278707 4219289 4332520 3317006 2239774 1772526 1134292 -286610 -1475784
42561 -1475784 -1294152 -451412 -337600 -606621 116255 1453813 1455423 -140833 -1048323
42552 -1048323 228626 2119913 2468509 1776105 2156112 3903206 5038381 4152728 2075706
42543 2075706 382448 -508261 -1133798 -1729646 -1971757 -1685711 -1152934 -623042 89887
42534 89887 1280740 2790407 4063809 4745011 4889482 4542947 3566885 2126496 890088
42525 890088 322441 137241 -120619 -342522 -220655 51874 64257 -137639 -230271 -110280
42515 -110280 305459 1199376 2088235 1689153 -415147 -2629064 -3078213 -1921398 -625100
42506 -625100 375270 1568890 2476996 2040693 875537 921541 2438204 3392024 2429113
42497B429113j870092j292775m10407M45793J350349J138231p58428k013113l40391
42488a321720K281955K142665j98766q06361R28753J365535q52178k340072q48384
42479C51427J060107P67888j47014M34675R79406n08163k138839j121656J148428
42470H26259J239993o25094j284825j03814M96708l13512o55708J92293N39353
42461C11653k77140m96669Q33911K075236J790199Q64759M39000M027q51193r15303
42451C778480M89248J583162N82293j220808j255095K35023N48141j078408k136265
42442A525771p93549J144240R35641r91801j828499n97006P37878N20328m11449
42433B41554o16597k63267j44384J2272O37806R16904J07933p01515j93604O48236
$$ plain form
42497 2429113 559021 -733754 -1144161 -698368 651981 1790212 1031784 -981329 -1321720
42488 -1321720 960235 3102900 2904134 2097773 3026526 4392061 3539883 1199811 351427
42479 351427 1411534 2179422 2032408 2467083 3446489 2938326 799487 -322169 826259
42470 826259 2066252 1441158 156333 52519 549227 235715 -419993 -227700 311653
42461 311653 34513 -462156 371755 2446991 4237190 5101949 5540949 5544976 4693783 3778480
42451 3778480 4267728 5850890 6433183 5212375 3957280 4192303 4740444 3662036 1525771
42442 1525771 732222 1876462 2812103 1820302 -8197 -605203 132675 653003 241554
42433 241554 -375043 -638310 -782694 -770422 -132616 784288 892221 190706 -2898 645338
42423F45338n918j421066j165136P04105J469286L05752l10394R96527J976028
42414C194522O66651j118147r06545K63345p8354j429451j389899O2507Q05724
42405G0353L98960L04556O13716l8827j204071p31496J221338J696259l11663
42396B019125j795159l37494J940085J572762r92203k196705n74868J562897J747379
42387B945819M69811j29545O56280J473358R81136m14676j286106j150522q93417
42378B652138j164341j370992q99922l56349m87606o67697R9601J213826J210592
42369B29250K08477k28706K86117M70433r8965n3581J231397K075917R15669j135447
42359C900561j802994q31054K4663k29757o06636J63663J761246K539340J360107
$$ plain form
42423 645338 639420 -781646 -1946782 -1242677 226609 532361 221967 1218494 3194522
42414 3194522 3861173 2743026 1836481 2099826 2021472 592021 -797878 -735371 70353
42405 70353 469313 773869 1387585 1348758 144687 -586809 634529 2330788 2019125
42396 2019125 223966 -113528 1826557 3399319 2407116 210411 -364457 1198440 2945819
42387 2945819 3415630 3286085 3942365 5415723 6396859 5982183 4696077 3545555 2652138
42378 2652138 1487797 116805 -783117 -1139466 -1627072 -2294769 -2195168 -981342 229250
42369 229250 437727 209021 495138 965571 866606 813025 2044422 4120339 5036008 3900561
42359 3900561 2097567 1266513 1291176 1061419 454783 618446 2379692 4919032 6279139
42350F279139r71941k252619j241818O83917J052881n36558j923871j404205Q6074
42341b29001O63919K07222K5390N06685O47759q1708p52860l83925N25600O71683
42331A800764j38229o45068n1874N25288m00484k013007j754498Q76384K934346
42322A133622J909140o21287j424121m19826r5037p57748m8667K308931L065655
42313E050662M67375k534033k534326n23815L58919j98773k29793M31966J68663
42304D56845q89046p54983Q40780J783615J031257J01375K80252O60797P0331
42295C581223q97295r78069m5117J125560J811545J420951k35544k125611k546118
42286A111525j098965Q03249J709001J336930n6276j963811k953048j528640J498599
$$ plain form
42350 6279139 5307198 3054579 1812761 2496678 3549559 3013001 1089130 -315075 -229001
42341 -229001 434918 642140 667530 1174215 1821974 1740266 987406 603481 1129081 1800764
42331 1800764 1662535 1017467 965593 1490881 1090397 -922610 -2677108 -1800724 1133622
42322 1133622 3042762 2421475 997354 577528 482491 -275257 -323924 1985007 5050662
42313 5050662 5518037 2984004 449678 -74137 284782 86009 -143784 288182 456845
42304 456845 -432201 -1187184 -346404 1437211 2468468 2569843 2850095 3510892 3581223
42295 3581223 2683928 1705859 1660742 2786302 4597847 6018798 5783254 3657643 1111525
42286 1111525 12560 815809 2524810 3861740 3805464 1841653 -1111395 -2640035 -1141436
42277a141436L184452K059880J2176o43896l33451p52371j608522j103313Q54791
42268E28310K108281J167186r05605j989380j272968K58667J089046O99047L9594
42259A722178K47740Q87591M48762j025208j350991N38311K304766J242045j480386
42250C534808k252214l00967J413650R48285m0098K67626O43864p51626k760083
42241G03245k743605o73830R01547O47060r7160K30243J376871K075126J510927
42232C930424k10627j940713j974088L3369J926445J442113n50055j223827j07839
42223A325202L50632r42168j762181l46020J472600J137702o21450j269687n22115
42214a177485j01170l26982J14258J291690J749911J265994J253123J949479J699764
$$ plain form
42277 -1141436 2043016 4102896 4115072 3471176 3137725 2385354 776832 -326481 528310
42268 528310 2636591 3803777 2898172 908792 -364176 -105509 983537 1682584 1722178
42259 1722178 1969918 2857509 3306271 2281063 930072 1468383 3773149 5015194 3534808
42250 3534808 1282594 981627 2395277 3343562 3303464 3571090 4214954 3463328 703245
42241 703245 -2040360 -2714190 -1812643 -1165583 -1262743 -1032500 344371 2419497 3930424
42232 3930424 3719797 1779084 -195004 -161635 1764810 3206923 2656868 1433041 1325202
42223 1325202 1675834 733666 -1028515 -1374535 98065 1235767 614317 -655370 -1177485
42214 -1177485 -1278655 -1605637 -1491379 -199689 1550222 2816216 4069339 6018818 7718582
42205G718582j66301j987402k299137j733882j355126r52837j53045M75425O21953
42196A68230R61221J536069J097953o22492j705251p00575J062252J553208R13250
42187D263865L09066n67986k406698l765428k451526Q98318L144023K660502R08455
42178B992591j58406k35789J14325N54083P19934K57484m90076q61986r01896
42169A990264r08338m01017R85922K072302J437809j76487p97446k98990k80268
42160C623751r71253q66556K44263N95742m71145j347399j024199n48887m97412
42151a263095K98190J979203K331436K57999j853391j580443j26637L4935p90950
42142g12753p44445n6888k41187p38111K51631K092819K171311O0490j748501
$$ plain form
42205 7718582 7552281 5564879 3265742 1531860 176734 -776103 -929148 -453723 168230
42196 168230 1129451 2665520 3763473 3140981 1435730 735155 1797407 3350615 4263865
42187 4263865 4572931 4004945 1598247 -2167181 -4618707 -3720389 -576366 2084136 2992591
42178 2992591 2834185 2598396 2712721 3266804 3986738 4244222 3754146 2892160 1990264
42169 1990264 1081926 680909 1666831 3739133 5176942 5000455 4203009 3904019 3623751
42160 3623751 2652498 1785942 2030205 2625947 2154802 807403 -216796 -765683 -1263095
42151 -1263095 -964905 1014298 3345734 3603733 1750342 169899 43262 78197 -712753
42142 -712753 -1457198 -1514086 -1755273 -2493384 -2241753 -148934 2022377 2082867 334366
42133C34366j606745n12958K85475R46188J605259J579955Q31450L41572L75873
42124D180435J16667n43788p15228l84209n25331r20253j79192J384167J435427
42115C848695o42672k158516r31514J434938K060052P70496n50294j100858j327343
42106A402984j042767J93866J394458J094169k48808q21529l16347k39847j182381
42097B33798j677710m57425J546320K295686J002001j169960k342046j664599
42089b233935q8207P41147N28988N81273J533761K003885P72775p52190k83410
42080B804087J569155J669655j057895l698785l207988m13788J501227J304935
42072D70603N37964N55076Q06495M20128j55348k5130O07480P99169K73786m66557
$$ plain form
42133 334366 -1272379 -1785337 -1499862 -553674 1051585 2631540 3462990 3804562 4180435
42124 4180435 4297102 3753314 3038086 2653877 2128546 1208293 1029101 2413268 3848695
42115 3848695 3206023 1047507 115993 1550931 3610983 4381479 3831185 2730327 1402984
42106 1402984 360217 554083 1948541 3042710 2793902 1972373 1656026 1416179 233798
42097 233798 -1443912 -1901337 -355017 1940669 2942670 1772710 -569336 -2233935
42089 -2233935 -2322142 -1580995 -1052007 -470734 1063027 3066912 3839687 3087497 2804087
42080 2804087 4373242 6042897 4985002 1286217 -1921771 -2335559 -834332 470603
42072 470603 1008567 1563643 2370138 2790266 2634918 2609788 3217268 4016437 4290223 3823666
42062C823666j131614j717354j670172k19960K004025K849155J084154j793995
42054C227905l256780k651766j235007J03764J489485K584795K357741Q46149
42046C466286m21104m96898j78246l86633p51949o81441n27767o81681o85630
42037a345063k29283J81652M56290J327923K465257K010364m19699k184381j211834
42028A051226O50974N36981q02371n71339R72857R12647j057724j836629j24679
42019b68057J410900O70208n79326j3932J414222J404759P8588o09921L3926R62059
42009D503426J132125K92609j116127j887860j047390L91726L19488j130060j350846
42000A07091N52233J970996R00226q38973q29786N987l55535j043007Q161J927698
$$ plain form
42062 3823666 2692052 974698 -695474 -915434 1088591 3937746 5021900 3227905
42054 3227905 -28875 -2680641 -3915648 -3811884 -2322399 262396 2620137 3466286
42046 3466286 3045182 2548284 2370038 1983405 1231456 550015 22248 -659433 -1345063
42037 -1345063 -1574346 -1392694 -936404 391519 2856776 4867140 4447441 2263060 1051226
42028 1051226 1702200 2239181 1436810 865471 1838328 2750975 1693251 -143378 -268057
42019 -268057 1142843 1813051 1233725 1219793 2634015 4038774 4117362 3507441 3541367 4503426
42009 4503426 5635551 5928160 4812033 2924173 1876783 2268509 2587997 1457937 107091
42000 107091 659324 2630320 3530546 2691573 1861787 1867774 1512239 469232 477393 2405091
41990B405091K146843P57252J4043J71348m93407j835869j801422l29471L74599
41981A409007j47121J6183J110444Q71574j117356j994461l27021J227835K51274
41972A300358j525207j321589K53625Q35346L52538L33213O01583j76667j453746
41963h00546j277671M21214J569545J039320j29531p34267p58324m68155J91461
41954i46954R06152R84877M09988p7002j20944j24827l91719o77981o69827k96816
41944a005053L64356R90537J037195L53209n15133r94222r63540k87477J244460
41935B24332K959039L327034J838648p1297r16286r86906j208409j313522o68858
41926C183775K9647k78095r51572m96261P87448J010117k95839j279459m93550
$$ plain form
41990 2405091 4551934 5309186 5323229 5494577 5001170 3165301 1363879 1034408 1409007
41981 1409007 1261886 1278069 2388513 3260087 2142731 148270 -178751 1049084 1300358
41972 1300358 -224849 -1546438 -1292813 -457467 -104929 228284 829867 653200 -800546
41963 -800546 -2078217 -1657003 -87458 951862 822331 88064 -670260 -1138415 -946954
41954 -946954 -40802 944075 1354063 1277061 1156117 1031290 639571 -38410 -708237 -1005053
41944 -1005053 -640697 349840 1387035 1740244 1225111 230889 -732651 -1020128 224332
41935 224332 3183371 6510405 8349053 8277756 7361470 6374564 5166155 3852633 3183775
41926 3183775 3213422 2935327 1983755 1487494 2274942 3285059 2989220 1709761 1216211
41917A216211J030197J325206J16296r81472m65780J362014K599895J678929p32489
41908G149007k219844j455774J53120M26241p44312j643581j238028j02083Q12148
41899A136894J043508N14529k52753j68566R51193J488854J23589j735181j548204
41890A553863N87648J943388J056871n77386j199472j012555q87992p92378n71006
41881A00981o33927p91844J6475J723411K452143J166069m80588m97965N13963
41872C568718N87306m12985p94585J37301J113196R03737j19897q17909p49308
41863C415574l79387k65859l39162m3151O85487R16767m1179j151423p03554R79857
41853C073970J536369l5237j688220j309721J74076M55898n75430j071679m07606
$$ plain form
41917 1216211 2246408 3571614 3687910 2706438 2240658 3602672 6202567 7881496 7149007
41908 7149007 4929163 3473389 3626509 4052750 3308438 1664857 426829 324746 1136894
41899 1136894 2180402 2694931 2442178 2273612 3224805 4713659 4837248 3102067 1553863
41890 1553863 2141511 4084899 5141770 4564384 3364912 2352357 1464365 671987 100981
41881 100981 -532946 -1324790 -1308315 415096 2867239 4033308 3552720 3054755 3568718
41872 3568718 4156024 3743039 2948454 3085755 4198951 5102688 4982791 4164882 3415574
41863 3415574 3036187 2770328 2431166 2388015 3073502 3990269 3949090 2797667 2094113 3073970
41853 3073970 4610339 4575102 2886882 1577161 1751237 2207135 1631705 560026 152420
41844A52420J66904L1404J55616J004250J351963K23295j276498j293484K46048
41835G61918J510315J048724n13984j274496k87903J287496J503264n6064j794638
41826B184632k060978q84079N91354J567773J798453J119578j87108j065736q00949
41817B262940j23697j46460n48250r6028J169025J704385O99481p38312j178432
41808C004652o46701j41521q9696j0008N91860J469020J721881O66697j132603
41799E433581k009786j021407O28969R13732l76182j455481j150672l43504k18973
41790D00277l66919K53328J344606J655168R72592L70922L82503J58041j022922
41781D147596k301485k149678m11659J329808J527530L39446p20593n71412K92878
$$ plain form
41844 152420 319324 350728 506344 1510594 2862557 3085852 1809354 515870 761918
41835 761918 2272233 3320957 2806973 1532477 1244574 2532070 4035334 3979270 2184632
41826 2184632 123654 -760425 -169071 1398702 3197155 4316733 4129625 3063889 2262940
41817 2262940 2139243 1992783 1444533 1348505 2517530 4221915 4921396 4183084 3004652
41808 3004652 2357951 2216430 2126734 2116726 2708586 4177606 5899487 6566184 5433581
41799 5433581 3423795 2402388 3031357 3945089 3568907 2113426 962754 619250 400277
41790 400277 33358 286686 1631292 3286460 4259052 4629974 5012477 5170518 4147596
41781 4147596 1846111 -303567 -715226 614582 2142112 2481558 1760965 1189553 1482431
41772A482431M86404n95090j963588k036846m26114J537931K293933J808121J321557
41763C908739J435866J311888J80722j207746j553793q82696l21823k62505k7311
41754B581341N84379Q02427L49545P4640M07322L83311p84496k126372k085073
41745A87024o28304R03814J529445J142476j28230j785965k525820j329500R37587
41736a697473K204034J660409N46454K56749O51814P09762J08576m71944l67214
41727C601167J77296K33668o49079j661076j558734k81094R75117J436929J489474
41718C763668J343506L46635j415602k226517r83550P53934P90195m75407r09286
41709I87576j12661L52164l8120j54569J43124n38050k185478k480405k50221
$$ plain form
41772 1482431 1968835 1373745 -589843 -2626689 -3052803 -1514872 779061 2587182 3908739
41763 3908739 5344605 6656493 6837215 5629469 4075676 3192980 2871157 2608652 2581341
41754 2581341 3165720 3968147 4317692 4392332 4799654 5182965 4398469 2272097 187024
41745 187024 -441280 462534 1991979 3134455 3006225 1220260 -1305560 -2635060 -1697473
41736 -1697473 506561 2166970 2713424 2970173 3621987 4331749 4440325 3968381 3601167
41727 3601167 3778463 4012131 3363052 1701976 143242 -137852 837265 2274194 3763668
41718 3763668 5107174 5453809 4038207 1811690 828140 1582074 2372269 1896862 987576
41709 987576 874915 1227079 1188959 1034390 1177514 639464 -1546014 -4026419 -4276640
41700d276640K361133K880726J838479J217435J137535L23667j115130j699847
41692B667358j037953k76872j20542n7734K97668N18012K83137j05791l47851
41683A819432l95275k8856R24610J879852J860747P28183o40421j414532j390271
41674C343469o54413M28431Q99410o3937j750238k170914l58885K164181K931715
41665D768819J318192q32129j382932k13956R28957O14327p56021j734218j618341
41656A092698r19623l09046J18588M16207L74557m4170l80043k45882J21598K79885
41646E04769K48995L64982O81155Q77208O75110J47859l19260l83479k22544m55868
41636B118927j195882j480853m03279J340117J998520R88234m25242r25999n80060
$$ plain form
41700 -4276640 -1915507 965219 2803698 4021133 5158668 5482335 4367205 2667358
41692 2667358 1629405 1352533 1231991 1174257 1471925 1989937 2273074 2167283 1819432
41683 1819432 1424157 1395301 2319911 4199763 6060510 6788693 6148272 4733740 3343469
41674 3343469 2689056 3117487 4016897 3952960 2202722 31808 -327077 1837104 4768819
41665 4768819 6087011 5254882 3871950 3657994 4586951 5201278 4445257 2711039 1092698
41656 1092698 173075 -135971 -17383 398824 773381 729211 349168 103286 224884 504769
41646 504769 753764 1118746 1799901 2677109 3352219 3500078 3180818 2797339 2574795 2118927
41636 2118927 923045 -557808 -961087 379030 2377550 3365784 2940542 2014543 1434483
41627A434483m1680N45282J099186J028092J03438p35710m36378O88740J349510
41618E034963Q65566k76364j154594j161513l51980M82145M27664m89336j248670
41609B127881j072089j79604Q07553J433883J252608J50837r17784p50562K27652
41600C080375L81412m18797m32680P40715R30420r36143k249065m35267K520198
41591C181168K590243k03281j862681n77026Q49469k21953k229049k076271L12046
41582b37335K245973J949378K15528j101887j017235m0962M90861o4538p51192
41573A688591k42715J173657J884933J182844l2114q15746j054648o79300L73753
41564C479255J118707K08546j787739k596406j446242j75796k06640m82518J77123
$$ plain form
41627 1434483 1392803 1938085 3037271 4065363 4168801 3433091 2996713 3685453 5034963
41618 5034963 5900529 5624165 4469571 3308058 2956078 3438223 3865887 3376551 2127881
41609 2127881 1055792 876188 1683741 3117624 4370232 4521069 3603285 2852723 3080375
41600 3080375 3461787 3042990 2610310 3351025 4281445 3345302 1096237 660970 3181168
41591 3181168 5771411 5568130 3705449 3128423 3977892 3755939 1526890 -549381 -237335
41582 -237335 2008638 3958016 4173544 3071657 2054422 2013460 2504321 2439783 1688591
41573 1688591 1445876 2619533 4504466 5687310 5655196 4839450 3784802 3105502 3479255
41564 3479255 4597962 4806508 3018769 422363 -1023879 -1199675 -1406315 -1888833 -1711710
41555a711710P53056P8622n24705P82369K836188K696432Q6059j991437j379157
41546A625717O63015J650770R10434l63145q26186p2255J107286J203999l67591
41537E532044k047922j778108K2340P45252o05230j740072m93300J688462J700664
41528C024130n82957k014081p13567J298190J138069q74018j926519p68041Q74836
41519e43958J097265L12437K7270L45180J58264o11472n71792R24824K358887
41510C496905J833798k62890j517658n20568J295534J471338l40935k015419j794935
41501A645170m63951N0991n03453n82081O01224J842456J799013Q46767J71243
41492E407379p7034n82547j391025j796986j437857n40035O46355J736170J909441
$$ plain form
41555 -1711710 -958654 -880032 -1404737 -622368 2213820 4910252 4996311 3004874 1625717
41546 1625717 2288732 3939502 4849936 4486791 3660605 3588350 4695636 5899635 5532044
41537 5532044 3484122 1706014 1728354 2473606 1868376 128304 -364996 1323466 3024130
41528 3024130 2441173 427092 -286475 1011715 2149784 1275766 -650753 -1418794 -543958
41519 -543958 553307 865744 893014 1238194 1396458 784986 213194 1138018 3496905
41510 3496905 5330703 5067813 3550155 3029587 4325121 5796459 5455524 3440105 1645170
41501 1645170 1181219 1232210 728757 146676 747900 2590356 4389369 5236136 5407379
41492 5407379 5330345 4747798 3356773 1559787 121930 -418105 228250 1964420 3873861
41483C873861Q29528m02465m15235M35623M95567p43830j927185j794548o49311
41474b97995M94439J136256J211592P38960L7877l99016n25109n78981l36476
41465A481547N31737J387246J120001r8062q05620l28830L71335L49190p2746
41456C935798k49917k40526k54056j19926J06947j6089m11569m28094l1389J30292
41446B421471J14835O62721J412485R31109p52141j545461l34611J202537J206695
41437E319640L21859Q3784J99502n31383j714663j867855p40994O50658J673263
41428C393811K145114J535564j78614j550333j311839l61187l64965j070456r38782
41419A298313J24516P69088N85441L80596K39646n38236j500515j169668N13785
$$ plain form
41483 3873861 4703389 4300924 3885689 4321312 4816879 4073049 2145864 351316 -297995
41474 -297995 196444 1332700 2544292 3283252 3321129 2922113 2397004 1818023 1481547
41465 1481547 2013284 3400530 4520531 4422469 3616849 3288019 3659354 4008544 3935798
41456 3935798 3685881 3445355 3191299 3071373 3178320 3162231 2750662 2322568 2291179 2421471
41446 2421471 2536306 3199027 4611512 5542621 4790480 3245019 2910408 4112945 5319640
41437 5319640 5641499 5725283 5924785 5393402 3678739 1810884 1069890 1720548 3393811
41428 3393811 5538925 7074489 6895875 5345542 4033703 3672516 3307551 2237095 1298313
41419 1298313 1422829 2191917 2777358 3157954 3397600 2859364 1358849 189181 702966
41410G02966J777096J542429O74648J91433j33141o74620q88725k21404Q42689
41401C813371J343713R02392o9015p34169m92669K24680K55772n82420r27243
41392C734412K1539R47964M49512n44687l74808L74585p877j016099o43599P95836
41382C736778P81271j073924k005515m59691J477098J507439M13795J12928N37786
41373E027965M42556k27678n95464l62132L17880J366879K127449J506935k08734
41364I395656j187181p15004k93139r00295j204823j84079N20870q03765k579060
41355B049180j881506J072314L024844K059908l37326j684526j132897N09009
41347C679000J877689J884162N21100r56598j308814n80548M05193J175239J523689
$$ plain form
41410 702966 2480062 4022491 4697139 4888572 4755431 4080811 3192086 2970682 3813371
41401 3813371 5157084 6059476 5990461 5256292 4763623 4988303 5244075 4661655 3734412
41392 3734412 3755951 4703915 5153427 4608740 4233932 4608517 4600640 3584541 2940942 3736778
41382 3736778 4518049 3444125 1438610 978919 2456017 3963456 4377251 4490179 5027965
41373 5027965 5470521 5242843 4647379 4285247 4603127 5970006 8097455 9604390 9395656
41364 9395656 8208475 7493471 7200332 6300037 5095214 4911135 5432005 4628240 2049180
41355 2049180 167674 1239988 4264832 6324740 5987414 4302888 3169991 3679000
41347 3679000 5556689 7440851 7961951 7005353 5696539 5115991 5521184 6696423 8220112
41338H220112J147272K89399j09721J18119k21555j634905k488275j229032R43068
41329E034482J558575L81261o13623m43724j95911p39278j246466n93558J031916
41320D173674K431741K520360J090474p76400j314601j1281J441062J185709l12530
41311A0428208j128744o94540q6305K03344Q16625J646208J351347m76856k209758
41302I849529k251294j129629m98481p88389q94808O5999J531944K183059J484475
41293I552405K42463m61497n93851q96841j422668j278538j28942J063751J400063
41284G476345J182256R80625O12679j6079j35837O32974J238836P58442P9709
41275A2809950N49066J802413K569148K821938L319789L760003L443986L223122
$$ plain form
41338 8220112 9367384 9656783 9547062 9665181 9443626 7808721 5320446 4091414 5034482
41329 5034482 6593057 6974318 6360695 5916971 5721060 4981782 3735316 3141758 4173674
41320 4173674 6605415 9125775 10216249 9439849 8125248 8113967 9555029 10740738 10428208
41311 10428208 9299464 8604924 8518619 8721963 9538588 11184796 12536143 12059287 9849529
41302 9849529 7598235 6468606 5970125 5181736 4286928 4352927 5884871 8067930 9552405
41293 9552405 9794868 9333371 8739520 7842679 6420011 5141473 5012531 6076282 7476345
41284 7476345 8658601 9639226 10251905 10235826 10099989 10732963 11971799 12730241 12809950
41275 12809950 13359016 15161429 17730577 20552515 23872304 27632307 31076293 34299415
41267C4299415M516588O713563Q023502Q884317J1667217J6094334J7509332J1590591
41259A19298859l45181j2073585j7907145j6838473j2199029q122962o172384
41252D5640100n139996l838451k878881k927735k787687j196219M97752k3901
41244B7344982k156533k841130j067196P59627N37960r02649j744576j528259
41236A8402226n89883Q20189J856210J385685n8350m20954R05089K084822J672404
41227B6057438N34279N2883L51625J176588K466011L186520J983219J2871M05828
41218C6227262L482662N493412M179856K584407M482547Q649034J1128664J1250717
41210H7478561J1644714J3581242J6118151J9177916K3682036K8650088L1499455
$$ plain form
41267 34299415 38816003 45529566 53553068 62437385 74104602 90198936 107708268 119298859
41259 119298859 118953678 106880093 88972948 72134475 59935446 51812484 45640100
41252 45640100 40500104 36661653 33782772 30855037 28067350 26871131 27368883 27344982
41244 27344982 25188449 22347319 21280123 22039750 22577710 21675061 19930485 18402226
41236 18402226 17812343 18632532 20488742 21874427 21816077 21395123 22300212 24385034 26057438
41227 26057438 26591717 26644600 26996225 28172813 30638824 33825344 35808563 35821434 36227262
41218 36227262 39709924 45203336 49383192 51967599 56450146 65099180 76227844 87478561
41210 87478561 99123275 112704517 128822668 148000584 171682620 200332708 231832163
41203B31832163L1341002K8838448K2812701J0791011n958196k1276949k9859437
41196B68520743l1897029l0627892k7796554k3641588j9323743j6465316j4832650
41189A03935971j2755913r892208p807962p460969p588216o478166m435834l243608
41181D4273095l350048k991029q14113J765049K286369P71244l05777M25428J729829
41172D3790047K319821K698120L330285L171427J818606J275964L268585O075919
41164F7748774O436509L766637K48246k488799m418270n513124n622301n648174
41156E4509498o453339o848375n106496k244906j095611k062734k658016j672612
41148B6367409q85881j711942k898150k907820k236797j841486j287430p9530
$$ plain form
41203 231832163 263173165 292011613 314824314 325615325 319657129 298380180 268520743
41196 268520743 236623714 205995822 178199268 154557680 135233937 118768621 103935971
41189 103935971 91180058 81287850 73479888 66018919 58430703 51952537 47516703 44273095
41181 44273095 40923047 37932018 37117905 38882954 41169323 41940567 41634790 42060218 43790047
41172 43790047 46109868 48807988 52138273 55309700 57128306 58404270 61672855 67748774
41164 67748774 74185283 77951920 78200166 75711367 71293097 65779973 60157672 54509498
41156 54509498 48056159 41207784 36101288 33856382 32760771 30698037 28040021 26367409
41148 26367409 25481528 23769586 20871436 17963616 15726819 13885333 12597903 12518373
41140A2518373Q52842O12358q3489k13300j21625n50747j150016j246990j097168
41131I520238j158231j025374k07847Q13484J245568R98612M00566k62603m90781
41122I833632L5897M43834n19966k206020k350022l98445J351375J026409l14230
41113F902464q25270o23198o31206m29585N94872J332043N33647o27865K2938
41104F248840K181820L250041J898093m66975j855264j733553q17710q8191o2576
41095H554525k34350L64692J397709J140196p35434j823173l08598J802782J365835
41086A1524184r88627j724715J21280J693532J058134p3819L41412J489597J667880
41077A5108858J179044J144257J176505N01290Q9199J257972K963036K983038
$$ plain form
41140 12518373 13371215 13983573 13900084 13686784 13565159 13014412 11864396 10617406 9520238
41131 9520238 8362007 7336633 7128786 7942270 9187838 10186450 10587016 10324413 9833632
41122 9833632 9869529 10313363 9793397 7587377 5237355 4838910 6190285 7216694 6902464
41113 6902464 6077194 5453996 4822790 4393205 4988077 6320120 6853767 6225902 6248840
41104 6248840 8430660 11680701 13578794 13111819 11256555 9523002 8705292 8617101 8554525
41095 8554525 8320175 8684867 10082576 11222772 10487338 8664165 8355567 10158349 11524184
41086 11524184 10535557 8810842 8932122 10625654 11683788 11609969 11951381 13440978 15108858
41077 15108858 16287902 17432159 18608664 19109954 19199153 20457125 23420161 26403199
41069B6403199J538225J214650K921140M302264L251890J031360J75512O10592
41061D1448832M9006k137029l742472l072404j544333j513098k731531k890332
41053B3866639j272726J42995l76783j985908k752023k193658j200816l56755
41045A3870965L80423Q27083O14875o4782o34127q89383q97409m73293M25397
41036A3159749J090952P76463j02343l13348O42603J961785K441922J466715n95477
41027B0529021k369370k287428k64976J766055J893072N23149k89700M43064J699508
41018B1642395K134298J570756O49659J230N2153Q09245J515908J222138j5273
41009B9582509j089596j214350p71334n64883p31498o93727M1415J207536J914399
$$ plain form
41069 26403199 27941424 29156074 32077214 36379478 39631368 40662728 40838240 41448832
41061 41448832 41497838 39360809 35618337 32545933 31001600 29488502 26756971 23866639
41053 23866639 22593913 22736908 22360125 20374217 17622194 15428536 14227720 13870965
41045 13870965 14251388 15078471 15693346 15628564 14994437 14105054 13207645 12734352 13159749
41036 13159749 14250701 15027164 14924821 14611473 15254076 17215861 19657783 21124498 20529021
41027 20529021 18159651 15872223 15607247 17373302 19266374 19789523 19499823 19942887 21642395
41018 21642395 23776693 25347449 25997108 25998338 26050491 26859736 28375644 29597782 29582509
41009 29582509 28492913 27278563 26507229 25942346 25210848 24517121 24558536 25766072 27680471
41000B7680471J654428J123148J428640K371483K501667J389714O44622J632575
40992D0426748L267548L525751K346935J344502J172494J031150N56604K78289
40984E3950021R6812q22797k246033k661462j482528l0171K90723m53018j507758
40975D5133789k517991l212445l108459k201575j213546q23855j257491k397496
40967B8400931l350102k490829M67188K984898K391273k41818j466256o31600
40959B6063685n12984k159640k776701n42096J874609J399288n36703n33579J216707
40950B3492586J579160k62383j774366j233278J43747O40224J73956n57770j164863
40941B1037013j311650q00263j01946K63027M91377N42495n28053k586529l114159
$$ plain form
41000 27680471 29334899 30458047 31886687 34258170 36759837 38149551 38794173 40426748
40992 40426748 43694296 47220047 49566982 50911484 52083978 53115128 53671732 53950021
40984 53950021 54046833 53224036 50978003 48316541 46834013 46803842 47094565 46641547 45133789
40975 45133789 42615798 39403353 36294894 34093319 32879773 32055918 30798427 28400931
40967 28400931 25050829 22560000 23027188 26012086 28403359 28161541 26695285 26063685
40959 26063685 25550701 23391061 20614360 20072264 21946873 23346161 22809458 22275879 23492586
40950 23492586 25071746 24809363 23034997 21801719 21945466 22585690 22759646 22201876 21037013
40941 21037013 19725363 18925100 18823154 19086181 19577558 20120053 19592000 17005471 13891312
40932A3891312m36665K801768K613569l94348j735009J05204J508092l73095l324189
40923A4656639l802374j859865J81508J452777K190235J707928l20950j979916
40915A2225982j376256K40102L49160p60791o90091Q58991J630332O04894o42835
40906A2439488q26756n57584l76732L39314J518870J704404M68866m75606M1927
40897A4276191P34872K09432n49758l1020R51778O46898l72404o132J612705J911534
40887A9384096o3677j855586j053691J336915K525399J653776K26857m22715m02028
40878B1329346j56343L95616J243429J774028J427827M57612k83520j61098O51445
40869B6678342J278845J056668N36929J125518L208738N111418M828770K706021
$$ plain form
40932 13891312 13454647 16256415 18869984 18475636 16740627 16845831 18353923 17980828 14656639
40923 14656639 10854265 8994400 9175908 10628685 12818920 14526848 14205898 12225982
40915 12225982 10849726 11089828 11438988 10678197 9988106 10847097 12477429 13082323 12439488
40906 12439488 11612732 11055148 10678416 11017730 12536600 14241004 14709870 14234264 14276191
40897 14276191 15011063 15220495 14670737 14639717 15591495 16238393 15865989 15859857 17472562 19384096
40887 19384096 19320419 17464833 16411142 17748057 20273456 21927232 22154089 21731374 21329346
40878 21329346 21173003 21568619 22812048 24586076 26013903 26471515 26187995 26026897 26678342
40869 26678342 27957187 29013855 29550784 30676302 33885040 38996458 43825228 46531249
40861D6531249J422732K984115O437948R070216R430179Q615966Q666231J0168224
40853A03326860J1824665J2411539J2625546J4132228J6711335J7501259J3934669
40846B02468101O649618j507077q546096j3971518j7106354j7054317j4646080
40839A36286277j2378928j1510229j0756863q770261o326390m858664m233853
40832G7451089l463965k518853j904886j408010q74102j349533l567742n907909
40824E6456089n914139l679154j783072j810363k781457l262729l152051k807702
40816C1265422k087799j071279m44530m55358n63901n82163r22584j317065p89466
40807B3031277M95501R95414K66544n6041J013940J879484R60261k78071P15803
$$ plain form
40861 46531249 47953981 50938096 57376044 66446260 75876439 84492405 93158636 103326860
40853 103326860 115151525 127563064 140188610 154320838 171032173 188533432 202468101
40846 202468101 209117719 207610642 199064546 185093028 167986674 150932357 136286277
40839 136286277 123907349 112397120 101640257 92869996 86543606 81684942 77451089
40832 77451089 73987124 71468271 69563385 68155375 67281273 65931740 62363998 56456089
40824 56456089 50541950 46862796 45079724 43269361 40487904 37225175 34073124 31265422
40816 31265422 29177623 28106344 27661814 27206456 26642555 26060392 25137808 23820743 23031277
40807 23031277 23526778 24522192 24788736 24732695 25746635 27626119 28586380 28308309 29024112
40798B9024112L424893M697733L297026J561663J935908L902935N377461N565730
40790E8787461N232760N191599N657425O386618O557019N175442K413710j71435
40782I5230599j595265k806303m987551p292293p837866o583001n446754n459989
40774E3221577n606221n029265m538422m781791m582056k829806q53516p79364
40766B4221136k145094k465919j105005j42088q42959j683451j110758j23080
40758A4602782k96676r21175k85928J282757J963267J368275O49211L9356j276856
40749A7125013k767858k534458l69226J377625J024714k55658o77399m66124o76003
40740A1780626q96385j24045R71305P34596p47560j445997j95564J699300K217585
$$ plain form
40798 29024112 32449005 37146738 40443764 42005427 43941335 47844270 53221731 58787461
40790 58787461 64020221 69211820 74869245 81255863 87812882 92988324 95402034 95230599
40782 95230599 93635334 90829031 85841480 78549187 70711321 64128320 58681566 53221577
40774 53221577 47615356 42586091 38047669 33265878 28683822 25854016 25000500 24221136
40766 24221136 22076042 19610123 18505118 18363030 17520071 15836620 14725862 14602782
40758 14602782 14306106 13384931 13099003 14381760 16345027 17713302 18362513 18401869 17125013
40749 17125013 14357155 11822697 11453471 12831096 13855810 13600152 12922753 12456629 11780626
40740 11780626 10884241 10760196 11731501 12466097 11718537 10272540 10076976 11776276 13993861
40731A3993861J071906k03895j79418R52991J765800J320356K58842p5959O61923
40722A9566407J652991K294910K764353L073976K791536K204508K496361L917956
40714D0762998N025219M906879M962053O800129R253655R547699P176657M513538
40706I2948827L281947K403559J58008l166315n968768p526559q167844p981284
40698F5981571o773757n162037m450510n032046n658079m853553k770952j123565
40690C0157072j219815k473042l216524k762130k010616j917917k144142j801077
40682A2611809r23101k98773j46988K7631K94158P9246o32020q95796k05690N36404
40672A0446880K75115n61668p20213j56411j99943j415519k432406j721181K13220
$$ plain form
40731 13993861 15065767 14861872 14682454 15635445 17401245 18721601 18980443 18904484 19566407
40722 19566407 21219398 23514308 26278661 29352637 32144173 34348681 36845042 40762998
40714 40762998 45788217 50695096 55657149 62457278 71710933 81258632 88435289 92948827
40706 92948827 96230774 98634333 98792341 95626026 89657258 82130699 73962855 65981571
40698 65981571 59207814 54045777 49595267 44563221 38905142 34051589 31280637 30157072
40690 30157072 28937257 26464215 23247691 20485561 18474945 16557028 14412886 12611809
40682 12611809 11688708 11389935 11242947 11270578 11564736 11643982 11011962 10116166 9910476 10446880
40672 10446880 10721995 10160327 9440114 9283703 9083760 7668241 5235835 3514654 3727874
40663C727874J521160J519970J189411J120711N56181p88533j459516k92467J335843
40654H430634J172954n08417j289976l64938L80904l69301j300785q79896J76171
40645E447350M98622M65545J033049J514604P83305k56733J45643J459510J505610
40636A2596505J34207m20379O38944J145233m95922k433700j857816R86977L126000
40627A3420049K604186M20945j105717q35871L98434R53412K86941l28471N17712
40618A6331620K166422K465030P83325q84908o02649R16996J550660P47773q3932
40609B3390337K27039J349992K358838K784194K507858J476705K2651r61413o72646
40600C2483555P38932K146588K463288J732912R94550R05921R07390K26534p44378
$$ plain form
40663 3727874 5249034 6769004 7958415 9079126 9635307 8846774 7387258 7094791 8430634
40654 8430634 9603588 9095171 7805195 7440257 7821161 7451860 6151075 5271179 5447350
40645 5447350 5945972 6411517 7444566 8959170 9742475 9485742 9631385 11090895 12596505
40636 12596505 12730712 12310333 12949277 14094510 13598588 11164888 9307072 10294049 13420049
40627 13420049 16024235 16445180 15339463 14503592 14902026 15855438 16142379 15813908 16331620
40618 16331620 18498042 20963072 21746397 20861489 20258840 21175836 22726496 23474269 23390337
40609 23390337 23617376 24967368 27326206 30110400 32618258 34094963 34117614 33156201 32483555
40600 32483555 33222487 35369075 37832363 39565275 40559825 41465746 42373136 42599670 41855292
40591D1855292r84801n67767o94256j808856k812538k655308j749988j167443
40583B9414335j220890j489897j540802j023050K08427J430662J315338l64653
40575B6729470k038843k218845j373137r70492j341584j638827j396717q85245
40567A4865780k57998L95060M21405n85670j477082o09458J556978K516239J013947
40558A7839201j157522j652586o30873L1361k93932n23099j03481P4398n42733
40549A3040734r89600l37682O44518O16213k13689m79994R9893L85107j44304
40540A2621196n23070o2210M31959J55587j80863M15401J420480J643540J163185
40531A7085205R06526Q71293M31031j9227L91041J000045K36274j568203k155186
$$ plain form
40591 41855292 40870491 40302724 39608468 37799612 34987074 32331766 30581778 29414335
40583 29414335 28193445 26703548 25162746 24139696 24348123 25778785 27094123 26729470
40575 26729470 24690627 22471782 21098645 20128153 18786569 17147742 15751025 14865780
40567 14865780 14607782 15002842 15424247 14838577 13361495 12752037 14309015 16825254 17839201
40558 17839201 16681679 15029093 14398220 14429581 14135649 13612550 13509069 13583467 13040734
40549 13040734 12051134 11713452 12357970 12974183 12760494 12280500 12380393 12765500 12621196
40540 12621196 12098126 12035916 12467875 12623462 12442599 12858000 14278480 15922020 17085205
40531 17085205 17991731 18863024 19294055 19274828 19665869 20665914 20902188 19333985 17178799
40522A7178799p28352P33112M88793o09434j021649r42507j209806j302936l19481
40513A2266539J043423J337461O31200L19083R82330J758352J638205M39552j179759
40504A9236386j997373j162979N11747J151861L81173m2349R08586J702691Q11343
40495B1501086n42135k72119J237705K054682J946511K130996K473000J755165
40487C2284891N51433R60491L084172M328844K928143L6453k348562l561990l700525
40478C4563350k817990j569534j094300j536877j994007k170446k488860k512877
40470A8378459j353379J18011r8452j689770j868451K83567K010332J038555r89237
40461A5829635j360185l93346j66482q12954q91661m49233r18643k286936k814187
$$ plain form
40522 17178799 16450447 17183559 17672352 17062918 16041269 15098762 13888956 12586020 12266539
40513 12266539 13309962 14647423 15278623 15597706 16580036 18338388 19976593 20416145 19236386
40504 19236386 17239013 16076034 16587781 17739642 18120815 18078466 18987052 20689743 21501086
40495 21501086 20958951 20686832 21924537 23979219 25925730 28056726 30529726 32284891
40487 32284891 32836324 33796815 36880987 41209831 44137974 44174427 41825865 38263875 34563350
40478 34563350 31745360 30175826 29081526 27544649 25550642 23380196 20891336 18378459
40470 18378459 17025080 17143091 17044639 15354869 13486418 13769985 15780317 16818872 15829635
40461 15829635 14469450 14076104 13909622 13096668 12205007 11755774 10837131 8550195 5736008
40452E736008j706071j35799O32977N97354K73986r9160l59127l50645k11193
40443D378330j49129j41339k95159q97666j548989j177588K53163J134781M37473
40434A993877n67523k39100Q47068J020955L61419L18242R65585Q93206j32639
40425E461090n89112K24480R27770K08493j241678j884092j383147o26188l89609
40416G08007o75288r40073n91210L84661J184269J060988M00385K57139P91637
40407B580515R38634j00296j614747k036469o96846J210569J608156j44113k078841
40398c33438j678858P96421K357906J228650p91280j058732K91644J198431J001595
40389C012339P64735Q57638M54414n80168j249346j080997o51857l59315j01562
$$ plain form
40452 5736008 4029937 3894138 4527115 5124469 5398455 5299295 4940168 4589523 4378330
40443 4378330 4229201 4087862 3792703 2895037 1346048 168460 421623 1556404 1993877
40434 1993877 1426354 1187254 2034322 3055277 3416696 3734938 4700523 5593729 5461090
40425 5461090 4871978 5096458 6024228 6232721 4991043 3106951 1723804 1097616 708007
40416 708007 32719 -907354 -1498564 -1113903 70366 1131354 1531739 1788878 2580515
40407 2580515 3519149 3418853 1804106 -232363 -929209 281360 1889516 1745403 -333438
40398 -333438 -2012296 -1215875 1142031 2370681 1579401 520669 812313 2010744 3012339
40389 3012339 3777074 4634712 5089126 4508958 3259612 2178615 1526758 1167443 1065881
40380A065881q6925m73901m58278O06278J539003P97618o95566o38280P32538
40371B388368O29831j729841l409541j940806J163382K737727J911409J20064
40363A870593j171716j190266K23249J913488K003263M95069k74525Q54085J739644
40354F462884J67602k528744l365897j940806l64751J05649l0639l68088r94896
40345b857686j335678o80781L40070O51122O63176J344799J899754P42973j408741
40336f40992j966672k55898J521898J629383Q34375M02560K41928L5837K38329
40327B040748P74643N21276o80049j168587j6364J155617N79209q10643q94550
40318A501300K31564N68291m57752j168455m21603O42385M50290o98701j210426
$$ plain form
40380 1065881 978956 505055 46777 653055 2192058 2989676 2294110 1655830 2388368
40371 2388368 3018199 1288358 -2121183 -4061989 -2898607 -160880 1750529 1870593
40363 1870593 698877 -491389 -268140 1645348 3648611 4143680 3869155 4723240 6462884
40354 6462884 6630486 4101742 735845 -1204961 -1569712 -1464063 -1494702 -1862790 -2857686
40345 -2857686 -4193364 -4874145 -4534075 -3882953 -3219777 -1874978 24776 767749 -640992
40336 -640992 -2607664 -2863562 -1341664 287719 1122094 1524654 1766582 1802419 2040748
40327 2040748 2815391 3336667 2656618 1488031 1471667 2627284 3206493 2395850 1501300
40318 1501300 1732864 2301155 1843403 674948 253345 895730 1346020 647319 -563107
40309e63107m13591P35371R68720O9842j095354j479092o87968P59978J787483
40300H2282J542639J73006j137864j214001j32391Q24291O42084k88075p71564
40291b79593k54316O80338J046653M15422o11630p46792O44313K359288K377240
40282E630923N26691j004940p48455j98280j315991k964554k367033K80618J633717
40273e27304K23397j284145l73404J354924Q99065j235827j768009L64351K530078
40264A83126K231378J91983j185255q91188J54479P16520M54065j37276l98678
40255A319154j41536K51041L38678M0066n15679j083525j073261M9024J698228
40246H82190K346705J448459L20136K22868N51636K01209k25387O27854K249108
$$ plain form
40309 -563107 -976698 -241327 727393 797235 -298119 -1777211 -2465179 -1705201 82282
40300 82282 1624921 1797927 660063 -553938 -686329 137962 780046 491971 -279593
40291 -279593 -533909 146429 1193082 1608504 996874 250082 894395 3253683 5630923
40282 5630923 6157614 5152674 4404219 4205939 2889948 -74606 -2441639 -2161021 -527304
40273 -527304 -303907 -1588052 -1961456 -606532 292533 -943294 -2711303 -2346952 183126
40264 183126 2414504 2606487 1421232 530044 684523 1401043 1855108 1717832 1319154
40255 1319154 1177618 1428659 1767337 1807403 1291724 208199 -865062 -816038 882190
40246 882190 3228895 4677354 4997490 5220358 5771994 5973203 5747816 6375670 8624778
40237H624778K659838J446610L98217P31801J524209J529075Q40284p3589j375266
40228A6305957k841129l265532k145098q42781q03977j528139j556701o73374
40220B649226J63331M51413M50093K93114q5017m61584o32917p81151q55710l36066
40210H54732O22463Q26881j44961r33973n00472O2979m74010j048023j71394R64627
40200E8849K05829j471724j058358J330274K185839K84671j271758l52236P12160
40191F23546m15465j602589P3750K769384K404778o64359k113756m81334R54714
40182A548669j47768j723940j164607O32396J247369M25623m08081o63629o24979
40173h78947j92469O62079J104022N64031j56875j25644K66607K24945n1835r0260
$$ plain form
40237 8624778 11284616 12731226 13129443 13861244 15385453 16914528 17754812 17681223 16305957
40228 16305957 13464828 10199296 8054198 7211417 6407440 4879301 3322600 2649226
40220 2649226 2812557 3263970 3714063 4007177 3922160 3460576 2827659 2046508 1190798 854732
40210 854732 1477195 2304076 2159115 1225142 724670 787649 313639 -734384 -905778 58849
40200 58849 264678 -1207046 -2265404 -935130 1250709 1535380 263622 -88614 623546
40191 623546 208081 -1394508 -1320758 1448626 3853404 3189045 1075289 593955 1548669
40182 1548669 1400901 -323039 -1487646 -855250 392119 817742 409661 -253968 -878947
40173 -878947 -1071416 -409337 694685 1258716 1101841 976197 1242804 1467749 1415914 1325654
40163A325654k54977q39261j009072q2486R90229R14373O2116l23610k05171l79101
40153A98694o76983l70461P7191l61877j097423m59759J384204K112417M96152
40144A302155j761099k301535q86510R39497J808957J330759q4710j354963j401092
40135b408541l57907M94215L97548o0378j50586n5898j40431p4298N57889J414461
40125c83926J802488J426996L66020j027480j887049j397255p4265M64565l79355
40116a089261j255075p95343M74217J096670P23035J12999k66473n06933n11163
40107b017327l4617O76759J047979Q20180R5898q09094j189923m29477Q12070
40098a027552R24854l38412j095923n0448J318368R35206o24379j185219m94766
$$ plain form
40163 1325654 1070677 231416 -777656 -860142 130087 1044460 1106576 782966 577795 198694
40153 198694 -478289 -848750 -771559 -1133436 -2230859 -2690618 -1306414 806003 1302155
40144 1302155 -458944 -2760479 -3646989 -2707492 -898535 432224 347514 -1007449 -2408541
40135 -2408541 -2766448 -2272233 -1874685 -1935063 -2085649 -2141547 -2281978 -2356276 -1798387 -383926
40125 -383926 1418562 2845558 3211578 2184098 297049 -1100206 -1174471 -709906 -1089261
40116 -1089261 -2344336 -3139679 -2665462 -1568792 -845757 -732758 -999231 -1506164 -2017327
40107 -2017327 -2051944 -1375185 -327206 492974 588872 -220222 -1410145 -1839622 -1027552
40098 -1027552 -102698 -441110 -1537033 -1587481 -269113 666093 41714 -1143505 -1638271
40089a638271k38523q32627q42565J44732O99136L26882N29430J886813K464742
40080B499749Q53851j186802j195677L68531J160674N22985k35475m28034n60643
40071A799159o10994L2779Q50356M99700p98359j138974J71612J382474Q77720
40062C065473n37113j087498n74952j39336k42227k44434K70507Q51177R08052
40053B269649L94094l30185r09007j212236j273155r69580q133J300268J592830
40044H54545j29967k581273l062061q68268J514377J643538L04776j8387J110887
40035a231833J818833J053789p7325m06237l05191m56844n28143q7084K84898
40026F4863p0203o14406m10889L00537M28239k82800q88594o34825P4125L47125
$$ plain form
40089 -1638271 -1876794 -2709421 -3551986 -3407254 -2708118 -2381236 -1851806 35007 2499749
40080 2499749 3353600 2166798 971121 1339652 2500326 3023311 2787836 2359802 1799159
40071 1799159 1188165 1220944 2071300 2571000 1772641 633667 805279 2187753 3065473
40062 3065473 2528360 1440862 865910 726574 484347 239913 510420 1361597 2269649
40053 2269649 2663743 2333558 1424551 212315 -1060840 -2030420 -2038553 -738285 854545
40044 854545 724578 -1856695 -4918756 -5787024 -4272647 -2629109 -2324333 -2342720 -1231833
40035 -1231833 587000 1640789 1563464 1157227 852036 395192 -132951 -220035 64863
40026 64863 -5340 -619746 -1030635 -730098 -301859 -584659 -1473253 -2108078 -2033953 -1686828
40016a686828l2595m35872k39593L75893O50594K70814k06075k58215k13088m45264
40006b220229l05360Q88841K051879J255170j231934k711819j746524j97477j74464
39997d391917p84764o2555J279579Q19214j408351k607206j330316P25807J710505
39988f050004J964524K268409J966615M88134r03030p26844L76899O51785j10780
39979g4292n29446O7551P51314M70183n98051j386700j127793j30761N17529K74866
39969a765600j2395O67103J645537J292964l36619j326547r10759o53678j475890
39960b875884j600252N88270L308721L472132J009437j350394j997004j644265
39952a089239r84032J94193J337718J091205m15129j299713o52812L12657M97403
$$ plain form
40016 -1686828 -1719423 -2155295 -2394888 -2018995 -1368401 -1097587 -1303662 -1561877 -1774965 -2220229
40006 -2220229 -2525589 -1636748 415131 1670301 438367 -2273452 -4019976 -4217453 -4391917
39997 -4391917 -5176681 -5239236 -3959657 -3140443 -4548794 -7156000 -8486316 -7760509 -6050004
39988 -6050004 -4085480 -1817071 149544 637678 -265352 -992196 -615297 36488 -74292
39979 -74292 -603738 -536187 215127 685310 87259 -1299441 -2427234 -2557995 -2040466 -1765600
39969 -1765600 -1777995 -1110892 534645 1827609 1490990 164443 -746316 -1399994 -2875884
39960 -2875884 -4476136 -3887866 -579145 2892987 3902424 2552030 555026 -1089239
39952 -1089239 -2073271 -1879078 -541360 549845 134716 -1164997 -1817809 -1505152 -1007749
39943a007749M74044R82851J544745J505751J034497K83090j012793k353513k438103
39934i87180j164205j25749k00990k72631N71186J291540P86563o5555L7612N63599
39924D34190L17496k21856K22461J249815J250610K0340r69604q38966k31561
39915A232925L5231j01967l87071n06569q6056O15379N13694o86335j452835m98881
39905a322485Q91930N50182j124823j697950n47161L35308k08668p71820p5087
39896c970574Q75055P52083J78159L48432Q16595M49982m23023o10743j17370
39887a701404J23831J19194O49612J374631R15799p67646j665074k90772K035263
39878G93434K593488N74963j979914k601546j011821J004775J807708J324369
$$ plain form
39943 -1007749 -533705 449146 1993891 3499642 4534139 4817229 3804436 1450923 -987180
39934 -987180 -2151385 -2277134 -2478124 -2750755 -2179569 -888029 -101466 -167021 -129409 434190
39924 434190 751686 529830 752291 2002106 3252716 3273056 2303452 1464486 1232925
39915 1232925 1268156 1166189 779118 272549 186493 801872 1315566 629231 -823604 -1322485
39905 -1322485 -430555 119627 -1005196 -2703146 -3250307 -2914999 -3123667 -3895487 -3970574
39896 -3970574 -3095519 -2343436 -2165277 -1816845 -1000250 -550268 -973291 -1584034 -1701404
39887 -1701404 -1577573 -1458379 -808767 565864 1481663 714017 -951057 -1241829 793434
39878 793434 3386922 3961885 1981971 -619575 -1631396 -626621 1181087 2505456
39870B505456M30703k65100o53630p37514o11627n23709m62909l3536P53247J062200
39860A463581L60533n23019m46048L39476O96315M87859N08340O68585j645j273789
39850B280188j497506j73189R99300O66040k18755k46105K00073J48499O1727
39841B220272O74680R88853k05579j561296o41323J956165K772661M32379k228370
39832D408442k273280o27488k6661p23078o91489O15268J236893k06135k275427
39823e62955k530950n89395J587696K096841J063273J51972M70443J283265J020952
39814C991142n84611j973888j688407k44853O31632L13047j60503J14444N59140
39805I57143J76150p50175r55269l9461Q75617O32350m21461r23363k94637N76679
$$ plain form
39870 2505456 2936159 2671059 2017429 1279915 668288 144579 -318330 -351866 401381 1463581
39860 1463581 1824114 1301095 855047 1194523 1890838 2378697 2887037 3555622 3553977 2280188
39850 2280188 782682 609493 1608793 2274833 2056078 1809973 2010046 2158545 2220272
39841 2220272 2894952 3883805 3678226 2116930 1475607 3431772 6204433 6636812 4408442
39832 4408442 2135162 1507674 1481013 757935 66446 681714 1918607 1712472 -562955
39823 -562955 -3093905 -3683300 -2095604 1237 1064510 1216482 1686925 2970190 3991142
39814 3991142 3406531 1432643 -255764 -500617 131015 444062 283559 398003 957143
39805 957143 1133293 383118 -572151 -611612 264005 896355 474894 -448469 -743106 -166427
39795a66427O22838N4392m1863N77825Q09249j28532j203433p96110P63729J253321
39785A744989l25120k017638j534748M02055J123501j5545r12737k65173M94274
39776a306142l6510o61827K51034J648696J365734p3061q4861J624395K254975
39767D982433K11718k373008k773969j255764J21569N96887P19358N11391l24822
39758D15793j047697o31088M32293P14459L2114m43549r8435N22984R08913R79256
39748A785043M10879r36134j921352j102293Q88750J590670m302j870075j593979
39739b752793N33229K169928J887209L61135r71624j381847r71113j09894Q84200
39730c51570J669629J743202P36313r20282k016712j795518q91178m00403l39147
$$ plain form
39795 -166427 456411 510803 468940 1046765 1856014 1727482 524049 -272061 491668 1744989
39785 1744989 1419869 -597769 -2132517 -1730462 -606961 -622506 -1535243 -1800416 -1306142
39776 -1306142 -1342652 -2004479 -1753445 -104749 1260985 1187924 1103063 2727458 4982433
39767 4982433 5194151 2821143 47174 -1208590 -1087021 -490134 229224 740615 415793
39758 415793 -631904 -1262992 -830699 -116240 -84126 -527675 -626110 -103126 805787 1785043
39748 1785043 2195922 1259788 -661564 -1763857 -875107 715563 711261 -1158814 -2752793
39739 -2752793 -2219564 -49636 1837573 2198708 1227084 -154763 -1125876 -1235770 -351570
39730 -351570 1318059 3061261 3797574 2877292 860580 -934938 -1826116 -2226519 -2565666
39721b565666Q0180Q73425J157023O57721J47577Q0595l9340m82149o31384j33627
39711h55645L46267K70958J36029L41165J34253j105048k228478j438564J085444
39702c313619K988162K449186J67295j747627k138515j484978o71328P6381P85753
39693b889290R60788J26620q95943m34974J646142L080037J957727m47233j324110
39684A779764l45295J14701j063129j972612q73325R96396J428128M59411k81422
39675B42617k86025k57179k43316L39282J135656J065508M8878r13286j277897
39666a45762j277258r02176P1357J166177J606145J483003J296390O97582q06310
39657C189148k229697j999493m24583N84292L77834J80466N45166L89242o80718
$$ plain form
39721 -2565666 -2485486 -1612061 -455038 202683 350260 430855 391515 -90634 -722018 -855645
39711 -855645 -509378 -238420 -102391 238774 373027 -732021 -2960499 -4399063 -3313619
39702 -3313619 -325457 2123729 2291024 543397 -1595118 -3080096 -3751424 -3675043 -2889290
39693 -2889290 -1928502 -1801882 -2697825 -3132799 -1486657 1593380 3551107 3103874 1779764
39684 1779764 1434469 1549170 486041 -1486571 -2359896 -1363500 64628 524039 242617
39675 242617 -43408 -300587 -543903 -204621 931035 1996543 2045421 1132135 -145762
39666 -145762 -1423020 -2325196 -2253839 -1087662 518483 2001486 3297876 3995458 3189148
39657 3189148 959451 -1040042 -1464625 -880333 -502499 -322033 223133 612375 -68343
39648f8343j262641n84481m9074p87332j422848k34450J789955K261638R24840
39639E67264l31008n50845n77973q83877p53763q3129M1627o06420n65321Q88351
39629b855094K014177R54503j225109j774443j28169J476793J446913Q61553J110305
39620A881429J302092j52837k380682k714116n37924J591014J364989m12342j455171
39611a513548j103560l84623L8883L25890L62827j57150o73714k24328R62216
39602b367107J609986J230675O02520L26980J78707N6418K38139M00068k29921
39593B046465j316525j457004l71796M36526M2801m09647K36887J034203M90036
39584G31946p79710q62062M45275J305798N97681o09784p96000j1774N08911P1433
$$ plain form
39648 -68343 -1330984 -1915465 -1964539 -2751871 -4174719 -4409169 -2619214 -357576 567264
39639 567264 236256 -314589 -892562 -1776439 -2530202 -2613331 -2571704 -3178124 -3743445 -2855094
39629 -2855094 -840917 113586 -1111523 -2885966 -3014135 -1537342 -90429 771124 1881429
39620 1881429 3183521 3030684 650002 -2064114 -2602038 -1011024 353965 -58377 -1513548
39611 -1513548 -2617108 -3001731 -2962848 -2636958 -2274131 -2431281 -3104995 -3329323 -2367107
39602 -2367107 -757121 473554 1076074 1403054 1581761 1638179 1876318 2276386 2046465
39593 2046465 729940 -727064 -1098860 -662334 -619533 -1029180 -792293 241910 731946
39584 731946 -47764 -909826 -464551 841247 1438928 829144 33144 21370 530281 601714
39574F01714p76996j050494m75927K44766L76088J62739L78623R00814O71657
39565A032984n19350j278882n24407P16274O42599o98226j456446n16132J192774
39556a408812K014046J284293l29861j435972r11382Q98835K083637J160367r19900
39547B435251j781769o66312O90364N35634o50913j064596J3987J502190J926717
39538B940553J002462j82042l94753L15388O49382k18164j388175j413963l98346
39529I12342J39525m95505j254795j089497m96351m72122p27782j13551J411075
39520b186661K375360J686356J35294n95459m0391O84817O12240J49503O9429
39511B890488L9391p54642j844173j767560l88878N27340j62210j204473r00730
$$ plain form
39574 601714 -175282 -1225776 -1701703 -1456937 -1080849 -918110 -539487 361327 1032984
39565 1032984 513634 -765248 -1289655 -573381 69218 -629008 -2085454 -2601586 -1408812
39556 -1408812 605234 1889527 1559666 123694 -787688 111147 2194784 3355151 2435251
39547 2435251 653482 -12830 677534 1213168 562255 -502341 -488354 1013836 2940553
39538 2940553 3943015 3760973 3366220 3681608 4330990 4112826 2724651 1310688 912342
39529 912342 1051867 556362 -698433 -1787930 -2284281 -2756403 -3484185 -3597736 -2186661
39520 -2186661 188699 1875055 2010349 1414890 1374499 2059316 2671556 2821059 2890488
39511 2890488 2929879 2175237 331064 -1436496 -1825374 -1298034 -1460244 -2664717 -3565447
39502c565447K57149M92189l95136q71522k11022N42379L99335k49729n58543
39493d160347k94754M00558J264502J603362P94966n70293j116780n79097j21997
39484b779880l58569l37610P50154J998082J933925N19317r26889j352990q27681
39475a382141j32525P277m04910n49893J60577J037604R68322K12000P5059O74894
39465F66264O11779o20260j593396j225297m38526k98159j03286R94596J866548
39456a39737R94393p35285j083818J17809Q29615P9416p38478k63571R17166J412357
39446A389867P42406o27452j826849j794843j61570J704534J772807m1886j537279
39437c80265j030888O49866J589623J060504l05896j505844j560353m8498J860028
$$ plain form
39502 -3565447 -3308298 -2816109 -3211245 -4082767 -4293789 -3751410 -3352075 -3601804 -4160347
39493 -4160347 -4455101 -4054543 -2790041 -1186679 -391713 -962006 -2078786 -2657883 -2779880
39484 -2779880 -3138449 -3476059 -2725905 -727823 1206102 1725419 798530 -554460 -1382141
39475 -1382141 -1514666 -1507389 -1912299 -2462192 -2301615 -1264011 -295689 -83689 -8630 666264
39465 666264 1278043 657783 -935613 -2160910 -2599436 -2897595 -3000881 -2006285 -139737
39456 -139737 854656 119371 -964447 -846638 -17023 62393 -676085 -939656 -22490 1389867
39446 1389867 2132273 1504821 -322028 -2116871 -2278441 -573907 1198900 1157014 -380265
39437 -380265 -1411153 -761287 828336 1888840 1582944 77100 -1483253 -1531751 328277
39428C28277K026651P6414j596903r03176R05739J040998o82085j668794m78442
39419i51321J253791J479379M39909m03121o47734p29390m83216M24121J188446
39410A570864O67242o48317j060205k54359J11162r77789k109103j363466R32395
39401c131576K594950K228111M01206j460593k294751j711075j67781J094522
39393b446987J133546L66988j00904L1738L18118P33377J504224J930753R68817
39384D439670q00543j492504p66137n39172j852136k860732j603104P62031J658075
39375c054552J021859R88189J973711J842966l68246k341534j578430R84307K201696
39366A669966P74084j494029k223255r53775R61187J954746J427081l0451j195523
$$ plain form
39428 328277 2354928 2431342 834439 -68737 837002 1878000 1195915 -472879 -951321
39419 -951321 302470 1781849 2221758 1818637 1170903 441513 -41703 382418 1570864
39410 1570864 2238106 1589789 529584 275225 386387 -591402 -2700505 -4063971 -3131576
39401 -3131576 -536626 1691485 2092691 632098 -1662653 -3373728 -3541509 -2446987
39393 -2446987 -1313441 -946453 -1047357 -1015619 -697501 35876 1540100 3470853 4439670
39384 4439670 3639127 2146623 1380486 841314 -1010822 -3871554 -5474658 -4712627 -3054552
39375 -3054552 -2032693 -1044504 929207 2772173 2403927 62393 -1516037 -531730 1669966
39366 1669966 2444050 950021 -1273234 -2227009 -1265822 688924 2116005 2085554 890031
39357H90031j256330n09003R6735J01418l8059K58867Q06911Q77685J72330q29160
39347E71425j514252j676517j255435j69785J082388J310637P4542j196568q27850
39338c601415N03893M56297j347279k286759m71002K244009K788204J201285J61455
39329c51312P80110J357026N33627o51371p58907j75069r6031n44225o83903l24213
39319i14268M2660K11532L26400L25654J06516l9924J89049N41997N66837K57071
39309A613524j12165m34508n77542j80263P10976J190929N04710o76141r11469
39300A128051q051N94838q8974j020818o11718P42442R77234n83674j912514j006851
39290a790035J119755J725769J54557j434983j261606j4102Q49555J116545J078507
$$ plain form
39357 890031 -366299 -875302 -778567 -677149 -715208 -456341 350570 1228255 1400585 571425
39347 571425 -942827 -2619344 -3874779 -4044564 -2962176 -1651539 -1576997 -2773565 -3601415
39338 -3601415 -3097522 -2641225 -3988504 -6275263 -6746265 -4502256 -1714052 -512767 -351312
39329 -351312 428798 1785824 2319451 1668080 909173 734104 638073 93848 -590055 -914268
39319 -914268 -871608 -660076 -333676 -8022 98494 58570 247619 789616 1356453 1613524
39309 1613524 1501359 1066851 489309 309046 1020022 2210951 2715661 2039520 1128051
39300 1128051 1120000 1714838 1625864 605046 -6672 735770 1713004 1129330 -783184 -1790035
39290 -1790035 -670280 1055489 1210046 -224937 -1486543 -1500645 -651090 465455 1543962
39281A543962L95937q48536j297740j85543J039770P26514l58281m11172L23381
39272I28292K18790n89530l93878Q76017J372801N57344j2597K56952r2968j535893
39262A585330k135961p69570O09802p0558j706971j876971n16973N21146N68529
39253c792197N96732J149357J726938J944510J818631J226685K66216l63832l98207
39244D174833o61303j586288k047467r98609O77104J397181J028401L35513o26830
39235A692535j816116j984533k97549J611332J464613l00202j253932o37356R3150
39226a428058J37124J92585L23633m01641j641912j612613L4129J385254J201314
39217a810185N66018O30009Q02706M21829K70804R34917J290952K48006j303972
$$ plain form
39281 1543962 1939899 1091363 -206377 -391920 647850 1374364 1016083 604911 928292
39272 928292 1147082 557552 163674 1039691 2412492 2969836 2957239 3214191 3121223 1585330
39262 1585330 -550631 -1320201 -710399 -780957 -2487928 -4364899 -4881872 -4360726 -3792197
39253 -3792197 -3195465 -2046108 -319170 1625340 3443971 4670656 4936872 4573040 4174833
39244 4174833 3513530 1927242 -120225 -1118834 -441730 955451 1983852 2319365 1692535
39235 1692535 -123581 -2108114 -2405663 -794331 670282 370080 -883852 -1521208 -1428058
39226 -1428058 -1290934 -1098349 -774716 -1176357 -2818269 -4430882 -4396753 -3011499 -1810185
39217 -1810185 -1244167 -614158 188548 610377 881181 1816098 3107050 3355056 2051084
39208B051084j813510j240402n19767O3616N39999L23015q20591j658606r13804
39199c988966P43415J536377R74770R9686k69872k55100j24090R4078L38663O53803
39189a97236J221324J598739P31698j311184k601072j735671n7972K59314m31817
39180b523877o9629J292422J213278j001255k564418j133056J609714K371171
39172h05650Q76634l00476Q9655N24488k41616r97743k24146J121284P58499j492272
39162f91343l144425k194507L88236K006868J517177J12548n37229j23397M68020
39153b198052M71712m9903n06768l68674M48896J440515J752464R11829n16222
39144A385797j255914o28242N56438Q08475k58011j404131j326050k74985M69332
$$ plain form
39208 2051084 237574 -1002828 -1522595 -1458979 -918980 -595965 -1416556 -3075162 -3988966
39199 -3988966 -3245551 -1709174 -734404 -634718 -904590 -1159690 -1283780 -1189702 -851039 -197236
39189 -197236 1024088 2622827 3354525 2043341 -557731 -2293402 -2351374 -2092060 -2523877
39180 -2523877 -2593506 -1301084 -87806 -1089061 -3653479 -4786535 -3176821 -805650
39172 -805650 70984 -229492 -139837 384651 143035 -854708 -1078854 42430 800929 -691343
39162 -691343 -3835768 -6030275 -5642039 -3635171 -2117994 -2005446 -2542675 -2666072 -2198052
39153 -2198052 -1726340 -1776243 -2283011 -2651685 -2202789 -762274 990190 1902019 1385797
39144 1385797 129883 -498359 58079 866554 608543 -795588 -2121638 -2396623 -1927291
39135a927291M07027K07932L05607J61331n91727j175915o97172L71311O89888
39126b249009q0723p36591m1576J710144K903360K264412K48699j349228j374773
39117A294715o25109n71114j077043o45632R00265J626839L34556j302214j026891
39108a091628O17904J147631j15242j203032n39878R86955J546034O47009o86705
39099A309048j173898l84204P54303O41243j033604k416113j680220M07181J583422
39090a992842J276917Q05776O53344j17164j418409j539326Q7961J625187J488667
39081H70111M45032j34580l23051n85782l90890N34428J010195J25071j073858
39072D76676j184890n37483r8216L94934J362024J682700K59080j596559j655073
$$ plain form
39135 -1927291 -1520264 -1312332 -1006725 -845394 -1437121 -2613036 -3310208 -2938897 -2249009
39126 -2249009 -2329732 -3066323 -3107899 -1397755 1505605 3770017 4018716 2669488 1294715
39117 1294715 669606 98492 -978551 -1624183 -723918 902921 1237477 -64737 -1091628
39108 -1091628 -473724 673907 558665 -644367 -1184245 -197290 1348744 1995753 1309048
39099 1309048 135150 -249054 505249 1146492 112888 -2303225 -3983445 -3576264 -1992842
39090 -1992842 -715925 89851 743195 626031 -792378 -2331704 -2243743 -618556 870111
39081 870111 1315143 1180563 857512 271730 -119160 415268 1425463 1550534 476676
39072 476676 -708214 -1245697 -1343913 -948979 413045 2095745 2354825 758266 -896807
39063h96807j67339N25435l79193j160877m86174P21837R89581L46366j30501
39054f37672J15250O42289O75736M6886m07091J81883J168397Q83449p82808j779284
39044A07035r89778k15875j223830k434740j191746J734703K987231J628561J71039
39035E72600L37126Q61349L85716k54886k5425L00104k93539j199008j360204
39026f76167r32870n03985Q5000R50294J358067Q44512J68816J90545O93441J035795
39016C213448R66931K68380j153924k289362j671029K84146J269557L44263o16397
39007F16013N0012J172759Q24320o01313j346884j086229p43683m66307K27011
38998a354301R43711R05067L94918J14021k20965j011892j376351m83889N40368
$$ plain form
39063 -896807 -1064146 -538711 -917904 -2078781 -2564955 -1843118 -853537 -507171 -637672
39054 -637672 -522422 119867 795603 842489 435398 617281 1785678 2669127 1886319 107035
39044 107035 -882743 -1098618 -2322448 -4757188 -5948934 -4214231 -1227000 401561 572600
39035 572600 909726 1771075 2156791 1901905 1876480 2176584 1883045 684037 -676167
39026 -676167 -1609037 -2113022 -2028022 -1077728 280339 1124851 1293667 1484212 2177653 3213448
39016 3213448 4180379 4448759 3294835 1005473 -665556 -381410 888147 1232410 616013
39007 616013 666025 1838784 2663104 2061791 714907 -371322 -1115005 -1581312 -1354301
38998 -1354301 -410590 494477 889395 1003416 782451 -229441 -1605792 -2089681 -1549313
38989a549313J80136p15585j60791J425902J595524j64935j529041r10545N28270
38980a300378J220518J233159R67612O136j453386j901045o92438O45945O68041
38971f05836Q3422J48822M40717p0049q95945q12541L6473N19258L99413K70099
38961d86167J49717l07820o48697j85006O21411P55560K47156k03133o34323j265832
38951a957134j174777M25455K002883J248985j134937j848432J72606K029896
38943b35455J267627n22563m94617J061445J610458M27945p85069q27917k74865
38934A226989P3423J18470j85098q02153r63941l1972J110652J077284K07621
38925A831275L6634O19439L84016j086645k165912j692697n08338K51699O14897
$$ plain form
38989 -1549313 -1369177 -2084762 -2245553 -819651 775873 610938 -918103 -1828648 -1300378
38980 -1300378 -79860 1153299 2120911 2127047 673661 -1227384 -1919822 -1273877 -605836
38971 -605836 -522414 -373592 67125 -2924 -898869 -1711410 -1674937 -1155679 -756266 -486167
38961 -486167 -336450 -644270 -1292967 -1477973 -856562 -101002 146154 -56979 -691302 -1957134
38951 -1957134 -3131911 -2706456 -703573 545412 -589525 -2437957 -2265351 -235455
38943 -235455 1032172 509609 14992 1076437 2686895 3114840 2329771 1501854 1226989
38934 1226989 1300412 1418882 1233784 431631 -532310 -564282 546370 1623654 1831275
38925 1831275 1867909 2487348 2871364 1784719 -381193 -2073890 -2582228 -2330529 -1715632
38916a715632P12771J17850p60615n13917P96139R68564r21822k400159j054364
38907d771185J532215J974518J09719j113172l19736P16811M53539k45015j80478
38898a842784K18664K10611K31751P48341R55223k472j375120j642987n67723
38889c066496N73768O45598j04012m69331K71903J371237J318549j88288j508222
38880a155294j011565O85608J441692K94114j589066k498366j730463K18722J960222
38871c384396K044603O44289r7760J181109K656700J679411r83137j946343l55544
38862A438932Q11086m49408k047521j338126O96902J228035j38566j364748j247661
38853b411075l83644N02980J134736R83833j68754j238783r91290R2523N52284
$$ plain form
38916 -1715632 -1002861 -885011 -1645626 -2159543 -1363404 -394840 -1316662 -3716821 -4771185
38907 -4771185 -3238970 -1264452 -1154733 -2267905 -2587641 -1870830 -1417291 -1662306 -1842784
38898 -1842784 -1624120 -1413509 -1181758 -433417 521806 519334 -855786 -2498773 -3066496
38889 -3066496 -2492728 -1847130 -1951142 -2420473 -2148570 -777333 541216 352928 -1155294
38880 -1155294 -2166859 -1481251 -39559 254555 -1334511 -3832877 -5563340 -5344618 -3384396
38871 -3384396 -1339793 -695504 -793264 387845 3044545 4723956 3740819 1794476 1438932
38862 1438932 2250018 1800610 -246911 -1585037 -888135 339900 201334 -1163414 -2411075
38853 -2411075 -2794719 -2291739 -1157003 -173170 -341924 -1580707 -2571997 -2479474 -1927190
38844a927190J61855j21380m6658k24030n32218q3702J036095J502244O25118
38835C90134o59095j047763k60104J012352J769819J295126j44612j237481j007581
38826A10795p7547K21728l26078q43790q68168o84764l46625L94686J160672J153802
38816a05289M69315J08395M32437O11777l5984j009007j309613n49276Q60947
38807e26298K043230K057147O20645j349883k402417j927680n94943N04557Q16125
38798g59517O03317N94627J097005J317425K28318j620566k240033q85379O02191
38789a062612L49902q13786q99868j00333l23698j697610k032592k96459J593567
38780e283489J576002L72058J61912J351691K185333J330472l41895r36357k279
$$ plain form
38844 -1927190 -1765335 -1886715 -1933373 -2157403 -2689621 -2773323 -1737228 -234984 390134
38835 390134 -268961 -1316724 -1576828 -564476 1205343 2500469 2355857 1118376 110795
38826 110795 33248 254976 -71102 -914892 -1783060 -2467824 -2814449 -2419763 -1259091 -105289
38816 -105289 364026 472421 904858 1516635 1480651 471644 -837969 -1387245 -526298
38807 -526298 1516932 3574079 4194724 2844841 442424 -1485256 -2080199 -1575642 -759517
38798 -759517 -156200 438427 1535432 2852857 3081175 1460609 -779424 -1664803 -1062612
38789 -1062612 -712710 -1526496 -2426364 -2526697 -2850395 -4548005 -6580597 -6877056 -5283489
38780 -5283489 -3707487 -3335429 -3173517 -1821826 363507 1693979 1352084 415727 413448
38771D13448P99646j34110j929559k106990q6125J700603J194911l33637m70460
38762i52273M93490L34658j151810j796314p58392J96885j36540n01506L68597
38753c903205J575359J798148J385087J128144N53987p93277j673727p38407J018044
38744C50153J346274n0571j146284m82047R91815J322760r3071j930245k297222
38735a988438o10113J689427K509959J383357r3358l56165K38523K14244q34701
38726B152735j679610j104753M25092J103350j42164k140776k599004q70194J195179
38717c660145J689462R77188O04491Q45031Q18605L73829J21784m886m76247q20543
38707D68569m04242o8585p88244j244397M16510K646817J854277j772703l629032
$$ plain form
38771 413448 1213094 1078984 -850575 -2957565 -3043690 -1343087 -148176 -481813 -952273
38762 -952273 -458783 -124125 -1275935 -3072249 -3830641 -3633756 -3770296 -4271802 -3903205
38753 -3903205 -2327846 -529698 855389 1983533 2537520 1744243 70516 -667891 350153
38744 350153 1696427 1645856 499572 17525 1009340 2332100 2239029 308784 -1988438
38735 -1988438 -2598551 -909124 1600835 2984192 2890834 2534669 2773192 2987436 2152735
38726 2152735 473125 -631628 -206536 896814 754650 -1386126 -3985130 -4855324 -3660145
38717 -3660145 -1970683 -993495 -389004 456027 1274632 1648461 1770245 1765359 1289112 468569
38707 468569 64327 -4258 -792502 -2036899 -1620389 1026428 2880705 1108002 -2521030
38698b521030j312105J877677K232152Q41309N24269P42580o07111k596574k587498
38689c406331q12843K67425L10394R75127K000507J317591q34301j648901k44855
38680b076187R53236K86587p34034l79778N72749O02692j17095n33575m49187
38671a874592k66526k14068n63465j386249j717202m72644J508280K132328J123003
38662a731135L96947Q51960J074905J74427m81927J91034Q75813J12432j092618
38653C71838r55103J66887O48351L65221M54992R75172Q90563J31257k27042J31715
38643B953851K87214k85108r20788q94334l32941K42008N17448M06378Q0629l1218
38633B023139J97545K50801k44598p58222n96138m657L05248L21725M07895K15378
$$ plain form
38698 -2521030 -3833135 -1955458 276694 1118003 1642272 2384852 1777741 -818833 -3406331
38689 -3406331 -4219174 -3951749 -3641355 -2666228 -665721 651870 -182431 -1831332 -2076187
38680 -2076187 -1122951 -836364 -1570398 -1950176 -1377427 -774735 -891830 -1425405 -1874592
38671 -1874592 -2141118 -2355186 -2918651 -4304900 -6022102 -6494746 -4986466 -2854138 -1731135
38662 -1731135 -1334188 -482228 592677 767104 285177 476211 1352024 1464456 371838
38653 371838 -583265 -416378 231973 597194 1052186 2027358 2917921 3049178 2822136 2953851
38643 2953851 3241065 2955957 2035169 1140835 807894 1049902 1567350 1973728 2054357 2023139
38633 2023139 2220684 2471485 2226887 1468665 872527 867870 1173118 1494843 1902738 2118116
38623B118116p66456j742517j247772M86569J386388M47898p09114l55047O13279
38614B31344J93865j272467j393416M50613J799790O32464j574802j911610m7404
38605b891623J687546J739235R09549M06182J31840m38235j064832j263865j049898
38596a834101n04105M90879J512323J588776N83962l94282o18964o83474j091411
38587i50397j192167n36922J0036j95380j95512Q55063J769601J019003n63817
38578A9508q71869K45199R68516M33729m12910p62322p37252k87707P07085J255285
38568E57262K65527j211434j007521O99895J400566K16234p46703M1216J155071
38559A370113Q29501k68287n99936k80742k53461m05286k35587j53692m84576
$$ plain form
38623 2118116 1351660 -390857 -1638629 -1152060 234328 682226 -26888 -381935 231344
38614 231344 425209 -847258 -2240674 -1790061 9729 642193 -932609 -2844219 -2891623
38605 -2891623 -1204077 535158 1444707 1850889 1982729 1544494 479662 -784203 -1834101
38596 -1834101 -2338206 -1847327 -335004 1253772 1837734 1443452 824488 141014 -950397
38587 -950397 -2142564 -2679486 -2669450 -2864830 -3060342 -2205279 -435678 583325 19508
38578 19508 -852361 -607162 361354 795083 382173 -380149 -1117401 -1405108 -698023 557262
38568 557262 822789 -388645 -1396166 -696271 704295 920529 173826 215042 1370113
38559 1370113 2199614 1931327 1331391 1050649 797188 391902 156315 2623 -481953
38550d81953l52747Q08967J710067Q53785j098424k183217j654099k77614J099051
38541a576184J902760J535652J18515j106480j267238r28792o32832L36841K255179
38532F37421L395077K175641j31679r97029j95475M15145O2356l74678o04491
38523D382288j190533j577800m48621J527891J838660j18924j750854r80895P62400
$$ plain form
38550 -481953 -834700 -25733 1684334 2538119 1439695 -743522 -2397621 -2675235 -1576184
38541 -1576184 326576 1862228 1980743 874263 -392975 -1321767 -1954599 -1617758 637421
38532 637421 4032498 6208139 6076460 5079431 4883956 5299101 5361457 4986779 4382288
38523 4382288 3191755 1613955 1165334 2693225 4531885 4412961 2662107 1681212 2443612
$$ [...]
##END NTUPLES=NMR SPECTRUM
##END=
