##TITLE=31Pdec_PR_164_SEA
 D2O, 24 sc
 6.2.2020
##JCAMPDX= 6.0         $$ Bruker NMR JCAMP-DX V2.0
##DATA TYPE= NMR SPECTRUM
##DATA CLASS= NTUPLES
##ORIGIN= UXNMR, Bruker Analytische Messtechnik GmbH
##OWNER= root
$$ XWIN-NMR		Version 3.5
$$ Thu Feb  6 16:31:42 2020 Russian Standard Time (UT+4h)  she@DPX200
##.OBSERVE FREQUENCY= 81.013821
##.OBSERVE NUCLEUS= ^31P
##.ACQUISITION MODE= SIMULTANEOUS
##.ACQUISITION SCHEME= undefined
##.AVERAGES= 24
##.DIGITISER RES= 17
##SPECTROMETER/DATA SYSTEM= spect
##.PULSE SEQUENCE= zgpg30
##.SOLVENT NAME= DMSO
##.SHIFT REFERENCE= (INTERNAL, DMSO, 0, 182.463)
##AUDIT TRAIL= $$ (NUMBER, WHEN, WHO, WHERE, WHAT)
$$ ##TITLE= Audit trail, XWIN-NMR		Version 3.5
$$ ##JCAMPDX= 5.01
$$ ##ORIGIN= Bruker BioSpin GmbH
$$ ##OWNER= she
$$ F:/spectra/data/she/nmr/P31/1/pdata/1/auditp.txt
$$ ##AUDIT TRAIL=  $$ (NUMBER, WHEN, WHO, WHERE, WHAT)
(   1,<2020-02-06 16:30:49.25 +0400>,<she>,<DPX200>,
      <created by zg, POWCHK disabled, PULCHK disabled
       configuration hash MD5:
       00 E9 B6 7A A2 85 ED C7 34 08 36 98 17 FE 4E 26
       data hash MD5: 32K
       EF 9F D6 9C 92 9A 19 B2 88 2F 5B A1 28 A9 2E 73>)
(   2,<2020-02-06 16:30:51.54 +0400>,<she>,<DPX200>,
      <Start of raw data processing
       efp BC_mod = 2 LB = 1 FT_mod = 6 PKNL = 1 PHC0 = -1353.832 PHC1 = 177.2013 SI = 64K 
       data hash MD5: 64K
       F8 15 C5 58 12 F0 19 B0 C0 76 40 E7 E9 CE 8C 73>)
(   3,<2020-02-06 16:31:02.85 +0400>,<she>,<DPX200>,
      <pk PHC0 = -26.34358 PHC1 = 13.2 
       data hash MD5: 64K
       D5 52 AA CF 04 F8 9F 8F E7 F6 E1 44 68 09 94 F7>)
(   4,<2020-02-06 16:31:06.03 +0400>,<she>,<DPX200>,
      <abs ABSG = 5 
       data hash MD5: 64K
       CA 95 FC DF 50 F7 AF A9 A8 C4 65 BB E5 37 09 98>)
$$ ##END=
$$ 
$$ hash MD5
$$ 2C 26 D1 71 C2 4E 46 C1 A5 FB 45 0A 1B BA 53 13
##$RELAX= 
##$RELAX= 
##$RELAX= 
##$RELAX= 
##$RELAX= 
##$RELAX= 
##$RELAX= 
##$RELAX= 
$$ Bruker specific parameters
$$ --------------------------
##$DU= <F:/spectra>
##$EXPNO= 1
##$NAME= <P31>
##$PROCNO= 1
##$TYPE= <nmr>
##$USER= <she>
##$AMP= (0..31)
100 100 100 100 100 100 100 100 100 100 100 100 100 100 100 100 100 100 
100 100 100 100 100 100 100 100 100 100 100 100 100 100 
##$AQSEQ= 0
##$AQ_mod= 1
##$AUNM= <au_zg>
##$AUTOPOS= <>
##$BF1= 81.014009
##$BF2= 200.13
##$BF3= 200.13
##$BF4= 200.13
##$BF5= 200.13
##$BF6= 200.13
##$BF7= 200.13
##$BF8= 200.13
##$BYTORDA= 1
##$CFDGTYP= 0
##$CFRGTYP= 5
##$CHEMSTR= <none>
##$CNST= (0..31)
1 1 145 1 1 1 1 1 1 1 1 1 1 1 1 1 1 1 1 1 1 1 1 1 1 1 1 1 1 1 1 1 
##$CPDPRG= <waltz16>
##$CPDPRG1= <>
##$CPDPRG2= <waltz16>
##$CPDPRG3= <>
##$CPDPRG4= <mlev>
##$CPDPRG5= <mlev>
##$CPDPRG6= <mlev>
##$CPDPRG7= <mlev>
##$CPDPRG8= <mlev>
##$CPDPRGB= <>
##$CPDPRGT= <>
##$D= (0..31)
0 1 0 0 0 0 0 0 0 0 0 0.03 2e-05 3e-06 0 0 0 0 0 0 0 0 0 0 0 0 0 0 0 0 
0 0 
##$DATE= 1580992248
##$DBL= (0..7)
120 120 120 11 120 120 24 19 
##$DBP= (0..7)
150 150 150 150 150 150 150 150 
##$DBP07= 0
##$DBPNAM0= <>
##$DBPNAM1= <>
##$DBPNAM2= <>
$$ [...]
##$SUBNAM3= <"">
##$SUBNAM4= <"">
##$SUBNAM5= <"">
##$SUBNAM6= <"">
##$SUBNAM7= <"">
##$SUBNAM8= <"">
##$SUBNAM9= <"">
##$SW= 369.568048894756
##$SWIBOX= (0..15)
0 1 3 0 0 0 0 0 0 0 0 0 0 0 0 0 
##$SW_h= 29940.119760479
##$TD= 32768
##$TD0= 1
##$TE= 0
##$TE2= 300
##$TE3= 300
##$TEG= 300
##$TL= (0..7)
0 120 53 12 22 120 120 120 
##$TP= (0..7)
150 150 150 150 150 150 150 150 
##$TP07= 0
##$TPNAME0= <>
##$TPNAME1= <>
##$TPNAME2= <>
##$TPNAME3= <>
##$TPNAME4= <>
##$TPNAME5= <>
##$TPNAME6= <>
##$TPNAME7= <>
##$TPOAL= (0..7)
0.5 0.5 0.5 0.5 0.5 0.5 0.5 0.5 
##$TPOFFS= (0..7)
0 0 0 0 0 0 0 0 
##$TUNHIN= 0
##$TUNHOUT= 0
##$TUNXOUT= 0
##$USERA1= <user>
##$USERA2= <user>
##$USERA3= <user>
##$USERA4= <user>
##$USERA5= <user>
##$V9= 5
##$VALIST= <valist>
##$VCLIST= <CCCCCCCCCCCCCCC>
##$VD= 0
##$VDLIST= <DDDDDDDDDDDDDDD>
##$VPLIST= <PPPPPPPPPPPPPPP>
##$VTLIST= <TTTTTTTTTTTTTTT>
##$WBST= 1024
##$WBSW= 4
##$XGAIN= (0..3)
0 0 0 0 
##$XL= 0
##$YL= 0
##$YMAX_a= 53719
##$YMIN_a= -59211
##$ZGOPTNS= <>
##$ZL1= 120
##$ZL2= 120
##$ZL3= 120
##$ZL4= 120
##$ABSF1= 182.463
##$ABSF2= -187.1042
##$ABSG= 5
##$ABSL= 3
##$ALPHA= 0
##$AQORDER= 0
##$ASSFAC= 0
##$ASSFACI= 0
##$ASSFACX= 0
##$ASSWID= 0
##$AUNMP= <proc_1d>
##$AZFE= 0.1
##$AZFW= 0.5
##$BCFW= 0
##$BC_mod= 2
##$BYTORDP= 0
##$COROFFS= 0
##$CY= -3
##$DATMOD= 1
##$DC= 0
##$DFILT= <>
##$DTYPP= 0
##$F1P= 0
##$F2P= 0
##$FCOR= 1
##$FTSIZE= 65536
##$FT_mod= 6
##$GAMMA= 0
##$GB= 0
##$INTBC= 1
##$INTSCL= 5.30512e-09
##$ISEN= 30
##$LB= 1
##$LEV0= 0
##$LPBIN= 0
##$MAXI= 10000
##$MC2= 0
##$MEAN= 0
##$ME_mod= 0
##$MI= 50
##$NCOEF= 0
##$NC_proc= -3
##$NLEV= 6
##$NOISF1= 182.463
##$NOISF2= 159.3651
##$NSP= 0
##$NTH_PI= 0
##$NZP= 0
##$OFFSET= 182.463
##$PC= 4
##$PHC0= -1380.176
##$PHC1= 190.4013
##$PH_mod= 1
##$PKNL= yes
##$PPARMOD= 0
##$PSCAL= 0
##$PSIGN= 0
##$REVERSE= no
##$SF= 81.0140089999434
##$SI= 65536
##$SIGF1= 159.3651
##$SIGF2= -187.1042
##$SINO= 113.3802
##$SIOLD= 16384
##$SREGLST= <1H.CDCl3>
##$SSB= 0
##$STSI= 65536
##$STSR= 0
##$SW_p= 29940.119760479
##$SYMM= 0
##$S_DEV= 0
##$TDeff= 32768
##$TDoff= 0
##$TI= <>
##$TILT= no
##$TM1= 0
##$TM2= 0
##$TOPLEV= 0
##$USERP1= <user>
##$USERP2= <user>
##$USERP3= <user>
##$USERP4= <user>
##$USERP5= <user>
##$WDW= 1
##$XDIM= 65536
##$YMAX_p= 443240441
##$YMIN_p= -4709939
$$ End of Bruker specific parameters
$$ ---------------------------------
##NTUPLES= NMR SPECTRUM
##VAR_NAME=  FREQUENCY,     SPECTRUM/REAL,   SPECTRUM/IMAG
##SYMBOL=    X,             R,               I
##VAR_TYPE=  INDEPENDENT,   DEPENDENT,       DEPENDENT
##VAR_FORM=  AFFN,          ASDF,            ASDF
##VAR_DIM=   65536,         65536,           65536
##UNITS=     HZ,            ARBITRARY UNITS, ARBITRARY UNITS
##FACTOR=    0.456856943014862, 1,           1
##FIRST=     14782.0589164792, 0,            0
##LAST=      -15158.0608439998, 0,           0
##MIN=       -15158.0608439998, -4709939,    0
##MAX=       14782.0589164792, 443240441,    0
$$ Real data points
##PAGE= N=1
##DATA TABLE= (X++(R..R)), XYDATA
$$ [...]
$$ plain form
37329 -95275 196132 409195 442463 454363 507072 403835 43938 -305940 -330749 -111599
37319 -111599 -3342 -135994 -285711 -249050 -111746 -55639 -80019 -65467 -11797 -35310 -142019
37308 -142019 -164579 7122 235237 279618 94050 -134918 -247968 -287804 -349934 -374066
37298 -374066 -227225 50365 251161 277587 257475 312792 361717 275651 117194 53979 97638
37287 97638 106403 27511 -42768 -57346 -98376 -204291 -280489 -269279 -267047 -362987 -477261 -478643
37275 -478643 -368916 -232766 -94194 49481 135749 124846 110416 187276 267784 199534 18099
37264 18099 -106220 -140355 -191080 -242270 -139428 109870 271681 231826 171519 243673 299048
37253 299048 156264 -34401 21669 301953 479630 389133 217851 180440 224241 166458
$$ packed form
37329i5275K91407K13063L3268J1900N2709j03237l59897l49878k4809K19150
37319a11599J08257j32652j49717L6661J37304N6107k4380J4552N3670k3513j06709
37308a42019k2560J71701K28115M4381j85568k28968j13050l9836o2130k4132
37298c74066J46841K77590K00796K6426k0112N5317M8925q6066j58457o3215M3659
37287I7638Q765p8892p0279j4578m1030j05915p6198J1210K232r5940j14274j382
37275d78643J09727J36150J38572J43675Q6268j0903j4430P6860Q0508o8250j81435
37264A8099j24319l4135n0725n1190J02842K49298J61811l9855o0307P2154N5375
37253B99048j42784j90665N6070K80284J77677r0497j71282l7411M3801n7783
$$ plain form
37243 166458 -26671 -218891 -286579 -236351 -172450 -181777 -232107 -207397 -86202 -13917 -93750
37232 -93750 -183107 -71298 177656 276711 131892 -25446 -7984 54011 -33280 -187098 -180179
37221 -180179 -4406 125910 97852 21198 12212 27439 -34319 -176563 -298937 -281222 -71107
37210 -71107 238020 434395 392109 239986 216962 361072 473185 414062 290384 270624
37200 270624 344866 387339 374495 398887 489058 546077 488275 367825 288312 253206 160202
37189 160202 -45475 -249260 -248852 10827 310057 330314 -14686 -470291 -696947 -591859
37179 -591859 -318121 -77724 52232 82983 35830 -49439 -102537 -89089 -62404 -99249 -197863
37168 -197863 -274821 -250860 -115517 71610 215137 242857 164827 58008 -25552 -92131 -117172
$$ packed form
37243A66458j93129j92220o7688N0228O3901r327n0330K4710J21195P2285p9833
37232i3750q9357J11809K48954R9055j44819j57338J7462O1995q7291j53818O919
37221a80179J75773J30316k8058p6654q986J5227o1758j42244j22374J7715K10115
37210g1107L09127J96375m2286j52123k3024J44110J12113n9123j23678j9760
37200B70624P4242M2473j2844K4392R0171N7019n7802j20450p9513l5106r3004
37189A60202k05677k03785M08K59679K99230K0257l45000m55605k26656J05088
37179e91859K73738K40397J29956L0751m7153q5269n3098J3448K6685l6845r8614
37168a97863p6958K3961J35343J87127J43527K7720p8030j06819q3560o6579k5041
$$ plain form
37157 -117172 1610 307007 639911 757860 605188 362880 219894 208426 283178 414774
37147 414774 529269 490170 261097 -1745 -131814 -148950 -164979 -182615 -128206 -14915
37137 -14915 78739 141457 192201 171067 36396 -89990 -76735 -33500 -170062 -432026 -555463
37126 -555463 -493922 -466226 -508502 -350281 77972 371573 187350 -223452 -375569 -238664
37116 -238664 -163100 -243818 -208509 57124 297409 310026 233872 253980 296364 205341 20864
37105 20864 -108943 -153556 -182818 -229213 -289599 -373194 -455333 -475577 -449985 -473817 -546329
37094 -546329 -522389 -324642 -82284 36717 27155 -4206 12125 87288 197373 256746 176586
37083 176586 8951 -94668 -121457 -228182 -452539 -582841 -451610 -192878 -47111 -50716
$$ packed form
37157a17172J18782L05397L32904J17949j52672k42308j42986j1468P4752J31596
37147D14774J14495l9099k29073k62842j30069j7136j6029j7636N4409J13291
37137a4915R3654O2718N0744k1134j34671j26386J3255M3235j36562k61964j23437
37126e55463O1541K7696m2276J58221M28253K93601j84223m10802j52117J36905
37116b38664P5564q0718L5309K65633K40285J2617p6154K0108M2384r1023j84477
37105B0864j29807m4613k9262m6395o0386q3595q2139k0244K5592k3832p2512
37094e46329K3940J97747K42358J19001r562l1361J6331P5163J10085N9373q0160
37083A76586j67635j03619k6789j06725k24357j30302J31231K58732J45767l605
$$ plain form
37073 -50716 -84677 -102389 -130919 -148499 -127974 -115148 -130285 -107057 -54495 -116618 -314871
37062 -314871 -428744 -341667 -290604 -490744 -714898 -603783 -242063 -19917 -23462 -13804 29031
37051 29031 -154100 -547594 -742284 -547344 -291917 -295797 -423743 -418688 -324405 -283635 -223525
37040 -223525 -58881 53400 -15304 -76732 62064 221003 141922 -39465 -22726 107727
37030 107727 11784 -293167 -402941 -140409 207349 346058 309180 227497 92587 -97198
37020 -97198 -218984 -213718 -192881 -234889 -259465 -203874 -135852 -96043 -18781 92550 104979
37009 104979 -19653 -126314 -110788 -84118 -167994 -292658 -326819 -255164 -112296 91019
36999 91019 255431 199031 -65592 -242644 -126982 99804 150325 44243 -6453 11074
$$ packed form
37073e0716l3961j7712k8530j7580K0525J2826j5137K3228N2562o2123j98253
37062c14871j13873Q7077N1063k00140k24154J11115L61720K22146l545R658M2835
37051B9031j83131l93494j94690J94940K55427l880j27946N055R4283M0770O0110
37040b23525J64644J12281o8704o1428J38796J58939p9081j81387J6739J30453
37030A07727r5943l04951j09774K62532L47758J38709l6878q1683j34910j89785
37020i7198j21786N266K0837m2008k4576N5591O8022L9809P7262J11331J2429
37009A04979j24632j06661J5526K6670q3876j24664l4161P1655J42868K03315
36999I1019J64412n6400k64623j77052J15662K26786N0521j06082n0696J7527
$$ plain form
36989 11074 -68713 -239854 -303187 -214768 -182134 -330279 -489417 -438477 -219046 -84018 -200827
36978 -200827 -485437 -697572 -663631 -426951 -183265 -64319 -37474 -41419 -113458 -287890
36968 -287890 -458377 -471524 -306793 -56061 203704 394949 392070 167730 -74791 -111016
36958 -111016 -3087 182 -156602 -284351 -287065 -301991 -432982 -569481 -580078 -498937 -402189
36947 -402189 -266722 -81710 45853 36721 -26952 -42576 -52524 -139416 -257770 -306303 -284355
36936 -284355 -246536 -180917 -64813 30621 29415 -14091 -617 53184 78132 116032 251960
36925 251960 411935 407755 202348 -25969 -125527 -141782 -188175 -266130 -300223 -275701 -248446
36914 -248446 -248348 -246008 -215480 -181337 -181152 -199988 -179315 -110774 -81825 -163139 -268621 -230871
$$ packed form
36989A1074p9787j71141o3333Q8419L2634j48145j59138N0940K19431J35028j16809
36978b00827k84610k12135L3941K36680K43686J18946K6845l945p2039j74432
36968b87890j70487j3147J64731K50732K59765J91245k879k24340k42521l6225
36958a11016J07929L269j56784j27749k714j4926j30991j36499j0597Q1141R6748
36947d02189J35467J85012J27563r132o3673j5624r948q6892j18354m8533K1948
36936b84355L7819O5619J16104R5434j206m3506J3474N3801K4948L7900J35928
36925B51960J59975m180k05407k28317r9558j6255m6393p7955l4093K4522K7255
36914b48446R8K340L0528L4143J85j8836K0673O8541K8949q1314j05482L7750
$$ plain form
36902 -230871 -41273 103922 71735 -7185 66805 248484 298066 130857 -50819 -23769
36892 -23769 183175 357088 358377 225797 68254 -58112 -150370 -194047 -157797 -66376 -31334
36881 -31334 -146531 -362498 -534870 -601621 -626246 -647347 -599788 -447280 -283415 -204330 -169342
36870 -169342 -95406 -9600 15858 12404 61957 145055 181030 177864 195793 195245 81007 -112328
36858 -112328 -232120 -203617 -74451 112800 320605 406226 228260 -96637 -252502 -116121
36848 -116121 96123 157807 115985 125915 182718 179961 106207 22231 -61239 -137753 -125924 17414
36836 17414 175274 199655 105823 19520 -1260 27128 103047 192987 170962 -29126 -245893
36825 -245893 -243435 -14047 221295 294634 220573 67100 -119258 -239836 -178418 23369
$$ packed form
36902b30871J89598J45195l2187p8920P3990J81679M9582j67209j81676K7050
36892b3769K06944J73913J289j32580j57543j26366r2258m3677L6250R1421L5042
36881c1334j15197k15967j72372o6751k4625k1101M7559J52508J63865P9085L4988
36870a69342P3936Q5806K5458l454M9553Q3098L5975l166J7929n48j14238j93335
36858a12328j19792K8503J29166J87251K07805Q5621j77966l24897j55865J36381
36848a16121K12244O1684m1822R930N6803k757p3754q3976q3470p6514J1829J43338
36836A7414J57860K4381r3832q6303k0780K8388P5919Q9940k2025k00088k16767
36825b45893K458K29388K35342P3339p4061j53473j86358j20578O1418K01787
$$ plain form
36815 23369 169415 163499 137617 242681 419245 481846 362949 170337 34790 -14290 -28043
36804 -28043 -50989 -66015 -15597 110067 217952 199821 85742 40802 164755 351998 419552
36793 419552 344616 291222 385191 532629 520767 276005 -42608 -219717 -196636 -72414
36783 -72414 52674 161011 268603 377249 484799 577135 605488 538357 429999 351422
36773 351422 261872 67972 -178848 -292433 -209673 -87114 -62778 -79696 -57149 -71825 -202426
36762 -202426 -330766 -298809 -167796 -112106 -130598 -90906 -13734 -65684 -267368 -445195 -506836
36751 -506836 -543064 -604278 -593779 -466928 -342585 -315762 -323476 -290259 -247271 -208002 -84501
36740 -84501 150603 348166 348655 163979 -91630 -332175 -478329 -448567 -285355 -165235
$$ packed form
36815B3369J46046n916k5882J05064J76564O2601j18897j92612j35547m9080j3753
36804b8043k2946j5026N0418J25664J07885j8131j14079m4940J23953J87243O7554
36793D19552p4936n3394R3969J47438j1862k44762l18613j77109K3081J24222
36783g2414J25088J08337J07592J08646J07550R2336K8353o7131j08358p8577
36773C51422q9550j93900k46820j13585Q2760J22559K4336j6918K2547j4676j30601
36762b02426j28340L1957J31013N5690j8492L9692P7172n1950k01684j77827o1641
36751e06836l6228o1214J0499J26851J24343K6823p714L3217M2988L9269J23501
36740h4501K35104J97563M89j84676k55609k40545j46154K9762J63212J20120
$$ plain form
36730 -165235 -171624 -182033 -89507 10049 -9129 -83370 -79781 -17248 8558 17882 79348 134150
36718 134150 73970 -74042 -213573 -345983 -478860 -464161 -175801 202915 340118 206006
36708 206006 101480 202380 337501 302894 154870 63502 69146 118898 182634 201581 69649
36697 69649 -196253 -397750 -406858 -357462 -437535 -598573 -640273 -507472 -328956 -204936 -123979
36686 -123979 -75763 -88104 -134323 -132366 -69204 -33847 -100906 -246912 -383416 -412293 -277071
36675 -277071 -49500 62818 -86857 -384153 -572773 -577628 -560315 -616434 -595591 -342922
36665 -342922 15803 201725 131977 -24979 -115017 -144552 -144512 -69684 76071 149078 30373
36654 30373 -188647 -306805 -265252 -191284 -207353 -299981 -383301 -402576 -356642 -288030 -261954
$$ packed form
36730a65235o389j0409R2526R9556j9178p4241L589O2533K5806R324O1466N4802
36718A34150o0180j48012j39531j32410j32877J4699K88360L78716J37203j34112
36708B06006j04526J00900J35121l4607j48024r1368N644M9752O3736J8947j31932
36697F9649k65902k01497r108M9396q0073j61038m1700J32801J78516J24020Q0957
36686a23979M8216j2341m6219J957O3162L5357o7059j46006j36504k8877J35222
36675b77071K27571J12318j49675k97296j88620m855J7313n6119K0843K52669
36665c42922L58725J85922o9748j56956r0038k9535M0P4828J45755P3007j18705
36654C0373k19020j18158M1553P3968j6069r2628q3320j9275M5934O8612K6076
$$ plain form
36643 -261954 -290271 -280107 -143043 42030 82445 -78495 -268162 -296022 -170121 -42759
36633 -42759 -25062 -121390 -261163 -317970 -185870 67073 206001 103490 -74033 -91241
36623 -91241 17347 9052 -200112 -423720 -477026 -379390 -236204 -87833 42517 91815 45553
36612 45553 -22055 -70133 -138007 -202018 -142231 26288 50803 -234913 -596218 -645675 -356362
36601 -356362 -74738 -19816 -49874 -12437 -36851 -267769 -521104 -501920 -273975 -204143 -428061
36590 -428061 -660344 -631405 -457783 -406761 -488337 -506339 -397683 -280298 -213501 -144451 -92419
36579 -92419 -164037 -343971 -470735 -481443 -487701 -531211 -470955 -239885 -19837 12003 -52607
36568 -52607 -46824 -50165 -264179 -634159 -853090 -749303 -461237 -211305 -98137 -131736 -274119
$$ packed form
36643b61954k8317J0164J37064J85073M0415j60940j89667k7860J25901J27362
36633d2759J7697r6328j39773n6807J32100K52943J38928j02511j77523j7208
36623i1241J08588q295k09164k23608n3306R7636J43186J48371J30350M9298m6262
36612D5553o7608m8078o7874o4011N9787J68519K4515k85716l61305m9457K89313
36601c56362K81624N4922l0058L7437k4414k30918k53335J9184K27945O9832k23918
36590d28061k32283K8939J73622N1022q1576j8002J08656J17385O6797O9050N2032
36579i2419p1618j79934j26764j0708o258m3510O0256K31070K20048L1840o4610
36568e2607N783l341k14014l69980k18931J03787K88066K49932J13168l3599j42383
$$ plain form
36557 -274119 -390803 -336109 -151448 -33306 -60727 -112941 -102002 -104191 -180705 -246677 -230266
36546 -230266 -205281 -239983 -255377 -175962 -100843 -166953 -325937 -406400 -341563 -212220 -121394
36535 -121394 -135939 -281673 -477664 -545224 -410089 -235261 -226800 -370884 -498532 -543522
36525 -543522 -571669 -598503 -562593 -481703 -466764 -549046 -628572 -623607 -551251 -439001 -283638
36514 -283638 -132461 -82003 -140777 -188946 -122839 41989 243025 450253 627597 705538
36504 705538 657278 547638 466153 464208 573908 801775 1059057 1182448 1098584 924285
36494 924285 845396 925390 1071546 1154575 1125094 1045404 1041155 1194884 1459785 1700050 1827866
36483 1827866 1868876 1885659 1883190 1814221 1648415 1421434 1236212 1203224 1333723 1500390
$$ packed form
36557b74119j16684N4694J84661J18142k7421n2214J0939k189p6514o5972J6411
36546b30266K4985l4702j5394P9415P5119o6110j58984q0463O4837J29343R0826
36535a21394j4545j45734j95991o7560J35135J74828Q461j44084j27648m4990
36525e43522k8147k6834L5910Q0890J4939q2282p9526M965P2356J12250J55363
36514b83638J51177N0458n8774m8169O6107J64828K01036K07228J77344P7941
36504G05538m8260j09640q1485j945J09700K27867K57282J23391q3864j74299
36494I24285p8889P9994J46156Q3029k9481p9690m249J53729K64901K40265J27816
36483A827866M1010J6783k469o8969j65806k26981j85222l2988J30499J66667
$$ plain form
36473 1500390 1559125 1503336 1434877 1396309 1326800 1195376 1067978 991335 905968 752725 597072
36462 597072 555982 634861 718755 714833 639209 563588 529410 529728 547570 591078 678564 778612
36450 778612 791870 647958 423438 298277 362287 512290 578190 513443 423406 432896 557167
36439 557167 683078 661445 449565 180014 55222 156271 380807 562111 600527 494195
36429 494195 328572 242912 302480 378759 282286 66081 37357 341816 682440 657386 302249
36418 302249 57480 192754 501600 645006 581544 501726 487400 437882 279415 70295
36408 70295 -105028 -214295 -236134 -152416 -7426 114006 186312 237430 239310 124773 -43839
36397 -43839 -53991 204908 553859 707275 593760 381011 226231 143816 112064 150627
$$ packed form
36473A500390N8735n5789o8459l8568o9509j31424j27398p6643q5367j53243j55653
36462E97072m1090P8879Q3894l922p5624p5621l4178L18J7842M3508Q7486J00048
36450G78612J3258j43912k24520j25161O4010J50003O5900o4747r0037R490J24271
36439E57167J25911k1633k11880k69551j24792J01049K24536J81304L8416j06332
36429D94195j65623q5660N9568P6279r6473k16205k8724L04459L40624k5054l55137
36418C02249k44769J35274L08846J43406o3462p9818j4326m9518j58467k09120
36408G0295j75323j09267k1839Q3718J44990J21432P2306N1118J880j14537j68612
36397d3839j0152K58899L48951J53416j13515k12749j54780q2415l1752L8563
$$ plain form
36387 150627 235632 261841 170560 31566 -72882 -164941 -293604 -418037 -468491 -467028 -475740
36376 -475740 -457368 -307143 -27624 228695 315583 224159 51534 -87384 -106247 10811
36366 10811 172365 239019 160580 25223 -46926 -25153 33685 71439 82688 94756 114175
36355 114175 104899 34592 -64416 -121472 -122423 -118175 -113631 -30474 154202 309247 289538 127711
36343 127711 -14197 -45702 1703 79392 147996 127973 -26806 -201843 -213251 -51003 103271
36332 103271 132333 119405 178955 283583 332660 292186 199866 112645 92537 161557 250206
36321 250206 292048 368452 606819 915128 1012309 798665 506235 373243 357987 316727
36311 316727 273852 313801 352304 248171 54872 -59508 -81235 -124721 -180486 -112056 95095
$$ packed form
36387A50627Q5005K6209r1281j38994j04448r2059j28663j24433n0454J463q712
36376d75740J8372J50225K79519K56319Q6888r1424j72625j38918j8863J17058
36366A0811J61554O6654p8439j35357p2149K1773N8838L7754J1249J2068J9419
36355A14175r276p0307r9008n7056r51M248M544Q3157J84676J55045j9709j61827
36343A27711j41908l1505M7405P7689O8604k0023j54779j75037j1408J62248J54274
36332A03271K9062j2928N9550J04628M9077m0474r2320q7221k0108O9020Q8649
36321B50206M1842P6404K38367L08309R7181k13644k92430j32992j5256m1260
36311C16727m2875L9949L8503j04133j93299j14380k1727m3486n5765O8430K07151
$$ plain form
36300 95095 279440 322648 264640 188733 141638 171061 289920 393233 354791 211616 113650
36289 113650 105231 118760 164548 317886 495961 474110 206072 -67186 -133646 -66492 -48717
36278 -48717 -97678 -108338 -52522 19580 105237 238669 393338 501557 545472 550786 519060
36267 519060 428192 274837 83744 -81888 -110019 70058 349300 489797 379649 157528
36257 157528 24621 20084 52669 63885 62159 53060 26266 -16542 -69285 -112816 -77295 99639
36245 99639 341443 470842 438371 389555 424371 433459 304335 156062 180412 329803 372401
36234 372401 240926 133469 235179 491245 704148 739715 591681 344873 134771 75941
36224 75941 170759 307545 364241 303822 191383 140236 196630 248804 126637 -155412 -358356
$$ packed form
36300I5095J84345M3208n8008p5907m7095K9423J18859J03313l8442j43175r7966
36289A13650q419J3529M5788J53338J78075k1851k68038k73258o6460O7154J7775
36278d8717m8961j0660N5816P2102Q5657J33432J54669J08219M3915N314l1726
36267E19060r0868j53355j91093j65632k8131J80077K79242J40497j10148k22121
36257A57528j32907m537L2585J1216j726r099k6794m2808n2743m3531L5521J76934
36245I9639K41804J29399l2471m8816L4816R088j29124j48273K4350J49391M2598
36234C72401j31475j07457J01710K56066K12903L5567j48034k46808k10102n8830
36224G5941R4818J36786N6696o0419j12439n1147N6394N2174j22167k82049k02944
$$ plain form
36213 -358356 -316693 -162554 -105515 -97466 66984 372321 562836 524388 435043 454998 500403
36202 500403 456973 409596 474426 558634 500752 354274 315433 412654 470264 373398 183688
36191 183688 -19888 -225622 -362958 -277792 46733 370340 439794 291510 182082 250381
36181 250381 381228 413301 352951 313817 329395 326772 264807 206967 233536 341309 465972
36170 465972 562617 621260 631342 583648 500170 415887 332092 233525 152185 152990 231222 284245
36158 284245 238472 162965 182946 292312 337622 221468 52046 17689 140143 240354
36148 240354 172418 16250 -28189 101560 265944 318103 271075 220739 174580 53550 -148061
36137 -148061 -299576 -272051 -87217 120634 261745 350848 413579 404499 272646 76138
$$ packed form
36213c58356M1663J54139N7039Q049J64450L05337J90515l8448q9345J9955M5405
36202E00403m3430m7377O4830Q4208n7882j46478l8841R7221N7610r6866j89710
36191A83688k03576k05734j37336Q5166L24525L23607O9454j48284j09428O8299
36181B50381J30847L2073o0350l9134J5578k623o1965n7840K6569J07773J24663
36170D65972R6645N8643J0082m7694q3478q4283q3795r8567q1340Q05P8232N3023
36158B84245m5773p5507J9981J09366M5310j16154j69422l4357J22454J00211
36148B40354o7936j56168m4439J29749J64384N2159m7028n0336m6159j21030k01611
36137a48061j51515K7525J84834K07851J41111Q9103O2731r080j31853j96508
$$ plain form
36127 76138 -50198 -63608 -79022 -207015 -375502 -397080 -195257 123435 414756 611528
36117 611528 685138 620454 484262 401181 379738 271566 6552 -241415 -265454 -113844
36107 -113844 2974 29307 89584 227434 342785 406839 507729 616779 544812 256322
36097 256322 13965 36051 187177 214554 139798 161334 265686 232210 19685 -132189
36087 -132189 -55979 122360 221488 268602 384500 547273 627049 576433 455882 324512
36077 324512 216993 183778 245481 327039 324340 228274 124601 90554 137146 215785 230798
36066 230798 95228 -155597 -345983 -331958 -165898 -22529 7896 -20549 -24906 17044 78286
36055 78286 105228 40044 -105626 -215104 -187361 -86037 -87708 -287926 -635684 -1038894 -1432997
$$ packed form
36127G6138j26336j3410j5414j27993j68487k1578K01823L18692K91321J96772
36117F11528P3610o4684j36192q3081k1443j08172k65014k47967k4039J51610
36107a13844J16818K6333O0277J37850J15351O4054J00890J09050p1967k88490
36097B56322k42357K2086J51126K7377p4756K1536J04352l3476k12525j51874
36087a32189P6210J78339R9128M7114J15898J62773P9776n0616j20551j31370
36077C24512j07519l3215O1703Q1558k699r6066j03673l4047M6592P8639J5013
36066B30798j35570k50825j90386J4025J66060J43369L0425k8445m357M1950O1242
36055G8286K6942o5184j45670j09478K7743J01324j671k00218l47758m03210l94103
$$ plain form
36044 -1432997 -1762398 -2028465 -2371532 -2955054 -3700850 -4262456 -4351588 -4004898 -3460720 -2889408
36034 -2889408 -2359555 -1964805 -1800990 -1818008 -1826802 -1686305 -1411535 -1096278 -814325 -617153
36024 -617153 -553428 -637027 -808147 -945643 -934726 -760821 -546229 -438962 -438036 -395968 -238693
36013 -238693 -98205 -140088 -324875 -450034 -393632 -212277 -24793 91663 102685 23511
36003 23511 -68221 -109352 -129440 -172757 -186143 -107060 -27304 -103842 -298527 -380506 -239196
35992 -239196 -33628 51714 55550 130969 293618 403999 349132 150343 -74380 -199189
35982 -199189 -185718 -124052 -122440 -152503 -108027 -23306 -66479 -248974 -322654 -104776 234028
35971 234028 369742 213013 -60562 -274426 -369244 -331884 -204192 -133936 -236256 -411679
$$ packed form
36044a432997l29401k66067l43067n83522p45796n61606q9132L46690N44178N71312
36034b889408N29853L94750J63815j7018q794J40497K74770L15257K81953J97172
36024f17153O3725q3599j71120j37496J0917J73905K14592J07267R26M2068J57275
36013b38693J40488m1883j84787j25159N6402J81355J87484J16456J1022p9174
36003B3511r1732m1131k0088m3317j3386P9083P9756p6538j94685q1979J41310
35992b39196K05568Q5342L836P5419J62649J10381n4867j98789k24723j24809
35982a99189J3471O1666J612l0063M4476Q4721m3173j82495p3680K17878L38804
35971B34028J35714j56729k73575k13864r4818L7360J27692P0256j02320j75423
$$ plain form
35961 -411679 -457670 -342687 -208432 -125468 -39091 38886 -5694 -179734 -320629 -317130 -236066
35950 -236066 -161015 -69129 42198 72456 -6918 -29225 158353 447357 581658 469755
35940 469755 251553 90052 28090 41089 104416 175896 197221 160055 134130 197278 338880
35929 338880 435589 343300 57697 -222613 -268684 -84340 80829 28265 -162835 -279157
35919 -279157 -258526 -208426 -186101 -119536 20623 109273 24589 -156073 -234937 -159958 -107363
35908 -107363 -252552 -528951 -697167 -636052 -479678 -438559 -549921 -656011 -594144 -360197
35898 -360197 -106148 -15353 -158242 -431896 -652287 -717371 -646864 -475735 -215781 39273
35888 39273 112691 -29757 -161074 -59621 181015 289687 208126 124487 132361 109125 -8092
$$ packed form
35961d11679m5991J14983J34255Q2964Q6377P7977m4580j74040j40895L499Q1064
35950b36066P5051R1886J11327L0258p9374k2307J87578K89004J34301j11903
35940D69755k18202j61501o1962J2999O3327P1480K1325l7166k5925O3148J41602
35929C38880R6709r2289k85603k80310m6071J84344J65169n2564j91100j16322
35919b79157K0631N0100K2325O6565J40159Q8650q4684j80662p8864P4979N2595
35908a07363j45189k76399j68216O1115J56374M1119j11362j06090O1867K33947
35898c60197K54049R0795j42889k73654k20391o5084P0507J71129K59954K55054
35888C9273P3418j42448j31317J01453K40636J08672q1561q3639P874k3236j17217
$$ plain form
35877 -8092 -71841 21724 127214 61319 -124259 -242629 -231277 -156414 -56903 52676 96558
35866 96558 17518 -102734 -141665 -110369 -104149 -138650 -177830 -264321 -447588 -614915 -587287
35855 -587287 -396374 -278693 -342083 -412270 -308706 -131297 -127464 -341832 -548599 -542824 -384753
35844 -384753 -287593 -319728 -322978 -153513 89262 176550 59420 -60691 7262 223186 398888
35833 398888 402342 231993 -9338 -161412 -138740 -71032 -175468 -418762 -484866 -209496
35823 -209496 139894 217604 72064 6714 83773 79169 -95186 -240530 -202737 -91756 -71982
35812 -71982 -138326 -196651 -200798 -137464 -30353 -2913 -160565 -376471 -404874 -252890 -190411
35801 -190411 -310971 -371104 -215957 -68452 -159511 -330142 -304205 -154849 -147640 -252075
$$ packed form
35877h092o3749R3565J05490o5895j85578j18370J1352P4863R9511J09579M3882
35866I6558p9040j20252l8931L1296O220l4501l9180q6491j83267j67327K7628
35855e87287J90913J17681o3390p0187J03564J77409L833k14368k06767N775J58071
35844c84753R7160l2135l250J69465K42775Q7288j17130j20111O7953K15924J75702
35833C98888L454j70349k41331j52074K2672O7708j04436k43294o6104K75370
35823b09496L49390P7710j45540o5350P7059m604j74355j45344L7793J10981J9774
35812g1982o6344n8325m147O3334J07111K7440j57652k15906k8403J51984O2479
35801a90411j20560o0133J55147J47505r1059j70631K5937J49356P209j04435
$$ plain form
35791 -252075 -195646 40561 169523 81640 15960 134986 252816 165224 -11706 -46281
35781 -46281 66721 196171 350174 606210 852120 857100 603330 344673 301674 442513
35771 442513 579824 545808 269046 -155363 -438129 -316750 110463 424718 369148 147655
35761 147655 105187 256426 344561 275466 219890 273585 287876 145384 -16250 -15560 101181
35750 101181 177192 204960 268254 320700 255929 158687 235133 460470 530745 264739 -129461
35739 -129461 -316143 -223721 -39069 86834 172086 280516 393931 420403 277063 -16057
35729 -16057 -293810 -357151 -182943 33360 102954 45383 -8037 -33242 -110903 -238635 -287403
35718 -287403 -177214 8590 146023 243249 412389 678668 888002 855542 591741 315923
$$ packed form
35791b52075N6429K36207J28962q7883o5680J19026J17830q7592j76930l4575
35781d6281J13002J29450J54003K56036K45910M980k53770k58657m2999J40839
35771D42513J37311l4016k76762m24409k82766J21379M27213L14255n5570k21493
35761A47655m2468J51239Q8135o9095n5576N3695J4291j42492j61634O90J16741
35750A01181P6011K7768O3294N2446o4771r7242P6446K25337P0275k66006l94200
35739a29461j86682R2422J84652J25903Q5252J08430J13415K6472j43340k93120
35729a6057k77753o3341J74208K16303O9594n7571n3420k5205p7661j27732m8768
35718b87403J10189J85804J37433R7226J69140K66279K09334l2460k63801k75818
$$ plain form
35708 315923 210276 218468 163246 18594 -60905 8136 94343 31666 -159581 -326749 -387978
35697 -387978 -377239 -331370 -242382 -117444 -1624 70722 94601 65534 -19437 -128295 -196588
35686 -196588 -172398 -57081 78074 120540 13594 -161850 -258126 -227180 -148349 -82017 -4212
35675 -4212 69892 29738 -155320 -305011 -216062 65962 295850 326081 230868 143626 99706
35664 99706 68494 41809 42332 94668 210332 366668 501829 564443 552364 471866 301903
35653 301903 55436 -163251 -232601 -126201 90824 328378 482032 452731 251088 31646
35643 31646 -70717 -89832 -121412 -136541 -33526 169036 335516 392178 372043 300588 174015
35632 174015 37683 -55789 -153883 -314310 -417631 -259764 129826 442935 439182 191636
$$ packed form
35708C15923j05647Q192n5222j44652p9499O9041Q6207o2677j91247j67168o1229
35697c87978J0739M5869Q8988J24938J15820P2346K3879k9067q4971j08858o8293
35686a96588K4190J15317J35155M2466j06946j75444r6276L0946P8831O6332P7805
35675d212P4104m0154j85058j49691Q8949K82024K29888L0231r5213q7242m3920
35664I9706l1212k6685N23N2336J15664J56336J35161O2614j2079q0498j69963
35653C01903k46467k18687o9350J06400K17025K37554J53654k9301k01643k19442
35643C1646j02363j9115l1580j5129J03015K02562J66480N6662k0135p1455j26573
35632A74015j36332r3472r8094j60427j03321J57867L89590L13109l753k47546
$$ plain form
35622 191636 -78955 -260410 -347520 -327410 -199686 -40732 46966 12441 -136647 -317181
35612 -317181 -357187 -144035 177816 323877 250246 232249 455662 726734 769393 656282
35602 656282 716821 1094847 1610651 2026145 2254418 2319873 2293690 2292307 2398374 2557174
35592 2557174 2655160 2693964 2770854 2897994 2972867 2938551 2853884 2788864 2758709 2772534 2837473
35581 2837473 2897883 2873017 2769983 2666355 2587938 2519987 2529940 2723704 3045162 3263808
35571 3263808 3216157 2934653 2504086 1961055 1412055 1057924 943731 830739 507822 124195
35561 124195 -4131 147686 297512 294345 306505 488594 703797 748311 678403 697904 817151
35550 817151 856080 762686 698062 752314 772609 586148 259764 8852 -68652 -47034 -20377
$$ packed form
35622A91636k70591j81455q7110K0110J27724J58954Q7698l4525j49088j80534
35612c17181m0006K13152L21851J46061p3631j7997K23413K71072M2659j13111
35602F56282O0539L78026N15804M15494K28273O5455k6183j383J06067J58800
35592B557174R7986L8804P6890J27140P4873l4316q4667o5020l0155J3825O4939
35581B837473O0410k4866j03034j03628p8417o7951R953J93764L21458K18646
35571C263808m7651k81504m30567n43031n49000l54131j14193j12992l22917l83627
35561A24195j28326J51817J49826l167J2160J82089K15203M4514o9908J9501J19247
35550H17151L8929r3394o4624N4252K0295j86461l26384k50912p7504K1618K6657
$$ plain form
35539 -20377 -14596 -22077 -22114 15747 70608 51269 -73627 -180973 -149422 -63386 -105121 -261607
35527 -261607 -320786 -185959 -6532 75870 134433 296370 519628 663307 671692 565866
35517 565866 363373 138273 42879 106632 123187 -64519 -260445 -143499 241921 499745
35507 499745 417456 214851 161514 202904 142147 -3456 -53089 39651 154116 212657 229247
35496 229247 180052 26154 -122933 -69005 178576 333577 180573 -123648 -243058 -95045
35486 -95045 71577 34061 -124235 -166624 -28824 127843 152333 72939 7633 -5978 -36113
35475 -36113 -153414 -342919 -494696 -466274 -204275 159360 380298 326917 107529 -70214
35465 -70214 -129197 -150203 -201165 -231833 -163358 -23691 55598 -19338 -178488 -232278 -84059
$$ packed form
35539b0377N781p481l7L7861N4861j9339j24896j07346L1551Q6036m1735j56486
35527b61607n9179J34827J79427Q2402N8563J61937K23258J43679Q385j05826
35517E65866k02493k25100r5394O3753J6555j87706j95926J16946L85420K57824
35507D99745q2289k02605n3337M1390o0757j45603m9633R2740J14465N8541J6590
35496B29247m9195j53898j49087N3928K47581J55001j53004l04221j19410J48013
35486i5045J66622l7516j58296m2389J37800J56667K4490p9394o5306j3611l0135
35475c6113j17301j89505j51777K8422K61999L63635K20938n3381k19388j77743
35465g0214n8983k1006n0962l0668O8475J39667P9289p4936j59150n3790J48219
$$ plain form
35454 -84059 119949 140105 -44100 -192727 -141066 -36446 -102744 -290130 -369475 -315584 -342221
35443 -342221 -527810 -657010 -546863 -330194 -257458 -353386 -430020 -348236 -124696 140710
35433 140710 308194 249114 4611 -168754 -68462 184547 303356 217713 113961 110874
35423 110874 113712 41589 -6230 71307 182665 172878 60726 10903 109500 275123 374499
35412 374499 345831 223389 103597 69235 96249 64006 -89326 -256797 -273317 -113689
35402 -113689 80767 151828 42366 -199529 -445488 -529095 -371229 -100449 29005 -107302
35392 -107302 -373115 -530973 -483790 -310344 -108491 109320 352106 553747 608740 508289
35382 508289 392875 424045 607608 784941 810458 693662 542578 424544 342248 303031
$$ packed form
35454h4059K04008K0156j84205j48627N1661J04620o6298j87386p9345N3891k6637
35443c42221j85589j29200J10147K16669P2736r5928p6634Q1784K23540K65406
35433A40710J67484n9080k44503j73365J00292K53009J18809q5643j03752l087
35423A10874K838p2123m7819P7537J11358r787j12152m9823R8597J65623R9376
35412C74499k8668j22442j19792l4362K7014l2243j53332j67471j6520J59628
35402a13689J94456P1061j09462k41895k45959q3607J57866K70780J29454j36307
35392a07302k65813j57858M7183J73446K01853K17811K42786K01641N4993j00451
35382E08289j15414L1170J83563J77333K5517j16796j51084j18034q2296l9217
$$ plain form
35372 303031 323977 377143 410449 424878 456242 486434 466416 426271 442950 482693 427074
35361 427074 310429 350425 613506 819310 683029 336926 160574 243914 299666 137394
35351 137394 -57905 -38392 146703 273526 260926 183112 81159 -50275 -150374 -133966
35341 -133966 -24274 76051 121078 138274 156386 199433 282788 331062 205693 -65021 -205489
35330 -205489 -20498 291389 363234 138479 -102244 -157402 -94631 -14909 105789 260975
35320 260975 331559 270182 182544 126873 16441 -172737 -285963 -212374 -49510 95449
35310 95449 293877 612618 898715 950811 798631 623896 499771 395655 346735 412840
35300 412840 532429 608159 673105 785360 845756 748173 629587 690113 804887 640822
$$ packed form
35372C03031K0946N3166L3306J4429L1364L0192k0018m0145J6679L9743n5619
35361D27074j16645L9996K63081K05804j36281l46103j76352Q3340N5752j62272
35351A37394j95299J9513J85095J26823j2600p7814j01953j31434j00099J6408
35341a33966J09692J00325M5027J7196J8112M3047Q3355M8274j25369k70714j40468
35330b05489J84991L11887P1845k24755k40723n5158O2771P9722J20698J55186
35320B60975P0584o1377q7638n5671j10432j89178j13226P3589J62864J44959
35310I5449J98428L18741K86097N2096j52180j74735j24125j04116m8920O6105
35300D12840J19589P5730O4946J12255O0396r7583j18586O0526J14774j64065
$$ plain form
35290 640822 196672 -106856 122 267296 305566 88300 -149334 -305395 -429523 -469137
35280 -469137 -298385 6515 172838 79471 -73329 -30384 193932 352364 271991 39390
35270 39390 -120441 -91931 44507 152304 189567 180534 117248 -30 -61699 67656 342512
35259 342512 539038 505838 303224 62117 -162083 -339248 -409285 -367437 -292024 -209730
35249 -209730 -58863 132557 189229 34522 -155613 -198555 -162569 -197768 -249321 -167861 -1156
35238 -1156 79899 79440 133868 213754 160840 22825 42674 259415 422154 396467 352694 405996
35226 405996 374839 122686 -117372 -44573 255911 446438 403427 271999 145006 -17725
35216 -17725 -182152 -234106 -198363 -219429 -291998 -239144 -7654 229709 328736 326315 269059
$$ packed form
35290F40822m44150l03528J06978K67174L8270k17266k37634j56061j24128l9614
35280d69137J70752L04900J66323r3367j52800M2945K24316J58432q0373k32601
35270C9390j59831K8510J36438J07797L7263r033o3286j17278o1669J29355K74856
35259C42512J96526l3200k02614k41107k24200j77165p0037M1848P5413Q2294
35249b09730J50867J91420N6672j54707j90135m2942L5986l5199n1553Q1460J66705
35238a156Q1055m59N4428P9886n2914j38015J9849K16741J62739k5687m3773N3302
35226D05996l1157k52153k40058P2799L00484J90527m3011j31428j26993j62731
35216a7725j64427n1954L5743k1066p2569N2854K31490K37363R9027k421n7256
$$ plain form
35205 269059 104498 -145671 -301412 -263359 -182388 -235607 -362143 -383418 -275701 -147368
35195 -147368 -31018 111936 232216 235545 172949 199970 323720 366978 239561 86497
35185 86497 76700 173161 228195 214438 225821 291788 327989 285777 241718 282812 362183 338912
35173 338912 161653 -28850 -16036 258351 593132 705254 525516 270409 179575 238110
35163 238110 248379 141961 72962 158706 280291 266967 168623 163275 244292 215652 21442
35152 21442 -139531 -118927 -35264 -36436 -27136 148773 376276 384666 161342 -3597 87836
35141 87836 326205 521098 620264 617276 454954 161199 -80493 -143466 -117389 -131341 -156088
35130 -156088 -127693 -122985 -215823 -265835 -75670 293498 582943 692209 754939 847068 846919
$$ packed form
35205B69059j64561k50169j55741L8053Q0971n3219j26536k1275J07717J28333
35195a47368J16350J42954J20280L329o2596K7021J23750M3258j27417j53064
35185H6497r797R6461N5034j3757J1383O5967L6201m2212m4059M1094P9371k3271
35173C38912j77259j90503J2814K74387L34781J12122j79738k55107r0834N8535
35163B38110J0269j06418o8999Q5744J21585j3324r8344n348Q1017k8640j94210
35152B1442j60973K0604Q3663j172R300J75909K27503Q390k23324j64939R1433
35141H7836K38369J94893R9166k988j62322k93755k41692o2973K6077j3952k4747
35130a56088K8395M708r2838n0012J90165L69168K89445J09266O2730R2129j49
$$ plain form
35119 846919 664990 427067 311229 328890 381660 439522 537838 644710 647354 484200 237554
35108 237554 76536 109640 282257 427119 434323 348083 271393 233552 221085 278308 453413
35097 453413 660413 728850 618715 474423 426589 441004 410706 302917 156540 18791
35087 18791 -47740 30400 240837 436606 466015 339843 214151 212951 308640 376472 334934
35076 334934 219051 125029 103884 131842 171802 211420 231683 206874 168317 194854 294450
35065 294450 376633 395231 413451 453295 414066 258790 134848 139855 119222 -68636 -223739
35054 -223739 -58004 298038 412718 189937 6348 123288 340947 405363 402678 503619
35044 503619 615957 585012 513616 583478 729599 773898 732237 714556 666248 500649 361530
$$ packed form
35119H46919j81929k37923j15838J7661N2770N7862R8316J06872K644j63154k46646
35108B37554j61018L3104J72617J44862P204q6240p6690l7841j2467N7223J75105
35097D53413K07000O8437j10135j44292m7834J4415l0298j07789j46377j37749
35087A8791o6531P8140K10437J95769K9409j26172j25692j200R5689O7832m1538
35076C34934j15883r4022k1145K7958L9960L9618K0263k4809l8557K6537R9596
35065B94450Q2183J8598J8220L9844l9229j55276j23942N007k0633j87858j55103
35054b23739J65735L56042J14680k22781j83589J16940K17659O4416k685J00941
35044E03619J12338l0945p1396O9862J46121M4299m1661j7681m8308j65599j39119
$$ plain form
35033 361530 442841 638860 681047 548520 431879 356212 182171 -44141 -100022 24468
35023 24468 84199 -6701 -35661 135640 352386 442272 448271 455525 426408 350905 348298 473693
35011 473693 605097 645618 657790 688658 658305 541280 459062 465853 446810 358946 344087
35000 344087 441472 435656 209903 17191 121007 357817 378032 185013 81962 154592
34990 154592 181958 80754 74469 297040 516397 435532 85427 -251114 -381931 -321438
34980 -321438 -158816 30772 169406 193474 114636 20469 7017 116861 314824 505058
34970 505058 594470 556838 430309 270152 133481 86959 171373 350789 537094 672148
34960 672148 754108 783992 731303 577692 376995 246436 282950 479686 730546 925727
$$ packed form
35033C61530Q1311J96019M2187j32527j16641p5667j74041k26312n5881J24490
35023B4468N9731r0900k8960J71301K16746Q9886N999P254k9117p5503k607J25395
35011D73693J31404M0521J2172L0868l0353j17025q2218O791j9043q7864j4859
35000C44087R7385n816k25753j92712J03816K36810K0215j93019j03051P2630
34990A54592K7366j01204o285K22571K19357q0865l50105l36541j30817O0493
34980c21438J62622J89588J38634K4068p8838r4167j3452J09844J97963J90234
34970E05058Q9412l7632j26529j60157j36671m6522Q4414J79416J86305J35054
34960F72148Q1960K9884n2689j53611k00697j30559L6514J96736K50860J95181
$$ plain form
34950 925727 1029542 1057724 1027272 979594 1006291 1158908 1343981 1399455 1274990 1048266
34940 1048266 780280 481415 219564 98075 81700 11919 -128001 -137598 91336 355373
34930 355373 397559 253058 139680 102229 -743 -188930 -276347 -141752 95757 242993
34920 242993 250843 203995 188701 230108 297517 330033 295666 233192 196975 179700 144126 100221
34908 100221 78839 58856 952 -74691 -126797 -170722 -220690 -199273 -34631 172902 227807
34897 227807 98958 -30861 -8691 115606 204596 209127 164024 93885 -3344 -121903 -238709
34886 -238709 -307659 -266433 -114941 19048 -5848 -139669 -160234 38447 268995 260469 -2667
34875 -2667 -259895 -296435 -188276 -164660 -281476 -346694 -208974 -10955 -21255 -253915 -432127
$$ packed form
34950I25727J03815K8182l0452m7678K6697J52617J85073N5474j24465k26724
34940A048266k67986k98865k61851j21489j6375o9781j39920r597K28934K64037
34930C55373M2186j44501j13378l7451j02972j88187q7417J34595K37509J47236
34920B42993P850m6848j5294M1407O7409L2516l4367o2474l6217j7275l5574m3905
34908A00221k1382j9983n7904p5643n2106m3925m9968K1417J64642K07533N4905
34897B27807j28849j29819K2170J24297Q8990M531m5103p0139r7229j18559j16806
34886b38709o8950M1226J51492J33989k4896j33821k0565J98681K30548q526k63136
34875b667k57228l6540J08159K3616j16816o5218J37720J98019j0300k32660j78212
$$ plain form
34864 -432127 -370364 -211699 -175810 -234298 -211854 -98097 -47309 -114158 -194683 -226730 -260992
34853 -260992 -309903 -298474 -211656 -142599 -137529 -115203 2425 175764 303538 312305 182121
34842 182121 -20724 -138671 -61200 135242 297804 418061 589140 766604 773544 572396
34832 572396 338744 217288 190560 232080 369317 516044 479720 268270 167428 340483
34822 340483 550514 487816 206887 6246 1754 62685 80431 53457 -37589 -194655 -273358
34811 -273358 -134303 78648 58664 -227289 -458915 -399188 -194781 -121124 -209768 -285405
34801 -285405 -243209 -115344 65586 295586 504209 575983 498093 386098 321762 245815
34791 245815 73513 -137332 -220692 -106108 81615 160082 86096 -19577 -11727 149773
$$ packed form
34864d32127O1763J58665L5889n8488K2444J13757N0788o6849q0525l2047l4262
34853b60992m8911J1429Q6818O9057N070K2326J17628J73339J27774Q767j30184
34842A82121k02845j17947P7471J96442J62562J20257J71079J77464O940k01148
34832E72396k33652j21456k6728M1520J37237J46727l6324k11450j00842J73055
34822C40483K10031o2698k80929k00641m492O0931J7746k6974r1046j57066p8703
34811b73358J39055K12951j9984k85953k31626N9727K04407P3657q8644p5637
34801b85405M2196J27865J80930K30000K08623P1774p7890j11995o4336p5947
34791B45815j72302k10845q3360J14584J87723P8467p3986j05673P850J61500
$$ plain form
34781 149773 371996 484569 367478 93507 -90943 -10635 239119 426770 477124 496192
34771 496192 526966 465063 264007 46265 -84504 -185060 -303107 -309551 -71379 293113
34761 293113 506440 447544 240580 64136 5568 75997 223305 318374 243837 23351
34751 23351 -203215 -320345 -289054 -111488 147880 341236 363260 287167 259668 279826 225396
34740 225396 100779 84380 257616 432528 374139 118258 -58431 32521 290185 465328
34730 465328 430525 270195 143449 123003 181232 271846 358343 386636 319534 217302 202213
34719 202213 301252 392727 359845 238788 161916 204389 330903 440965 436272 320666 265842
34708 265842 463011 839360 1051442 882479 537580 388423 504220 618589 527136 326288
$$ packed form
34781A49773K22223J12573j17091k73971j84450Q0308K49754J87651N0354J9068
34771D96192L0774o1903k01056k17742j30769j00556j18047o444K38172L64492
34761B93113K13327n8896k06964j76444n8568P0429J47308R5069p4537k20486
34751B3351k26566j17130L1291J77566K59368J93356K2024p6093k7499K0158n4430
34740B25396j24617j6399J73236J74912n8389k55881j76689R0952K57664J75143
34730D65328l4803j60330j26746k0446N8229R0614Q6497K8293o7102j02232j5089
34719B02213R9039R1475l2882j21057p6872M2473J26514J10062m693j15606n4824
34708B65842J97169L76349K12082j68963l44899j49157J15797J14369r1453k00848
$$ plain form
34698 326288 233319 328948 538323 757949 934075 1066766 1172368 1232055 1212361 1167767
34688 1167767 1241556 1480321 1726286 1810847 1787392 1831657 1965369 2044597 2000025 1917406 1868364
34677 1868364 1817710 1731637 1650073 1618454 1645311 1730108 1835558 1862004 1775775 1721938 1846113
34666 1846113 2038164 2056452 1903007 1841172 1993339 2162042 2155178 2066664 2075536 2141201 2089314
34655 2089314 1892415 1682018 1539758 1439888 1382685 1446222 1665082 1915016 1960279 1649365
34645 1649365 1097491 629970 462980 481886 442669 324162 292927 357349 322051 142198
34635 142198 49737 184308 337596 268300 84360 69455 250703 390754 353004 241564
34625 241564 188435 204195 257933 333362 370913 298671 165794 124238 223682 323217 274633
$$ packed form
34698C26288r2969R5629K09375K19626J76126J32691J05602N9687j9694m4594
34688A167767P3789K38765K45965Q4561k3455M4265J33712P9228m4572q2619m9042
34677A868364n0654q6073q1564l1619K6857Q4797J05450K6446q6229n3837J24175
34666A846113J92051J8288j53445o1835J52167J68703o864q8514Q872O5665n1887
34655B089314j96899k10397j42260r9870n7203O3537K18860K49934M5263l10914
34645A649365n51874m67521j66990J8906l9217j18507l1235O4422l5298j79853
34635A42198r2461J34571J53288o9296j83940j4905J81248J40051l7750j11440
34625B41564n3129J5760N3738P5429L7551p2242j32877m1556R9444R9535m8584
$$ plain form
34614 274633 125530 58965 150737 264333 227224 69061 -4678 104167 239059 213959
34604 213959 85415 43917 97837 71422 -86809 -211240 -177049 -43221 121893 337635
34594 337635 543535 564997 381472 216624 208928 206574 67912 -60333 1221 134944 131555
34583 131555 59549 118106 242789 195042 -15414 -128267 -38652 101062 187842 272090 330036
34572 330036 241642 65232 45039 242755 418290 388469 262567 197548 155517 61131 -7301
34561 -7301 34254 97678 72601 29304 100182 252046 335380 299886 233259 231619 323606 468242
34549 468242 555060 474486 256884 73370 46230 139009 267948 398539 472085 383238 143812
34538 143812 -44154 -5149 196680 364586 408503 369664 284853 155669 18416 -59672
$$ packed form
34614B74633j49103o6565R1772J13596l7109j58163p3739J08845J34892k5100
34604B13959j28544m1498N3920k6415j58231j24431L4191J33828J65114K15742
34594C37635K05900K1462j83525j64848p696k354j38662j28245O1554J33723l389
34583A31555p2006N8557J24683m7747k10456j12853Q9615J39714Q6780Q4248N7946
34572C30036q8394j76410k0193J97716J75535k9821j25902o5019m2031r4386o8432
34561g301M1555O3424k5077m3297P0878J51864Q3334l5494o6627j640R1987J44636
34549D68242Q6818q0574k17602j83514k7140R2779J28939J30591P3546q8847k39426
34538A43812j87966L9005K01829J67906M3917l8839q4811j29184j37253p8088
$$ plain form
34528 -59672 -43165 64798 236709 399400 463411 422490 356021 297118 194722 49991 -38250
34517 -38250 -46097 -112318 -332610 -569788 -607956 -426601 -192117 -32285 55094 109815 147477
34506 147477 178411 207012 229846 276282 389722 523970 551147 435666 296527 230600 204919
34495 204919 204230 310974 502976 557967 360890 143390 171206 331844 326902 171841 157527
34484 157527 348157 492852 487178 547006 782738 942240 801421 544996 493639 636612
34474 636612 708193 615021 523497 564839 674553 726590 667614 519320 368965 337863 450119
34463 450119 564889 543825 441417 417386 508111 607146 630119 572887 449789 316298 317983
34452 317983 550118 863488 968904 775299 501840 417138 571809 815127 967513 941113
$$ packed form
34528e9672J6507J07963J71911J62691O4011m0921o6469n8903j02396j44731q8241
34517c8250p847o6221k20292k37178l8168J81355K34484J59832Q7379N4721L7662
34506A47477L0934K8601K2834M6436J13440J34248K7177j15481j39139o5927k5681
34495B04919o89J06744J92002N4991j97077k17500K7816J60638m942j55061j4314
34484A57527J90630J44695n674N9828K35732J59502j40819k56425n1357J42973
34474F36612P1581r3172r1524M1342J09714N2037n8976j48294j50355l1102J12256
34463D50119J14770k1064j02408k4031R0725R9035K2973n7232j23098j33491J685
34452C17983K32135L13370J05416j93605k73459q4702J54671K43318J52386k6400
$$ plain form
34442 941113 787239 662232 671160 737799 717300 620750 594206 673824 730120 698583 686276
34431 686276 756340 773682 607599 365381 262940 337588 441817 476436 485479 534123 610138
34420 610138 650296 594198 438805 299359 352768 634409 956725 1126385 1166771 1210282
34410 1210282 1262345 1239323 1175908 1195208 1292825 1353580 1393729 1579366 1957156 2370308 2731695
34399 2731695 3200648 3959922 4937159 5854404 6448913 6561876 6150316 5358853 4499619
34390 4499619 3820793 3323223 2879317 2456797 2123169 1897571 1725062 1576338 1473137
34381 1473137 1417337 1363716 1268386 1137173 1035586 1036771 1104968 1061190 779399 409566 252487
34370 252487 384956 580723 655601 684969 768462 794815 634008 406396 341074 460534
$$ packed form
34442I41113j53874j25007Q928O6639k0499r6550k6544P9618N6296l1537j2307
34431F86276P0064J7342j66083k42218j02441P4648J04229L4619R043M8644P6015
34420F10138M0158n6098j55393j39446N3409K81641L22316J69660M0386M3511
34410A210282N2063k3022o3415J9300R7617O0755M0149J85637L77790M13152L61387
34399B731695M68953P59274R77237R17245N94509J12963m11560p91463q59234
34390D499619o78826m97570m43906m22520l33628k25598j72509j48724j03201
34381A473137n5800n3621r5330j31213j01587J185O8197m3778k81791l69833j57079
34370B52487J32469J95767P4878K9368Q3493K6353j60807k27612o5322J19460
$$ plain form
34360 460534 600588 663184 666672 626109 570416 601827 749553 844782 742736 585172 611800
34349 611800 779106 824465 675700 532162 537395 624277 704537 771201 789644 726767 712393
34338 712393 918575 1241530 1369826 1226439 1067462 1063228 1077792 991204 942681 1059287
34328 1059287 1191961 1145888 982979 880641 851364 809542 774600 802928 834827 795401 740447
34317 740447 740219 745713 736343 849610 1158946 1459697 1510334 1380333 1316826 1356546 1335867
34306 1335867 1229504 1191040 1249480 1235778 1069154 886984 813377 804547 819745 949317 1225439
34295 1225439 1453410 1421144 1213682 1131906 1283565 1421241 1283984 990392 924843 1241849
34285 1241849 1662967 1846071 1791786 1728554 1735623 1723178 1719872 1883793 2187521 2370042 2314155
$$ packed form
34360D60534J40054O2596L488m0563n5693L1411J47726R5229j02046j57564K6628
34349F11800J67306M5359j48765j43538N233Q6882Q0260O6664J8443o2877j4374
34338G12393K06182L22955J28296j43387j58977m234J4564q6588m8523J16606
34328A059287J32674m6073j62909j02338k9277m1822l4942K8328L1899l9426n4954
34317G40447k28N494r370J13267L09336L00751N0637j30001o3507L9720k0679
34306A335867j06363l8464N8440j3702j66624j82170p3607q830J5198J29572K76122
34295A225439K27971l2266k07462q1776J51659J37676j37257k93592o5549L17006
34285A241849M21118J83104n4285o3232P069j2445l306J63921L03728J82521n5887
$$ plain form
34274 2314155 2240181 2382633 2668321 2868351 2902953 2840255 2741860 2669641 2721244 2911036
34264 2911036 3122540 3290107 3492014 3756138 3947467 3996347 4070257 4343809 4738813 5063179
34254 5063179 5278827 5471657 5683561 5924189 6219159 6516769 6702978 6835098 7173201
34245 7173201 7838221 8639811 9383887 10117270 10914919 11701396 12480357 13458940 14731133
34236 14731133 16136672 17650430 19560313 22009260 24771012 27798679 31556781 36432515
34228 36432515 42294050 49086724 57391353 67947793 81252908 98219577 120565169
34221 120565169 149984316 187932638 236659007 297563964 364703955 420516502 443240441
34214 443240441 422755247 368959423 303385483 243482629 195316964 157769146 128803524
$$ packed form
34274B314155p3974J42452K85688K00030L4602o2698r8395p2219N1603J89792
34264B911036K11504J67567K01907K64124J91329M8880P3910K73552L95004L24366
34254E063179K15648J92830K11904K40628K94970K97610J86209J32120L38103
34245G173201O65020Q01590P44076P33383P97649P86477P78961R78583J272193
34236A4731133J405539J513758J909883K448947K761752L027667L758102M875734
34228C6432515N861535O792674Q304629J0556440J3305115J6966669K2345592
34221A20565169K9419147L7948322M8726369O0904957O7139991N5812547K2723939
34214D43240441k0485194n3795824o5573940n9902854m8165665l7547818k8965622
$$ plain form
34207 128803524 106954224 90325859 76989959 66028328 57218963 50159663 44312713
34200 44312713 39412153 35278370 31593998 28230655 25409113 23207711 21270394 19283959
34192 19283959 17395832 15886351 14734654 13749262 12844753 11976599 11067309 10186099 9558080
34183 9558080 9242989 9040117 8811433 8619597 8451274 8135382 7689973 7437206 7585466
34174 7585466 7964126 8341569 8727016 9151615 9402175 9223481 8637562 7876457 7119253
34165 7119253 6426561 5811129 5266563 4817394 4552584 4465177 4307379 3853327 3281118 2981604
34155 2981604 2976748 2894583 2586568 2351407 2380215 2395115 2114389 1734008 1614532 1741647
34145 1741647 1836655 1820530 1833406 1901441 1887524 1736052 1546034 1427054 1426618 1534765 1642883
$$ packed form
34207A28803524k1849300j6628365j3335900j0961631q809365p059300n846950
34200D4312713m900560m133783l684372l363343k821542k201402j937317j986435
34192A9283959j888127j509481j151697r85392r04509q68154r09290q81210o28019
34183I558080l15091k02872k28684j91836j68323l15892m45409k52767J48260
34174G585466L78660L77443L85447M24599K50560j78694n85919p61105p57204
34165G119253o92692o15432n44566m49169k64810q7407j57798m54052n72209k99514
34155B981604m856q2165l08015k35161K8808J4900k80726l80381j19476J27115
34145A741647R5008j6125J2876O8035j3917j51472j90018j18980m36J08147J08118
$$ plain form
34134 1642883 1593495 1378830 1178398 1112751 1108619 1092728 1123601 1210960 1214622 1078850 965928
34123 965928 985156 987195 816504 577953 451079 421104 404784 466425 681346 937366 1088171
34112 1088171 1156557 1192184 1113920 913864 812890 949667 1111806 1070648 988433 1144838
34102 1144838 1420412 1447972 1185296 937659 847982 755369 576183 461358 511994 640814
34092 640814 768511 887476 910348 743091 532031 538758 734828 829137 740967 707962 838284
34081 838284 907490 758419 588827 634192 810874 882641 785682 602459 392390 229554
34071 229554 248217 470290 710305 793900 748188 670017 570990 476960 495932 627078 675968
34060 675968 538819 406183 482144 654070 678100 575120 578407 745498 880939 845566
$$ packed form
34134A642883m9388k14665k00432o5647m132j5891L0873Q7359L662j35772j12922
34123I65928J9228K039j70691k38551j26874k9975j6320O1641K14921K56020J50805
34112A088171O8386L5627p8264k00056j00974J36777J62139m1158q2215J56405
34102A144838K75574K7560k62676k47637q9677r2613j79186j14825N0636J28820
34092F40814J27697J18965K2872j67257k11060O727J96070R4309q8170l3005J30322
34081H38284O9206j49071j69592M5365J76682P1767r6959j83223k10069j62836
34071B29554J8663K22073K40015Q3595m5712p8171r9027r4030J8972J31146M8890
34060F75968j37149j32636P5961J71926K4030j02980L287J67091J35441l5373
$$ plain form
34050 845566 721290 640586 638852 716696 886835 1099929 1243957 1270175 1234870 1194050 1144031
34039 1144031 1078758 1013783 942168 863090 863256 1048994 1352491 1523105 1400887 1120901 942038
34028 942038 920445 877899 696251 506295 501804 657921 766568 723644 633852 605513 598354
34017 598354 560324 564520 657400 686023 484801 184170 106582 342217 642024 778304 794387
34006 794387 804821 763046 593884 409564 406964 616997 888987 1060296 1039706 818992
33996 818992 530031 400060 503463 630382 551451 341303 263273 382197 494513 444925
33986 444925 313012 233006 203524 173749 189974 328433 537429 658558 611476 495734
33976 495734 477640 587392 665757 554352 321694 212871 343182 539628 564373 413575
$$ packed form
34050H45566j24276q0704j734P7844J70139K13094J44028K6218l5305m0820n0019
34039A144031o5273o4975p1615p9078J66J85738L03497J70614j22218k79986j78863
34028I42038k1593m2546j81648j89956m491J56117J08647m2924q9792k8339p159
34017E98354l8030M196R2880K8623k01222l00631p7588K35635K99807J36280J6083
34006G94387J0434m1775j69162j84320k600K10033K71990J71309k0590k20714
33996H18992k88961j29971J03403J26919p8931k10148p8030J18924J12316m9588
33986D44925j31913q0006k9482k9775J6225J38459K08996J21129m7082j15742
33976D95734j8094J09752P8365j11405k32658j08823J30311J96446K4745j50798
$$ plain form
33966 413575 290192 341044 536188 764897 931975 992829 1013017 1157898 1491424 1821983
33956 1821983 1908029 1797801 1780320 1989527 2265686 2470499 2727292 3217815 3900492 4576575
33946 4576575 5108135 5416383 5380070 4936498 4244750 3574596 3033494 2537473 2043718 1664088
33936 1664088 1511153 1540775 1596665 1548078 1362593 1101323 857104 659394 459756 255419
33926 255419 161155 251590 388296 369271 245644 294518 610853 915873 909316 666839 503643
33915 503643 535564 593432 550314 500054 541312 583184 509521 406391 441679 565527 520131
33904 520131 186875 -224050 -419844 -364126 -258113 -239575 -239562 -147188 16186 155865 242815
33893 242815 301246 321842 296349 298294 401421 526904 511031 348722 224360 242323 275088
$$ packed form
33966D13575j23383N0852J95144K28709J67078O0854K0188J44881L33526L30559
33956A821983Q6046j10228j7481K09207K76159K04813K56793M90523O82677O76083
33946D576575N31560L08248l6313m43572o91748o70154n41102m96021m93755l79630
33936A664088j52935K9622N5890m8587j85485k61270k44219j97710j99638k04337
33926B55419r4264R0435J36706j9025j23627M8874L16335L05020o557k42477j63196
33915E03643L1921N7868m3118n0260M1258M1872p3663j03130L5288J23848m5396
33904E20131l33256m10925j95794N5718J06013J8538J3R2374J63374J39679Q6950
33893B42815N8431K0596k5493J945J03127J25483j5873j62309j24362J7963L2765
$$ plain form
33882 275088 177297 8915 -93365 -136961 -181322 -134644 111348 390620 390562 111647 -72544
33871 -72544 77084 342273 391910 238016 142253 230552 430336 669352 885862 918180
33861 918180 653123 269068 79751 119092 123828 -31494 -143696 -30170 173409 241892
33851 241892 210033 277749 461664 557987 443167 243316 166471 270464 440288 534791
33841 534791 511771 423784 323197 210001 93950 51640 135576 250486 234598 78483
33831 78483 -49265 -25423 91741 191001 251270 292494 300926 285158 302152 346306 324316
33820 324316 232020 229121 408799 607015 598943 397415 189698 58832 -32997 -37044 163758
33809 163758 497155 677893 539866 250418 96998 161985 298225 347998 288272 190470
$$ packed form
33882B75088r7791j68382j02280m3596m4361M6678K45992K79272n8k78915j84191
33871g2544J49628K65189M9637j53894r5763Q8299J99784K39016K16510L2318
33861I18180k65057l84055j89317L9341M736j55322j12202J13526K03579O8483
33851B41892l1859O7716J83915R6323j14820j99851p6845J03993J69824R4503
33841E34791k3020q7987j00587j13196j16051m2310Q3936J14910j5888j56115
33831G8483j27748K3842J17164R9260O0269M1224Q432j5768J6994M4154k1990
33820C24316r2296k899J79678J98216q072k01528k07717j30866r1829m047K00802
33809A63758L33397J80738j38027k89448j53420O4987J36240M9773n9726r7802
$$ plain form
33799 190470 117737 84540 98302 203310 425488 670274 774803 721416 693466 816495
33789 816495 953647 912115 756936 709793 787959 790248 650157 547803 605061 715312 791689
33778 791689 954925 1301983 1668577 1824335 1784816 1738373 1756065 1767639 1761706 1810350 1907393
33767 1907393 1948232 1882679 1768080 1672946 1629144 1658473 1743400 1799022 1776075 1749998 1794226
33756 1794226 1823440 1718196 1569404 1611664 1893290 2180384 2237933 2069869 1836140 1667523
33746 1667523 1620049 1685663 1771956 1763973 1658774 1549467 1455079 1300550 1103467 1008838 1047862
33735 1047862 1035683 850123 654594 653194 748268 680198 444578 306375 387345 500079
33725 500079 479854 448928 587019 800728 828987 615394 390206 376010 546113 703085
$$ packed form
33799A90470p2733l3197J3762J05008K22178K44786J04529n3387k7950J23029
33789H16495J37152m1532j55179m7143P8166K289j40091j02354N7258J10251P6377
33778G91689J63236L47058L66594J55758l9519m6443J7692J1574n933M8644R7043
33767A907393M0839o5553j14599r5134m3802K9329Q4927N5622k2947k6077M4228
33756A794226K9214j05244j48792M2260K81626K87094N7549j68064k33729j68617
33746A667523m7474O5614Q6293p983j05199j09307r4388j54529j97083r4629L9024
33735A047862j2179j85560j95529j400R5074o8070k35620j38203Q0970J12734
33725E00079k0225l0926J38091K13709K8259k13593k25188j4196J70103J56972
$$ plain form
33715 703085 697793 529358 294890 91140 -50844 -151319 -205535 -156209 22028 244901
33705 244901 386708 414005 395005 390783 404328 426677 449061 421545 290681 105920 -2177
33694 -2177 5924 17630 -60390 -157416 -145059 -7255 188313 400089 568634 552589 296713
33683 296713 26151 55711 380557 668008 711526 658397 672788 632261 392542 154897
33673 154897 244613 600005 811710 684294 449112 343879 282778 103004 -114605 -193385
33663 -193385 -153787 -124868 -84792 69024 264062 312901 213143 164482 266533 394855 417131
33652 417131 359549 305707 278621 272850 270473 194798 -2429 -184353 -148952 41177 71718
33641 71718 -165416 -354461 -189743 160503 280763 84764 -113715 -66280 148871 355202
$$ packed form
33715G03085n292j68435k34468k03750j41984j00475n4216M9326J78237K22873
33705B44901J41807K7297j9000m222J3545K2349K2384k7516j30864j84761j08097
33694b177Q101J1706p8020r7026J2357J37804J95568K11776J68545j6045k55876
33683B96713k70562K9560L24846K87451M3518n3129J4391m0527k39719k37645
33673A54897Q9716L55392K11705j27416k35182j05233o1101j79774k17609p8780
33663a93385L9598K8919M0076J53816J95038M8839r9758m8661J02051J28322K2276
33652D17131n7582n3842k7086n771k377p5675j97227j81924L5401J90129L0541
33641G1718k37134j89045J64718L50246J20260j95999j98479M7435K15151K06331
$$ plain form
33631 355202 509617 614982 610048 485313 377359 413555 535896 582637 497369 377362
33621 377362 343261 414918 501715 498152 406878 346416 392144 453937 397553 244581 132148
33610 132148 105290 96323 93500 153110 234066 220948 155181 224981 440636 551794 428021
33599 428021 292095 368141 498739 388366 99581 -4334 220594 520218 614688 516037
33589 516037 415211 439912 590762 771248 827443 678610 438519 297040 284544 284181 257299
33578 257299 285794 390764 496998 597965 757192 905842 853629 580292 313103 212706
33568 212706 174798 62069 -59386 -65819 11011 80129 152095 237796 235882 109358 32992
33557 32992 144980 271593 153749 -129209 -238196 -56853 175323 240509 194072 161658
$$ packed form
33631C55202J54415J05365m934j24735j07954L6196J22341M6741q5268j20007
33621C77362l4101P1657Q6797l563r1274o0462M5728O1793n6384j52972j12433
33610A32148k6858q967k823N9610Q0956j3118o5767O9800K15655J11158j23773
33599D28021j35926P6046J30598j10373k88785j03915K24928K99624R4470r8651
33589E16037j00826K4701J50850J80486N6195j48833k40091j41479j2496l63k6882
33578B57299K8495J04970J06234J00967J59227J48650n2213k73337k67189j00397
33568B12706l7908j12729j21455o433P6830O9118P1966Q5701j914j26524p6366
33557C2992J11988J26613j17844k82958j08987J81343K32176O5186m6437l2414
$$ plain form
33547 161658 124504 46441 35755 205335 463883 600830 548003 448365 469636 617184 739947
33536 739947 697394 516734 366771 352231 378074 287490 99185 1327 107166 321272
33526 321272 477154 520230 514117 531002 576761 593728 534925 462648 522011 737679 898021
33515 898021 779833 461483 245855 262683 335254 300223 262810 401784 669235 852774
33505 852774 852226 736034 573786 367692 138642 -53044 -189481 -301338 -376292 -340452
33495 -340452 -153451 130797 411990 617241 730960 786969 831614 882250 940313 1037744
33485 1037744 1203386 1366190 1386054 1239108 1079062 1023823 967211 732764 363544 109932
33475 109932 131880 342774 560367 685617 699437 608713 470751 387251 392137 390379 273128
$$ packed form
33547A61658l7154p8063j0686J69580K58548J36947n2827r9638K1271J47548J22763
33536G39947m2553j80660j49963j4540K5843r0584j88305r7858J05839K14106
33526C21272J55882M3076o113J6885M5759J6967n8803p2277N9363K15668J60342
33515H98021j18188l18350k15628J6828P2571l5031l7413J38974K67451J83539
33505H52774n48j16192j62248k06094k29050j91686j36437j11857p4954L5840
33495c40452J87001K84248K81193K05251J13719N6009M4645N0636N8063R7431
33485A037744J65642J62804J9864j46946j60046n5239n6612k34447l69220k53612
33475A09932K1948K10894K17593J25250J3820r0724j37962q3500M886j758j17251
$$ plain form
33464 273128 65886 -89298 -85682 46311 178677 210851 166520 167882 297721 499194 638513
33453 638513 641627 524331 324066 87164 -87897 -100637 26843 159461 218393 259081
33443 259081 341208 416936 421933 396662 419148 468233 455892 367782 272082 199317 110613 -7276
33431 -7276 -105817 -155852 -184105 -195262 -132404 31612 218824 328499 367895 435170 570394
33420 570394 678282 630492 424816 206768 121120 166847 231417 249814 258987 275100 212627
33409 212627 19414 -169323 -154790 43350 171652 62023 -162978 -288702 -289537 -279225
33399 -279225 -273608 -183328 -19878 69685 9541 -102309 -143457 -97857 4676 146197 254604
33388 254604 221196 83998 64169 289485 591580 728171 704978 692581 710220 633263 489449
$$ packed form
33464B73128k07242j55184L616J31993J32366L2174m4331J362J29839K01473J39319
33453F38513L114j17296k00265k36902j75061j2740J27480J32618N8932M0688
33443B59081Q2127P5728M997k5271K2486M9085j2341q8110r5700p2765q8704j17889
33431g276r8541n0035k8253j1157O2858J64016J87212J09675L9396O7275J35224
33420E70394J07888m7790k05676k18048q5648M5727O4570J8397R173J6113o2473
33409B12627j93213j88737J4533J98140J28302j09629k25001j25724q35J0312
33399b79225N617R0280J63450Q9563o0144j11850m1148M5600J02533J41521J08407
33388B54604l3408j37198j9829K25316L02095J36591k3193j2397J7639p6957j43814
$$ plain form
33377 489449 479182 649188 803887 852024 992284 1365516 1723966 1701756 1305812 885106
33367 885106 666645 572942 487206 432231 417608 340702 166202 38069 78599 201091 251615
33356 251615 226373 204657 158178 -54 -218313 -329247 -275664 -164397 -66476 93009
33346 93009 373041 655706 756690 650642 488746 398286 345762 226843 38867 -93740
33336 -93740 -67528 69302 168814 150650 71574 23104 18572 22168 40322 110518 213014 269239
33324 269239 242768 181423 136026 94127 32395 -13475 9605 76895 88536 -15367 -165339
33313 -165339 -207927 -53128 208893 349285 205501 -129211 -360583 -287601 -24531 127829
33303 127829 29122 -156311 -195285 -87653 -33060 -118020 -170490 -2701 291494 420958
$$ packed form
33377D89449j0267J70006J54699M8137J40260L73232L58450k2210l95944m20706
33367H85106k18461r3703q5736n4975j4623p6906j74500j28133M0530J22492N0524
33356B51615k5242k1716m6479j58232k18259j10934N3583J11267R7921J59485
33346I3009K80032K82665J00984j06048j61896r0460n2524j18919j87976j32607
33336i3740K6212J36830R9512j8164p9076m8470m532L596J8154P0196J02496N6225
33324B69239k6471o1345m5397m1899o1732m5870K3080O7290J1641j03903j49972
33313a65339m2588J54799K62021J40392j43784l34712k31372P2982K63070J52360
33303A27829r8707j85433l8974J07632N4593q4960n2470J67789K94195J29464
$$ plain form
33293 420958 274234 76468 107500 363219 594268 618999 482474 329327 243334 235601
33283 235601 286720 344076 337958 247709 117648 -6009 -102596 -139618 -90292 -9938 -801
33272 -801 -58502 -51520 87001 253680 346196 424562 566864 658975 513506 166569 -130766
33261 -130766 -231750 -232920 -254152 -250323 -129771 73295 252662 364154 408618 361745 226002
33250 226002 95994 70458 131632 192165 224380 258956 285281 246752 137567 33504 5745
33239 5745 34579 18532 -126352 -349964 -465172 -330387 -38226 172462 215599 248589 405304
33228 405304 573377 553994 338994 87520 -98725 -226707 -292027 -268814 -201476 -163789
33218 -163789 -134864 -41628 96623 200676 280895 400243 509375 495410 390617 334963
$$ packed form
33293D20958j46724j97766L1032K55719K31049K4731j36525j53147q5993p733
33283B35601N1119N7356o118r0249j30061j23657r6587l7022M9326Q0354R137
33272h01n7701O982J38521J66679R2516P8366J42302R2111j45469l46937k97335
33261a30766j00984j170k1232L829J20552K03066J79367J11492M4464m6873j35743
33250B26002j30008k5536O1174O0533L2215L4576K6325l8529j09185j04063k7759
33239E745K8834j6047j44884k23612j15208J34785K92161K10688M3137L2990J56715
33228D05304J68073j9383k15000k51474j86245j27982o5320K3213O7338L7687
33218a63789K8925R3236J38251J04053Q0219J19348J09132j3965j04793n5654
$$ plain form
33208 334963 311476 142235 -183590 -403559 -328002 -97106 60341 149313 297645 460216
33198 460216 463910 289476 101457 10714 -20489 -38030 -23687 7801 -25758 -157933 -306690
33187 -306690 -363084 -294655 -148445 -60 96465 145826 191065 237556 241840 205203 202981
33176 202981 258201 265859 138105 -36503 -86020 31974 205566 311740 286609 107364
33166 107364 -172460 -401679 -463814 -406297 -334819 -235123 -41170 170281 238335 167326 130870
33155 130870 197644 237345 166509 118237 254741 521658 698282 634749 377130 112690
33145 112690 23267 124873 236331 183869 24294 -53722 -32703 -89449 -279216 -397027
33135 -397027 -256617 58504 343335 521110 610608 590030 467308 382254 458706 620476
$$ packed form
33208C34963k3487j69241l25825k19969P5557K30896J57447Q8972J48332J62571
33198D60216L694j74434j88019r0743l1203j7541J4343L1488l3559j32175j48757
33187c06690n6394O8429J46210J48385R6525M9361M5239M6491M284l6637k222
33176B02981N5220P658j27754j74608m9517J17994J73592J06174k5131j79245
33166A07364k79824k29219o2135N7517P1478R9696J93953K11451O8054p1009l6456
33155A30870O6774L9701p0836m8272J36504K66917J76624o3533k57619k64440
33145A12690q9423J01606J11458n2462j59575p8016K1019n6746j89767j17811
33135c97027J40410L15121K84831J77775Q9498k0578j22722q5054P6452J61770
$$ plain form
33125 620476 711411 727201 758187 767043 625086 351471 120226 10034 -77633 -212085 -308201
33114 -308201 -277027 -173040 -108362 -106675 -112537 -82278 -8255 102674 235579 379892 535641
33103 535641 661886 643879 406116 66243 -126320 -50739 158080 283057 257462 172594
33093 172594 110794 48252 -73737 -225455 -278094 -147382 64779 146792 33243 -97776
33083 -97776 -61603 79515 121875 15992 -106033 -169100 -220931 -231392 -45579 344928 658308
33072 658308 622818 322182 74280 31028 75507 88200 115336 214655 291497 209461 -4134
33061 -4134 -173664 -181810 -77956 29197 115266 229943 378727 475950 427629 233301 1334
33050 1334 -117265 -34136 176110 290045 144233 -145799 -286480 -183312 -82237 -215414
$$ packed form
33125F20476R0935J5790L0986Q856j41957k73615k31245j10192q7667j34452r6116
33114c08201L1174J03987O4678J687n862L0259P4023J10929J32905J44313J55749
33103E35641J26245j8007k37763l39873j92563P5581K08819J24977k5595q4868
33093A72594o1800o2542j21989j51718n2639J30712K12161Q2013j13549j31019
33083i7776L6173J41118M2360j05883j22025o3067n1831j0461J85813L90507L13380
33072F58308l5490l00636k47902m3252M4479J2693K7136R9319P6842q2036k13595
33061d134j69530q146J03854J07153Q6069J14677J48784R7223m8321j94328k31967
33050A334j18599Q3129K10246J13935j45812k90032j40681J03168J01075j33177
$$ plain form
33040 -215414 -441797 -445316 -211916 -50413 -133198 -283562 -299977 -237904 -221518 -198138 -88254
33029 -88254 -11414 -114356 -274054 -231531 11186 173098 91114 -85245 -151418 -105082 -53374
33018 -53374 -20466 28115 64980 24194 -95709 -232131 -334971 -387692 -374744 -274787 -89818
33007 -89818 123432 251321 195867 -3769 -166506 -162085 -71843 -62441 -138513 -158409 -88268
32996 -88268 -71667 -190769 -309102 -254357 -54423 115480 152240 96898 38434 26599 43679
32985 43679 10695 -124986 -270189 -245119 -25917 179524 198386 128048 163064 279464 284612
32974 284612 142831 30470 29670 -22992 -270470 -572803 -664331 -492969 -256286 -135921
32964 -135921 -136151 -187295 -267915 -360163 -384535 -285060 -141963 -92845 -135391 -111707 63404
$$ packed form
33040b15414k26383l519K33400J61503q2785j50364j6415O2073J6386K3380J09884
33029h8254P6840j02942j59698M2523K42717J61912q1984j76359o6173M6336N1708
33018e3374L2908M8581L6865m0786j19903j36422j02840n2721J2948R9957J84969
33007h9818K13250J27889n5454j99636j62737M421R0242R402p6072j9896P0141
32996h8268J6601j19102j18333N4745J99934J69903L6760n5342n8464j1835J7080
32985D3679l2984j35681j45203K5070K19202K05441J8862p0338L5016J16400N148
32974B84612j41781j12361q00n2662k47478l02333r1528J71362K36683J20365
32964a35921k30n1144q0620r2248k4372R9475J43097M9118m2546K3684J75111
$$ plain form
32953 63404 251411 257620 85407 -93428 -180092 -211520 -193054 -62041 117742 122918 -122075
32942 -122075 -356661 -292443 -2980 207077 243562 275795 367440 348303 138950 -59682
32932 -59682 -60879 24667 -6840 -115902 -109999 18472 77897 -15595 -124240 -115180 -34285 5486
32920 5486 -17042 -51393 -62660 -36510 32405 99912 75001 -81876 -295274 -444936 -470120
32909 -470120 -383246 -224431 -43249 99457 155508 124045 56388 25523 75000 175187 238376
32898 238376 201884 89905 -26101 -108079 -161630 -189482 -180370 -131707 -41236 105660 290348
32887 290348 426432 444880 408607 456875 611204 713863 609814 339686 95124 4422
32877 4422 11702 -28524 -165876 -283477 -220482 44980 367312 594702 711918 799012 913681
$$ packed form
32953F3404J88007O209j72213j78835q6664l1428J8466J31013J79783N176k44993
32942a22075k34586O4218K89463K10057L6485L2233R1645j9137k09353j98632
32932e9682j197Q5546l1507j09062N903J28471N9425r3492j08645R060Q0895L9771
32920E486k2528l4351j1267K6150O8915O7507k4911j56877k13398j49662k5184
32909d70120Q6874J58815J81182J42706N6051l1463o7657l0865M9477J00187O3189
32898B38376l6492j11979j16006q1978n3551k7852R112M8663R0471J46896J84688
32887B90348J36084J8448l6273M8268J54329J02659j04049k70128k44562r0702
32877D422P280m0226j37352j17601O2995K65462L22332K27390J17216Q7094J14669
$$ plain form
32866 913681 1071369 1275293 1478651 1577499 1558560 1601626 1872499 2229997 2340273 2138983
32856 2138983 1982630 2210625 2703156 3036279 2982034 2685517 2404112 2258782 2252406 2365316
32846 2365316 2550217 2712139 2766442 2702443 2575890 2462164 2419240 2471090 2612208 2808078
32836 2808078 2964450 2936988 2667324 2303887 2057600 1908553 1619730 1125436 720342 692574
32826 692574 918214 1044582 971368 881614 846168 713931 449901 285634 386792 591056
32816 591056 646968 548765 461217 444187 437036 428292 459407 504224 496003 444020 396003 322279
32804 322279 170514 12040 -1254 166655 383903 498310 457899 303666 132641 54066
32794 54066 96620 173133 207758 252056 378811 519224 546141 484437 471139 504716 414992
$$ packed form
32866I13681J57688K03924K03358R8848j8939M3066K70873L57498J10276k01290
32856B138983j56353K27995M92531L33123n4245k96517k81405j45330o376J12910
32846B365316J84901J61922N4303o3999j26553j13726m2924N1850J41118J95870
32836B808078J56372k7462k69664l63437k46287j49047k88823m94294m05094k7768
32826F92574K25640J26368p3214q9754l5446j32237k64030j64267J01158K04264
32816E91056N5912r8203q7548j7030p151q744L1115M4817q221n1983m8017p3724
32804C22279j51765j58474j3294J67909K17248J14407m0411j54233j71025p8575
32794E4066M2554P6513L4625M4298J26755J40413K6917o1704j3298L3577q9724
$$ plain form
32783 414992 132261 -178366 -329564 -313694 -202099 5821 289588 478752 404618 147588
32773 147588 -30508 -10695 59312 -6137 -194440 -345549 -359206 -281732 -223527 -246576 -322850
32762 -322850 -370361 -333017 -237639 -159195 -118794 -41589 145874 375772 446628 229066 -135908
32751 -135908 -315559 -121522 268557 500804 439441 275313 232475 293034 289963 169482
32741 169482 35463 -16591 18664 116591 229814 237134 38140 -255486 -369069 -193896
32731 -193896 54425 119290 34475 16728 105628 116792 -42370 -212152 -211865 -74670 55463
32720 55463 138032 215283 264916 228848 158497 188763 355046 539988 614634 547200 373677
32709 373677 159331 -1418 -49111 -47013 -112410 -242278 -310667 -259470 -165991 -83191 34815
$$ packed form
32783D14992k82731l10627j51198J5870J11595K07920K83767J89164p4134k57030
32773A47588j78096J9813P0007o5449j88303j51109j3657P7474N8205k3049p6274
32762c22850m7511L7344R5378P8444M0401P7205J87463K29898P0856k17562l64974
32751a35908j79651J94037L90079K32247o1363j64128m2838O0559l071j20481
32741A69482j34019n2054L5255R7927J13223P320j98994k93626j13583J75173
32731a93896K48321O4865q4815j7747Q8900J1164j59162j69782K87J37195J30133
32720E5463Q2569P7251M9633l6068p0351L0266J66283J84942P4646o7434j73523
32709C73677k14346j60749m7693K098o5397j29868o8389N1197R3479Q2800J18006
$$ plain form
32698 34815 167578 152715 -79142 -323588 -339901 -181073 -85887 -102938 -59815 94458 170094
32687 170094 43008 -127207 -111223 108947 392883 640078 801866 813114 668903 498857
32677 498857 429803 433088 420638 403932 414401 358530 145166 -96541 -140340 9527 133755
32666 133755 154339 229437 419709 514005 344571 68870 -65437 -74618 -120567 -161256 -14085
32655 -14085 261138 348966 124495 -143634 -171396 -32253 26230 -27818 -41045 -9985 -114199
32644 -114199 -380874 -552025 -415539 -118366 15563 -91333 -200862 -113064 70558 111954
32634 111954 -44969 -235775 -306620 -260491 -172782 -84331 -28337 -58068 -154361 -173911 -5507
32623 -5507 248451 359950 244385 36487 -107310 -160294 -149629 -66937 64315 144260 122632
$$ packed form
32698C4815J32763j4863k31857k44446j6313J58828R5186j7051M3123J54273P5636
32687A70094j27086j70215J5984K20170K83936K47195J61788J1248j44211j70046
32677D98857o9054L285j2450j6706J0469n5871k13364k41707m3799J49867J24228
32666A33755K0584P5098J90272R4296j69434k75701j34307r181m5949m0689J47171
32655a4085K75223Q7828k24471k68129k7762J39143N8483n4048j3227L1060j04214
32644a14199k66675j71151J36486K97173J33929j06896j09529Q7798J83622M1396
32634A11954j56923j90806p0845M6129Q7709Q8451N5994k9731r6293j9550J68404
32623e507K53958J11499j15565k07898j43797n2984J0665Q2692J31252P9945k1628
$$ plain form
32612 122632 81398 86308 49807 -118965 -306504 -315006 -155045 -30599 -32393 -42606 17226
32601 17226 45867 -39564 -143598 -156604 -134517 -175748 -244868 -275021 -335538 -512121 -693524
32590 -693524 -677442 -462102 -249127 -166472 -168868 -214293 -338393 -505444 -574038 -499734 -418459
32579 -418459 -430873 -443529 -341975 -201052 -179047 -281563 -376883 -402702 -415425 -440190 -399732
32568 -399732 -230602 6256 175793 203532 141676 106704 149665 199122 156859 23316 -131010
32557 -131010 -284406 -443230 -517175 -383326 -128450 -46494 -264650 -517803 -468079 -145222
32547 -145222 124517 158077 69891 14090 -93 97 42583 117317 147079 127185 155994 246619
32535 246619 240459 9300 -357349 -661016 -803238 -800761 -686129 -503522 -341735 -264280
$$ packed form
32612A22632m1234M910l6501j68772j87539q502J59961J24446j794j0213N9832
32601A7226K8641q5431j04034j3006K2087m1231o9120l0153o0517j76583j81403
32590f93524J6082K15340K12975Q2655k396m5425j24100j67051o8594P4304Q1275
32579d18459j2414j2656J01554J40923K2005j02516r5320k5819j2723k4765M0458
32568c99732J69130K36858J69537K7739o1856l4972M2961M9457m2263j33543j54326
32557a31010j53396j58824p3945J33849K54876Q1956k18156k53153M9724L22857
32547a45222K69739L3560q8186n5801j4183J90M2486P4734K9762j9894K8809R0625
32535B46619o160k31159l66649l03667j42222K477J14632J82607J61787P7455
$$ plain form
32525 -264280 -236880 -196612 -150693 -138973 -147247 -132452 -94904 -56485 -931 101512 235244
32514 235244 346712 379679 290130 95787 -72086 -69889 66625 155652 150151 223239 460495
32503 460495 641213 520051 199104 -17181 -63633 -150236 -370401 -539402 -484543 -276148
32493 -276148 -79578 46134 113795 131318 150354 248796 377991 366086 159218 -83410
32483 -83410 -223287 -309238 -395123 -368798 -145495 100739 116472 -83215 -243440 -214913 -90660
32472 -90660 -9909 1688 -22357 -57299 -65991 -19377 38067 33161 -21703 -49400 -34710 -28487
32460 -28487 -32324 7823 82809 99617 -2288 -197830 -436902 -664846 -791447 -746715 -570632
32449 -570632 -357124 -139062 53644 79854 -170514 -523976 -643904 -467553 -302766 -383142
$$ packed form
32525b64280K7400M0268M5919J1720q274J4795L7548L8419N5554J02443J33732
32514B35244J11468L2967q9549j94343j67873K197J36514Q9027n501P3088K37256
32503D60495J80718j21162l20947k16285m6452q6603k20165j69001N4859K08395
32493b76148J96570J25712O7661J7523J9036R8442J29195j1905k06868k42628
32483h3410j39877q5951q5885K6325K23303K46234J5733j99687j60225K8527J24253
32472i0660Q0751J1597k4045l4942q692M6614N7444m906n4864k7697J4690O223
32460b8487l837M0147P4986J6808j01905j95542k39072k27944j26601M4732J76083
32449e70632K13508K18062J92706K6210k50368l53462j19928J76351J64787q0376
$$ plain form
32439 -383142 -546401 -521483 -341784 -243520 -280898 -300671 -249593 -256549 -385037 -504941 -467271
32428 -467271 -265766 8051 233603 259636 -4195 -421598 -690335 -662414 -500801 -427151
32418 -427151 -423037 -318664 -111447 -24826 -225697 -606127 -903506 -961915 -820635 -615519
32408 -615519 -481412 -515879 -723353 -964624 -1055104 -983181 -970842 -1231408 -1701922 -2112056
32398 -2112056 -2305753 -2393864 -2587245 -2991912 -3584121 -4239764 -4709939 -4706331 -4163464 -3366138
32388 -3366138 -2694366 -2270185 -1949045 -1597374 -1232818 -911626 -640941 -440567 -357370 -354100
32378 -354100 -290458 -95051 122348 218094 217652 268095 406698 490541 401334 235908 193511
32367 193511 296190 347624 224527 85145 144306 313929 281389 -31731 -316595 -295344
$$ packed form
32439c83142j63259K4918J79699R8264l7378j9773N1078o956j28488j19904L7670
32428d67271K01505K73817K25552K6033k63831m17403k68737K7921J61613P3650
32418d27151M114J04373K07217Q6621k00871l80430k97379n8409J41280K05116
32408f15519J34107l4467k07474k41271r0480P1923J2339k60566m70514m10134
32398b112056j93697q8111j93381m04667n92209o55643m70175L608N42867P97326
32388c366138O71772M24181L21140L51671L64556L21192K70685K00374Q3197L270
32378c54100O3642J95407K17399R5746m42N0443J38603Q3843q9207j65426m2397
32367A93511J02679N1434j23097j39382N9161J69623l2540l13120k84864K1251
$$ plain form
32357 -295344 -91222 847 -46838 -28667 108409 181762 77900 -90348 -171294 -131079 9214
32346 9214 206630 328740 245251 40425 -57023 -11003 -26132 -173162 -216219 19547 327427
32335 327427 392284 226345 89191 87088 115499 141175 263117 466925 554997 406780 151088
32324 151088 -4207 -10731 13225 -56840 -218479 -324827 -215602 76026 298701 261465
32314 261465 78980 5220 76590 104263 10181 -44850 69896 250815 336360 338251 360148
32303 360148 390219 323380 142454 -45369 -133472 -90352 63441 266936 422134 461700
32293 461700 410880 332735 237697 111511 4004 -4999 62020 73708 -38214 -167732 -163315
32282 -163315 -27672 96312 132221 163319 276346 404161 422510 352804 340467 433115 512692
$$ packed form
32357b95344K04122R2069m7685J8171J37076P3353j03862j68248q0946M0215J40293
32346I214J97416J22110q3489k04826r7448M6020j5129j47030m3057K35766L07880
32335C27427O4857j65939j37154k103K8411K5676J21942K03808Q8072j48217k55692
32324A51088j55295o524K3956p0065j61639j06348J09225K91628K22675l7236
32314B61465j82485p3760P1370K7673r4082n5031J14746J80919Q5545J891K1897
32303C60148L0071o6839j80926j87823q8103M3120J53793K03495J55198L9566
32293D61700n0820p8145r5038j26186j07507r003O7019J1688j11922j29518M417
32282a63315J35643J23984L5909L1098J13027J27815J8349o9706j2337R2648P9577
$$ plain form
32271 512692 483217 391577 292265 133068 -98161 -231237 -103081 159940 242584 37282
32261 37282 -225862 -288027 -154076 -7612 44164 44756 78132 168144 257137 243588 77381
32250 77381 -160428 -317550 -320660 -216811 -79797 38322 69820 -33829 -200147 -286179
32240 -286179 -276577 -313350 -470020 -626294 -658847 -631405 -665791 -722472 -663934 -477132 -276200
32229 -276200 -115568 40887 169636 169844 32583 -114114 -189329 -262388 -388200 -453490 -319064
32218 -319064 -57795 96709 46391 -53758 -24544 98787 154621 114932 120520 255666 425687
32207 425687 521148 587374 717911 854470 836242 631173 387878 249593 234246 307217
32197 307217 431168 500888 381345 111045 -52499 75677 342093 416264 184572 -141583
$$ packed form
32271E12692k9475r1640r9312j59197k31229j33076J28156K63021Q2644k05302
32261C7282k63144o2165J33951J46464N1776N92L3376R0012Q8993j3549j66207
32250G7381k37809j57122l110J03849J37014J18119L1498j03649j66318q6032
32240b86179R602l6773j56670j56274l2553K7442l4386n6681N8538J86802K00932
32229b76200J60632J56455J28749K08j37261j46697p5215p3059j25812o5290J34426
32218c19064K61269J54504n0318j00149K9214J23331N5834l9689N588J35146J70021
32207D25687R5461O6226J30537J36559j8228k05069k43295j38285j5347P2971
32197C07217J23951O9720j19543k70300j63544J28176K66416P4171k31692l26155
$$ plain form
32187 -141583 -298706 -229383 -47743 140813 313033 466928 561368 545521 439981 350373
32177 350373 355456 397440 353662 220570 131336 154323 181358 97125 -32479 -53792 55967
32166 55967 188647 285892 385809 495296 545278 499589 409790 338787 318096 391038 586782
32155 586782 814477 895634 772928 601269 552084 599028 592250 491151 405274 412351 448937
32144 448937 418201 326702 262826 290802 414785 602851 785507 863578 795428 670660 623158
32133 623158 665031 681601 600644 475259 374131 300818 273502 352936 494202 509992 335189
32122 335189 200666 329928 560525 546628 303640 221533 474892 756770 759618 614455
32112 614455 606136 699141 659405 491688 420608 499131 547231 480091 422684 458651 502471
$$ packed form
32187a41583j57123O9323J81640J88556J72220J53895R4440j5847j05540q9608
32177C50373N083M1984m3778j33092q9234K2987K7035q4233j29604k1313J09759
32166E5967J32680R7245R9917J09487M9982m5689q9799p1003k0691P2942J95744
32155E86782K27695Q1157j22706j71659m9185M6944o778j01099q5877P077L6586
32144D48937l0736r1499o3876K7976J23983J88066J82656P8071o8150j24768m7502
32133F23158M1873J6570q0957j25385j01128p3313k7316P9434J41266J5790j74803
32122C35189j34523J29262K30597j3897k42988q2107K53359K81878K848j45163
32112F14455q319R3005l9736j67717p1080P8523M8100o7140n7407L5967M3820
$$ plain form
32101 502471 486068 474288 516081 536009 448567 268230 65623 -83802 -100646 29026 183250
32090 183250 225292 182226 169981 178583 113761 29206 88489 261752 292897 59477 -232696
32079 -232696 -328684 -236976 -145836 -159870 -235697 -283447 -244640 -146675 -117257 -241428 -397702
32068 -397702 -390139 -253672 -224276 -362338 -444477 -325966 -163659 -128658 -133241 -43073 47870
32057 47870 -2296 -88649 -8164 203587 341187 364868 417499 538298 592166 492524 309317
32046 309317 142877 33944 -10145 -23835 -84191 -192083 -226032 -138838 -85206 -180236 -257878
32035 -257878 -104902 166259 258678 145319 75923 143376 169034 67971 8714 103914 228876
32024 228876 279389 342846 458874 470111 306452 180802 265697 376680 253660 5864
$$ packed form
32101E02471j6403j1780M1793J9928q7442j80337k02607j49425j6844J29672J54224
32090A83250M2042m3066j2245Q602o4822q4555N9283J73263L1145k33420k92173
32079b32696r5988R1708R1140j4034p5827m7750L8807R7965K9418j24171j56274
32068c97702P563J36467K9396j38062q2139J18511J62307L5001m583R0168R0943
32057D7870n0166q6353Q0485K11751J37600K3681N2631J20799N3868r9642j83207
32046C09317j66440j08933m4089j3690o0356j07892l3949Q7194N3632r5030p7642
32035b57878J52976K71161R2419j13359o9396O7453K5658j01063n9257R5200J24962
32024B28876N0513O3457J16028J1237j63659j25650Q4895J10983j23020k47796
$$ plain form
32014 5864 -37531 152512 258393 111537 -54121 49436 370977 615653 606931 416984
32004 416984 207243 73783 48852 150760 364372 588253 663580 507015 208022 -48850
31994 -48850 -154999 -123192 16814 262172 545451 717114 712885 660472 708782 804936 775310
31983 775310 614162 540645 710903 986107 1089550 941944 727852 629528 612460 544455
31973 544455 439050 442137 586039 713011 713724 706920 852929 1087418 1213703 1210445 1250886
31962 1250886 1413463 1576593 1652537 1726101 1860404 1948780 1911044 1893940 2092115 2451619
31952 2451619 2722888 2757609 2602553 2353913 2087355 1901741 1856558 1863314 1793606 1692123
31942 1692123 1709629 1810217 1748896 1421013 1054174 925521 1023528 1134715 1160541 1176149
$$ packed form
32014E864m3395J90043J05881j46856j65658J03557L21541K44676q722j89947
32004D16984k09741j33460k4931J01908K13612K23881P5327j56565k98993k56872
31994d8850j06149L1807J40006K45358K83279J71663m229n2413M8310R6154k9626
31983G75310j61148p3517J70258K75204J03443j47606k14092r8324j7068o8005
31973E44455j05405L087J43902J26972P13o804J46009K34489J26285l258M0441
31962A250886J62577J63130P5944P3564J34303Q8376l7736j7104J98175L59504
31952B451619K71269L4721j55056k48640k66558j85614m5183O756o9708j01483
31942A692123J7506J00588o1321l27883l66839j28653R8007J11187K5826J5608
$$ plain form
31932 1176149 1225889 1238749 1164193 1057446 984955 933992 857078 741761 604321 467351
31922 467351 367338 330923 317121 233241 38881 -207136 -425962 -593203 -703120 -719592
31912 -719592 -626289 -492133 -419313 -432415 -466539 -459003 -414095 -386414 -432046 -556402 -678438
31901 -678438 -682861 -556063 -429169 -423882 -503516 -559563 -588083 -653439 -716939 -670485 -548110
31890 -548110 -525101 -658800 -803892 -854440 -885532 -951737 -941111 -787455 -647218 -660100 -686421
31879 -686421 -526982 -284506 -221280 -322795 -309596 -82016 143040 179453 73614 -105173
31869 -105173 -382878 -668853 -703269 -401694 -42672 76501 -283 -47569 -6469 29275
31859 29275 33372 30495 -48244 -280020 -565193 -698021 -591732 -318710 -3952 203186 165344
$$ packed form
31932A176149M9740J2860p4556j06747p2491n0963p6914j15317j37440j36970
31922D67351j00013l6415j3802q3880j94360k46017k18826j67241j09917j6472
31912g19592R3303J34156P2820j3102l4124P536M4908K7681m5632j24356j22036
31901f78438m423J26798J26894N287p9634n6047k8520o5356o3500M6454J22375
31890e48110K3009j33699j45092n0548l1092o6205J0626J53656J40237j2882k6321
31879f86421J59439K42476O3226j01515J3199K27580K25056L6413j05839j78787
31869a05173k77705k85975l4416L01575L59022J19173p6784m7286M1100L5744
31859B9275M097k877p8739k31776k85173j32828J06289K73022L14758K07138l7842
$$ plain form
31848 165344 -71320 -237042 -140177 77942 155876 69306 -27007 -100622 -222177 -313001 -212842
31837 -212842 -8926 -8469 -307252 -624285 -665627 -459499 -232538 -125079 -133552 -190728 -196692
31826 -196692 -77508 106315 198935 136557 -11222 -202285 -468923 -760008 -910196 -859511
31816 -859511 -759491 -756230 -790316 -721340 -546087 -377232 -280575 -239173 -232403 -270900 -374764
31805 -374764 -538914 -679744 -648887 -410020 -172487 -180895 -367334 -414836 -209508 483
31795 483 -4424 -101771 -70199 56212 86377 -27749 -209301 -450094 -746554 -927157 -798497
31784 -798497 -442438 -148086 -49442 -28430 19776 31457 -71895 -249537 -425960 -577245
31774 -577245 -679237 -686458 -618693 -575083 -610686 -663862 -632473 -470122 -214983 12039 67293
$$ packed form
31848A65344k36664j65722R6865K18119P7934q6570r6313p3615j21555r0824J00159
31837b12842K03916M57k98783l17033m1342K06128K26961J07459q473n7176n964
31826a96692J19184J83823R2620o2378j47779j91063k66638k91085j50188N0685
31816h59511J00020L261l4086O8976J75253J68855R6657M1402O770l8497j03864
31805c74764j64150j40830L0857K38867K37533q408j86439m7502K05328K09991
31795D83m907r7347L1572J26411L0165j14126j81552k40793k96460j80603J28660
31784g98497L56059K94352R8644K1012M8206J1681j03352j77642j76423j51285
31774e77245j01992p221O7765M3610l5603n3176L1389J62351K55139K27022N5254
$$ plain form
31763 67293 -68541 -234009 -277542 -260628 -338315 -479374 -489894 -325746 -184393 -215434 -312695
31752 -312695 -304071 -208958 -165601 -189107 -152379 13853 216850 307837 222640 8658 -236503
31741 -236503 -434210 -556578 -614094 -633229 -656418 -733441 -870738 -1000007 -1035819 -958364 -814992
31730 -814992 -668256 -576004 -578404 -648339 -690781 -645321 -545131 -427037 -267115 -89464 -34498
31719 -34498 -174064 -337159 -299046 -97790 33275 24231 36395 150575 217647 99123 -133568
31708 -133568 -327910 -413337 -364679 -184514 -8761 -42152 -279662 -470148 -464190 -400129 -419549
31697 -419549 -428801 -329300 -258271 -349721 -442702 -316783 -74504 23886 324 91875 301222
31686 301222 379411 271110 217692 336690 430108 340634 201738 167090 150810 32205 -100191
$$ packed form
31763F7293j35834j65468m3533J6914p7687j41059j0520J64148J41353l1041r7261
31752c12695Q624R5113M3357k3506L6728J66232K02997R0987q5197k13982k45161
31741b36503j97707j22368n7516j9135k3189p7023j37297j29269l5812P7455J43372
31730h14992J46736R2252k400o9935m2442M5460J00190J18094J59922J77651N4966
31719c4498j39566j63095L8113K01256J31065r044J2164J14180O7072j18524k32691
31708a33568j94342q5427M8658J80165J75753l3391k37510j90486N958O4061j9420
31697d19549r252R9501P1029r1450r2981J25919K42279R8390k3562R1551K09347
31686C01222P8189j08301n3418J18998R3418q9474j38896l4648j6280j18605j32396
$$ plain form
31675 -100191 -124599 -130044 -258660 -435112 -478988 -399362 -364181 -429571 -494335 -495619 -472798
31664 -472798 -439483 -342103 -162292 47295 235009 376239 442483 420672 342589 236944
31654 236944 97468 -48172 -118937 -107410 -129409 -241161 -310311 -209349 -42228 -3313
31644 -3313 -80908 -100470 -26806 -10677 -127428 -271712 -351004 -399543 -439442 -392181 -209161
31633 -209161 31212 219247 305803 272168 128966 -36131 -144473 -266191 -505436 -740066
31623 -740066 -703704 -389219 -121764 -106717 -150937 -15700 186963 206409 84320 68217
31613 68217 186720 219807 77716 -68465 -69980 17674 88659 125273 123718 53096 -48127
31602 -48127 -74237 4644 124934 261242 421941 513046 402559 157712 16155 57071
$$ packed form
31675a00191k4408n445j28616j76452m3876P9626L5181o5390o4764j284K2821
31664d72798L3315R7380J79811K09587J87714J41230O6244k1811p8083j05645
31654B36944j39476j45640p0765J1527k1999j11752o9150J00962J67121L8915
31644c313p7595j9562P3664J6129j16751j44284p9292m8539l9899M7261J83020
31633b09161K40373J88035Q6556l3635j43202j65097j08342j21718k39245k34630
31623g40066L6362L14485K67455J5047m4220J35237K02663J9446j22089j6103
31613F8217J18503L3087j42091j46181j515Q7654P0985L6614j555p0622j01223
31602d8127k6110P8881J20290J36308J60699R1105j10487k44847j41557M0916
$$ plain form
31592 57071 102143 22554 -75222 -90614 -132680 -301729 -452815 -396115 -200842 -75836 -47087
31581 -47087 13855 107033 92921 -50505 -179873 -209389 -185837 -119629 60429 325408 494445
31570 494445 455153 313800 247018 295816 362575 329255 142743 -129346 -305310 -252142 -59390
31559 -59390 62500 62269 70340 119228 57283 -148737 -238610 5814 386936 499588 256713
31548 256713 -37262 -137495 -131684 -186273 -253747 -204399 -98230 -105945 -208036 -186262 48072
31537 48072 294443 329918 209939 164004 260716 342352 292320 202295 205147 272844 288215
31526 288215 224026 123428 -29618 -266882 -493870 -563827 -513439 -552454 -746715 -867073
31516 -867073 -680324 -285573 -8741 -4213 -101418 -50670 189896 441645 503286 327687
$$ packed form
31592E7071M5072p9589r7776j5392m2066j69049j51086N6700J95273J25006K8749
31581d7087O0942R3178j4112j43426j29368k9516K3552O6208J80058K64979J69037
31570D94445l9292j41353o6782M8798O6759l3320j86512k72089j75964N3168J92752
31559e9390J21890k31Q071M8888o1945k06020q9873K44424L81122J12652k42875
31548B56713k93975j00233N811n4589o7474M9348J06169p715j02091K1774K34334
31537D8072K46371L5475j19979m5935R6712Q1636n0032r0025K852O7697J5371
31526B88215o4189j00598j53046k37264k26988o9957N0388l9015j94261j20358
31516h67073J86749L94751K76832M528r7205N0748K40566K51749O1641j75599
$$ plain form
31506 327687 48468 -139963 -149471 -57525 3892 -3956 -14394 35695 129522 199332 199250 144562
31494 144562 88889 57732 14206 -77685 -169295 -172335 -94731 -49907 -103514 -203141 -302193 -434429
31482 -434429 -579146 -581568 -361516 -110445 -84798 -239975 -280919 -88914 122961 151838
31472 151838 91033 134142 255254 268331 117057 -73085 -193887 -248987 -262179 -231329 -181748
31461 -181748 -146820 -85184 67872 250144 297350 165241 18864 31235 173557 275549
31451 275549 226352 43369 -192849 -377579 -396731 -211740 62191 237615 230804 113729
31441 113729 5616 -23861 40506 156921 208565 80241 -190844 -401050 -375634 -143538
31431 -143538 116263 248921 205959 33982 -133786 -134286 63729 273854 271896 56187 -169345
$$ packed form
31506C27687k79219j88431r508R1946O1417p848j0438N0089R3827O9810q2n4688
31494A44562n5673l1157m3526r1891r1610l040P7604M4824n3607r9627r9052j32236
31482d34429j44717k422K20052K51071K5647j55177m0944J92005K11875K8877
31472A51838o0805M3109J21112J3077j51274j90142j20802n5100j3192L0850M9581
31461a81748L4928O1636J53056J82272M7206j32109j46377J2371J42322J01992
31451B75549m9197j82983k36218j84730j9152J84991K73931J75424o811j17075
31441A13729j08113k9477O4367J16415N1644j28324k71085k10206K5416K32096
31431a43538K59801J32658m2962j71977j67768n00J98015K10125j958k15709k25532
$$ plain form
31420 -169345 -261223 -262793 -253249 -214599 -114571 -5935 41524 22991 -55288 -212180 -391677
31409 -391677 -437859 -288404 -100160 -47512 -81082 -43165 59075 96462 83210 158766 295541
31398 295541 281633 75355 -65392 48645 245606 257653 119319 75300 189289 285435
31388 285435 246830 145270 58984 -30101 -100586 -37652 183374 389032 394245 216902 17302
31377 17302 -106174 -168893 -200818 -197655 -160679 -112235 -68601 -41273 -55291 -122713 -205989 -249902
31365 -249902 -247070 -233918 -224443 -193777 -142487 -134226 -227522 -386175 -508781 -559659 -614699 -725457
31353 -725457 -782165 -618708 -274636 -37671 -127722 -400979 -495130 -264930 49488 131482
31343 131482 -38663 -206300 -181032 -39644 23671 -43023 -118616 -111371 -90496 -160097 -273409
$$ packed form
31420a69345r1878j570R544L8650J00028J08636M7459j8533p8279j56892j79497
31409c91677m6182J49455J88244N2648l3570L7917J02240L7387j3252P5556J36775
31398B95541j3908k06278j40747J14037J96961J2047j38334m4019J13989R6146
31388B85435l8605j01560q6286q9085p0485O2934K21026K05658N213j77343j99600
31377A7302j23476o2719l1925L163L6976M8444M3634K7328j4018o7422q3276m3913
31365b49902K832J3152R475L0666N1290Q261r3296j58653j22606n0878n5040j10758
31353g25457n6708J63457L44072K36965r0051k73257r4151K30200L14418Q1994
31343A31482j70145j67637K5268J41388O3315o6694p5593P245K0875o9601j13312
$$ plain form
31332 -273409 -286740 -185529 -120808 -176319 -235509 -175975 -73393 -71122 -146192 -183707 -212140
31321 -212140 -344661 -512481 -507214 -325022 -213592 -286888 -351722 -271012 -246171 -491936 -817153
31310 -817153 -834048 -498162 -144356 -10641 -9413 2407 695 -62208 -108105 -56351 45624
31299 45624 119271 171824 241542 331008 447639 595813 688850 608874 405061 276440 291951
31288 291951 301633 216978 182399 315586 453354 359690 69183 -178332 -254530 -196874 -35845
31277 -35845 201952 364517 285352 28866 -174443 -240321 -282501 -355506 -370566 -302025 -252748
31266 -252748 -249946 -193810 -92632 -121322 -317328 -433627 -271179 17844 156554 127456
31256 127456 110227 146879 117798 4850 -62659 -32564 7114 19432 84115 216878 289304
$$ packed form
31332b73409j3331J01211O4721n5511n9190N9534J02582K271p5070l7515k8433
31321b12140j32521j67820N267J82192J11430p3296o4834Q0710K4841k45765l25217
31310h17153j6895L35886L53806J33715J228J1820j712o2903m5897N1754J01975
31299D5624P3647N2553O9718Q9466J16631J48174R3037p9976k03813j28621J5511
31288B91951R682q4655l4579J33187J37768r3664k90507k47515p6198N7656J61029
31277c5845K37797J62565p9165k56486k03309o5878m2180p3005j5060O8541M9277
31266b52748K802N6136J01178k8690j96006j16299J62448K89023J38710k9098
31256A27456j7229L6652k9081j12948o7509L0095L9678J2318O4683J32763P2426
$$ plain form
31245 289304 210681 64973 -12574 4418 66526 147214 226377 245197 163727 34053 -38161
31234 -38161 10607 155708 293236 299582 154994 11606 43901 214547 308389 246400 224702
31223 224702 431562 744092 869673 730585 531412 448508 427857 345471 218990 152714
31213 152714 160889 163934 128707 115112 182298 312807 431162 449868 310059 42032 -210443
31202 -210443 -294379 -202989 -76818 -28919 -31388 -12891 7161 -34449 -111429 -131685 -90126
31191 -90126 -89213 -177799 -267755 -267606 -219152 -224099 -287604 -316897 -249169 -110032 39725 154285
31179 154285 209183 207183 170084 97219 -32717 -187636 -276399 -279796 -309555 -433653 -514521
31168 -514521 -374369 -92167 44189 -84758 -262037 -216021 56873 335083 436243 353595
$$ packed form
31245B89304p8623j45708p7547J6992O2108Q0688P9163J8820q1470j29674p2214
31234c8161M8768J45101J37528O346j44588j43388L2295J70646R3842o1989k1698
31223B24702K06860L12530J25581j39088j99173q2904k0651q2386j26481o6276
31213A52714Q175L045l5227j3595O7186J30509J18355J8706j39809k68027k52475
31202b10443q3936R1390J26171M7899k469J8497K0052m1610p6980k0256M1559
31191i0126R13q8586q9956J49M8454m947o3505k9293O7728J39137J49757J14560
31179A54285N4898k000l7099p2865j29936j54919q8763l397k9759j24098q0868
31168e14521J40152K82202J36356j28947j77279M6016K72894K78210J01160q2648
$$ plain form
31158 353595 206958 132332 158813 154851 -17535 -271520 -357121 -207667 -46292 -33704 -5653
31147 -5653 238686 549087 602518 390775 228835 273410 329938 216442 47604 8360 55790
31136 55790 30193 -78743 -157578 -171075 -182463 -235065 -338198 -498406 -641699 -590090 -270068
31125 -270068 115655 289479 238443 190300 273610 384218 404856 367632 328308 243091 82858
31114 82858 -47394 -34193 63733 82148 -27029 -144356 -156638 -101047 -101556 -193469 -246723
31103 -246723 -91808 260793 567081 587492 362790 148896 69914 -9473 -184857 -259611
31093 -259611 1438 446132 625051 357178 -17276 -73892 176626 377987 320222 127326
$$ packed form
31158C53595j46637p4626K6481l962j72386k53985q5601J49454J61375J2588K8051
31147e653K44339L10401N3431k11743j61940M4575N6528j13496j68838l9244M7430
31136E5790k5597j08936p8835j3497j1388n2602j03133j60208j43293N1609L20022
31125b70068L85723J73824n1036m8143Q3310J10608K0638l7224l9324q5217j60233
31114H2858j30252J3201R7926J8415j09177j17327j2282N5591n09r1913n3254
31103b46723J54915L52601L06288K0411k24702k13894p8982p9387j75384p4754
31093b59611K61049M44694J78919k67873l74454n6616K50518K01361n7765j92896
$$ [...]
##END NTUPLES=NMR SPECTRUM
##END=
