##TITLE=31Pdec_PR95S
 D2O, 24 sc
 2.4.2019
##JCAMPDX= 6.0         $$ Bruker NMR JCAMP-DX V2.0
##DATA TYPE= NMR SPECTRUM
##DATA CLASS= NTUPLES
##ORIGIN= UXNMR, Bruker Analytische Messtechnik GmbH
##OWNER= root
$$ XWIN-NMR		Version 3.5
$$ Tue Apr  2 16:08:55 2019 Russian Standard Time (UT+4h)  she@DPX200
##.OBSERVE FREQUENCY= 81.013821
##.OBSERVE NUCLEUS= ^31P
##.ACQUISITION MODE= SIMULTANEOUS
##.ACQUISITION SCHEME= undefined
##.AVERAGES= 24
##.DIGITISER RES= 17
##SPECTROMETER/DATA SYSTEM= spect
##.PULSE SEQUENCE= zgpg30
##.SOLVENT NAME= CDCl3
##.SHIFT REFERENCE= (INTERNAL, CDCl3, 0, 182.463)
##AUDIT TRAIL= $$ (NUMBER, WHEN, WHO, WHERE, WHAT)
$$ ##TITLE= Audit trail, XWIN-NMR		Version 3.5
$$ ##JCAMPDX= 5.01
$$ ##ORIGIN= Bruker BioSpin GmbH
$$ ##OWNER= she
$$ F:/spectra/data/she/nmr/P31/1/pdata/1/auditp.txt
$$ ##AUDIT TRAIL=  $$ (NUMBER, WHEN, WHO, WHERE, WHAT)
(   1,<2019-04-02 16:08:04.73 +0400>,<she>,<DPX200>,
      <created by zg, POWCHK disabled, PULCHK disabled
       configuration hash MD5:
       00 E9 B6 7A A2 85 ED C7 34 08 36 98 17 FE 4E 26
       data hash MD5: 32K
       12 80 08 85 63 CF 56 A0 B5 43 59 99 51 9A B0 2B>)
(   2,<2019-04-02 16:08:07.17 +0400>,<she>,<DPX200>,
      <Start of raw data processing
       efp BC_mod = 2 LB = 1 FT_mod = 6 PKNL = 1 PHC0 = -1810.87 PHC1 = 56.99897 SI = 64K 
       data hash MD5: 64K
       5B 59 81 1B 7D E2 D7 2D 00 8A 22 0C AA 7C 4A E1>)
(   3,<2019-04-02 16:08:19.60 +0400>,<she>,<DPX200>,
      <pk PHC0 = -14.51327 PHC1 = 0 
       data hash MD5: 64K
       55 E2 04 B4 99 18 6E 2E 4E 9C 61 8A 9A A3 63 FC>)
(   4,<2019-04-02 16:08:22.75 +0400>,<she>,<DPX200>,
      <abs ABSG = 5 
       data hash MD5: 64K
       25 15 21 81 9C 4D 6A 61 84 8D 53 A1 1F 16 86 2A>)
$$ ##END=
$$ 
$$ hash MD5
$$ 85 55 35 7F 13 4F 18 9D CF DC 6C D1 AF B7 CC 55
##$RELAX= 
##$RELAX= 
##$RELAX= 
##$RELAX= 
##$RELAX= 
##$RELAX= 
##$RELAX= 
##$RELAX= 
$$ Bruker specific parameters
$$ --------------------------
##$DU= <F:/spectra>
##$EXPNO= 1
##$NAME= <P31>
##$PROCNO= 1
##$TYPE= <nmr>
##$USER= <she>
##$AMP= (0..31)
100 100 100 100 100 100 100 100 100 100 100 100 100 100 100 100 100 100 
100 100 100 100 100 100 100 100 100 100 100 100 100 100 
##$AQSEQ= 0
##$AQ_mod= 1
##$AUNM= <au_zg>
##$AUTOPOS= <>
##$BF1= 81.014009
##$BF2= 200.13
##$BF3= 200.13
##$BF4= 200.13
##$BF5= 200.13
##$BF6= 200.13
##$BF7= 200.13
##$BF8= 200.13
##$BYTORDA= 1
##$CFDGTYP= 0
##$CFRGTYP= 5
##$CHEMSTR= <none>
##$CNST= (0..31)
1 1 145 1 1 1 1 1 1 1 1 1 1 1 1 1 1 1 1 1 1 1 1 1 1 1 1 1 1 1 1 1 
##$CPDPRG= <waltz16>
##$CPDPRG1= <>
##$CPDPRG2= <waltz16>
##$CPDPRG3= <>
##$CPDPRG4= <mlev>
##$CPDPRG5= <mlev>
##$CPDPRG6= <mlev>
##$CPDPRG7= <mlev>
##$CPDPRG8= <mlev>
##$CPDPRGB= <>
##$CPDPRGT= <>
##$D= (0..31)
0 1 0 0 0 0 0 0 0 0 0 0.03 2e-05 3e-06 0 0 0 0 0 0 0 0 0 0 0 0 0 0 0 0 
0 0 
##$DATE= 1554206883
##$DBL= (0..7)
120 120 120 11 120 120 24 19 
##$DBP= (0..7)
150 150 150 150 150 150 150 150 
##$DBP07= 0
##$DBPNAM0= <>
##$DBPNAM1= <>
##$DBPNAM2= <>
$$ [...]
##$SUBNAM3= <"">
##$SUBNAM4= <"">
##$SUBNAM5= <"">
##$SUBNAM6= <"">
##$SUBNAM7= <"">
##$SUBNAM8= <"">
##$SUBNAM9= <"">
##$SW= 369.568048894756
##$SWIBOX= (0..15)
0 1 3 0 0 0 0 0 0 0 0 0 0 0 0 0 
##$SW_h= 29940.119760479
##$TD= 32768
##$TD0= 1
##$TE= 0
##$TE2= 300
##$TE3= 300
##$TEG= 300
##$TL= (0..7)
0 120 53 12 22 120 120 120 
##$TP= (0..7)
150 150 150 150 150 150 150 150 
##$TP07= 0
##$TPNAME0= <>
##$TPNAME1= <>
##$TPNAME2= <>
##$TPNAME3= <>
##$TPNAME4= <>
##$TPNAME5= <>
##$TPNAME6= <>
##$TPNAME7= <>
##$TPOAL= (0..7)
0.5 0.5 0.5 0.5 0.5 0.5 0.5 0.5 
##$TPOFFS= (0..7)
0 0 0 0 0 0 0 0 
##$TUNHIN= 0
##$TUNHOUT= 0
##$TUNXOUT= 0
##$USERA1= <user>
##$USERA2= <user>
##$USERA3= <user>
##$USERA4= <user>
##$USERA5= <user>
##$V9= 5
##$VALIST= <valist>
##$VCLIST= <CCCCCCCCCCCCCCC>
##$VD= 0
##$VDLIST= <DDDDDDDDDDDDDDD>
##$VPLIST= <PPPPPPPPPPPPPPP>
##$VTLIST= <TTTTTTTTTTTTTTT>
##$WBST= 1024
##$WBSW= 4
##$XGAIN= (0..3)
0 0 0 0 
##$XL= 0
##$YL= 0
##$YMAX_a= 10413
##$YMIN_a= -9343
##$ZGOPTNS= <>
##$ZL1= 120
##$ZL2= 120
##$ZL3= 120
##$ZL4= 120
##$ABSF1= 182.463
##$ABSF2= -187.1042
##$ABSG= 5
##$ABSL= 3
##$ALPHA= 0
##$AQORDER= 0
##$ASSFAC= 0
##$ASSFACI= 0
##$ASSFACX= 0
##$ASSWID= 0
##$AUNMP= <proc_1d>
##$AZFE= 0.1
##$AZFW= 0.5
##$BCFW= 0
##$BC_mod= 2
##$BYTORDP= 0
##$COROFFS= 0
##$CY= -3
##$DATMOD= 1
##$DC= 0
##$DFILT= <>
##$DTYPP= 0
##$F1P= 0
##$F2P= 0
##$FCOR= 1
##$FTSIZE= 65536
##$FT_mod= 6
##$GAMMA= 0
##$GB= 0
##$INTBC= 1
##$INTSCL= 5.30512e-09
##$ISEN= 30
##$LB= 1
##$LEV0= 0
##$LPBIN= 0
##$MAXI= 10000
##$MC2= 0
##$MEAN= 0
##$ME_mod= 0
##$MI= 50
##$NCOEF= 0
##$NC_proc= -7
##$NLEV= 6
##$NOISF1= 182.463
##$NOISF2= 159.3651
##$NSP= 0
##$NTH_PI= 0
##$NZP= 0
##$OFFSET= 182.463
##$PC= 4
##$PHC0= -1825.383
##$PHC1= 56.99897
##$PH_mod= 1
##$PKNL= yes
##$PPARMOD= 0
##$PSCAL= 0
##$PSIGN= 0
##$REVERSE= no
##$SF= 81.0140089999434
##$SI= 65536
##$SIGF1= 159.3651
##$SIGF2= -187.1042
##$SINO= 113.3802
##$SIOLD= 16384
##$SREGLST= <1H.CDCl3>
##$SSB= 0
##$STSI= 65536
##$STSR= 0
##$SW_p= 29940.119760479
##$SYMM= 0
##$S_DEV= 0
##$TDeff= 32768
##$TDoff= 0
##$TI= <>
##$TILT= no
##$TM1= 0
##$TM2= 0
##$TOPLEV= 0
##$USERP1= <user>
##$USERP2= <user>
##$USERP3= <user>
##$USERP4= <user>
##$USERP5= <user>
##$WDW= 1
##$XDIM= 65536
##$YMAX_p= 389785979
##$YMIN_p= -38427111
$$ End of Bruker specific parameters
$$ ---------------------------------
##NTUPLES= NMR SPECTRUM
##VAR_NAME=  FREQUENCY,     SPECTRUM/REAL,   SPECTRUM/IMAG
##SYMBOL=    X,             R,               I
##VAR_TYPE=  INDEPENDENT,   DEPENDENT,       DEPENDENT
##VAR_FORM=  AFFN,          ASDF,            ASDF
##VAR_DIM=   65536,         65536,           65536
##UNITS=     HZ,            ARBITRARY UNITS, ARBITRARY UNITS
##FACTOR=    0.456856943014862, 1,           1
##FIRST=     14782.0589164792, 0,            0
##LAST=      -15158.0608439998, 0,           0
##MIN=       -15158.0608439998, -38427111,   0
##MAX=       14782.0589164792, 389785979,    0
$$ Real data points
##PAGE= N=1
##DATA TABLE= (X++(R..R)), XYDATA
$$ [...]
$$ plain form
37933 4116964 4532758 3545775 1448993 -283525 -242903 1436784 3552289 5423856 6840946
37924 6840946 6805531 4257385 471859 -1221072 685235 3665336 4213091 2074139 -46892
37915 -46892 -191275 1198562 2945060 4465041 5075536 3815867 1088747 -757906 7566
37906 7566 1944088 2080752 94411 -970831 989118 3709168 3218860 -837202 -4742129
37897 -4742129 -5668198 -4769508 -4315966 -4011679 -2418761 -708785 -1979928 -6607096 -10821060
37888 -10821060 -11070299 -8074165 -5190288 -4075678 -3678782 -2832077 -1897205 -1584803 -1612948
37879 -1612948 -1257264 -344721 1006563 2897550 4988278 5909190 4668818 2602413 2366064
37870 2366064 4344365 5528584 3264204 -1065021 -3905200 -4223713 -3920935 -3849193 -2500329
$$ packed form
37933D116964M15794r86983k096782j732518M0622J679687K115505J871567J417090
37924F840946l5415k548146l785526j692931J906307K980101N47755k138952k121031
37915d6892j44383J389837J746498J519981O10495j259669k727120j846653P65472
37906G566J936522J36664j986341j065242J959949K720050m90308m056062l904927
37897d742129r26069Q98690M53542L04287J592918J709976j271143m627168m213964
37888a0821060k49239K996134K883877J114610L96896Q46705R34872L12402k8145
37879a612948L55684R12543J351284J890987K090728R20912j240372k066405k36349
37870B366064J978301J184219k264380m329225k840179l18513L02778P1742J348864
$$ plain form
37861 -2500329 445632 2372413 1664808 940499 3416303 7636201 9162254 6801888
37853 6801888 3680862 2086148 880338 -867929 -1119299 1904287 6015807 7455335
37845 7455335 5972126 4888582 6281894 8435981 8659249 6808623 4804683 3699892
37837 3699892 2789756 1499806 571973 529851 123723 -2079339 -4969477 -5713844 -3555142
37828 -3555142 -671298 1498336 4168877 7615137 8378129 3549543 -3641682 -6667307
37820 -6667307 -3995669 -614139 -738000 -3085767 -4911410 -6646352 -9514253 -11452944
37812 -11452944 -9222327 -3431739 1658346 2997202 1179724 -1488582 -3223104 -3238776
37804 -3238776 -1849209 -316852 341456 141027 -789400 -2781968 -5368067 -6931154 -7032407
$$ packed form
37861b500329K945961J926781p07605p24309K475804M219898J526053k360366
37853F801888l121026j594714j205810j748267k51370L023586M111520J439528
37845G455335j483209j083544J393312K154087K23268j850626k003940j104791
37837C699892r10136j289950r27833m2122m06128k203062k890138p44367K158702
37828c555142K883844K169634K670541L446260P62992m828586p191225l025625
37820f667307K671638L381530j23861k347767j825643j734942k867901j938691
37812a1452944K230617N790588N090085J338856j817478k668306j734522j5672
37804c238776J389567J532357O58308k00429r30427j992568k586099j563087j01253
$$ plain form
37795 -7032407 -7517283 -9452745 -10581200 -8366386 -4355139 -2448580 -3343558 -3871879 -2016981
37786 -2016981 512122 1465563 961588 -60492 -1793219 -4146893 -5272723 -3730565
37778 -3730565 -1200225 -921897 -3524931 -6016169 -5325637 -1797066 1575460 2861206
37770 2861206 3074632 4034361 5476720 5759201 4996378 5301451 7264473 8466115 7069594
37761 7069594 4858564 4384023 4726076 3098899 -255491 -2163820 -1446287 -450201 -1098562
37752 -1098562 -2492093 -3480163 -4730653 -6701866 -8009386 -7604444 -6564137 -5924587 -4614498
37743 -4614498 -1590875 1540063 2358459 1144952 383046 1220930 2300790 1939850 -25466
37734 -25466 -2515796 -4186137 -4215530 -2974196 -1740098 -1243216 -1015291 -633471 -675478
$$ packed form
37795g032407m84876j935462j128455K214814M011247J906559q94978n28321J854898
37786b016981K529103R53441n03975j022080j732727k353674j125830J542158
37778c730565K530340K78328k603034k491238O90532L528571L372526J285746
37770B861206K13426R59729J442359K82481p62823L05073J963022J201642j396521
37761G069594k211030m74541L42053j627177l354390j908329P17533R96086o48361
37752a098562j393531r88070j250490j971213j307520M04942J040307O39550J310089
37743d614498L023623L130938Q18396j213507p61906Q37884J079860l60940j965316
37734b5466k490330j670341k9393J241334J234098M96882K27925L81820m2007
$$ plain form
37725 -675478 -1641243 -2803727 -3075606 -2328953 -1080942 341577 1586219 2109827 1943688
37716 1943688 1674942 1147746 -424137 -2390827 -2588523 -526767 1349090 1301329 1175767
37707 1175767 3246556 5906794 5514091 1603082 -2670818 -4741422 -4538043 -2787058
37699 -2787058 -475552 285074 -1832970 -4420076 -3572941 427809 3042306 1856331
37691 1856331 -504366 -1101759 -565266 -183582 1168814 4089257 5692450 3448721 -113818
37682 -113818 -616472 1574189 2141219 -422804 -3217537 -4354813 -5557902 -7860780 -8590355
37673 -8590355 -5305136 -247838 1967825 -189576 -4312766 -7660909 -9412048 -9820863
37665 -9820863 -9205823 -7966890 -6339026 -4085070 -1324253 702726 833076 -335323
$$ packed form
37725f75478r65765j162484k71879P46653J248011J422519J244642N23608j66139
37716A943688k68746n27196j571883j966690j97696K061756J875857m7761j25562
37707A175767K070789K660238l92703l911009m273900k070604K03379J750985
37699b787058K311506P60626k118044k587106Q47135M000750K614497j185975
37691A856331k360697n97393N36493L81684J352396K920443J603193k243729l562539
37682a13818n02654K190661N67030k564023k794733j137276j203089k302878p29575
37673h590355L285219N057298K215663k157401m123190l348143j751139m08815
37665i820863O15040J238933J627864K253956K760817K026979J30350j168399
$$ plain form
37657 -335323 -1177803 -1287048 -1668982 -2672847 -3141769 -2080095 -33910 1769926 2750877
37648 2750877 2864475 2029471 441105 -1066766 -1615752 -928030 834540 3160404 4836297
37639 4836297 4626928 3083539 2532592 4012541 5249614 3514879 -76065 -1419523
37631 -1419523 1148420 4520771 4908405 2356983 -298437 -1432400 -1586408 -1362826 -653209
37622 -653209 101739 -93580 -1104311 -1612168 -1309745 -1581305 -3120942 -4323488 -3383956
37613 -3383956 -976383 696623 867011 510773 35308 -1249884 -2874048 -2500387 1025078
37604 1025078 5272946 6826631 5676523 4918255 6038417 6814421 4939324 1771796
37596 1771796 574233 2088579 3952437 4121714 2815064 975557 -1127175 -3102969
$$ packed form
37657c35323q42480j09245l81934j003865m68922J061674K046185J803836R80951
37648B750877J13598q35004j588366j507871n48986O87722J762570K325864J675893
37639D836297k09369j543389n50947J479949J237073j734735l590944j343458
37631a419523K567943L372351L87634k551422k655420j133963j54008K23582P09617
37622f53209P54948j95319j010731n07857L02423k71560j539637j202546R39532
37613c383956K407573J673006J70388l56238m75465j285192j624164L73661L525465
37604A025078M247868J553685j150108p58268J120162P76004j875097l167528
37596A771796j197563J514346J863858J69277j306650j839507k102732j975794
$$ plain form
37588 -3102969 -4076092 -4146228 -4682368 -5954210 -5975347 -3413153 -450900 -471525 -3287336
37579 -3287336 -5031460 -3186736 349747 2158489 1545185 466122 362469 888888 1493845
37570 1493845 2482382 3973611 5131133 5497625 6312063 9013395 12427210 13013828 8842774
37561 8842774 2296567 -2397661 -3612654 -2906305 -1927922 -951476 -480781 -1697844 -4240670
37552 -4240670 -5749330 -5127730 -4243180 -4556829 -4204672 -1136819 2566664 3069250 706149
37543 706149 -317566 1598642 3070284 1003187 -3111293 -5996616 -6877153 -6811119 -6149853
37534 -6149853 -5199838 -5534604 -7808832 -9446112 -7327187 -2237733 1869342 2755647 1666776
37525 1666776 298492 -1521172 -4443995 -7784853 -10095357 -10541008 -9185391 -6779354
$$ packed form
37588c102969r73123p0136n36140j271842k1137K562194K962253k0625k815811
37579c287336j744124J844724L536483J808742o13304j079063j03653N26419O04957
37570A493845R88537J491229J157522L66492Q14438K701332L413815N86618m171054
37561H842774o546207m694228j214993P06349R78383R76446M70695j217063k542826
37552d240670j508660O21600Q84550l13649L52157L067853L703483N02586k363101
37543G06149j023715J916208J471642k067097m114480k885323q80537O6034O61266
37534f149853R50015l34766k274228j637280K118925N089454M107075Q86305j088871
37525A666776j368284j819664k922823l340858k310504m45651J355617K406037
$$ plain form
37517 -6779354 -4594474 -3685436 -4079814 -5167177 -6527956 -7557449 -6914672 -3873150 -67108
37508 -67108 1769483 1142584 446727 1729328 4053438 4898496 3375407 1219125 843550
37499 843550 2774358 4933418 4677920 1832951 -931127 -1434949 -795872 -1520665 -3555110
37490 -3555110 -4326857 -2702954 -703961 -607504 -2186237 -3715758 -4096298 -2930814 -14895
37481 -14895 3883291 6757620 7090680 5160609 2025894 -1520433 -4198046 -4195986 -1489098
37472 -1489098 1147505 1289852 -26178 -301277 360851 -300169 -2656897 -4431979 -4405242
37463 -4405242 -4273274 -5638009 -7184023 -6519632 -3658330 -1088909 -836085 -2492614 -3908306
37454 -3908306 -3285248 -1019993 249597 -1800799 -6244855 -9541438 -9610703 -8000805 -7112926
$$ packed form
37517f779354K184880R09038l94378j087363j360779j029493O42777L041522L806042
37508f7108J836591o26899o95857J282601K324110Q45058j523089k156282l75575
37499H43550J930808K159060k55498k844969k764078n03822O39077p24793k034445
37490c555110p71747J623903J998993R6457j578733j529521l80540J165484K915919
37481a4895L898186K874329L33060j930071l134715l546327k677613K060K706888
37472a489098K636603J42347j316030k75099O62128o61020k356728j775082K6737
37463d405242J31968j364735j546014O64391K861302K569421K52824j656529j415692
37454c908306O23058K265255J269590k050396m444056l296583o9265J609898Q87879
$$ plain form
37445 -7112926 -6785422 -5398981 -3330130 -2815189 -4266528 -5050551 -2987087 552330 2436223
37436 2436223 1669549 22177 -711235 -484432 74139 1040016 2670651 4298563 4742212
37427 4742212 3671061 1868759 185971 -1091864 -1761425 -1422828 -206058 844019
37419 844019 847332 116790 -716784 -2022758 -4145488 -5339972 -3065869 1673581 3626074
37410 3626074 -705889 -7720695 -10327667 -6507616 -1170811 818017 1256 -690040
37402 -690040 -849157 -1595680 -2106466 -787910 1266540 1567194 498351 798901 2808801
37393 2808801 3892794 3184403 3106500 4798881 5820964 4730169 4450790 7654965 11354569
37384 11354569 10212103 4005730 -2107060 -4248745 -3059098 -470065 2729882 5238418
$$ packed form
37445g112926L27504J386441K068851N14941j451339p84023K063464L539417J883893
37436B436223p66674j647372p33412K26803N58571R65877J630635J627912M43649
37427D742212j071151j802302j682788j277835o69561L38597J216770J050077
37419H44019L313p30542q33574j305974k122730j194484K274103M739450J952493
37410C626074m331963p014806k606972L820051N336805J988828q16761o91296
37402f90040j59117p46523n10786J318556K054450L00654j068843L00550K009900
37393B808801J083993p08391p7903J692381J022083j090795k79379L204175L699604
37384A1354569j142466o206373o112790k141685J189647K589033L199947K508536
$$ plain form
37376 5238418 4890063 1900892 -251913 685394 2441417 1559399 -1654821 -3967682 -3920013
37367 -3920013 -3056340 -2665912 -1782757 783083 4100652 6027533 5740824 4337463 3183963
37358 3183963 2628800 2501463 2904751 3674326 3666869 1957970 -255603 -550877 1326636
37349 1326636 2614661 1255019 -1112437 -1619615 -288624 596676 330232 359297 1369020
37340 1369020 2503585 3582792 5379968 7249236 7188001 5079391 3285954 2968556 2378512
37331 2378512 185057 -1972367 -2042157 -600330 531381 953501 1211223 1309121 1440607
37322 1440607 2611357 4850129 6384761 6157831 5291067 4376317 1656360 -3654099 -8391485
37313 -8391485 -8882227 -5916207 -3233342 -2194307 -1114350 853807 2389867 2445209 1375896
$$ packed form
37376E238418l48355k989171k152805R37307J756023q82018l214220k312861M7669
37367c920013Q63673L90428Q83155K565840L317569J926881k86709j403361j153500
37358C183963n55163j27337M03288P69575p457j708899k213573k95274J877513
37349A326636J288025j359642k367456n07178J330991Q85300k66444K9065J009723
37340A369020J134565J079207J797176J869268o1235k108610j793437l17398n90044
37331B378512k193455k157424o9790J441827J131711M22120K57722R7898J31486
37322A440607J170750K238772J534632k26930q66764r14750k719957n310459m737386
37313h391485m90742K966020K682865J039035J079957J968157J536060N5342j069313
$$ plain form
37304 1375896 -319400 -2234372 -3299326 -2714319 -1161259 467422 2395014 4403442
37296 4403442 4902807 3753899 3558242 5215370 5170748 1206838 -2153853 236074 5100100
37287 5100100 4971681 253507 -1260185 2535057 4435679 311793 -3505785 -514445
37279 -514445 5285641 5725910 565496 -3735504 -4085160 -2765114 -1253025 1449418 4711125
37270 4711125 5824413 3961698 750935 -2806891 -6512917 -8701898 -7393823 -3420144
37262 -3420144 570536 3550069 5793116 6436911 4729362 2662241 2881290 4737756
37254 4737756 5563845 4775459 3475658 1519048 -1172765 -1913374 1537917 6039301 6163277
37245 6163277 1780483 -2144548 -2859168 -1856669 49428 3813891 7638846 7286273
$$ packed form
37304A375896j695296j914972j064954N85007J553060J628681J927592K008428
37296D403442M99365j148908j95657J657128m4622l963910l360691K389927M864026
37287E100100j28419m718174j513692L795242J900622m123886l817578K991340
37279e14445N800086M40269n160414m301000l49656J320046J512089K702443L261707
37270D711125J113288j862715l210763l557826l706026k188981J308075L973679
37262c420144L990680K979533K243047O43795j707549k067121K19049J856466
37254D737756Q26089p88386j299801j956610k691813p40609L451291M501384J23976
37245F163277m382794l925031p14620J002499J906097L764463L824955l52573
$$ plain form
37237 7286273 2584336 -1682663 -3151277 -4776684 -8258160 -10293187 -8597099 -6387270
37229 -6387270 -6858241 -7716331 -5628259 -2254861 -1171660 -1915269 -1764531 -823792 -712630
37220 -712630 -449774 1733343 4374803 5126362 5347687 7616578 10167985 8974806 4580725
37211 4580725 1694800 2127207 3088983 2748244 2484267 2782152 1767386 -624470 -1467279
37202 -1467279 161517 1033491 -997178 -3281108 -2769486 -956563 -1029920 -2463975 -2210967
37193 -2210967 45254 1499084 768744 -306931 247608 2140748 4085232 5437466
37185 5437466 5738502 4282662 1306077 -1448969 -2538242 -2571139 -2994432 -3427018 -1662306
37176 -1662306 3057433 7779817 8141599 3023178 -3853697 -7283462 -5270192 -511563
$$ packed form
37237G286273m701937m266999j468614j625407l481476k035027J696088K209829
37229f387270m70971q58090K088072L373398J083201p43609J50738R40739J11162
37220g12630K62856K183117K641460P51559K21325K268891K551407j193179m394081
37211D580725k885925M32407R61776l40739k63977K97885j014766k391856q42809
37202a467279J628796Q71974k030669k283930N11622J812923p3357j434055K53008
37193b210967K256221J453830p30340j075675N54539J893140J944484J352234
37185E437466L01036j455840k976585k755046j089273l2897m23293m32586J764712
37176a662306M719739M722384L61782n118421o876875l429765K013270M758629
$$ plain form
37168 -511563 2295061 795334 -2738352 -3680415 -299020 3869042 4188930 813285 -1805081
37159 -1805081 -1194018 249986 -324909 -1849097 -1507323 895207 3218712 4022158 2921707
37150 2921707 -415901 -4846589 -6828762 -4251199 -142582 1027898 -3735 1452812
37142 1452812 6144008 8940897 6268169 1284645 -792482 739825 2964053 4204491
37134 4204491 4872486 5174916 5043959 5435968 7118521 8768058 8434377 6279465 3877370
37125 3877370 1601292 -998714 -2868057 -2261855 4331 809060 -944830 -2577467
37117 -2577467 -1575805 625644 862701 -782621 -679871 3342671 8661245 10816094
37109 10816094 8711444 5185809 2794676 1133537 -962707 -2647674 -2436198 -1174265
$$ packed form
37168e11563K806624j499727l533686r42063L381395M168062L19888l375645k618366
37159a805081O11063J444004n74895j524188L41774K402530K323505Q03446j100451
37150B921707l337608m430688j982173K577563M108617J170480j031633J456547
37142A452812M691196K796889k672728m983524k077127J532307K224228J240438
37134D204491O67995L02430j30957L92009J682553J649537l33681k154912k402095
37125C877370k276078k600006j869343O06202K266186Q04729j753890j632637
37117b577467J001662K201449K37057j645322J02750M022542N318574K154849
37109A0816094k104650l525635k391133j661139k096244j684967K11476J261933
$$ plain form
37101 -1174265 -1176080 -2568064 -2888471 -864226 1548336 1922421 438977 -1009533 -1385422
37092 -1385422 -882750 69199 812049 420478 -1049109 -2172675 -2286836 -2936992 -5530786
37083 -5530786 -8414703 -8403648 -5032019 -1259399 363680 453037 1024633 2413128 3061154
37074 3061154 1747421 -802854 -2368757 -1116633 2497179 5583023 5266192 1647694
37066 1647694 -2209101 -3552458 -2556344 -1218212 -523990 87478 759095 416918 -1247216
37057 -1247216 -2297159 -698683 2485009 3871992 2005416 -953275 -2495114 -2870385
37049 -2870385 -3564071 -4432282 -4490544 -4321970 -5160834 -6299460 -6166785 -5590819 -6758594
37040 -6758594 -8664718 -7197520 -1139694 5151385 7154571 5594457 4030358 3489399
$$ packed form
37101a174265j815j391984l20407K024245K412562L74085j483444j448510l75889
37092a385422N02672R51949P42850l91571j469587j123566j14161o50156k593794
37083e530786k883917J1055L371629L772620J623079Q9357N71596J388495O48026
37074C061154j313733k550275j565903J252124L613812L085844l16831l618498
37066A647694l856795j343357R96114J338132O94222O11468O71617l42177j664134
37057a247216j049943J598476L183692J386983j866576k958691j541839l75271
37049b870385o93686q68211n8262J68574q38864j138626J32675N75966j167775
37040f758594j906124J467198O057826O291079K003186j560114j564099n40959
$$ plain form
37032 3489399 2605934 1404323 1418998 2613267 3268457 2911624 2717760 2854974 1952790
37023 1952790 -169470 -1355149 240084 3513502 5232734 3103193 -1909127 -5967931
37015 -5967931 -5850189 -2678458 -926543 -2753728 -5215415 -4867177 -2864569 -2421512 -3111389
37006 -3111389 -2017496 279455 -6985 -2850168 -2855047 2803201 9074401 9159824 3099095
36997 3099095 -3377704 -6532146 -7271009 -7160442 -5793719 -2724063 701423 2534849
36989 2534849 2045445 84709 -1480068 -1045501 1021024 2540252 2322074 1677793 1795093
36980 1795093 1208799 -1685643 -4757825 -4036408 576274 4675521 5133400 3552612 2758510
36971 2758510 2748747 2174983 1462284 1668714 1649457 -675009 -4673119 -7300112 -7171906
$$ packed form
37032C489399q83465j201611J4675J194269O55190l56833j93864J37214r02184
37023A952790k122260j185679J595233L273418J719232k129541n012320m058804
37015e967931J17742L171731J751915j827185k461687L48238K002608M43057o89877
37006c111389J093893K296951k86440k843183m879N658248O271200Q5423o060729
36997C099095o476799l154442p38863J10567J366723L069656L425486J833426
36989B534849m89404j960736j564777M34567K066525J519228k18178o44281J17300
36980A795093n86294k894442l072182P21417M612682M099247M57879j580788p94102
36971B758510r763n73764p12699K06430j9257k324466l998110k626993J28206
$$ plain form
36962 -7171906 -6021806 -5687715 -5894116 -5898359 -6226860 -7229995 -7436686 -5281783 -1793529
36953 -1793529 160963 -855298 -3554112 -5588477 -5314041 -2329699 2161883 5605426
36945 5605426 6275693 5319331 5077969 5403644 3816612 -113362 -3109367 -2510227 -14231
36936 -14231 1261503 1704082 4027027 7948167 9622327 7042546 3054816 1601268 3160552
36927 3160552 5522677 7272815 8404678 8447761 6233338 1787510 -2808725 -4974411
36919 -4974411 -3768992 -564008 2195272 3100723 2732193 2290093 1761671 404020 -1328882
36910 -1328882 -1957077 -1269153 -708444 -905546 -707644 373883 847171 31396 131270
36901 131270 2987892 6224762 5840188 2108189 -502484 407998 2462657 3252020 4271031
$$ packed form
36962g171906J150100L34091k06401m243l28501j003135k06691K154903L488254
36953a793529J954492j016261k698814k034365K74436K984342M491582L443543
36945E605426O70267r56362k41362L25675j587032l929974k996005N99140K495996
36936a4231J275734M42579K322945L921140J674160k579781l987730j453548J559284
36927C160552K362125J750138J131863M3083k214423m445828m596235k165686
36919d974411J205419L204984K759280R05451l68530m42100n28422j357651j732902
36910a328882o28195O87924N60709j97102J97902J081527M73288q15775R9874
36901A31270K856622L236870l84574l731999k610673R10482K054659P89363J019011
$$ plain form
36892 4271031 7470229 10484638 9105660 3691318 -605017 -569112 1232837 825448 -1463530
36883 -1463530 -2132231 -123221 1508984 -95589 -3718535 -5706676 -4458811 -1906218
36875 -1906218 -681226 -948361 -632954 1636913 4629636 5933310 4884887 3318517
36867 3318517 3239654 4480802 5143953 3724469 158855 -4453176 -8081382 -8459105 -5253730
36858 -5253730 -1322313 103448 -438177 433480 3396124 4746770 2044338 -1349417
36850 -1349417 -525854 3833519 6292468 4196952 757513 130450 2683655 6210395
36842 6210395 8906837 9571372 7391591 3574929 1276823 1772143 2177831 -787853 -5833279
36833 -5833279 -8221739 -5506286 -125495 3801522 4697126 4204834 4702270 6631288 8123994
$$ packed form
36892D271031L199198L014409j378978n414342m296335L5905J801949m07389k288978
36883a463530o68701K009010J632205j604573l622946j988141J247865K552593
36875a906218J224992k67135L15407K269867K992723J303674j048423j566370
36867C318517p8863J241148O63151j419484l565614m612031l628206l77723L205375
36858e253730L931417J425761n41625Q71657K962644J350646k702432l393755
36850a349417Q23563M359373K458949k095516l439439o27063K553205L526740
36842F210395K696442O64535k179781l816662k298106M95320M05688k965684n045426
36833e833279k388460K715453N380791L927017Q95604m92292M97436J929018J492706
$$ plain form
36824 8123994 7375916 5165737 4033617 4874550 5873517 5464951 4637114 5037039 6297026
36815 6297026 6872789 6340338 5145056 3177808 564650 -981009 280241 3621525
36807 3621525 6712594 8407210 8895533 8031350 5967305 4781578 6466154 9326852
36799 9326852 9562712 6971357 5733258 8155761 10892509 9764173 5758019 3141408
36791 3141408 3207842 3286962 1421929 -1293003 -3477560 -5604501 -8026243 -9107087 -7353464
36782 -7353464 -4233508 -2776927 -3686030 -4728559 -4195961 -3099047 -3022060 -3457114 -3009128
36773 -3009128 -2217525 -2813491 -4262508 -3698167 -383817 2119766 414164 -3564382 -4579497
36764 -4579497 -1031333 2821126 2410331 -1390790 -3632844 -1441800 2849298 4828573
$$ packed form
36824H123994p48078k210179j132120Q40933R98967m08566q27837L99925J259987
36815F297026N75763n32451j195282j967248k613158j545659J261250L341284
36807C621525L091069J694616M88323q64183k064045j185727J684576K860698
36799I326852K35860k591355j238099K422503K736748j128336m006154k616611
36791C141408O6434P9120j865033k714932k184557k126941k421742j080844J753623
36782g353464L119956J456581r09103j042529N32598J096914P6987m35054M47986
36773c009128P91603n95966j449017N64341L314350K503583j705602l978546j015115
36764d579497L548164L852459m10795l801121k242054K191044M291098J979275
$$ plain form
36756 4828573 3080767 190093 -1070102 -1149891 -2203688 -4124735 -4416898 -2330021 -484734
36747 -484734 -760074 -849874 2407048 7678711 10287167 8278231 4295749 1264960 -754070
36738 -754070 -2624806 -3896007 -4015924 -3715345 -3636848 -3144752 -1814478 -632256 -392325
36729 -392325 -284575 487279 863661 -729301 -3909195 -6497290 -6716487 -4500194 -1348780
36720 -1348780 493435 -308506 -2667427 -4237367 -4586303 -5711876 -8630351 -11360244
36712 -11360244 -11805677 -10904961 -10777763 -10952163 -8959618 -4331127 318422 2481711 2264290
36703 2264290 1206322 -25421 -1978911 -5020473 -8101142 -9044532 -6516546 -1857503
36695 -1857503 1897390 3277883 3636358 4519363 5180970 4029673 1395088 -874102 -1896480
$$ packed form
36756D828573j747806k890674j260195p9789j053797j921047k92163K086877J845287
36747d84734k75340q9800L256922N271663K608456k008936l982482l030789k019030
36738g54070j870736j271201j19917L00579P8497M92096J330274J182222K39931
36729c92325J07750P71854L76382j592962l179894k588095k19197K216293L151414
36720a348780J842215q01941k358921j569940l48936j125573k918475k729893
36712a1360244m45433R00716J27198j74400J992545M628491M649549K163289k17421
36703B264290j057968j231743j953490l041562l080669r43390K527986M659043
36695a857503L754893J380493L58475Q83005O61607j151297k634585k269190j022378
$$ plain form
36686 -1896480 -2176109 -2068233 -1571473 -1331299 -2062734 -3035560 -2850868 -1806471 -1733090
36677 -1733090 -3107672 -4045567 -2982397 -1027525 -555303 -2156846 -3931734 -3566355 -523343
36668 -523343 3794786 7682846 10564775 12529911 12956839 10959546 7600709 5972286
36660 5972286 7532031 9466697 7781767 2664245 -1379169 -1028061 2160020 4361235
36652 4361235 4134057 3094341 2882610 3074855 2270762 251516 -1668603 -2311863 -2013083
36643 -2013083 -1900574 -2262099 -2481162 -2402513 -2577349 -3004563 -2966442 -2507183 -2563980 -3006040
36633 -3006040 -2334619 -402423 501167 -1105567 -3407864 -4082841 -3806037 -4423885 -5197773
36624 -5197773 -4028126 -1393160 418645 1521569 4163319 8097419 10026839 8605912
$$ packed form
36686a896480k79629J07876M96760K40174p31435r72826J84692J044397P3381
36677a733090j374582r37895J063170J954872M72222j601543j774888L65379L043012
36668e23343M318129L888060K881929J965136M26928j997293l358837j628423
36660E972286J559745J934666j684930n117522m043414L51108L188081K201215
36652D361235k27178j039716k11731J92245q04093k019246j920119o43260K98780
36643b013083J12509l61525k19063P8649j74836m27214L8121M59259n6797m42060
36633c006040O71421J932196R03590j606734k302297o74977K76804o17848p73888
36624e197773J169647K634966J811805J102924K641750L934100J929420j420927
$$ plain form
36616 8605912 6537746 6254524 6563254 5340525 2932473 913650 -448262 -1662838
36608 -1662838 -2690824 -3643038 -5100441 -6516253 -6245303 -4374531 -3302085 -4096055 -4712889
36599 -4712889 -3588430 -2468254 -3425870 -5380782 -6081210 -5422949 -4166678 -1552088 2672294
36590 2672294 5766007 5111889 2437573 1364196 1973892 1677518 480968 921661 2955300
36581 2955300 3546797 2056597 1565996 3354780 4222255 1641955 -1846327 -2255846 304531
36572 304531 2586205 2986983 2631584 2695065 3094237 3486450 3836334 4157496 4689071 5872593
36562 5872593 7523143 8793680 9351031 9439835 8575948 5962048 2621459 781557 244952
36553 244952 -1841899 -5985389 -8198655 -5673147 -1957704 -2623235 -7306292 -10232051
$$ packed form
36616H605912k068166k83222L08730j222729k408052k018823j361912j214576
36608a662838j027986r52214j457403j415812K70950J870772J072446p93970o16834
36599d712889J124459J120176r57616j954912p00428O58261J256271K614590M224382
36590B672294L093713o54118k674316j073377O09696k96374j196550M40693K033639
36581B955300N91497j490200m90601J788784Q67475k580300l488282m09519K560377
36572C04531K281674M00778l55399O3481L99172L92213L49884L21162N31575J183522
36562E872593J650550J270537N57351Q8804q63887k613900l340589j839902n36605
36553B44952k086851m143490k213266K525508L715443o65531m683057k925759
$$ plain form
36545 -10232051 -8102700 -3381500 431640 2777643 4332433 4938037 4836684 5121234
36537 5121234 5438221 3900911 785277 -567447 1457255 3879689 3689322 2722873 4566136
36528 4566136 8385072 9804170 7310060 4046959 3096412 4304405 6300336 8405473
36520 8405473 9361860 7026512 1188436 -5071168 -8281029 -7543362 -3958921 841420
36512 841420 4518219 4713196 1830442 -555214 47469 1900726 2052373 836544 860434
36503 860434 2693494 4378251 4705012 4329501 3834062 3112556 2513664 2143399 289681
36494 289681 -4494835 -9542254 -9650877 -3676830 3381450 6422415 5679033 4307577 3325581
36485 3325581 1771858 -12930 -547042 70035 376974 269163 1173086 3533231 6102667
$$ packed form
36545a0232051K129351M721200L813140K346003J554790O05604j01353K84550
36537E121234L16987j537310l115634j352724K024702K422434j90367r66449J843263
36528D566136L818936J419098k494110l263101r50547J207993J995931K105137
36520H405473R56387k335348n838076o259604l209861P37667L584441M800341
36512H41420L676799J94977k882754k385656O02683J853257J51647j215829K3890
36503H60434J833060J684757L26761l75511m95439p21506n98892l70265j853718
36494B89681m784516n047419j08623N974047P058280L040965p43382j371456r81996
36485C325581j553723j784788n34112O17077L06939j07811R03923K360145K569436
$$ plain form
36476 6102667 7735516 8145733 7090864 4780903 3065335 3992491 6674690 7635987 5239683
36467 5239683 2108651 1935246 5121541 8909588 11000065 11564402 11823435 11899219 10680967
36458 10680967 7450781 3042213 -945782 -3831590 -6015795 -7355596 -6576045 -3363696
36450 -3363696 -187018 -271223 -3641607 -6669072 -6154345 -2832372 -134352 -254241 -2285580
36441 -2285580 -3885802 -3931475 -3307981 -3471158 -4739466 -6271992 -7397532 -8252233 -9051396
36432 -9051396 -9536809 -9412536 -8513184 -6330366 -2583181 1264713 2669311 1323383 274106
36423 274106 2112345 5391667 6778597 5518500 3416399 1498114 -335732 -942447
36415 -942447 1280395 4891689 6013875 3489820 581884 291864 1658122 2177114 1373768
$$ packed form
36476F102667J632849M10217j054869k309961j715568R27156K682199R61297k396304
36467E239683l131032j73405L186295L788047K090477N64337K59033P5784j218252
36458A0680967l230186m408568l987995k885808k184205j339801P79551L212349
36450c363696L176678q4205l370384l027465N14727L321973K698020j19889k031339
36441b285580j600222m5673O23494j63177j268308j532526j125540q54701p99163
36432i051396m85413J24273Q99352K182818L747185L847894J404598j345928j049277
36423B74106J838239L279322J386930j260097k102101j918285j833846o06715
36415i42447K222842L611294J122186k524055k907936k90020J366258N18992q03346
$$ plain form
36406 1373768 163342 -1162451 -2416062 -2793408 -2332198 -2300235 -2728028 -1777053 834718
36397 834718 2412476 1395742 21315 123138 -627320 -4364771 -7639296 -5566132 82007
36388 82007 2567020 -219352 -3429110 -3235671 -1485792 -520237 1169451 4801307 7322670
36379 7322670 5823142 2801318 2606187 4717872 5008722 2543133 822096 2417946
36371 2417946 6024656 9145763 10648897 10218954 8022889 5545625 4445919 4074940
36363 4074940 2290176 -943338 -3154493 -3063096 -2147392 -1736817 -1198183 -227272 -169419
36354 -169419 -1138216 -414640 3562635 7634224 7690223 4771086 3567978 5021944 4627318
36345 4627318 -408843 -5954455 -5916555 -411022 4436811 4316071 1136047 -978262 -1159591
$$ packed form
36406A373768j210426j325793j253611l77346M61210L1963m27793R50975K611771
36397H34718J577758j016734j374427J01823p50458l737451l274525K073164N648139
36388H2007K485013k786372l209758J93439J749879R65555J689688L631856K521363
36379G322670j499528l021824j95131K111685K90850k465589j721037J595850
36371B417946L606710L121107J503134m29943k196065k477264j099706l70979
36363D074940j784764l233514k211155R1397R15704M10575N38634R70911N7853
36354a69419r68797P23576L977275M071589N5999k919137j203108J453966l94626
36345D627318n036161n545612L7900N505533M847833j20740l180024k114309j81329
$$ plain form
36336 -1159591 -1342949 -2252169 -2678400 -2445376 -3291860 -5729674 -7187649 -5315838 -1917032
36327 -1917032 -1056214 -3446764 -5333957 -3718018 -278737 1465899 925415 134191 39065
36318 39065 -237953 -967608 -1353151 -1603530 -2898592 -4747975 -4865461 -2681490 -731632
36309 -731632 -1212521 -3142875 -4436541 -4872440 -5213273 -5166130 -4370963 -3934110 -4676054
36300 -4676054 -5181070 -4101812 -3115796 -4535586 -6885163 -6459581 -3164230 -982068 -1819055
36291 -1819055 -2528413 202320 4949840 7725167 6939825 4152542 1532149 482846
36283 482846 1398357 3035232 3319945 2154015 1893761 3550805 4382724 1466101 -3745141
36274 -3745141 -6885910 -5899854 -2654379 -91631 102570 -2353541 -6227327 -9008402
$$ packed form
36336a159591j83358r09220m26231K33024q46484k437814j457975J871811L398806
36327a917032Q60818k390550j887193J615939L439281J744636n40484p91224r5126
36318C9065k77018p29655l85543k50379j295062j849383j17486K183971J949858
36309g31632m80889j930354j293666m35899l40833M7143P95167M36853p41944
36300d676054n05016J079258R86016j419790k349577M25582L295351K182162q36987
36291a819055p09358K730733M747520K775327p85342k787283k620393j049303
36283D82846R15511J636875K84713j165930k60254J657044Q31919k916623n211242
36274c745141l140769R86056L245475K562748J94201k456111l873786k781075
$$ plain form
36266 -9008402 -9196413 -8228362 -8540506 -10168264 -11019659 -10030664 -8110824 -6268527 -4702210
36257 -4702210 -3536308 -2680229 -1264839 1032861 2642974 2063294 528793 362819 1189914
36248 1189914 578851 -1634386 -2630026 -685081 2673745 5167189 5925099 4683127 1541630
36239 1541630 -1718094 -2773262 -2144373 -2794794 -5409401 -6987754 -5461249 -2708683
36231 -2708683 -1166327 -303114 1272384 2765064 2888854 2582703 3389968 4721625 5162745
36222 5162745 5039868 5374520 5681187 5012274 3782352 2512693 509657 -1977157 -2370156
36213 -2370156 637472 4093971 4699236 3851020 4906626 6964852 6122642 2451869 730075
36204 730075 3397062 7177675 8211176 6745966 4830603 2684329 -102102 -2096241
$$ packed form
36266i008402j88011R68051l12144j627758q51395R88995J919840J842297J566317
36257d702210J165902Q56079J415390K297700J610113n79680j534501j65974Q27095
36248A189914o11063k213237r95640J944945L358826K493444P57910j241972l141497
36239A541630l259724j055168O28889o50421k614607j578353J526505K752566
36231b708683J542356Q63213J575498J492680J23790l06151Q07265J331657M41120
36222E162745j22877L34652L06667o68913j229922j269659k003036k486814l92999
36213b370156L007628L456499O05265q48216J055606K058226q42210l670773j721794
36204G30075K666987L780613J033501j465210j915363k146274k786431j994139
$$ plain form
36196 -2096241 -1399351 1637322 4880225 6804342 7276453 6800733 5892842 4643845 2633265
36187 2633265 -108857 -2482320 -3732972 -4597456 -5379324 -4231700 -122229 3656044
36179 3656044 2825015 -1302003 -2973355 -326846 2146560 1094616 -508804 1412412
36171 1412412 5679956 8415985 8805570 8366658 6973792 3867959 1012564 1249849 3848044
36162 3848044 5418988 4686908 3200173 2019441 925060 365623 970284 1457350 98528
36153 98528 -2075123 -2591538 -1588220 -1123009 -773186 2040121 6830159 9254318 7031639
36144 7031639 3179677 1472028 1642086 1285111 64318 -483253 247604 1547962 2861811
36135 2861811 3990219 4591601 4600439 4356133 3733099 2372235 1173150 1733291 3601464
$$ packed form
36196b096241O96890L036673L242903J924117M72111m75720r07891j248997k010580
36187B633265k742122k373463j250652q64484p81868J147624M109471L778273
36179C656044q31029m127018j671352K646509K473406j051944j603420J921216
36171A412412M267544K736029L89585m38912j392866l105833k855395K37285K598195
36162C848044J570944p32080j486735j180732j094381n59437O04661M87066j358822
36153I8528k173651n16415J003318M65211L49823K813307M790038K424159k222679
36144G031639l851962j707649J70058l56975j220793n47571P30857J300358J313849
36135B861811J128408O01382Q838k44306o23034j360864j199085N60141J868173
$$ plain form
36126 3601464 4194941 2513612 668720 238100 -436011 -2967877 -4947372 -2303459 5084580
36117 5084580 12648226 15704634 12998358 6506166 -118550 -3457130 -2935887 -1450846
36109 -1450846 -1789094 -3153893 -3202254 -2335335 -2767116 -3760433 -1776007 3572848 7432825
36100 7432825 5852453 1179324 -1520043 -1297070 -1116753 -1982714 -1312772 2191425 5427209
36091 5427209 4557577 -99539 -4741801 -6514740 -5489538 -2958419 106693 2535463
36083 2535463 2578039 -666068 -5745335 -9637516 -10367379 -8749409 -7354111 -7664440 -8513687
36074 -8513687 -7743420 -5088962 -2371993 -719691 804022 2768559 3314770 830151
36066 830151 -2297555 -1837410 1982875 3684059 -191900 -5793877 -6703773 -2186477 2413497
$$ packed form
36126C601464N93477j681329j844892m30620o74111k531866j979495K643913P388039
36117E084580P563646L056408k706276o492192o624716l338580N21243J485041
36109a450846l38248j364799m8361Q66919m31781r93317J984426N348855L859977
36100G432825j580372m673129k699367K22973J80317q65961O69942L504197L235784
36091E427209q69632m657116m642262j772939J025202K531119L065112K428770
36083B535463M2576l244107n079267l892181p29863J617970J395298l10329q49247
36074h513687P70267K654458K716969J652302J523713J964537N46211k484619
36066H30151l127706M60145L820285J701184l875959n601977r09896M517296M599974
$$ plain form
36057 2413497 2594078 -1207195 -6223468 -10693118 -13662275 -14178551 -12313386 -9499725
36049 -9499725 -6816488 -4255553 -2249150 -2028011 -3409851 -4131421 -2954042 -1865002
36041 -1865002 -3279114 -6228881 -7592059 -6576434 -5592111 -6370704 -7438844 -6682165 -4832421
36032 -4832421 -4305822 -4925207 -3293961 2182026 7531564 7379482 2502465 -314866 2774438
36023 2774438 7463565 7824078 4781204 3499811 4426004 2976309 -1843816 -4821131
36015 -4821131 -2575539 1295621 2352213 1891808 3291205 5612893 5685031 3873427 2885037
36006 2885037 2739800 1775664 1137449 3149168 6103789 5931172 2843996 1089396 1807481
35997 1807481 1604164 -656508 -1175079 2405746 6859882 8594047 8786671 9918238 10892040
$$ packed form
36057B413497J80581l801273n016273m469650k969157n16276J865165K813661
36049i499725K683237K560935K006403K21139j381840p21570J177379J089040
36041a865002j414112k949767j363178J015625R84323p78593j068140P56679J849744
36032d832421N26599o19385J631246N475987N349538j52082m877017k817331L089304
36023B774438M689127L60513l042874j281393R26193j449695m820125k977315
36015d821131K245592L871160J056592m60405J399397K321688P2138j811604r88390
36006B885037j45237r64136o38215K011719K954621j72617l087176j754600P18085
35997A807481k03317k260672n18571L580825M454136J734165J92624J131567R73802
$$ plain form
35988 10892040 9609523 7476087 6950535 6643030 3463203 -1371258 -3072566 -204342
35980 -204342 3130368 3074784 855293 257445 2465146 5288071 6481603 6159648 5814271
35971 5814271 5757262 4298595 15030 -5488902 -8391950 -6739861 -2532208 966957
35963 966957 2624285 3099404 2726927 1629660 930911 1692949 2980297 2844302 1066247
35954 1066247 -802062 -1960156 -3046929 -4233655 -4622871 -4136454 -4229747 -5684627 -6921687
35945 -6921687 -5642357 -1498411 3623988 7346847 8200027 6058876 2173954 -1527392
35937 -1527392 -3959916 -5593281 -7135864 -7921818 -6631289 -3663206 -1566232 -2233047
35929 -2233047 -4357191 -4870063 -2732638 -19339 1008462 570346 405356 1325059 2723701
$$ packed form
35988A0892040j282517k133436n25552l07505l179827m834461j701308K868224
35980b04342L334710n5584k219491n97848K207701K822925J193532l21955l45377
35971E814271n7009j458667m283565n503932k903048J652089M207653L499165
35963I66957J657328M75119l72477j097267o98749P62038J287348j35995j778055
35954A066247j868309j158094j086773j186726l89216M86417r3293j454880j237060
35945f921687J279330M143946N122399L722859Q53180k141151l884922l701346
35937a527392k432524j633365j542583p85954J290529K968083K096974o66815
35929b233047k124144n12872K137425K713299J027801m38116j64990R19703J398642
$$ plain form
35920 2723701 3541936 2681931 -396647 -4190742 -5649447 -4072876 -3096296 -6016708 -10223572
35911 -10223572 -10008477 -4805149 -402080 -848618 -3335686 -3322405 -901596 1154655 2491631
35902 2491631 4239409 5156992 3225640 132972 -217152 2369125 3969793 2630370
35894 2630370 1039376 1792628 3357612 2969950 1220207 1176199 3981261 7503198 9176203
35885 9176203 8634493 7177838 5532663 3025462 -745734 -4063044 -4238928 -1018617
35877 -1018617 2486666 3212283 1318629 -1123707 -3158607 -4885192 -5647610 -4708191 -3215433
35868 -3215433 -3131892 -4225987 -4197811 -1934330 1141664 3061461 3123237 1950785 1317227
35859 1317227 3317522 7709457 10689065 8757746 3440512 -466918 -1002186 -311797
$$ packed form
35920B723701Q18235q60005l078578l794095j458705J576571R76580k920412m206864
35911a0223572K15095N203328M403069m46538k487068J3281K420809K056251J336976
35902B491631J747778R17583j931352l092668l50124K586277J600668j339423
35894B630370j590994P53252J564984l87662j749743m4008K805062L521937J673005
35885I176203n41710j456655j645175k507201l771196l317310j75884L220311
35877a018617L505283P25617j893654k442336k034900j726585p62418R39419J492758
35868c215433Q3541j094095K8176K263481L075994J919797O1776j172452o33558
35859A317227K000295M391935K979608j931319n317234l907430n35268O90389
$$ plain form
35851 -311797 14836 1016722 2847484 3100591 749861 -1352926 -512967 1585025 1399269
35842 1399269 -1315772 -3472337 -2810319 124552 3595698 6451342 8517093 10379848
35834 10379848 12566543 14587300 15680934 16589604 18818470 21584073 21696563 17751207
35826 17751207 12454735 9180382 7941861 6530669 4072462 1507201 -228489 -608155
35818 -608155 855561 3585778 5402581 4667675 2309389 483513 149308 1071344 2899391
35809 2899391 4853144 5655057 5288497 5547180 7355701 8964197 8435800 6487959 5166982
35800 5166982 5227112 6552282 9277281 12236848 12235406 7781715 2132590 -447826 -339024
35791 -339024 -1252330 -4110995 -5781812 -3881790 275082 3850697 5088364 3696089
$$ packed form
35851c11797L26633J001886J830762K53107k350730k102787Q39959K097992j85756
35842A399269k715041k156565O62018K934871L471146K855644K065751J862755
35834A0379848K186695K020757J093634R08670K228866K765603J12490l945356
35826A7751207n296472l274353j238521j411192k458207k565261j735690l79666
35818f08155J463716K730217J816803p34906k358286j825876l34205R22036J828047
35809B899391J953753Q01913l66560K58683J808521J608496n28397j947841j320977
35800E166982O0130J325170K724999K959567j442m453691n649125k580416J08802
35791c39024r13306k858665j670817J900022M156872L575615J237667j392275
$$ plain form
35783 3696089 1003833 -404068 490222 1235192 -569613 -2801867 -1446541 2773144
35775 2773144 4666748 1986437 -1738749 -3062210 -3084988 -3904843 -4445648 -2889693 -378334
35766 -378334 1069582 2251505 4918575 7549212 6613666 1910531 -2434026 -2986382 -864572
35757 -864572 360186 -875617 -2946415 -3569650 -2222214 97119 2337028 3547837
35749 3547837 2345674 -1587329 -5065984 -3190967 4425814 11404787 11462396 6017954
35741 6017954 1660810 1370402 2539133 3204839 4985704 8484348 10622229 9275525
35733 9275525 6962181 6965871 8591867 9097679 7854508 5751449 2779812 -705484 -2273621
35724 -2273621 -257927 3007561 3777373 1656710 -863191 -2369697 -3196734 -3258973 -2247440
$$ packed form
35783C696089k692256j407901Q94290P44970j804805k232254J355326M219685
35775B773144J893604k680311l725186j323461k2778q19855n40805J555955K511359
35766c78334J447916J181923K667070K630637r35546m703135m344557n52356K121810
35757h64572J224758j235803k070798o23235J347436K319333K239909J210809
35749C547837j202163l933003l478655J875017P616781O978973N7609n444442
35741F017954m357144k90408J168731O65706J780865L498644K137881j346704
35733I275525k313344L690J625996N05812j243171k103059k971637l485296j568137
35724b273621K015694L265488P69812k120663k519901j506506q27037o2239J011533
$$ plain form
35715 -2247440 -1283221 -1585844 -2151886 -1431256 -459739 -1284711 -2921599 -2288282 837952
35706 837952 3066856 2072332 -815725 -3213687 -4160943 -3333411 -449622 3421943 6001623
35697 6001623 6203230 4801545 2374935 -1336341 -5491353 -7817088 -7255065 -5264667
35689 -5264667 -3713960 -3038295 -2991038 -3400027 -3515909 -2352441 -317311 1168764 2086860
35680 2086860 3864561 6495190 7877673 6945418 5319288 4792444 5171518 5555834 5536890
35671 5536890 4114772 65561 -5072582 -7164434 -4886610 -2493334 -4405859 -9070654
35663 -9070654 -11333550 -9391179 -5974907 -3536429 -1801736 -70132 1148771 1313174
35655 1313174 510842 -1130086 -2819263 -2509003 645365 3920571 4128963 2564583 3189696
$$ packed form
35715b247440R64219l02623n66042P20630R71517q24972j636888O33317L126234
35706H37952K228904r94524k888057k397962r47256Q27532K883789L871565K579680
35697F001623K01607j401685k426610l711276m155012k325735N62023J990398
35689e264667J550707O75665M7257m08989j15882J163468K035130J486075R18096
35680B086860J777701K630629J382483r32255j626130n26844L79074L84316j8944
35671E536890j422118m049211n138143k091852K277824K393276j912525m664795
35663i070654k262896J942371L416272K438478J734693J731604J218903J64403
35655A313174q02332j640928j689177L10260L154368L275206K08392j564380O25113
$$ plain form
35646 3189696 5969313 6496024 3315917 796572 2120231 3878424 1690683 -2193717
35638 -2193717 -2011252 2639163 6428194 6432027 5342625 5528660 4828360 952406 -3461243
35629 -3461243 -3774452 300385 4414343 5117456 3182841 1341424 777556 735312 496294
35620 496294 532284 1474091 2563566 2162655 141714 -1425094 -1070632 -319941 -1449811
35611 -1449811 -3827087 -5090564 -5439706 -7270094 -10180074 -10453014 -7251857 -5233375
35603 -5233375 -7857471 -11580426 -10939711 -6857523 -4848126 -6325351 -7148913 -4874122
35595 -4874122 -2224963 -2095152 -3526602 -4429979 -4542939 -3818188 -1389561 1745320 2309397
35586 2309397 -595427 -3418125 -3279807 -2218449 -3346741 -5465266 -5052978 -1701968
$$ packed form
35646C189696K779617N26711l180107k519345J323659J758193k187741l884400
35638b193717J82465M650415L789031L833j089402J86035p00300l875954m413649
35629c461243l13209M074837M113958P03113j934615j841417n63868m2244k39018
35620D96294L5990R41807J089475m00911k020941j566808L54462P50691j129870
35611a449811k377276j263477l49142j830388k909980k72940L201157K018482
35603e233375k624096l722955O40715M082188K009397j477225q23562K274791
35595d874122K649159J29811j431450r03377j12960P24751K428627L134881N64077
35586B309397k904824k822698J38318J061358j128292k118525M12288L351010
$$ plain form
35578 -1701968 1944952 4206114 4940828 3485780 -358465 -4111154 -4887915 -3426490
35570 -3426490 -2676332 -3044325 -2526886 -1073283 -892176 -2262300 -2953354 -2478254 -3056763
35561 -3056763 -5149021 -5794806 -3322804 -458145 -308182 -1772359 -1538952 1133791 4061208
35552 4061208 5337473 4874350 3714299 3447727 5289725 8210739 9043348 6044512 1494821
35543 1494821 -722960 603928 3439877 5359183 5640552 5179885 5544348 7591769 10157808
35534 10157808 10892416 9186616 7170835 6869474 7707558 8081229 7867232 7543191 6179382
35525 6179382 2794915 -906810 -1774565 656296 3517492 4620356 5066772 6820426
35517 6820426 9279778 9837447 7264865 3217047 243594 -898490 -1417878 -2204192 -2268370
$$ packed form
35578a701968L646920K261162P34714j455048l844245l752689p76761J461425
35570c426490P50158l67993N17439J453603J81107j370124o91054M75100n78509
35561c056763k092258o45785K472002K864659J49963j464177K33407K672743K927417
35552D061208J276265m63123j160051k66572J841998K921014Q32609k998836m549691
35543A494821k217781J326888K835949J919306K81369m60667L64463K047421K566039
35534A0157808P34608j705800k015781l01361Q38084L73671k13997l24041j363809
35525F179382l384467l701725q67755K430861K861196J102864M46416J753654
35517F820426K459352N57669k572582m047818k973453j142084n19388p86314o4178
$$ plain form
35508 -2268370 -332821 2444275 2988471 225453 -3052580 -3681595 -2356532 -2329140 -4368008
35499 -4368008 -5525263 -3576390 -433614 551194 -687471 -1096713 878140 3041258
35491 3041258 2666264 380909 -757454 636077 2927965 4284157 4919210 5635305 5839640
35482 5839640 4773406 3653796 4357522 6206029 6346514 3831908 1270993 1354555 3360507
35473 3360507 4520197 3756242 2512200 2368869 3237846 3998566 4055084 3911162 4333761
35464 4333761 5101858 5114844 4211804 4041744 5833953 8021745 8141941 6809862 7035455
35455 7035455 9021349 8856671 4321760 -751837 -931476 3572680 7297034 6555270 3094749
35446 3094749 588928 125225 146574 -758496 -2116338 -2167209 15431 2901543 3772990
$$ packed form
35508b268370J935549K777096N44196k763018l278033o29015J325063K7392k038868
35499d368008j157255J948873L142776R84808j238665m09242J974853K163118
35491C041258l74994k285355j138363J393531K291888J356192O35053P16095K04335
35482E839640j066234j119610P03726J848507J40485k514606k560915Q3562K005952
35473C360507J159690p63955j244042j43331Q68977P60720N6518j43922M22599
35464D333761P68097J2986r03040j70060J792209K187792J20196j332079K25593
35455G035455J985894j64678m534911n073597j79639M504156L724354p41764l460521
35446C094749k505821m63703K1349r05070j357842n0871K182640K886112Q71447
$$ plain form
35437 3772990 2082592 198179 -170689 -449164 -2254907 -3878233 -2647836 359869
35429 359869 1449897 -206251 -1807982 -1905825 -2352050 -4136928 -4950421 -3026006 -424774
35420 -424774 174243 -300996 802684 3376297 5006090 5035698 5194202 6395992 7621539
35411 7621539 8227093 8917860 9725559 9116025 6244351 2618307 344972 -211863 89254
35402 89254 1106359 3401062 6564407 8863881 8897800 6924500 4358329 2589348 2562998
35393 2562998 4749198 8662676 12577688 14588480 14338953 13282124 12863594 12768976 11492422
35384 11492422 8645131 6214391 7007118 11550671 16706994 18074921 14357862 8980083
35376 8980083 6584117 8163046 10733082 11729205 12009041 13618822 16163264 17289970
$$ packed form
35437C772990j690398j884413l68868k78475j805743j623326J230397L007705
35429C59869J090028j656148j601731r7843m46225j784878q13493J924415K601232
35420d24774N99017m75239J103680K573613J629793K9608J58504J201790J225547
35411G621539O05554O90767Q07699o09534k871674l626044k273335n56835L01117
35402H9254J017105K294703L163345K299474L3919j973300k566171j768981k6350
35393B562998K186200L913478L915012K010792k49527j056829m18530r4618j276554
35384A1492422k847291k430740P92727M543553N156323J367927l717059n377779
35376H980083k395966J578929K570036R96123K79836J609781K544442J126706
$$ plain form
35368 17289970 16198523 14594765 13822776 12935304 10861535 9235892 11020332 16258734
35360 16258734 21234090 23100240 23738201 26623019 30738091 31348182 27757833 26035717
35352 26035717 30811673 38021766 40971142 41179172 46379027 58345659 70743269 80833675
35344 80833675 94857537 117730597 146363428 180425119 230282588 300177347 366616322
35337 366616322 389785979 352399103 277918740 205320735 154267715 120491059 95074075
35330 95074075 75780303 62208369 51537961 42269846 36135373 33740072 32176055 28708030
35322 28708030 23874458 19612789 16678137 14925697 14165818 13870149 13449058 13141221 13320132
35313 13320132 13088498 11182303 8119333 5737252 4673212 4003565 3351036 3603115 5332298
$$ packed form
35368A7289970j091447j603758p71989q87472k073769j625643J784440N238402
35360A6258734M975356J866150O37961K884818M115072O10091l590349j722116
35352B6035717M775956P210093K949376K08030N199855J1966632J2397610J0090406
35344H0833675J4023862K2873060K8632831L4061691M9857469O9894759O6438975
35337C66616322K3169657l7386876p4480363p2598005n1053020l3776656k5416984
35330I5074075j9293772j3571934j0670408r268115o134473k395301j564017l468025
35322B8708030m833572m261669k934652j752440p59879k95669m21091l07837J78911
35313A3320132k31634j906195l062970k382081j064040o69647o52529K52079J729183
$$ plain form
35304 5332298 7948806 10530432 12220832 11976247 9430996 6007264 3711977 2765360
35296 2765360 1730422 -52665 -1544480 -1557609 37683 2664446 5391291 6985754
35288 6985754 6825552 5790101 5312406 5788057 6742087 7765095 8012758 5830385 863318
35279 863318 -4161243 -6068330 -5327189 -5101864 -6362946 -6744915 -4735577 -2114585 -999981
35270 -999981 -960851 -690545 -417278 -659482 -262656 1985318 4710281 5213583 3186824
35261 3186824 1352665 2250419 5670647 9352327 11077578 10024442 7314352 5669643
35253 5669643 7444154 12078737 15952780 15630901 11303442 6481933 4287087 4726060
35245 4726060 5863704 6664681 7539492 8554016 8737299 7655321 6436353 6406194 7463170
$$ packed form
35304E332298K616508K581626J690400k44585k545251l423732k295287r46617
35296B765360j034938j783087j491815j3129J595292K626763K726845J594463
35288F985754j60202j035451m77695M75651R54030J023008K47663k182373m967067
35279H63318n024561j907087P41141K25325j261082l81969K009338K620992J114604
35270i99981L9130K70306K73267k42204L96826K247974K724963N03302k026759
35261C186824j834159Q97754L420228L681680J725251j053136k710090j644709
35253E669643J774511M634583L874043l21879m327459m821509k194846M38973
35245D726060J137644Q00977Q74811J014524J83283j081978j218968l0159J056976
$$ plain form
35236 7463170 8420490 8191546 6160141 2442070 -1528449 -3867043 -4627662 -6048850 -9160027
35227 -9160027 -11400748 -9328833 -2916567 4391189 9145247 10035152 7769220 4791967
35219 4791967 4176854 6605109 9129358 9010156 7706270 8330908 10173585 9469219 5577781
35210 5577781 2443730 2899496 5070697 5974800 5435140 4435731 2594411 -95708 -1317688
35201 -1317688 854513 4728285 7101010 7542707 8129649 9684760 10736375 10051379 8220429
35192 8220429 6574532 5866088 6070685 6592702 6813913 6929307 7655953 8823267 9414356
35183 9414356 9392705 9747672 9968177 7787692 3118994 -45776 1728850 6428373 9281596
35174 9281596 9139452 8760704 9317842 8617088 5650141 3302698 4366597 7199132 7877688
$$ packed form
35236G463170R57320k28944k031405l718071l970519k338594p60619j421188l111177
35227i160027k240721K071915O412266P307756M754058Q89905k265932k977253
35219D791967o15113K428255K524249j19202j303886O24638J842677p04366l891438
35210E577781l134051M55766K171201R04103n39660r99409j841320k690119j221980
35201a317688K172201L873772K372725M41697N86942J555111J051615o84996j830950
35192H220429j645897p08444K04597N22017K21211J15394P26646J167314N91089
35183I414356k1651L54967K20505k180485m668698l164770J774626M699523K853223
35174I281596j42144l78748N57138p00754k966947k347443J063899K832535O78556
$$ plain form
35165 7877688 5511252 3048235 3088620 4949502 6403962 6787382 7100985 7639970 7184359
35156 7184359 5202162 3583556 4597959 7535975 9234751 8226224 6496982 6322755
35148 6322755 7224507 7501163 7206245 7638520 8810994 9423792 8931271 7927509 6794782
35139 6794782 5571505 4931525 5727545 7572151 9113575 9581042 9010005 7447403 5239032
35130 5239032 3565183 3235363 3493435 3553343 4565834 8003560 12554424 14978169 14118108
35121 14118108 11918965 10367137 9694827 9892189 11480364 13896263 15269106 14880007
35113 14880007 14099032 14118269 14720014 16052734 19174502 23425304 25730900 24695155 23416626
35104 23416626 25638885 30507047 34015290 34843358 35598460 38125642 40594192 40435816
$$ packed form
35165G877688k366436k463017M0385J860882J454460L83420L13603N38985m55611
35156G184359j982197j618606J014403K938016J698776j008527j729242j74227
35148F322755R01752K76656k94918M32275J172474O12798m92521j003762j132727
35139F794782j223277o39980P96020J844606J541424M67467n71037j562602k208371
35130E239032j673849l29820K58072N9908J012491L437726M550864K423745q60061
35121A4118108k199143j551828o72310J97362J588175K415899J372843l89099
35113A4880007p80975J9237O01745J332720L121768M250802K305596j035745j278529
35104B3416626K222259M868162L508243Q28068P55102K527182K468550j58376
$$ plain form
35096 40435816 38007512 35655679 34377397 33147574 31171764 29328034 29072146 30805772
35088 30805772 33805670 37127990 39757607 40143991 36979994 31324623 27041858 27562699
35080 27562699 32179557 36846286 38837476 39205566 40184057 41905939 43044720 43448669
35072 43448669 44277429 45989552 47964563 50117685 53219704 57213782 60789889 63576301
35064 63576301 67530003 74659910 83814010 91338046 95390366 98491678 104896643 116011220
35056 116011220 129446820 142410983 154790600 168472578 184786172 203722048 225077993
35049 225077993 248869209 274137941 298201583 317912995 331786150 340647326 345843284
35042 345843284 346497635 338949045 320126533 292034310 261759992 235745257 214454837
$$ packed form
35096D0435816k428304k351833j278282j229823j975810j843730k55888J733626
35088C0805772K999898L322320K629617L86384l163997n655371m282765N20841
35080B7562699M616858M666729J991190L68090R78491J721882J138781M03949
35072D3448669Q28760J712123J975011K153122L102019L994078L576107K786412
35064F3576301L953702P129907R154100P524036M052320L101312O404965J1114577
35056A16011220J3435600J2964163J2379617J3681978J6313594J8935876K1355945
35049B25077993K3791216K5268732K4063642J9711412J3873155Q861176N195958
35042C45843284O54351p548590j8822512k8092223l0274318k6014735k1290420
$$ plain form
35035 214454837 193777755 171156660 148770754 130670139 118422834 110283977 103487436
35028 103487436 96342760 88559241 80434055 72084012 63584542 55724195 49771424 45779545
35020 45779545 41853503 36360135 30562772 27596414 28597855 31093715 31719289 29608134
35012 29608134 26534630 24392575 23276912 22064094 20527143 20200846 22346762 25417642
35004 25417642 26171232 23702418 20566982 19153669 19104716 19426816 20255855 20485813 17120282
34995 17120282 10559365 7159239 11307941 17561363 17291985 11655701 9922147 14625526
34987 14625526 17408308 12509518 5565533 3687938 4491494 2191301 -1458537 -849657
34979 -849657 2851030 3653759 1230773 828806 3458631 4493332 2551273 2007680 5137683
$$ packed form
35035B14454837k0677082k2621095k2385906j8100615j2247305q138857o796541
35028A03487436p144676p783519q125186q350043q499470p860347n952771l991879
35020D5779545l926042n493368n797363k966358J001441K495860O25574k111155
35012B9608134l073504k142055j115663j212818j536951l26297K145916L070880
35004B5417642P53590k468814l135436j413313m8953L22100Q29039K29958l365531
34995A7120282o560917l400126M148702O253422k69378n636284j733554M703379
34987A4625526K782782m898790o943985j877595Q03556k300193l649838O08880
34979h49657L700687Q02729k422986m01967K629825J034701j942059n43593L130003
$$ plain form
34970 5137683 8692252 10237684 11451478 12826960 11397797 6787457 3827182 5566802
34962 5566802 8583038 8843369 7610325 7584916 7467094 4860950 1234915 -437941 -318723
34953 -318723 -39519 916478 3207803 4630289 3312746 1563563 2237465 3530451 2084473
34944 2084473 -708748 -806226 1251902 776791 -3415384 -6936197 -6236551 -2744651 426775
34935 426775 2083474 2139210 640708 -1126533 -1348764 -330464 205791 664462 3074419
34926 3074419 6675056 8073363 7069072 8104032 13525614 19088905 19363516 14858081
34918 14858081 10303345 7897674 6039249 3699860 2219154 2520477 3534765 4198095
34910 4198095 4891015 5988431 6563525 5617483 3735900 2613954 3246456 5080431 6771030
$$ packed form
34970E137683L554569J545432J213794J375482j429163m610340k960275J739620
34962E566802L016236K60331j233044k5409j17822k606144l626035j672856J19218
34953c18723K79204R55997K291325J422486j317543j749183O73902J292986j445978
34944B084473k793221r7478K058128m75111m192175l520813O99646L491900L171426
34935D26775J656699N5736j498502j767241k22231J018300N36255M58671K409957
34926C074419L600637J398307j004291J034960N421582N563291K74611m505435
34918A4858081m554736k405671j858425k339389j480706L01323J014288O63330
34910D198095O92920J097416N75094r46042j881583j121946O32502J833975J690599
$$ plain form
34901 6771030 7423250 7101443 6390300 5777352 5547005 5878986 6634834 7252105 7194567 6221642
34891 6221642 4003226 300479 -3754654 -5572288 -3719789 -23442 2567005 3792769
34883 3792769 5787722 8989100 10667032 8470828 3734321 38389 -510772 1260428
34875 1260428 2950578 2764280 1123121 368105 1921003 3904004 3245422 224241 -1316642
34866 -1316642 1011288 5321938 8989325 12504795 17413405 22200411 23377793 20280245
34858 20280245 16077396 13666864 12697960 11413980 9749793 9248895 10439238 11399703
34850 11399703 9472975 4450497 -467221 -1763971 366190 2257155 1360844 -881660
34842 -881660 -1678504 -833922 -246621 -377074 443067 2898417 4849041 3832864 570805
$$ packed form
34901F771030O52220l21807p11143o12948k30347L31981P55848O17271n7538r72925
34891F221642k218416l702747m055133j817634J852499L696347K590447J225764
34883C792769J994953L201378J677932k196204m736507l695932n49161J771200
34875A260428J690150j86298j641159p55016J552898J983001o58582l021181j540883
34866a316642K327930M310650L667387L515470M908610M787006J177382l097548
34858B0280245m202849k410532r68904j283980j664187n00898J190343R60465
34850A1399703j926728n022478m917718j296750K130161J890965q96311k242504
34842h81660p96844Q44582N87301j30453Q20141K455350J950624j016177l262059
$$ plain form
34833 570805 -1342119 553175 4644487 7011858 5886864 3366662 2448559 3663152
34825 3663152 5523721 6764324 6367558 2915334 -3147632 -7444650 -5615432 430902
34817 430902 4137781 3093999 1874300 4226944 7222284 6790233 4774310 5218313 6593865
34808 6593865 4000413 -2037753 -5341992 -3137824 434527 1440665 1605863 4032413
34800 4032413 7618902 9028930 7473855 4582895 1603994 -590009 -502277 2165548
34792 2165548 4716771 3960839 174807 -3040908 -2486803 2025716 7911545 11645534
34784 11645534 11328861 8450715 6260941 5838170 5175102 2795799 193050 -835885
34776 -835885 -1299258 -3117008 -5316337 -4781930 -721745 3729446 4904649 2401293 -906500
$$ packed form
34833E70805j912924J895294M091312K367371j124994k520202r18103J214593
34825C663152J860569J240603l96766l452224o062966m297018J829218O046334
34817D30902L706879j043782j219699K352644K995340m32051k015923M44003J375552
34808F593865k593452o038166l304239K204168L572351J006138J65198K426550
34800D032413L586489J410028j555075k890960k978901k194003Q7732K667825
34792B165548K551223p55932l786032l215715N54105M512519N885829L733989
34784A1645534l16673k878146k189774m22771o63068k379303k602749j028935
34776h35885m63373j817750k199329N34407M060185M451191J175203k503356l307793
$$ plain form
34767 -906500 -1897196 12427 2661186 3460575 1789606 -1014496 -3412411 -4531111 -3881654
34758 -3881654 -1771828 102015 103248 -1264385 -2368045 -3281677 -5244130 -7245636 -6278917
34749 -6278917 -2075418 1393808 902381 -2072320 -4204011 -4597610 -4092355 -2869668 -1469537
34740 -1469537 -1970954 -5068138 -7680502 -6589910 -3031252 -592784 -20236 430621 702802
34731 702802 -995417 -4178047 -5911875 -4945368 -2935150 -1496616 -1017364 -2224493 -5522335
34722 -5522335 -8612124 -8310594 -5281050 -3492247 -4272958 -4580360 -2369147 70038 88412
34713 88412 -1310917 -1918931 -2144275 -3640641 -5874179 -6612254 -4881886 -1721625 1068545
34704 1068545 1818345 20645 -2452235 -2746531 -689256 705019 -602901 -3125173
$$ packed form
34767i06500r90696J909623K648759P99389j670969k804102k397915j118700O49457
34758c881654K109826J873843J233j367633j103660r13632j962453k001506R66719
34749f278917M203499L469226m91427k974701k131691l93599N05255J222687J400131
34740a469537n01417l097184k612364J090592L558658K438468N72548M50857K72181
34731G02802j698219l182630j733828R66507K010218J438534M79252j207129l297842
34722e522335l089789L01530L029544J788803p80711l07402K211213K439185J8374
34713H8412j399329o08014k25344j496366k233538p38075J730368L160261K790170
34704A068545P49800j797700k472880k94296K057275J394275j307920k522272
$$ plain form
34696 -3125173 -4704776 -5489084 -6235749 -6049676 -4255605 -2636546 -3142162 -4724009 -4973586
34687 -4973586 -3771897 -2870349 -2862438 -3016955 -3233991 -3688617 -3256281 -827700 2230608
34678 2230608 3261147 1633404 -1172515 -4128536 -6945077 -8484227 -7743646 -6260234
34670 -6260234 -6656852 -8612770 -9152978 -7391053 -5904771 -6286053 -6289987 -3345447 1374121
34661 1374121 4705798 5787797 6113641 6040019 3796196 -1508223 -7515312 -10348258 -8396646
34652 -8396646 -3831750 -280630 673286 190722 -430408 -1700189 -4227852 -6241728 -4990041
34643 -4990041 -617318 3478696 4831063 4515915 4469554 4122873 1795331 -1639306 -3057777
34634 -3057777 -1244130 1384102 2102339 1336776 1387340 2647056 2908985 513584 -3324490
$$ packed form
34696c125173j579603p84308p46665J86073J794071J619059n05616j581847k49577
34687d973586J201689R01548P911j54517k17036m54626M32336K428581L058308
34678B230608J030539j627743k805919k956021k816541j539150P40581J483412
34670f260234l96618j955918n40208J761925J486282l81282l934K944540M719568
34661A374121L331677J081999L25844p3622k243823n304419o007089k832946J951612
34652h396646M564896L551120R53916m82564o21130j269781k527663k013876J251687
34643d990041M372723M096014J352367l15148m6361l46681k327542l434637j418471
34634c057777J813647K628232P18237p65563N0564J259716K61929k395401l838074
$$ plain form
34625 -3324490 -6042020 -6618082 -6069305 -5669835 -5652360 -5459571 -4484468 -2623540 -587788
34616 -587788 664345 1266278 2468067 4523987 5636279 4477795 2664666 2417641 2495865
34607 2495865 -390732 -5897633 -9270270 -7628227 -3881937 -2286331 -2829393 -2694413
34599 -2694413 -1014500 988565 3002334 5432808 7146959 6592445 4731556 4006568
34591 4006568 4675298 4792225 3492730 1736391 218191 -855907 -559978 1232396 1836354
34582 1836354 -1225837 -5645137 -6731833 -4287583 -2584067 -3100872 -2501973 642338
34574 642338 2653451 1226465 -52992 2071401 4225152 1783059 -2648708 -2466084
34566 -2466084 2673487 6211099 4450684 1073259 485907 1830576 2147556 1447513 1381127
$$ packed form
34625c324490k717530n76062N48777L99470J7475J92789R75103J860928K035752
34616e87788J252133O01933J201789K055920J112292j158484j813129k47025P8224
34607B495865k886597n506901l372637J642043L746290J595606n43062J34980
34599b694413J679913K003065K013769K430474J714151n54514j860889p24988
34591D006568O68730J16927j299495j756339j518200j074098K95929J792374O03958
34582A836354l062191m419300j086696K444250J703516n16805N98899L144311
34574F42338K011113j426986j279457K124393K153751k442093m431767J82624
34566b466084N139571L537612j760415l377425n87352J344669L16980p00043o6386
$$ plain form
34557 1381127 1511023 209645 -2108824 -3393458 -2889745 -1565144 -166870 1219380
34549 1219380 1950748 1012951 -1255639 -2882640 -2236992 275909 2665858 3062685 1018712
34540 1018712 -2223881 -4464799 -4000118 -989986 2385079 3468770 1480311 -1404867
34532 -1404867 -1852879 1085814 4406706 3901209 -1262501 -7198385 -8930845 -5234844
34524 -5234844 283259 2731910 364960 -4341885 -7558533 -7635789 -5888614 -4603560
34516 -4603560 -4938532 -6479307 -7919956 -7960669 -6284259 -4048562 -2902473 -3211132 -3729600
34507 -3729600 -3188207 -1541861 514403 2356448 3358637 3012167 1813353 1186028 1766915
34498 1766915 2594876 2779517 2947187 3879891 4686383 3920760 1995139 832894 1317277
$$ packed form
34557A381127J29896j301378k318469j284634N03713J324601J398274J386250
34549A219380P31368r37797k268590j627001O45648K512901K389949L96827k043973
34540A018712l242593k240918M64681L010132L375065J083691j988459k885178
34532a404867m48012K938693L320892n05497n163710n935884j732460L696001
34524e234844N518103K448651k366950m706845l216648p7256J747175J285054
34516d603560l34972j540775j440649m0713J676410K235697J146089l08659n18468
34507c729600N41393J646346K056264J842045J002189l46470j198814o27325N80887
34498A766915Q27961J84641J67670R32704Q06492p65623j925621j162245M84383
$$ plain form
34489 1317277 2617071 3904121 5052435 5519126 4329637 1740137 -605910 -1785237
34481 -1785237 -2364278 -2474391 -1060008 1663505 2971140 1121177 -1200980 167990
34473 167990 4794499 7658338 5962119 2858319 2547113 4350874 4718785 3429538 3818842
34464 3818842 6921570 9426825 8900337 7601497 8542567 10259768 8804581 3678124
34456 3678124 -1483369 -3738751 -3407320 -1854451 302582 2164838 2386157 1123413
34448 1123413 116870 -79399 -944499 -3163880 -5133520 -5578852 -5576234 -6237289 -6136253
34439 -6136253 -3151407 2128318 6639844 7915900 5804419 2083485 -565610 -418726
34431 -418726 1199794 887304 -2578456 -6414996 -7625582 -6772900 -5967455 -4915976 -1863498
$$ packed form
34489A317277J299794J287050J148314M66691j189489k589500k346047j179327
34481a785237n79041j10113J414383K723513J307635j849963k322157J368970
34473A67990M626509K863839j696219l103800l11206J803761L67911j289247L89304
34464C818842L102728K505255n26488j298840R41070J717201j455187n126457
34456C678124n161493k255382L31431J552869K157033J862256K21319j262744
34448A123413j006543j96269q65100k219381j969640m45332K618o61055J01036
34439f136253K984846N279725M511526J276056k111481l720934k649095J46884
34431d18726J618520l12490l465760l836540j210586Q52682Q05445J051479L052478
$$ plain form
34422 -1863498 2528010 5370201 5562459 4983677 5393587 6411649 7083864 7523964 8227868
34413 8227868 9037784 9352034 8607896 6604321 4149984 2966336 3895515 5635528 6243870
34404 6243870 5284525 3577986 1884566 1037217 2074739 4653572 6610611 6789994 6759062
34395 6759062 7749035 7856746 5094589 1421669 251757 1317593 1867802 1847077 3412942
34386 3412942 5812218 5681325 2894151 1281541 2413524 3255454 1572330 -756413
34378 -756413 -1803301 -2769519 -4728441 -6079620 -5828178 -5732657 -6507029 -5667065 -2339206
34369 -2339206 -506414 -3529807 -8490028 -10199877 -8370210 -6463867 -5559892 -4119122
34361 -4119122 -2576701 -3327199 -6220932 -8023223 -6706755 -3428842 -403744 693948
$$ packed form
34422a863498M391508K842191J92258n78782M09910J018062O72215M40100P03904
34413H227868Q09916L14250p44138k003575k454337j183648R29179J740013O08342
34404F243870r59345j706539j693420q47349J037522K578833J957039J79383l0932
34395F759062R89973J07711k762157l672920j169912J065836N50209k0725J565865
34386C412942K399276j30893k787174j612610J131983Q41930j683124k328743
34378g56413j046888r66218j958922j351179K51442R5521p74372Q39964L327859
34369b339206J832792l023393m960221j709849J829667J906343R03975J440770
34361d119122J542421p50498k893733j802291J316468L277913L025098J097692
$$ plain form
34353 693948 -1018184 -4206324 -5099793 -1769314 2238138 1803306 -2952481 -7107034 -7470812
34344 -7470812 -5040017 -1512661 2442580 5229345 4802206 2143184 842198 2137192
34336 2137192 3363529 2218822 -360985 -2397203 -3003201 -1559875 2121494 5797147
34328 5797147 6054689 2851915 -60796 -369478 248124 53194 199279 1658427 2439294
34319 2439294 651029 -2111363 -3218104 -2845592 -2696217 -2651163 -1469990 505114 1932223
34310 1932223 2624113 2736752 1097581 -2838168 -6212146 -5061219 470545 5741315
34302 5741315 6968879 5055884 3442938 3752055 4631093 4248497 2937711 2875403 5071907
34293 5071907 7513970 7547083 5675124 4932081 6162992 6419414 3350651 -1109666 -3497440
$$ packed form
34353F93948j712132l188140q93469L330479M007452m34832m755787m154553l63778
34344g470812K430795L527356L955241K786765m27139k659022j300986J294994
34336B137192J226337j144707k579807k036218o05998J443326L681369L675653
34328E797147K57542l202774k912711l08682O17602j94930J46085J459148P80867
34319B439294j788265k762392j106741L72512J49375M5054J181173J975104J427109
34310A932223O91890J12639j639171l935749l373978J150927N531764N270770
34302E741315J227564j912995j612946L09117Q79038l82596j310786o2308K196504
34293E071907K442063L3113j871959p43043J230911K56422l068763m460317k387774
$$ plain form
34284 -3497440 -3524192 -3653562 -5112339 -6710929 -7007665 -5550739 -2505118 948260 2329452
34275 2329452 64436 -4167497 -6980486 -6837527 -4508855 -888703 3255935 5810760
34267 5810760 4448081 -175921 -4508154 -5974306 -4955488 -2689018 432792 3685015
34259 3685015 5484112 5443075 5154658 5542763 5180373 2904139 434314 131304 1223037
34250 1223037 854154 -1442935 -3013475 -2322858 -1404024 -2592076 -4697222 -4643610 -2076787
34241 -2076787 76102 -189435 -1409694 -1309838 -200221 4975 -913203 -1240499 -150523
34232 -150523 1205685 1749017 1850766 1945614 1319439 -541664 -2418159 -2503118 -733613
34223 -733613 948517 601891 -1793513 -4137814 -3910257 -761927 2546919 2780730 -38276
$$ packed form
34284c497440k6752j29370j458777j598590k96736J456926L045621L453378J381192
34275B329452k265016m231933k812989J42959K328672L620152M144638K554825
34267E810760j362679m624002m332233j466152J018818K266470L121810L252223
34259C685015J799097m1037k88417L88105l62390k276234k469825l03010J091733
34250A223037l68883k297089j570540O90617R18834j188052k105146N3612K566823
34241b076787K152889k65537j220259R9856J109617K05196r18178l27296J089976
34232a50523J356208N43332J01749R4848o26175j861103j876495q4959J769505
34223g33613J682130l46626k395404k344301K27557L148330L308846K33811k819006
$$ plain form
34214 -38276 -2665050 -2594138 -585078 1103992 1266729 -195208 -2883930 -5313308 -5311537
34205 -5311537 -2455057 1167059 3674886 5177690 5755077 4216731 1033293 -59508
34197 -59508 3308680 7674924 7661088 3306863 -456106 -1100528 -898864 -1635449 -1406443
34188 -1406443 1542419 5275668 6720344 5421723 2980358 813383 2851 1318555
34180 1318555 3778652 4901271 3688959 1696642 327181 -619791 -749837 1558018
34172 1558018 5733425 7930718 6042021 3381289 4285691 7876948 9448759 6785652
34164 6785652 1925619 -2410506 -4952162 -5053498 -2949348 -802947 -773326 -2021689 -2019769
34155 -2019769 -507859 520130 508525 985098 2314785 2845553 1972696 1303887 1885619
$$ packed form
34214c8276k626774P0912K009060J689070J62737j461937k688722k429378J771
34205e311537K856480L622116K507827J502804N77387j538346l183438j092801
34197e9508L368188M366244j3836m354225l762969o44422K01664p36585K29006
34188a406443K948862L733249J444676j298621k441365k166975q10532J315704
34180A318555K460097J122619j212312j992317j369461r46972j30046K307855
34172A558018M175407K197293j888697k660732R04402L591257J571811k663107
34164F785652m860033m336125k541656j01336K104150K146401K9621j248363J920
34155b019769J511910J027989j1605M76573J329687N30768q72857o68809N81732
$$ plain form
34146 1885619 2723833 2875766 2555558 1389594 -1625814 -5184908 -5546888 -1277488 4200293
34137 4200293 6858108 6812958 6574165 6420064 4390419 59533 -4231176 -5851886 -4092029
34128 -4092029 -374428 2463107 1966335 -1385346 -4243031 -4313283 -3022791 -2701550 -2734658
34119 -2734658 -1068473 1557343 2059342 -351495 -2874736 -3038092 -1503525 -185253
34111 -185253 309770 348210 130975 62476 1058009 3484847 6513321 8930781 9848255
34102 9848255 8703895 5792059 2696862 795051 -441830 -1961911 -2491267 -49938
34094 -49938 3824764 4641301 896466 -3513811 -4438066 -2193411 778938 3872090 6932952
34085 6932952 7567643 3841627 -1640794 -4283199 -3643178 -3449533 -5600916 -7717298 -7194441
$$ packed form
34146A885619Q38214J51933l20208j165964l015408l559094l61980M269400N477781
34137D200293K657815m5150k38793j54101k029645m330886m290709j620710J759857
34128d092029L717601K837535m96772l351681k857685p0252J290492L21241l3108
34119b734658J666185K625816N01999k410837k523241j63356J534567J318272
34111a85253M95023L8440k17235o8499R95533K426838L028474K417460R17474
34102I848255j144360k911836l095197j901811j236881j520081n29356K441329
34094d9938L874702Q16537l744835m410277r24255K244655K972349L093152L060862
34085F932952O34691l726016n482421k642405O40021J93645k151383k116382N22857
$$ plain form
34076 -7194441 -4484998 -1378025 1282362 3017989 3055355 1386779 -1015358 -3455500
34068 -3455500 -5420605 -5554138 -3157209 -534956 -813716 -3197124 -3779755 -1650208 -310551
34059 -310551 -1787803 -3535506 -3352505 -3198634 -4983942 -6369945 -4737576 -2209959 -2268379
34050 -2268379 -3849396 -3555892 -1730065 -1167990 -1247901 989284 4472918 4748962 1505987
34041 1505987 -277426 1897500 4472632 4016993 1931336 348284 -1917436 -5883398
34033 -5883398 -8836413 -8078214 -5132628 -2645586 -125977 3389360 5449118 3660181
34025 3660181 823366 1469951 4528202 4691615 798884 -2333338 -1233713 1665327
34017 1665327 2360501 447235 -1904303 -3209867 -3080490 -1721081 -625851 -1723763
$$ packed form
34076g194441K709443L106973K660387J735627L7366j668576k402137k440142
34068c455500j965105j33533K396929K622253k78760k383408n82631K129547J339657
34059c10551j477252j747703J83001J53871j785308j386003J632369K527617n8420
34050b268379j581017K93504J825827N62075p9911K237185L483634K76044l242975
34041A505987j783413K174926K575132m55639k085657j583052k265720l965962
34033e883398k953015P58199K945586K487042K519609L515337K059758j788937
34025C660181k836815O46585L058251J63413l892731l132222J099625K899040
34017A665327O95174j913266k351538j305564J29377J359409J095230j097912
$$ plain form
34009 -1723763 -4437051 -5588184 -3615589 -923161 -518327 -2093610 -3065344 -1987946
34001 -1987946 607902 3350068 4464512 2500131 -1659616 -4649306 -4159199 -1634266
33993 -1634266 69861 468707 933091 1493855 688997 -1667894 -3935080 -5131682 -5987417
33984 -5987417 -7057874 -7661413 -7458139 -7413265 -8068438 -8216997 -6789647 -5201386 -6011177
33975 -6011177 -9210763 -11426155 -9634607 -4843165 -1066926 -869604 -2818568 -3528146
33967 -3528146 -1456232 1812538 3529085 2385167 -545636 -2823089 -2731709 -938954
33959 -938954 17588 -1625879 -4939469 -7515940 -8134382 -7367887 -6064187 -4611184 -3593261
33950 -3593261 -3528499 -3524727 -1764769 1810293 4574202 4004313 446766 -3757901 -6745685
$$ packed form
34009a723763k713288j151133J972595K692428M04834j575283r71734J077398
34001a987946K595848K742166J114444j964381m159747k989690M90107K524933
33993a634266J704127L98846M64384N60764q04858k356891k267186j196602q55735
33984e987417j070457o03539K03274M4874o55173j48559J427350J588261q09791
33975f011177l199586k215392J791548M791442L776239J97322j948964p09578
33967c528146K071914L268770J716547j143918k930803k277453R1380J792755
33959i38954R56542j643467l313590k576471o18442P66495J303700J453003J017923
33950c593261O4762L772J759958L575062K763909n69889l557547m204667k987784
$$ plain form
33941 -6745685 -7591050 -5609478 -1165957 3273832 4886493 3635192 2319498 3074085
33933 3074085 4902496 5216141 2999970 -224414 -2253371 -2532331 -2588874 -4201581 -7292531
33924 -7292531 -9999149 -10736374 -9412508 -6507054 -2238483 2525755 5766836 6217447
33916 6217447 5135537 4705646 5124064 4850653 3426907 2117560 1534273 551126 -1573664
33907 -1573664 -3487634 -3306404 -1041825 1439585 2297618 964015 -1748663 -4042179
33899 -4042179 -4216101 -2175828 303946 1229061 142076 -1785409 -2921160 -2441527 -1139230
33890 -1139230 -984044 -2995059 -5515143 -5811813 -3707284 -2163098 -3369736 -5537333
33882 -5537333 -5002901 -920132 3544870 4698268 2147107 -929620 -936137 2625653 6715197
$$ packed form
33941f745685q45365J981572M443521M439789J612661j251301j315694P54587
33933C074085J828411L13645k216171l224384k028957k78960n6543j612707l090950
33924g292531k706618p37225J323866K905454M268571M764238L241081M50611
33916F217447j081910m29891M18418k73411j423746j309347n83287r83147k124790
33907a573664j913970J81230K264579K481410Q58033j333603k712678k293516
33899d042179j73922K040273K479774R25115j086985j927485j135751M79633J302297
33890a139230J55186k011015k520084k96670K104529J544186j206638k167597
33882e537333N34432M082769M465002J153398k551161l076727o517L561790M089544
$$ plain form
33873 6715197 8148758 7077800 6008867 5760974 4635269 2215606 1218121 3400931
33865 3400931 5845549 4567020 671065 -927972 967672 1604979 -2759647 -8924132
33857 -8924132 -10619233 -6521896 -1360823 378800 -954588 -2281308 -2164350 -1667385
33849 -1667385 -1903493 -2312280 -1650941 109895 1717020 2526788 3575606 5913632 8473542
33840 8473542 9085651 7638662 6462478 6836153 6880825 4401767 432139 -2061588 -2168163
33831 -2168163 -1488057 -1043200 -378420 -61495 -2173405 -6747998 -10011707 -8543937 -3939453
33822 -3939453 -910664 -1418721 -3230072 -4184332 -5009434 -6780672 -7943296 -6004161 -1227698
33813 -1227698 3212470 4558123 2764331 -148650 -1836391 -1029581 1484683 3277184
$$ packed form
33873F715197J433561j070958j068933k47893j125705k419663r97485K182810
33865C400931K444618j278529l895955j599037J895644O37307m364626o164485
33857h924132j695101M097337N161073J739623j333388j326720J16958M96965
33849a667385k36108m08787O61339J760836J607125Q09768J048818K338026K559910
33840H473542O12109j446989j176184L73675M4672k479058l969628k493727j06575
33831b168163O80106M44857O64780L16925k111910m574593l263709J467770M604484
33822c939453L028789n08057j811351r54260q25102j771238j162624J939135M776463
33813a227698M440168J345653j793792k912981j687741Q06810K514264J792501
$$ plain form
33805 3277184 2782002 1317184 1406982 3226490 4371174 3462985 2047731 1828389 1798801
33796 1798801 90751 -2320145 -2176488 1575097 5848310 6984654 5097291 3610507
33788 3610507 4858802 7327114 7667716 4794824 1092776 -546527 37712 784392 407832
33779 407832 -602841 -1733571 -3128948 -3917000 -2133556 2001086 4657614 2791100
33771 2791100 -1228955 -2351174 300038 2622837 1913285 451582 1130661 2638077
33763 2638077 1711327 -1717929 -4518016 -4555395 -2369028 764777 3943586 5924349 5679092
33754 5679092 4135396 3505819 4331652 4800421 3591756 1798001 1047843 1007663 34480
33745 34480 -2367111 -4966483 -6521406 -7120516 -7593850 -8144709 -8090122 -7041112 -5869320
$$ packed form
33805C277184m95182j464818Q9798J819508J144684r08189j415254k19342k9588
33796A798801j708050k410896J43657L751585M273213J136344j887363j486784
33788C610507J248295K468312L40602k872892l702048j639303N84239P46680l76560
33779D07832j010673j130730j395377p88052J783444M134642K656528j866514
33771B791100m020055j122219K651212K322799p09552j461703O79079J507416
33763B638077r26750l429256k800087l7379K186367L133805L178809J980763k45257
33754E679092j543696o29577Q25833M68769j208665j793755p50158m0180r73183
33745C4480k401591k599372j554923n99110m73334n50859N4587J049010J171792
$$ plain form
33736 -5869320 -5736734 -6117102 -4913216 -1363240 2168691 2787776 953848 -103804 957380
33727 957380 1542095 -1125274 -5678262 -7882352 -5808447 -1989537 3878 -186114 37032
33718 37032 2297448 5038485 5739061 4208113 2418048 1589745 1124368 531073 446494
33709 446494 872286 383217 -1303713 -1803332 529317 3118718 2219882 -1287071 -2787328
33700 -2787328 -745987 1291686 601397 -864466 -762886 -700783 -2816977 -5052853 -4291391
33691 -4291391 -2335267 -3703305 -7989595 -9611140 -6078452 -1743778 -1238884 -3233677
33683 -3233677 -3697769 -2259244 -1700195 -2966655 -4270054 -4384112 -3795395 -2903724 -1701676
33674 -1701676 -1067426 -1937099 -3246888 -3065207 -1802200 -1817802 -3574606 -4803988 -4175371
$$ packed form
33736e869320J32586l80368J203886L549976L531931O19085j833928j057652J061184
33727I57380N84715k667369m552988k204090K073905L818910J993415j89992K23146
33718C7032K260416K741037P00576j530948j790065q28303m65377n93295q4579
33709D46494M25792m89069j686930m99619K332649K589401q98836l506953j500257
33700b787328K041341K037673o90289j465863J01580O2103k116194k235876P61462
33691d291391J956124j368038m286290j621545L532688M334674N04894j994793
33683c233677m64092J438525N59049j266460j303399j14058N88717Q91671J202048
33674a701676O34250q69673j309789J81681J263007j5602j756804j229382O28617
$$ plain form
33665 -4175371 -3150154 -3063673 -2972187 -2051916 -1701687 -3057435 -4512925 -4380578 -4284189
33656 -4284189 -6656652 -9939860 -10015827 -6379485 -3139370 -2891897 -3004879 69917 5389683
33647 5389683 8873757 8459757 5572963 2473365 413767 18954 1416104 3664503
33639 3664503 5242910 5345636 4186698 2421128 869024 144613 -199041 -1366337 -3292771
33630 -3292771 -3904277 -1650237 2020271 4111877 3481579 1580324 457498 1269249 3967537
33621 3967537 6990638 8000234 6477212 4792049 5076461 6141747 5634536 4043153
33613 4043153 3610983 4030332 2849413 308510 -71757 3060532 6227318 5737346 2254656
33604 2254656 -1162894 -3160970 -4076420 -3897987 -2664621 -1610173 -1901235 -3153656 -4490565
$$ packed form
33665d175371J025217Q6481R1486R20271L50229j355748j455490J32347R6389
33656d284189k372463l283208p5967L636342L240115K47473j12982L074796N319766
33647E389683L484074m14000k886794l099598k059598l94813J397150K248399
33639C664503J578407J02726j158938j765570j552104p24411l43654j167296j926434
33630c292771o11506K254040L670508K091606o30298j901255j122826Q11751K698288
33621C967537L023101J009596j523022j685163K84412J065286n07211j591383
33613D043153m32170M19349j180919k540903l80267L132289L166786m89972l482690
33604B254656l417550j998076r15450J78433J233366J054448k91062j252421j336909
$$ plain form
33595 -4490565 -5768450 -6706189 -6635115 -6319040 -7749568 -10533027 -11064926 -7543668 -3267495
33586 -3267495 -2140867 -3268928 -3356128 -2370403 -2831055 -4861565 -6167403 -6238330 -6473753
33577 -6473753 -6452107 -4213359 -429779 1681947 1146302 211842 -35557 -1194144 -3670527
33568 -3670527 -5049761 -3900655 -2035406 -1479561 -2042728 -3033286 -4262522 -4243927 -1007616
33559 -1007616 3707482 4849929 801961 -3875068 -4882917 -3707478 -3796134 -5003134
33551 -5003134 -5644392 -6679584 -9198349 -10335896 -6825027 -990056 1952948 1622090
33543 1622090 2306684 5419601 7497309 6450119 4720748 4499143 4088150 1272695 -3086565
33534 -3086565 -6993921 -9886952 -11187924 -9280129 -4590099 -1255016 -2634168 -6637448
$$ packed form
33595d490565j277885r37739P1074L16075j430528k783459n31899L521258M276173
33586c267495J126628j128061q7200R85725m60652k030510j305838p0927k35423
33577f473753K1646K238748L783580K111726n35645r34460k47399j158587k476383
33568c670527j379234J149106J865249N55845n63167r90558j229236J8595L236311
33559a007616M715098J142447m047968m677029j007849J175439q8656j207000
33551e003134o41258j035192k518765j137547L510869N834971K943004l30858
33543A622090O84594L112917K077708j047190j729371k21605m10993k815455m359260
33534c086565l907356k893031j300972J907795M690030L335083j379152m003280
$$ plain form
33526 -6637448 -8346696 -6274201 -3323451 -2155730 -2363702 -2395098 -1884048 -1212146 -336123
33517 -336123 896210 2056610 2559186 2365653 1726728 536784 -1437619 -3700875 -5036809
33508 -5036809 -4781560 -3649022 -2635289 -1484763 654627 3180051 4224719 3353040
33500 3353040 2334407 2304966 2051852 597118 -592409 -319714 -656929 -3893110 -7729746
33491 -7729746 -7643888 -3899860 -1796155 -3891486 -6255170 -4631369 -651349 1150151
33483 1150151 -267286 -2547250 -4580163 -7240386 -10047729 -10497204 -7330880 -2422440
33475 -2422440 1150179 1804855 362532 -757664 291519 2559314 3109373 964244
33467 964244 -1137731 -322659 2538325 4313310 3586994 1137847 -2108983 -5181135 -6478551
$$ packed form
33526f637448j709248K072495K950750J167721k07972l1396N11050O71902Q76023
33517c36123J232333J160400N02576j93533o38925j189944j974403k263256j335934
33508e036809K55249J132538J013733J150526K139390K525424J044668q71679
33500C353040j018633k9441k53114j454734j189527K72695l37215l236181l836636
33491g729746Q5858L744028K103705k095331k363684J623801L980020J801500
33483A150151j417437k279964k032913k660223k807343m49475L166324M908440
33475b422440L572619O54676j442323j120196J049183K267795N50059k145129
33467I64244k101975Q15072K860984J774985p26316k449147l246830l072152j297416
$$ plain form
33458 -6478551 -5891465 -6189453 -9000501 -10691489 -6586605 1192453 5177932 2647342
33450 2647342 -952718 -714363 805684 -912143 -4235066 -3984589 174818 3296999
33442 3296999 2447853 -170960 -1529518 -1253016 -306331 299494 -1136488 -5548681 -10161961
33433 -10161961 -10485940 -6590811 -3888314 -5609633 -7915087 -5578673 216755 3783040
33425 3783040 3084564 1571510 1976344 2575431 1037470 -1352093 -1651312 511066 2949538
33416 2949538 4076531 4018601 3180309 1652206 136019 -53804 1555756 3904919 5444476
33407 5444476 5320350 3460037 219793 -3625225 -6882290 -8368471 -7507917 -4708335
33399 -4708335 -1335335 884134 866671 -1183338 -4034481 -6198362 -6615876 -5195711 -3005592
$$ packed form
33458f478551N87086k97988k811048j690988M104884P779058L985479k530590
33450B647342l600060K38355J520047j717827l322923K50477M159407L122181
33442C296999q49146k618813j358558K76502R46685O05825j435982m412193m613280
33433a0161961l23979L895129K702497j721319k305454K336414N795428L566285
33425C783040o98476j513054M04834N99087j537961k389563k99219K162378K438472
33416B949538J126993n7930q38292j528103j516187j89823J609560K349163J539557
33407E444476j24126j860313l240244l845018l257065j486181Q60554K799582
33399d708335L373000K219469j7463k050009k851143k163881m17514J420165K190119
$$ plain form
33390 -3005592 -1530731 -1385474 -2074394 -3197568 -5152586 -8009084 -10353063 -10295145 -7477146
33381 -7477146 -3314154 492832 2875061 3300098 2087569 772111 750574 1302575 317207
33372 317207 -2606202 -5310083 -6094253 -5958078 -6492433 -7017383 -5895216 -3862848 -3527900
33363 -3527900 -5372567 -6605684 -4923541 -1504651 1112558 2545821 4007854 5214935
33355 5214935 4363298 1371504 -1166847 -1387301 -801910 -1940296 -4539446 -6151277 -6025137
33346 -6025137 -5989569 -7113995 -7876473 -6877540 -5327110 -4923819 -4846901 -3340444 -1298601
33337 -1298601 -1300103 -3235957 -4071995 -2679655 -1781347 -3513221 -5905119 -6184072 -5262237
33328 -5262237 -5811441 -7367297 -6926509 -3986173 -1496494 -1356744 -2065829 -1842162 -1383669
$$ packed form
33390c005592J474861J45257o88920j123174j955018k856498k343979N7918K817999
33381g477146M162992L806986K382229M25037j212529j315458k1537N52001r85368
33372C17207k923409k703881p84170J36175n34355n24950J122167K032368L34948
33363c527900j844667j233117J682143L418890K617209J433263J462033J207081
33355E214935q51637k991794k538351k20454N85391j138386k599150j611831J26140
33346f025137L5568j124426p62478R98933J550430M03291P6918J506457K041843
33337a298601j502j935854q36038J392340Q98308j731874k391898k78953R21835
33328e262237n49204j555856M40788K940336K489679J39750p09085K23667M58493
$$ plain form
33319 -1383669 -2127050 -3916131 -5808716 -7312463 -7535410 -5212284 -1223571 1060639
33311 1060639 135853 -929692 1058369 3927496 2743107 -2714677 -7039788 -6390072
33303 -6390072 -3011878 -1144595 -1567071 -2439049 -3029237 -3627758 -3170083 -135951 4328854
33294 4328854 6780185 5521342 2515123 633886 343614 -99448 -1938153 -4154366
33286 -4154366 -4428186 -1906237 1144325 1462638 -964798 -2336343 -128052 2842289
33278 2842289 2014684 -2189677 -4662910 -2818689 173994 671129 -589207 -1411380 -2616949
33269 -2616949 -5698221 -8104541 -5615030 956259 5884616 6071864 4465872 4592844
33261 4592844 5519829 4659778 2447600 1080488 715542 160994 -121272 930500 1826138
$$ packed form
33319a383669p43381j789081j892585j503747k22947K323126L988713K284210
33311A060639r24786j065545J988061K869127j184389n457784m325111O49716
33303f390072L378194J867283m22476q71978n90188n98521M57675L034132M464805
33294D328854K451331j258843l006219j881237k90272m43062j838705k216213
33286d154366k73820K521949L050562L18313k427436j371545K208291K970341
33278B842289q27605m204361k473233J844221K992683M97135j260336q22173j205569
33269b616949l081272k406320K489511O571289M928357J87248j605992J26972
33261D592844R26985q60051k212178j367112l64946n54548k82266J051772Q95638
$$ plain form
33252 1826138 -33546 -3907128 -6149900 -5556769 -4913215 -6148995 -7276828 -6184310
33244 -6184310 -4667299 -5815966 -9153827 -11433606 -11322235 -10264497 -9059099 -6775376
33236 -6775376 -3625717 -1939916 -2806933 -3993653 -3077373 -1006615 -396855 -1347593 -1372182
33227 -1372182 749144 3312477 4275478 3578871 2122713 130701 -2168647 -3392913
33219 -3392913 -2162516 895091 3523824 4240867 3556042 2839125 2697836 2570127 1494576
33210 1494576 -705576 -2885817 -3714322 -3540041 -4095520 -5613507 -5632490 -2421868 1415633
33201 1415633 1395170 -2783974 -6461140 -6321982 -4796833 -6108878 -9984869 -12209467 -10633318
33192 -10633318 -7689211 -6630699 -7662273 -8767049 -8737191 -8172675 -8237231 -9237618 -10117280
$$ packed form
33252A826138j859684l873582k242772N93131O43554j235780j127833J092518
33244f184310J517011j148667l337861k279779J11371J057738J205398K283723
33236f775376L149659J685801q67017j186720R16280K070758O09760r50738k4589
33227a372182K121326K563333R63001o96607j456158j992012k299348j224266
33219c392913J230397L057607K628733P17043o84825p16917j41289j27709j075551
33210A494576k200152k180241q28505J74281n55479j517987j8983L210622L837501
33201A415633k0463m179144l677166J39158J525149j312045l875991k224598J576149
33192a0633318K944107J058512j031574j104776K9858N64516o4556j000387q79662
$$ plain form
33183 -10117280 -9235776 -6227809 -2922715 -1428826 -1464525 -1039890 76706 -472412 -3904015
33174 -3904015 -7363559 -6631579 -1202360 5016981 8040076 7463603 5615394 4350306
33166 4350306 3503530 2016706 -148305 -1464837 -303313 3027265 6058098 6400457
33158 6400457 4090356 1417795 653546 2218228 4611391 5529307 3507068 -539720
33150 -539720 -3478669 -2723889 889044 3854048 3873526 1959518 209359 -1155005 -3214911
33141 -3214911 -5738849 -7061176 -6627691 -5890426 -5967731 -5854227 -4097908 -1227855 917196
33132 917196 1718104 2087306 2402642 1817832 153234 -965739 42178 2459125 3869583
33123 3869583 2661689 -771094 -4788979 -7493620 -7337788 -4089589 452257 3615248
$$ packed form
33183a0117280Q81504L007967L305094J493889l5699M24635J116596n49118l431603
33174c904015l459544P31980N429219O219341L023095n76473j848209j265088
33166D350306q46776j486824k165011j316532J161524L330578L030833L42359
33158F400457k310101k672561p64249J564682K393163R17916k022239m046788
33150e39720k938949P54780L612933K965004J9478j914008j750159j364364k059906
33141c214911k523938j322327M33485P37265p7305J13504J756319K870053K145051
33132I17196Q00908L69202L15336n84810j664598j118973J007917K416947J410458
33123C869583j207894l432783m017885k704641J55832L248199M541846L162991
$$ plain form
33115 3615248 4263017 3550410 3035888 2886224 2623597 2756828 4128575 5655467 4540867
33106 4540867 -10926 -4416037 -4003379 1354041 6757353 7974767 5794114 3634227
33098 3634227 2801695 2241816 1541723 1214270 473657 -2044751 -4962020 -4792972 -1005568
33089 -1005568 2757946 4260509 6103582 10647695 14476350 12282962 4874328 -1234770
33081 -1234770 -2039757 280393 2210556 3138999 3494532 2662242 975991 597901 1921051
33072 1921051 1799686 -1915037 -6433339 -7660270 -5831260 -4191893 -3629177 -2499150
33064 -2499150 -1030012 -1645847 -4456660 -6337821 -5837470 -5588405 -7743358 -9762966 -7586241
33055 -7586241 -1476658 4081529 5782669 4505484 3069169 3078695 4418848 6227417 7483806
$$ packed form
33115C615248O47769p12607n14522j49664k62627J33231J371747J526892j114600
33106D540867m551793m405111M12658N357420N403312J217414k180653k159887
33098C634227q32532n59879p00093l27453p40613k518408k917269J69048L787404
33089a005568L763514J502563J843073M544113L828655k193388p408634o109098
33081a234770q04987K320150J930163R28443L55533q32290j686251l78090J323150
33072A921051j21365l714723m518302j226931J829010J639367N62716J130027
33064b499150J469138o15835k810813j881161N00351K49065k154953k019608K176725
33055g586241O109583N558187J701140j277185j436315R526J340153J808569J256389
$$ plain form
33046 7483806 7480765 6423417 5201286 4324678 3519366 2467775 1396172 802856 1152300
33037 1152300 2840289 5652296 8131667 8552605 6973984 5175885 3867588 1476356
33029 1476356 -2794164 -6185625 -5274461 -1064000 1900061 1844207 1834253 4171087 6233480
33020 6233480 4775007 1613651 1083850 3280333 4084297 1552653 -1842012 -3677293
33012 -3677293 -4237384 -3808262 -1476366 1579599 1559645 -2461210 -5854769 -4587208 -1284375
33003 -1284375 -1227874 -4265795 -5197721 -1564099 3225042 4970001 3351807 612801 -1511233
32994 -1511233 -2269146 -1481694 20416 898093 1004801 1392592 2250985 2179340 -74532
32985 -74532 -4235123 -8883211 -12015931 -11547747 -7057022 -1177804 2415269 2683824 1541056
$$ packed form
33046G483806l041j057348j222131q76608q05312j051591j071603n93316L49444
33037A152300J687989K812007K479371M20938j578621j798099j308297k391232
33029A476356m270520l391461R11164M210461K964061n5854r954K336834K062393
33020F233480j458473l161356n29801K196483Q03964k531644l394665j835281
33012c677293n60091M29122K331896L055965j9954m020855l393559J267561L302833
33003a284375N6501l037921r31926L633622M789141J744959j618194k739006k124034
32994a511233p57913P87452J502110Q77677J06708L87791Q58393p1645k253872
32985g4532m160591m648088l132720M68184M490725N879218L593073K68555j142768
$$ plain form
32976 1541056 713872 151757 -484921 -982293 -1732445 -3714629 -6535251 -8157737 -7369564
32967 -7369564 -5213013 -3557696 -3552372 -5438821 -8114410 -8959151 -6346825 -2477436 -1188014
32958 -1188014 -2630204 -3108774 -1024876 400511 -1859498 -5924452 -7809945 -6665955
32950 -6665955 -4579548 -2889125 -1383693 -65762 662437 918929 805562 -137344 -1684663
32941 -1684663 -2565210 -2650205 -3636212 -5952734 -7184740 -5693277 -3593446 -3557331 -4763936
32932 -4763936 -4979875 -4664986 -5606067 -7194218 -7805517 -8431387 -10816721 -13064239 -11595658
32923 -11595658 -7024997 -3501047 -2240107 -496978 2446922 3189025 -342373 -5558281
32915 -5558281 -9107201 -10399071 -9720228 -6799404 -3145647 -1881048 -3024788 -2774422
$$ packed form
32976A541056q27184n62115o36678m97372p50152j982184k820622j622486P88173
32967g369564K156551J655317N324j886449k675589q44741K612326L869389J289422
32958a188014j442190m78570K083898J425387k260009m064954j885493J143990
32950f665955K086407J690423J505432J317931P28199K56492j13367r42906j547319
32941a684663q80547q4995r86007k316522j232006J491463K099831L6115j206605
32932d763936k15939L14889r41081j588151o11299o25870k385334k247518J468581
32923a1595658M570661L523950J260940J743129K943900P42103l531398n215908
32915e558281l548920j291870O78843K920824L653757J264599j143740K50366
$$ plain form
32907 -2774422 208053 2060452 323348 -1158432 1734091 6188489 6512675 2806454
32899 2806454 84101 310469 799369 -181451 -1567529 -3218703 -6264153 -9031833 -7604389
32890 -7604389 -1975347 2630904 2482399 -324818 -2218446 -3205718 -4938107 -6750003
32882 -6750003 -6888444 -5906716 -5836460 -6884321 -7293100 -5926915 -3263147 -434685 1255094
32873 1255094 553550 -2562885 -6304262 -8554528 -8388043 -5732052 -1008096 3863337
32865 3863337 5744694 3422596 -389848 -1879318 -407355 1464707 1550290 -43399
32857 -43399 -2218063 -4308743 -5878807 -6332201 -5334166 -3264294 -1210663 -573097 -1965204
32848 -1965204 -4021823 -4158321 -1365247 2450773 4758734 5254374 5443621 6219411 7119371
$$ packed form
32907b774422K982475J852399j737104j481780K892523M454398L24186l706221
32899B806454k722353K26368M88900r80820j386078j651174l045450k767680J427444
32890g604389N629042M606251j48505k807217j893628r87272j732389j811896
32882f750003j38441R81728P0256j047861m08779J366185K663768K828462J689779
32873A255094p01544l116435l741377k250266J66485K655991M723956M871433
32865C863337J881357k322098l812444j489470J471963J872062Q5583j593689
32857d3399k174664k090680j570064m53394R98035K069872K053631O37566j392107
32848a965204k056619j36498K793074L816020K307961M95640J89247P75790Q99960
$$ plain form
32839 7119371 7390641 6534101 4320097 1483056 -228335 -47672 465895 -321671 -1310951
32830 -1310951 -314108 1840463 1534954 -2640156 -7412190 -8611047 -5841061 -2152217
32822 -2152217 -316404 -672533 -1735062 -1736026 -66783 2048775 2794626 1954757 899211
32813 899211 117388 -1644312 -4855592 -7457092 -7330621 -5461767 -4708644 -5861193 -6767814
32804 -6767814 -5405607 -2244575 729659 2068577 1544002 -156211 -1848904 -2573693
32796 -2573693 -2275665 -1538567 -834061 -526199 -1161368 -2789957 -4268573 -4407170 -3758470
32787 -3758470 -3990408 -5340612 -6130981 -5316934 -4064547 -3829902 -4130660 -3666849 -2901374
32778 -2901374 -3785833 -6805034 -9644535 -9473685 -6066235 -2291211 -1641579 -5074886 -9788931
$$ packed form
32839G119371K71270q56540k214004k837041j711391J80663N13567p87566r89280
32830a310951R96843K154571l05509m175110m772034j198857K769986L688844
32822b152217J835813l56129j062529r64J669243K115558P45851q39869j055546
32813H99211p81823j761700l211280k601500J26471J868854P53123j152549r06621
32804f767814J362207L161032K974234J338918n24575j700213j692693p24789
32796b573693K98028P37098P04506L07862o35169j628589j478616j38597O48700
32787c758470k31938j350204p90369Q14047J252387K34645l00758M63811P65475
32778b901374q84459l019201k839501J70850L407450L775024O49632l433307m714045
$$ plain form
32769 -9788931 -11274591 -7368071 -566536 4136509 3988890 802974 -1427331 -615666
32761 -615666 2020216 4043817 4476808 4328127 5001380 6601858 7848362 7493930 5655713
$$ packed form
32769i788931j485660L906520O801535M703045j47619l185916k230305Q11665
32761f15666K635882K023601M32991j48681O73253J600478J246504l54432j838217
$$ [...]
##END NTUPLES=NMR SPECTRUM
##END=
