##TITLE=31Pdec_PR90_RMSO
 DMSO-d6, 24 sc
 5.6.2019
##JCAMPDX= 6.0         $$ Bruker NMR JCAMP-DX V2.0
##DATA TYPE= NMR SPECTRUM
##DATA CLASS= NTUPLES
##ORIGIN= UXNMR, Bruker Analytische Messtechnik GmbH
##OWNER= root
$$ XWIN-NMR		Version 3.5
$$ Wed Jun  5 15:51:29 2019 Russian Standard Time (UT+4h)  she@DPX200
##.OBSERVE FREQUENCY= 81.013821
##.OBSERVE NUCLEUS= ^31P
##.ACQUISITION MODE= SIMULTANEOUS
##.ACQUISITION SCHEME= undefined
##.AVERAGES= 24
##.DIGITISER RES= 17
##SPECTROMETER/DATA SYSTEM= spect
##.PULSE SEQUENCE= zgpg30
##.SOLVENT NAME= DMSO
##.SHIFT REFERENCE= (INTERNAL, DMSO, 0, 182.463)
##AUDIT TRAIL= $$ (NUMBER, WHEN, WHO, WHERE, WHAT)
$$ ##TITLE= Audit trail, XWIN-NMR		Version 3.5
$$ ##JCAMPDX= 5.01
$$ ##ORIGIN= Bruker BioSpin GmbH
$$ ##OWNER= she
$$ F:/spectra/data/she/nmr/P31/1/pdata/1/auditp.txt
$$ ##AUDIT TRAIL=  $$ (NUMBER, WHEN, WHO, WHERE, WHAT)
(   1,<2019-06-05 15:50:31.68 +0400>,<she>,<DPX200>,
      <created by zg, POWCHK disabled, PULCHK disabled
       configuration hash MD5:
       00 E9 B6 7A A2 85 ED C7 34 08 36 98 17 FE 4E 26
       data hash MD5: 32K
       E8 0A F6 A9 4B 2A EE 87 21 97 D0 D4 C7 BB E6 75>)
(   2,<2019-06-05 15:50:35.15 +0400>,<she>,<DPX200>,
      <Start of raw data processing
       efp BC_mod = 2 LB = 1 FT_mod = 6 PKNL = 1 PHC0 = -2162.475 PHC1 = 46.39912 SI = 64K 
       data hash MD5: 64K
       5C 61 5C 38 4E A2 57 6B 82 E1 C6 4B 64 B5 4A BB>)
(   3,<2019-06-05 15:50:51.39 +0400>,<she>,<DPX200>,
      <pk PHC0 = -20.66611 PHC1 = -9.000005 
       data hash MD5: 64K
       73 C5 34 FC A7 99 16 98 F9 36 B4 05 C1 73 7B 11>)
(   4,<2019-06-05 15:50:54.50 +0400>,<she>,<DPX200>,
      <abs ABSG = 5 
       data hash MD5: 64K
       C9 5B 02 0A AC B7 FB 86 09 F7 6E 09 CE 46 BC EA>)
$$ ##END=
$$ 
$$ hash MD5
$$ 73 DB AC 4B E4 D0 E5 A6 BD C7 24 02 59 47 AD D5
##$RELAX= 
##$RELAX= 
##$RELAX= 
##$RELAX= 
##$RELAX= 
##$RELAX= 
##$RELAX= 
##$RELAX= 
$$ Bruker specific parameters
$$ --------------------------
##$DU= <F:/spectra>
##$EXPNO= 1
##$NAME= <P31>
##$PROCNO= 1
##$TYPE= <nmr>
##$USER= <she>
##$AMP= (0..31)
100 100 100 100 100 100 100 100 100 100 100 100 100 100 100 100 100 100 
100 100 100 100 100 100 100 100 100 100 100 100 100 100 
##$AQSEQ= 0
##$AQ_mod= 1
##$AUNM= <au_zg>
##$AUTOPOS= <>
##$BF1= 81.014009
##$BF2= 200.13
##$BF3= 200.13
##$BF4= 200.13
##$BF5= 200.13
##$BF6= 200.13
##$BF7= 200.13
##$BF8= 200.13
##$BYTORDA= 1
##$CFDGTYP= 0
##$CFRGTYP= 5
##$CHEMSTR= <none>
##$CNST= (0..31)
1 1 145 1 1 1 1 1 1 1 1 1 1 1 1 1 1 1 1 1 1 1 1 1 1 1 1 1 1 1 1 1 
##$CPDPRG= <waltz16>
##$CPDPRG1= <>
##$CPDPRG2= <waltz16>
##$CPDPRG3= <>
##$CPDPRG4= <mlev>
##$CPDPRG5= <mlev>
##$CPDPRG6= <mlev>
##$CPDPRG7= <mlev>
##$CPDPRG8= <mlev>
##$CPDPRGB= <>
##$CPDPRGT= <>
##$D= (0..31)
0 1 0 0 0 0 0 0 0 0 0 0.03 2e-05 3e-06 0 0 0 0 0 0 0 0 0 0 0 0 0 0 0 0 
0 0 
##$DATE= 1559735431
##$DBL= (0..7)
120 120 120 11 120 120 24 19 
##$DBP= (0..7)
150 150 150 150 150 150 150 150 
##$DBP07= 0
##$DBPNAM0= <>
##$DBPNAM1= <>
$$ [...]
##$SUBNAM3= <"">
##$SUBNAM4= <"">
##$SUBNAM5= <"">
##$SUBNAM6= <"">
##$SUBNAM7= <"">
##$SUBNAM8= <"">
##$SUBNAM9= <"">
##$SW= 369.568048894756
##$SWIBOX= (0..15)
0 1 3 0 0 0 0 0 0 0 0 0 0 0 0 0 
##$SW_h= 29940.119760479
##$TD= 32768
##$TD0= 1
##$TE= 0
##$TE2= 300
##$TE3= 300
##$TEG= 300
##$TL= (0..7)
0 120 53 12 22 120 120 120 
##$TP= (0..7)
150 150 150 150 150 150 150 150 
##$TP07= 0
##$TPNAME0= <>
##$TPNAME1= <>
##$TPNAME2= <>
##$TPNAME3= <>
##$TPNAME4= <>
##$TPNAME5= <>
##$TPNAME6= <>
##$TPNAME7= <>
##$TPOAL= (0..7)
0.5 0.5 0.5 0.5 0.5 0.5 0.5 0.5 
##$TPOFFS= (0..7)
0 0 0 0 0 0 0 0 
##$TUNHIN= 0
##$TUNHOUT= 0
##$TUNXOUT= 0
##$USERA1= <user>
##$USERA2= <user>
##$USERA3= <user>
##$USERA4= <user>
##$USERA5= <user>
##$V9= 5
##$VALIST= <valist>
##$VCLIST= <CCCCCCCCCCCCCCC>
##$VD= 0
##$VDLIST= <DDDDDDDDDDDDDDD>
##$VPLIST= <PPPPPPPPPPPPPPP>
##$VTLIST= <TTTTTTTTTTTTTTT>
##$WBST= 1024
##$WBSW= 4
##$XGAIN= (0..3)
0 0 0 0 
##$XL= 0
##$YL= 0
##$YMAX_a= 27339
##$YMIN_a= -41476
##$ZGOPTNS= <>
##$ZL1= 120
##$ZL2= 120
##$ZL3= 120
##$ZL4= 120
##$ABSF1= 182.463
##$ABSF2= -187.1042
##$ABSG= 5
##$ABSL= 3
##$ALPHA= 0
##$AQORDER= 0
##$ASSFAC= 0
##$ASSFACI= 0
##$ASSFACX= 0
##$ASSWID= 0
##$AUNMP= <proc_1d>
##$AZFE= 0.1
##$AZFW= 0.5
##$BCFW= 0
##$BC_mod= 2
##$BYTORDP= 0
##$COROFFS= 0
##$CY= -3
##$DATMOD= 1
##$DC= 0
##$DFILT= <>
##$DTYPP= 0
##$F1P= 0
##$F2P= 0
##$FCOR= 1
##$FTSIZE= 65536
##$FT_mod= 6
##$GAMMA= 0
##$GB= 0
##$INTBC= 1
##$INTSCL= 5.30512e-09
##$ISEN= 30
##$LB= 1
##$LEV0= 0
##$LPBIN= 0
##$MAXI= 10000
##$MC2= 0
##$MEAN= 0
##$ME_mod= 0
##$MI= 50
##$NCOEF= 0
##$NC_proc= -5
##$NLEV= 6
##$NOISF1= 182.463
##$NOISF2= 159.3651
##$NSP= 0
##$NTH_PI= 0
##$NZP= 0
##$OFFSET= 182.463
##$PC= 4
##$PHC0= -2183.141
##$PHC1= 37.39912
##$PH_mod= 1
##$PKNL= yes
##$PPARMOD= 0
##$PSCAL= 0
##$PSIGN= 0
##$REVERSE= no
##$SF= 81.0140089999434
##$SI= 65536
##$SIGF1= 159.3651
##$SIGF2= -187.1042
##$SINO= 113.3802
##$SIOLD= 16384
##$SREGLST= <1H.CDCl3>
##$SSB= 0
##$STSI= 65536
##$STSR= 0
##$SW_p= 29940.119760479
##$SYMM= 0
##$S_DEV= 0
##$TDeff= 32768
##$TDoff= 0
##$TI= <>
##$TILT= no
##$TM1= 0
##$TM2= 0
##$TOPLEV= 0
##$USERP1= <user>
##$USERP2= <user>
##$USERP3= <user>
##$USERP4= <user>
##$USERP5= <user>
##$WDW= 1
##$XDIM= 65536
##$YMAX_p= 350745989
##$YMIN_p= -18131034
$$ End of Bruker specific parameters
$$ ---------------------------------
##NTUPLES= NMR SPECTRUM
##VAR_NAME=  FREQUENCY,     SPECTRUM/REAL,   SPECTRUM/IMAG
##SYMBOL=    X,             R,               I
##VAR_TYPE=  INDEPENDENT,   DEPENDENT,       DEPENDENT
##VAR_FORM=  AFFN,          ASDF,            ASDF
##VAR_DIM=   65536,         65536,           65536
##UNITS=     HZ,            ARBITRARY UNITS, ARBITRARY UNITS
##FACTOR=    0.456856943014862, 1,           1
##FIRST=     14782.0589164792, 0,            0
##LAST=      -15158.0608439998, 0,           0
##MIN=       -15158.0608439998, -18131034,   0
##MAX=       14782.0589164792, 350745989,    0
$$ Real data points
##PAGE= N=1
##DATA TABLE= (X++(R..R)), XYDATA
$$ [...]
41698i8530K67998M40317K40009k92500p07909n75857P1916O86991O77217L8696
41688G48348n75666n87593j98895q6889m27294o26659j90147N37505Q38216N57921
41678a1153J63893J8061M1557P4796J34040K12826J75021q258j58469j38680n365
41667D98269J49569K96761L59419K30877l7758k78504m64255o77902p97554n35898
41657a256976P9032N60419N09639J07971j41627l1956J76767J47167j15357k76373
41647b41294j06321J66639J26453j81712k14164K41436N92362K34210n10512q41468
41637g34371o36931m45541m40104k19335K66128M60210J63833l6220K83474O91699
41627f47158O41838K95835Q0173m3543k79711m11255j26867L66541O10036N43839
$$ plain form
41698 -98530 169468 609785 849794 557294 -150615 -726472 -654556 32435 709652 748348
41688 748348 172682 -414911 -613806 -700695 -1127989 -1754648 -1944795 -1407290 -569074 -11153
41678 -11153 152740 170801 212358 287154 421194 634020 809041 800783 642314 503634 498269
41667 498269 647838 944599 1304018 1534895 1497137 1218633 754378 76476 -721078 -1256976
41657 -1256976 -1177944 -617525 -107886 85 -141542 -173498 3269 150436 35079 -241294
41647 -241294 -347615 -180976 -54523 -236235 -450399 -208963 383399 617609 107097 -734371
41637 -734371 -1371302 -1816843 -2256947 -2476282 -2210154 -1749944 -1586111 -1622331 -1338857 -647158
41627 -647158 -5320 290515 370688 327145 47434 -363821 -490688 -124147 485889 1029728
41617A029728M28159L32024J25732j89606m72107n91329m18367M0858M01807K55313
41607I42212j24818o1183L66964K67581n93978j189005p09534K00391M79995J53713
41597b67662p7670n7576l0504J19331M95341N88016L5199n41220m52538j11641
41587c00924k04901l59652P0978N28547R1752o84116m95688M08015N15911l50321
41577g80399o57525K90230J257399J119108L50436k22531o37403r72362p22873
41568i75920J08981N46014J34125k42313J17866N57146L08873k02945k96165k22050
41558a66388l99138m20019J03515N54866K52632l39376l37197K64778Q63587J131029
41548A508289R07491N8639q55394p99254P3283K20282q55422j437103k38924J244995
$$ plain form
41617 1029728 1457887 1789911 1915643 1726037 1253930 662601 244234 285092 686899 942212
41607 942212 817394 756211 1123175 1390756 796778 -392227 -1101761 -901370 -421375 -267662
41597 -267662 -345332 -402908 -433412 -314081 181260 769276 804475 263255 -189283 -300924
41587 -300924 -505825 -865477 -794499 -265952 -174200 -858316 -1354004 -945989 -430078 -780399
41577 -780399 -1437924 -1147694 109705 1228813 1579249 1356718 719315 -253047 -975920
41568 -975920 -866939 -320925 -186800 -429113 -311247 245899 554772 351827 55662 -166388
41558 -166388 -565526 -985545 -882030 -327164 -74532 -413908 -751105 -486327 377260 1508289
41548 1508289 2415780 2474419 1619025 819771 893054 1113336 257914 -1179189 -1418113 -173118
41538a73118Q97958o90093j219341k26368O49877N53011K88460L60860K58972
41529G00218j00097j17336O0464l36626r44484n19885P36219J112616J91316l38320
41519D44085M61350J121439K58765j047273j020754l753L14746l53027p29958
41510e54380k04847M00244L34864j03466l55528m08515m65588m42330j58684K87528
41500a670702N95661O01015M19504K45081M9367l40177p78895p61698j52184M25829
41490a367199M26023K15577L91773O59738L17297m10676o14975j87885P8545r5754
41480e87536j64519L3074K3052j11353L37660J168787J107731j66270j212968
41471D27658r10907o9133M9892l55422l68264k3667M9538p0375J13446M67433
$$ plain form
41538 -173118 724840 34747 -1184594 -1410962 -761085 -208074 80386 441246 700218
41529 700218 600121 482785 543249 206623 -737861 -1257746 -521527 591089 782405 444085
41519 444085 905435 2026874 2285639 1238366 217612 213859 528605 175578 -554380
41510 -554380 -759227 -358983 -24119 -127585 -483113 -891628 -1357216 -1799546 -1958230 -1670702
41500 -1670702 -1075041 -474026 -54522 190559 239926 -100251 -879146 -1640844 -1793028 -1367199
41490 -1367199 -941176 -725599 -333826 325912 643209 232533 -382442 -570327 -491782 -587536
41480 -587536 -752055 -718981 -695929 -807282 -469622 699165 1806896 1640626 427658
41471 427658 -483249 -552382 -502490 -857912 -1226176 -1249843 -1200305 -1270680 -1157234 -689801
41461f89801N38463M00067K52964j81505q97082r76877J12478J278959J136457
41452I74123K2636o32340m63499k90224m49999m93512l55424l86718l12565M08470
41442a979052J213845R25315k64195q07881j21835O06426M38355O9236L94731
41433D74945R22959O58871k49603p82263n10310M0613K44751p17l61276m27810
41423A0160j34507R6621r6793m10060l09270N1703Q5782j10056J63628Q69347
41413B16555J034587L02218l51013r7099M49647K74793m01584n33721Q8507N65411
41403A548301K07435o36901j156447r59321k92698K72019L30976L4862p2108K53077
41393d70805N97320M36109j58984o16120n49529j28004J79089P3565l20754o13253
$$ plain form
41461 -689801 -151338 248729 501693 320188 -576894 -1553771 -1441293 -162334 974123
41452 974123 996759 364419 -99080 -389304 -839303 -1332815 -1688239 -2074957 -2387522 -1979052
41442 -1979052 -765207 160108 -104087 -911968 -1033803 -427377 10978 80214 474945
41433 474945 1397904 2056775 1807172 1024909 514599 555212 799963 799246 437970 10160
41423 10160 -124347 -27726 -124519 -534579 -843849 -792146 -706364 -816420 -652792 216555
41413 216555 1251142 1553360 1202347 1105248 1554895 1829688 1428104 894383 982890 1548301
41403 1548301 1755736 1118835 -37612 -996933 -1289631 -1017612 -686636 -651774 -723882 -470805
41393 -470805 126515 562624 403640 -212480 -762009 -890013 -710924 -637359 -958113 -1571366
41383a571366n57068k37298J65609N50168P05168L58661k50379l34071L45923
41374h24653Q35103K56037p12588p16848J68469N38349j04371o43137k48988M13376
41364a039251N25510L65741L76418J71485m94028q16866j96142N00054K23330
41355c83749m41385j98807P44895R61338R2436o65258m60837J96484N85768P16721
41345A147606P30530M18274j61195m22481j03652K86929K63883r133k23049m31322
41335A496390o75722o67963k67880J53764K02320l7356k65341l98188m89193n13012
41325a462181m26034k10260J90476O87514Q68052M50588j17463p4925N84705J030186
41315A520658O93305r7863p11139q76941o28067j54605J13815j47990n82454n09779
$$ plain form
41383 -1571366 -2128434 -2365732 -2200123 -1649955 -944787 -586126 -836505 -1170576 -824653
41374 -824653 10450 266487 -446101 -1162949 -994480 -456131 -560502 -1203639 -1452627 -1039251
41364 -1039251 -513741 -148000 228418 399903 -94125 -910991 -1107133 -607079 -383749
41355 -383749 -825134 -1023941 -279046 682292 774728 109470 -351367 -154883 430885 1147606
41345 1147606 1878136 2296410 2135215 1712734 1609082 1896011 2159894 2150761 1927712 1496390
41335 1496390 820668 152705 -115175 38589 240909 203553 -61788 -459976 -949169 -1462181
41325 -1462181 -1888215 -2098475 -1907999 -1220485 -352433 98155 -19308 -94233 490472 1520658
41315 1520658 2213963 2116100 1404961 528020 -100047 -254652 -140837 -288827 -871281 -1381060
41305a381060K6921K97168J05982Q8448M54929M34313l95909j114877o82964M67345
41295a699704J026785O13158N3054M7593L98223N59215L19546j22247l67574j75395
41285F52654J31427p5040p57444j009245l26354M81052L86821l18985n11422N8304
41275a288232N29480L22607j77425l86275j60109L89720R80448J044713K95844
41266A550771n99550p18065k15371n0147l87536l86572K45829O91460M28642M1144
41256F00605L7014p770l76351m02031K80124O96343n710q81186m43898R12110
41246D09250J346889L03909p73480o92699m0032R3918k74695m60770l04757j00170
41236d92637J33138N52921R78705J051670P08701J22938n33748r34922o28779
$$ plain form
41305 -1381060 -1354139 -1056971 -950989 -862541 -407612 26701 -369208 -1484085 -2167049 -1699704
41295 -1699704 -672919 -59761 -6707 40886 439109 998324 1317870 1195623 828049 652654
41285 652654 784081 709041 -48403 -1057648 -1384002 -902950 -516129 -835114 -1346536 -1288232
41275 -1288232 -758752 -436145 -613570 -999845 -1159954 -770234 210214 1254927 1550771
41266 1550771 951221 233156 17785 -32362 -419898 -806470 -560641 130819 559461 600605
41256 600605 637619 629849 253498 -148533 131591 827934 822224 -58962 -502860 409250
41246 409250 1756139 2060048 1286568 593869 553837 647755 373060 -87710 -392467 -492637
41236 -492637 -359499 193422 1172127 2223797 2932498 3055436 2521688 1586766 957987
41227I57987K83135Q61553L55851o76225r45092j21627O97403M23350o58656j340653
41217a62974r74855m2152O29924P18234L80714j45914n85161n75006p5944L09217
41207e23917j4553o61680o02202L32248J007239N23414m69292p07523m8865N99322
41197e65809P25726N94922L67480p0389l88344o0180M80437J24804j060462j499315
41187a351130l43946J092101J158246J92911k28151K74726O17262J64389m73602
41178A102806o68275o15846o36780n72885k81336k0938J5605K835O6649Q7332
41168a520833Q8143K59805M38952J85419l93661n36736J22594R56964J151727
41159G52374O19131k02877r19630j177443o79728K59127O55841j4757r53769r29921
$$ plain form
41227 957987 1241122 2102675 2458526 1782301 837209 715582 1412985 1836335 1177679 -162974
41217 -162974 -1137829 -1179981 -550057 168177 548891 402977 -182184 -757190 -833134 -523917
41207 -523917 -538470 -1200150 -1802352 -1470104 -462865 60549 -408743 -1116266 -1165131 -565809
41197 -565809 159917 754839 1122319 1051930 663586 603406 1083843 1208647 148185 -1351130
41187 -1351130 -1695076 -602975 555271 748182 520031 794757 1412019 1576408 1102806
41178 1102806 434531 -181315 -818095 -1390980 -1672316 -1693254 -1677649 -1674814 -1608165 -1520833
41168 -1520833 -1432690 -1172885 -733933 -548514 -942175 -1478911 -1356317 -399353 752374
41159 752374 1371505 1168628 248998 -928445 -1608173 -1349046 -693205 -707962 -1661731 -2591652
41149b591652J52105J168306J174413L58558l91686m22948K08313Q26308O93229
41140A174946j98363r22387n77711N42921J151679M65655q39050j407667p26560
41131a336537L97695P94864J24244r21444j398674r28593J65088J231170J684079
41122a88108J292321L83470l30903m19080j73152j46278l75001m33126j60694
41113e50551J59064L57882N52523O37047K27086n98062j083420p54653r4508K02622
41103i44970J68084J80098J11892l68879r12921p59467J00746P83123O73678J19930
41093h48686k11790j11472K39052N69421N06085k23418j206946j417610l60453
41084c065817J112934J638192Q89101j50118m60612r5845J62472q7393m69077
$$ plain form
41149 -2591652 -2439547 -1271241 -96828 261730 -129956 -552904 -344591 481717 1174946
41140 1174946 976583 54196 -523515 19406 1171085 1636740 797690 -609977 -1336537
41131 -1336537 -938842 -143978 -19734 -941178 -2339852 -3268445 -3103357 -1872187 -188108
41122 -188108 1104213 1487683 1156780 737700 564548 418270 43269 -389857 -550551
41113 -550551 -391487 -33605 518918 1155965 1383051 784989 -298431 -1053084 -1147592 -944970
41103 -944970 -776886 -596788 -484896 -853775 -1766696 -2526163 -2425417 -1642294 -968616 -848686
41093 -848686 -1060476 -1171948 -932896 -363475 142610 -80808 -1287754 -2705364 -3065817
41084 -3065817 -1952883 -314691 574410 424292 -36320 -132165 30307 -57086 -526163
41075e26163m63397p6478K88008L86972K92174J00676j63134l35597j62428K93260
41065c66107N86698M16449m0986m63181p11354o47763q6586P13579R87064M40840
41055H28653j19974J42376P50059N54292m18624q80036k36677M93884K79581m15671
41045I77863n72838k87321l87658q27829o99285J87015R02008Q48319N55967N31248
41035A227489K87796o35944j429085r28763M92650J174305M51160m35812k24560
41026b0764N52765N25009m00978j011552o74795j16737j08778l64426k29643K65632
41016a584267O50390P88692P97569N75692N0930l64754k16080K30194K69460k27501
41006I70325o49582n36084j21754J25492Q5191o1704j47059j23720m1765J6050
$$ plain form
41075 -526163 -989560 -1066038 -778030 -391058 -98884 1792 -161342 -496939 -659367 -366107
41065 -366107 220591 637040 596054 132873 -578481 -1226244 -1312830 -599251 387813 828653
41055 828653 708679 851055 1601114 2155406 1736782 856746 620069 1113953 1393534 977863
41045 977863 405025 117704 -269954 -1097783 -1797068 -1610053 -708045 140274 696241 1227489
41035 1227489 1515285 879341 -549744 -1478507 -985857 188448 639608 203796 -20764
41026 -20764 532001 1057010 656032 -355520 -1030315 -1147052 -1255830 -1620256 -1849899 -1584267
41016 -1584267 -933877 -145185 652384 1228076 1279006 914252 698172 928366 1197826 970325
41006 970325 320743 -215341 -337095 -211603 -126412 -188116 -335175 -458895 -500660 -484610
40996d84610P5080K43118M00899J68095n12854j014014o91341K42128R65853J023643
40986D15997N74838j12805p87610r59858k80183P54153J156587O56925n6485l86633
40976I74926m37333m39116l21437j29952j72172m34824n08306l55914m18014o61465
40966b903607m16369L86054P83735K71236k40005J45497Q07923P01881J99157
40957b64498M22895J184845J156623N2602q63389o97163Q563N24163R45975J336629
40947C807245J048895j90138j404039j537244q71070l77243k21473J05066N68912
40938I28911N86091J07237k66259k90844l40158n40609m77561n146M03276M44340
40928E49278M40076O06868N42541n328m59973k34920K03205m7771q68734j211173
$$ plain form
40996 -484610 -409530 -166412 234487 402582 -110272 -1124286 -1815627 -1573499 -607646 415997
40986 415997 990835 878030 90420 -869438 -1149621 -395468 761119 1418044 1361559 974926
40976 974926 537593 98477 -222960 -352912 -525084 -959908 -1468214 -1824128 -2242142 -2903607
40966 -2903607 -3319976 -2933922 -2150187 -1878951 -2118956 -1973459 -1165536 -463655 -264498
40957 -264498 158397 1343242 2499865 2552467 1689078 991915 1000478 1524641 2470616 3807245
40947 3807245 4856140 4666002 3261963 1724719 853649 476406 254933 359999 928911
40938 928911 1515002 1622239 1355980 1065136 724978 184369 -293192 -298338 104938 549278
40928 549278 989354 1596222 2138763 2133435 1673462 1438542 1641747 1593976 725242 -485931
40918d85931o57818L9669K09721J41498K68550L20972J179j76119L58505J058907
40908A079133Q75719j24529p90637n91180k48077l79360n19338q0412N26996N39262
40898B87577Q6060n4132L01684N29855K12116k92940m34463j89388j718j95065
40888B49586n54806n01635K00442R52561Q94851M5047o32786n13153o3645Q0516
40878A56978J08515M03102N39949n5810p99286n12286O60613J124435M5803j354583
40868C17430j441205l37795M40564J45387l61028N472J022534J433107N36233
40859A760699q59941j273003k84728Q76152P68475m74116j300400o84719O56500
40850h15081J241289N65497n22619r33462m11803M28775Q20923N17292j00660
$$ plain form
40918 -485931 -1143749 -1104080 -894359 -752861 -484311 -163339 -162160 -338279 20226 1079133
40908 1079133 1954852 1830323 1039686 448506 200429 -178931 -698269 -778681 -251685 287577
40898 287577 373637 319505 621189 1151044 1363160 1070220 635757 446369 444651 249586
40888 249586 -305220 -806855 -606413 346148 1240999 1286046 653260 140107 76462 156978
40878 156978 265493 668595 1208544 1152734 353448 -158838 501775 1626210 1672013 317430
40868 317430 -1123775 -1461570 -1021006 -875619 -1236647 -1231175 -208641 1224466 1760699
40859 1760699 900758 -372245 -656973 219179 987654 513538 -786862 -1471581 -815081
40850 -815081 426208 991705 469086 -464376 -876179 -447404 373519 890811 790151
40841G90151m74015l76558R302L63662M45768J96534j62865k52731L8583M02582
40831I80413N78512O74444P02744K31964q74382j731922j341868j04911N64006
40822c21000K16437j13516L00129P06658K03119p26939r65873m19184Q9888J88254
40812h42027K24783L72843L89419K44508K07140K76147J91778J5785O2871K64560
40802A407807K45058K7445r070R9283r4564n51668o09795J659P11673J019992
40792B247820J208223J697107K290109K641175L018290L874558M807778M604726
40784B6389786K486008r62066m137327n579553m957312l213624j734479j193737
40776G097696j190244r99096m58805j461l7136n17026r84929r45189l35573L00176
$$ plain form
40841 790151 316136 -60422 -51120 312542 758310 954844 791979 539248 577831 980413
40831 980413 1558925 2233369 2936113 3168077 2293695 561773 -780095 -885006 -321000
40822 -321000 -104563 -218079 82050 788708 991827 264888 -700985 -1120169 -1030281 -842027
40812 -842027 -617244 -244401 145018 389526 596666 872813 1064591 1080376 1143247 1407807
40802 1407807 1652865 1680310 1671240 1770523 1675959 1124291 514496 516155 1227828 2247820
40792 2247820 3456043 5153150 7443259 10084434 13102724 16977282 21785060 26389786
40784 26389786 28875794 27913728 23776401 18196848 13239536 10025912 8291433 7097696
40776 7097696 5907452 4908356 4449551 4448090 4410954 3893928 2908999 1963810 1628237 1928413
40766A928413L46538j21355m43911l20773j57276k51640k41078J75192N43233
40757A457343L90470J81043O10051J229667R06004l29074j087519o58525p6919
40748B622541m47742j198004j023893R5908R94161J058084P15258L18415k73418
40739B861310q82817q98541l12871Q2183n1449n6167M92856R16998N20891k03835
40729B468558l27723J34675N05509O54473R30339J158542P49332k34751j035510
40720E003444j251658j125273q17798k94786P5097j80619o31679l36860N21743
40711I61611O34284l14720q53710M3759J166628Q36607m47786p93922J01817N63310
40701A897878l31669j321424r50729L11510R35426M78925j82651l45318j89180
$$ plain form
40766 1928413 2274951 2153596 1709685 1388912 1231636 979996 738918 914110 1457343
40757 1457343 1847813 2028856 2638907 3868574 4774578 4445504 3357985 2699460 2622541
40748 2622541 2174799 976795 -47098 48810 1042971 2101055 2816313 3134728 2861310
40739 2861310 1978493 1079952 767081 849264 797815 741648 1234504 2151502 2672393 2468558
40729 2468558 2140835 2275510 2781019 3435492 4365831 5524373 6273705 6038954 5003444
40720 5003444 3751786 2626513 1808715 1513929 1589026 1408407 776728 439868 961611
40711 961611 1595895 1281175 427465 471224 1637852 2474459 2026673 1232751 1334568 1897878
40701 1897878 1566209 244785 -705944 -394434 540992 1019917 837266 491948 302768
40692C02768p2403N4057L07767M71069K34509l56995q87840r41447m45190K79288
40682a054417P81670Q34955N40203J35869j83836k69638l2956M04045O84221N18127
40672B358243J7148l93870m46577l30329m11249o68284o19639J0358P27324P55527
40662I98652J00321l53169l0359N20046M59363p8791k40519J88889M76707J45230
40652B186370k69510q1764M98390P59343N50283L01324J88690Q853q9035M82506
40642D535450J740574K677103K497025J983401K716048M740187N848062L898351
40634C0636201m95550m379502n556577m540943l237924k533397j926692j049419
40626F916197m48454o33593j137328j094725m23498J21387M277m49028o09977
$$ plain form
40692 302768 230365 284422 592189 1063258 1297767 940772 52932 -888515 -1333705 -1054417
40682 -1054417 -272747 562208 1102411 1238280 1054444 784806 751850 1155895 1840116 2358243
40672 2358243 2375391 1981521 1534944 1204615 793366 125082 -494557 -484199 243125 998652
40662 998652 1098973 745804 715445 1235491 1694854 1616063 1375544 1564433 2041140 2186370
40652 2186370 1916860 1835096 2333486 3092829 3643112 3944436 4133126 4141979 4052944 4535450
40642 4535450 6276024 8953127 11450152 13433553 16149601 20889788 26737850 30636201
40634 30636201 30140651 25761149 20204572 15663629 12425705 9892308 7965616 6916197
40626 6916197 6467743 5834150 4696822 3602097 3178599 3299986 3304263 2855235 2245258
40617B245258m02410k58422l35657k31445L00840P08956K32351r21417j572576
40608b34522r71302K67321R90396Q72414M71403K27253L7780k32910m22559l71441
40598F33833j48849J07750K62086J23447k84577m78720o6110M91555L27304n11478
40588D56241r48509l98077L62696L86913n6498p3110L59262M45840k1678k89011
40578B24069J36078O62660M34029n07102j280228j158912k38501P20334R64930
40569d2643M28881j97300k53770Q2438J15592k90630m96241j10227L57513K86044
40559a20343q5205n9371M15221O91290M19932J7659K7417M51761Q63546Q55880
40549C477787K97234n41568j042882p53910P2410P52667J013056J168881J438251
$$ plain form
40617 2245258 1842848 1584426 1248769 1017324 1318164 2027120 2259471 1338054 -234522
40608 -234522 -1205824 -938503 51893 924307 1395710 1622963 1660743 1427833 1005274 633833
40598 633833 484984 592734 854820 978267 693690 214970 148860 640415 967719 456241
40588 456241 -492268 -890345 -527649 -140736 -197234 -270344 88918 534758 513080 224069
40578 224069 360147 1022807 1456836 949734 -330494 -1489406 -1727907 -1007573 -42643
40569 -42643 386238 188938 -64832 17606 133198 -157432 -653673 -763900 -406387 -120343
40559 -120343 -205548 -264919 150302 841592 1261524 1279183 1306600 1758361 2621907 3477787
40549 3477787 3775021 3233453 2190571 1436661 1509071 2261738 3274794 4443675 5881926
40540E881926J586868J406988J017111M48689m96058j618218k136395j651485
40532D439426q25258n20469o81245o86097m04925j81623j02359n8335k39349p21323
40522A8443q47950r903J147005J381809O42817J5791r2513l33524p87117n41597
40512E93261M91076R16873L3224p37685O2004J531943J727473O26772L4453Q04984
40502F084378J853783K078200J793914J761265J838556J266093k00771j867013
40494A4608405k678466k251022j409228j307271j847529j735483n29078M36442
40486C286770O3503o79157l18702O56412O42466l74278r21690n84587l84082n77844
40476H08811k09020P62885R73088O401p03051k55959K43305k70091r81232p26504
$$ plain form
40540 5881926 7468794 8875782 9892893 10341582 9845524 8227306 6090911 4439426
40532 4439426 3614168 3093699 2412454 1726357 1321432 1139809 1037450 979115 739766 18443
40522 18443 -829507 -839410 307595 1689404 2332221 2348012 2255499 1921975 1134858 593261
40512 593261 1084337 2001210 2034434 1296749 1358753 2890696 4618169 5244941 5279394 6084378
40502 6084378 7938161 10016361 11810275 13571540 15410096 16676189 16475418 14608405
40494 14608405 11929939 9678917 8269689 6962418 5114889 3379406 2850328 3286770
40486 3286770 3350273 2671116 2352414 3008826 3651292 3277014 2355324 1770737 1386655 808811
40476 808811 599791 1362676 2335764 2342165 1639114 1383155 1626460 1356369 375137 -351367
40466c51367Q1747M75062O02972R20678Q55322j29671j086093q31945Q6707K83265
40456I06677k39636l70687O8214K19491r6354j34706L18276O14604M39608J72664
40446A898151J1820k26964m57277m21218l29158m84201n07854O3841P14140N96228
40436H57508l1682k34271j556p7961l73180o0046P00494P12735k51792q91373
40426C48876l61789M72326M52977k80913q31234q11487m28783J9617K16899p205
40416a210716k41706J27410Q69817J014577K81317m08211k21028N23909R60248
40407A695617O98326m1877p08460o65780J73131R09252O18169k95073o49162l09174
40397A424969k28704o22976n70151K13042P11931L49500n0407J96275N03202L01725
$$ plain form
40466 -351367 -269620 205442 808414 1729092 2584414 2454743 1368650 536705 623412 906677
40456 906677 667041 296354 364568 584059 487705 352999 671275 1285879 1725487 1898151
40446 1898151 1909971 1683007 1225730 804512 475354 -8847 -516701 -452860 261280 857508
40436 857508 825826 591555 589999 512038 138858 78812 779306 1492041 1240249 348876
40426 348876 -12913 459413 912390 631477 -199757 -1011244 -1440027 -1420410 -1203511 -1210716
40416 -1210716 -1452422 -1325012 -455195 559382 840699 432488 211460 735369 1695617
40407 1695617 2393943 2352066 1643606 977826 1150957 2060209 2678378 2383305 1734143 1424969
40397 1424969 1196265 573289 3138 216180 928111 1277611 1227204 1423479 1926681 2228406
40387B228406J05748K93804K01755l92632k86390J155566K315706J458411m56458
40378F623916j137204m40709k40821j096804j462869n83100R0111o37592j602522
40369d87594j029570P62294J844918J314610J60753l59226j47340J50414K20888
40360B430147K34094K43130L9714k74050r6518Q09901J613049J331712L68570
40351F699749J90974J329822K756648L632912M398572N259795M890319K153053
40343C1311844j659262l991462m115664l468403l099511k574422j644766j198030
40335I560324j738025k295592j832248p45712n9273P2055J16319J00278k12242
40326B965884n07739k58678L05120L85712k32144q56840p91193j16844N04151
$$ plain form
40387 2228406 2334154 2627958 2829713 2437081 2150691 3306257 5621963 7080374 6623916
40378 6623916 5486712 5046003 4805182 3708378 2245509 1662409 1752520 1114928 -487594
40369 -487594 -1517164 -754870 1090048 2404658 2565411 2206185 2058845 2209259 2430147
40360 2430147 2664241 2907371 2947085 2673035 2576517 3386418 4999467 6331179 6699749
40351 6699749 6890723 8220545 10977193 14610105 19008677 24268472 29158791 31311844
40343 31311844 29652582 25661120 21545456 18077053 14977542 12403120 10758354 9560324
40335 9560324 7822299 5526707 3694459 2948747 2889474 2961529 3077848 3178126 2965884
40326 2965884 2458145 2199467 2504587 2890299 2658155 1801315 1010122 893278 1397429
40317A397429N53626J61503k1341M08282R51764P05418l56914j133197p91680
40308A874890J00566M24539P3201r4208L25698P48718N91395L7854m47345p18235
40298B917073o96072j63683O24801O99575m31269j689670j545990j71830O65517
40289B08452J24388n47335r2709P31408N05568l71846l05144P39046J044701k1302
40279B015227r08316m08483M50191K85378l05364P7012J117380J285276L65158
40270C973459l06493m4976L85861L55308K49919L69969K27228m83932j211227
40261C515116j386333j134714p21535r9870N59089O95232K24085j51123N02J63129
40251A663578j83023o13536m37468J83267N09082L02402j4278r9426m2565m4409
$$ plain form
40317 1397429 1951055 2112558 2091217 2499499 3451263 4156681 3799767 2666570 1874890
40308 1874890 1975456 2399995 2473196 2378988 2704686 3453404 4044799 4082653 3635308 2917073
40298 2917073 2221001 2057318 2682119 3381694 2950425 1260755 -285235 -457065 208452
40289 208452 332840 -214495 -307204 424204 929772 557926 252782 991828 2036529 2015227
40279 2015227 1106911 698428 1148619 1433997 1128633 1205645 2323025 3608301 3973459
40270 3973459 3666966 3621990 4007851 4363159 4613078 4983047 5210275 4726343 3515116
40261 3515116 2128783 994069 272534 172664 731753 1426985 1651070 1499947 1500449 1663578
40251 1663578 1480555 867019 429551 612818 1121900 1424302 1410024 1310598 1268033 1223624
40241A223624j50904k85610l14055j42232J28120K80847K73150K26765J24110
40232A363815j75288n83730p95727o86517l57224J74735Q71132J300152R71503
40223B082851J40914l21138m0707M36006M98598J65344k76835o90910q59246m57277
40213F77600L50676Q14638N05250j21425m19403l69946l26949l47448j91199K51633
40203H23427Q02347J088255P76737M5554k97855K56311R76525O85140m72355j044419
40193C639667l34076N86802M56342m94878j125818r19579k26078M52616P63426
40184B798424N47301Q9984j14289j32411m62702r20934o57566K79793N81019l85484
40174A623135j430058j308573n09469j06742P1123O55377J058176L49533p58080
$$ plain form
40241 1223624 1072720 787110 473055 330823 458943 739790 1012940 1239705 1363815
40232 1363815 1188527 604797 -190930 -877447 -1234671 -1059936 -188804 1111348 2082851
40223 2082851 2223765 1902627 1861920 2297926 2796524 2961868 2685033 1994123 1134877 677600
40213 677600 1028276 1842914 2348164 2226739 1807336 1437390 1110441 762993 571794 823427
40203 823427 1625774 2714029 3490766 3536320 3238465 3494776 4471301 5156441 4684086 3639667
40193 3639667 3305591 3892393 4348735 3853857 2728039 1808460 1582382 2034998 2798424
40184 2798424 3345725 3435709 3321420 3189009 2726307 1805373 1147807 1427600 2008619 1623135
40174 1623135 193077 -1115496 -1624965 -1731707 -1660584 -1005207 52969 402502 -355578
40165c55578o68444N44333J127595K93872p63869q08519p5142N72831P83919N74664
40155A225662Q0567j78638K82864R73263Q45060j25868p89343m95004J22228L42667
40145B283458K98678K96558J98200l791J52104Q33295J490116J569519J024328
40136H142465l4215j367900k179619j681777l64627L50955K8083l44557j49916
40127B398892m5461m95760p95006m16795m8492k48531l04093L47740P29855j33522
40117I88827j239325r22459M59624J028125L31826j15324N48053J183925O28956
40108B892228m19795n38169K76926O85159p5565j203705j381831l78442O63468
40099E20274N54661n08519j192055p21606K38170O87005N93444M87122L69819
$$ plain form
40165 -355578 -1024022 -479689 647906 941778 177909 -630610 -705752 -132921 650998 1225662
40155 1225662 1306229 1127591 1410455 2383718 3228778 3102910 2313567 1818563 1940791 2283458
40145 2283458 2582136 2878694 3076894 3073103 3225207 4058502 5548618 7118137 8142465
40136 8142465 8108250 6740350 4560731 2878954 2514327 2865282 2893365 2548808 2398892
40127 2398892 2353431 1857671 1062665 645870 597378 348847 44754 392494 1122349 988827
40117 988827 -250498 -1172957 -713333 314792 646618 531294 1079347 2263272 2892228
40108 2892228 2472433 1934264 2211190 2896349 2820784 1617079 235248 -143194 520274
40099 520274 1074935 566416 -625639 -1347245 -1109075 -422070 171374 658496 1028315
40090A028315o6594n32839m58847k5467J02387n7905M9843K84606p7087q51366
40080f04954q78408J03610P76059J90702o98079m78823N73003J005433L66535
40071C55078l66853m09023q4144L2083l0721K2289J95296L32631L84526L09701
40061G40863O4385j72087j30258R2550J38157N7541L26962R37877J072743K12340
40051C341073q90731j053590k58616L72123K20397j7751M94237J418285J720185
40042E345612J117974L75119J90693L77904L08822k36087r12890j268691j112908
40033D185548n58767R1540N03961M75146K5977n90954r70071q06847k30703K32113
40023B356943K20107n6390k01751k58431n39349r10663p88987k3692P07930P22668
$$ plain form
40090 1028315 961721 428882 -29965 -55432 46955 -10950 38893 323499 246412 -604954
40080 -604954 -1483362 -1379752 -603693 -412991 -1111070 -1589893 -1016890 -11457 355078
40071 355078 -11775 -420798 -504942 -472859 -503580 -481291 -285995 46636 431162 740863
40061 740863 805248 633161 502903 595453 733610 791151 1118113 2055990 3128733 3341073
40051 3341073 2450342 1396752 1138136 1510259 1730656 1712905 2207142 3625427 5345612
40042 5345612 6463586 6838705 7029398 7407302 7716124 7480037 6567147 5298456 4185548
40033 4185548 3626781 3718321 4222282 4697428 4723405 4132451 3162380 2355533 2124830 2356943
40023 2356943 2577050 2520660 2318909 2060478 1521129 610466 -178521 -202213 505717 1228385
40013A228385J99133j62923j00150M0919j9675r7916Q1775M15747N04972J31501
40003B221768m41212o85381l82821O6197Q7556l09607m97638p4507N50933O71777
39993A207065J74217l83172m74974j30643J94750Q4116m24220p50357l03027P01767
39983a04478J232710O27325m48981p55905r2590M84564J86718m30295l47902M30237
39973G81403R06919M55947m44422r38866p83280l62369l5759J99788M84904P76578
39963A040843P88487K34324p40703j374131q89622M69123J370399Q43917m33956
39954A308681r30944k29532N83164N97852K17972J60121K35238n1471l83931j70936
39944A336214K30247j8141p26796q45434j86313K30170j66622o55804n20540j07355
$$ plain form
40013 1228385 1427518 1264595 1164445 1205364 1185689 1087773 1169548 1585295 2090267 2221768
40003 2221768 1780556 1095175 712354 778551 866107 556500 58862 -15645 535288 1207065
39993 1207065 1381282 998110 523136 392493 587243 671359 247139 -503218 -806245 -104478
39983 -104478 1128232 1755557 1306576 550671 458081 942645 1129363 699068 351166 781403
39973 781403 1688322 2144269 1699847 760981 -22299 -384668 -420427 -220639 264265 1040843
39963 1040843 1829330 2063654 1322951 -51180 -940802 -471679 898720 1742637 1308681
39954 1308681 377737 148205 731369 1329221 1547193 1707314 1942552 1891081 1507150 1336214
39944 1336214 1566461 1548320 821524 -23910 -210223 19947 -146675 -802479 -1323019 -1430374
39934a430374N1771J83007N30016N54727j32819p34359k60174Q69715J322953
39925I54463P18184n5274k81587j68211r0823k3650N7035l2070k15121j08106
39915G54840L11146N22449K06012k88017m55765k58001r505O6079Q527L2861K98949
39904A189575O12982N04225j33584o97376n70663L5893M11682L30367J66948J77894
39894B027943K56181L21973L81775K81718l2437j64470J83366N32430L00480o4846
39884D024113L63514J405427J909987J551257J211215J350788J437552J451587
39876A4705440K354720M241114N725060O432459Q255876J1964649J3974386R606368
39868G7260072m45492r743611j3013956j1145086q312479o553100n165793l709038
$$ plain form
39934 -1430374 -1378603 -1195596 -665580 -110853 -243672 -978031 -1238205 -368490 954463
39925 954463 1672647 1617373 1335786 1167575 1076752 1053102 1110137 1078067 862946 754840
39915 754840 1065986 1588435 1794447 1506430 1050665 792664 783159 849238 857765 890626 1189575
39904 1189575 1802557 2306782 2173198 1475822 905159 941052 1352734 1683101 1850049 2027943
39894 2027943 2284124 2606097 2987872 3269590 3237153 3072683 3256049 3788479 4088959 4024113
39884 4024113 4387627 5793054 7703041 9254298 10465513 11816301 13253853 14705440
39876 14705440 17060160 21301274 27026334 33458793 41714669 53679318 67653704 77260072
39868 77260072 76814580 67070969 54057013 42911927 34599448 28046348 22880555 19171517
39860A9171517k843173k589742k061030j172659q74024j309771j330914m19226
39852F570978L07379j66227j154838j377809p74573j94075M8057K36398L61528
39843C856818K18777R0097L33155N42895J18004n65388o27242j68553p8141l94355
39833C326067k24220N00657O56970j48937p33478k67299K68193k73746j203152
39824A901055j072309k143O14689L27401O494J23232J31396k44967m21381o8458
39814A295009K38478o766m24145l96843O7111N27294O86203M82513L7083k93476
39804B212461k01481J30724K52702P8115j49748l77425o25484n28569K12146R86048
39794A989489Q06115k06056p99135l07960N00751O58667K29516j67761l40175
$$ plain form
39860 19171517 16328344 13738602 11677572 10504913 9630889 8321118 6990204 6570978
39852 6570978 6878357 6712130 5557292 4179483 3404910 3210835 3258892 3495290 3856818
39843 3856818 4075595 4165692 4498847 5041742 5159746 4594358 3967116 3798563 3720422 3326067
39833 3326067 3101847 3602504 4259474 4110537 3377059 3109760 3377953 3104207 1901055
39824 1901055 828746 826603 1441292 1768693 1775187 1898419 2029815 1784848 1363467 1295009
39814 1295009 1533487 1526721 1102576 705733 772844 1300138 1986341 2468854 2505937 2212461
39804 2212461 2010980 2141704 2394406 2472521 2322773 1945348 1319864 791295 1003441 1989489
39794 1989489 2795604 2589548 1790413 1482453 1983204 2641871 2871387 2703626 2363451
39785B363451m55275n22863m60027l16106j03000K39274N22950M15972J6914j83547
39775A517743l1002J73804L50927P27461J120007R32944J40242m82830m15581
39766D033715J1836L33523N35746O71823O21543M90528N52300O52717M54593L11005
39756H669329R04117J930546K281602J706791J112945J047012J194635J544976
39748B0391953K561814L998694N174493O545900R122950J2468594J5890788K1232900
39740I7388086K9953850L6250061K8975745N149022k2306574l6265056l3166251
39733A05978883k3734399j7648680j4486259j0379002o070032m366704m513419
39726B4780388l833535k373973j980097k466629k152634j079353p08093j171827
$$ plain form
39785 2363451 1908176 1385313 925286 609180 506180 745454 1268404 1684376 1701290 1517743
39775 1517743 1486741 1660545 2011472 2738933 3858940 4791884 4932126 4449296 4033715
39766 4033715 4045551 4379074 4914820 5586643 6208186 6698714 7251014 7903731 8358324 8669329
39756 8669329 9573446 11503992 13785594 15492385 16605330 17652342 18846977 20391953
39748 20391953 22953767 26952461 32126954 38672854 47795804 60264398 76155186 97388086
39740 97388086 127341936 163591997 192567742 197716764 175410190 139145134 105978883
39733 105978883 82244484 64595804 50109545 39730543 33660511 29293807 24780388
39726 24780388 20946853 18572880 16592783 14126154 11973520 10894167 10186074 9014247
39718I014247j373699j182088j245341j224064l92694N19377K39556o88074o00379
39709C066841M30455O02698o26201j590697r56019M65039J109349O23469k20780
39700B904154o42174l45624M26566R79956P85860J11750l98907n96698o96928
39691B527955n84495l4948N87266O80231L06697k0304k27654n35667o99599l59623
39681A639859O2179j35507o47639m85414M07808R81212O49711m0254n20058q67144
39671A044753j026533m86576O70324J330765P19018m56875r55109n95667j80985
39662F3115j72865k25357J5712L13536K78569K6880K1735L14331L53746j66113
39652H23289o09236j70194P73383R69844J68725l46489K95280J117069Q25818
$$ plain form
39718 9014247 7640548 6458460 5213119 3989055 3596361 4115738 4355294 3667220 3066841
39709 3066841 3497296 4099994 3473793 1883096 927077 1392116 2501465 3124934 2904154
39700 2904154 2261980 1916356 2342922 3322878 4108738 4220488 3821581 3224883 2527955
39691 2527955 1943460 1908512 2495778 3176009 3482706 3462402 3234748 2699081 1999482 1639859
39681 1639859 1702038 1566531 918892 433478 841286 1822498 2472209 2431955 1911897 1044753
39671 1044753 18220 -468356 201968 1532733 2251751 1794876 839767 244100 63115
39662 63115 -109750 -335107 -319395 -5859 272710 299590 321325 635656 989402 823289
39652 823289 214053 43859 817242 1787086 1955811 1609322 1904602 3021671 3847489
39643C847489j00585k34922M62126P21452J86645j06350L51452P33888M74820
39634F336015K29406N25530P20851K30360k10078M52373J986717L209379L415499
39625A6896052K676955J200705p29948k434395l231198l109549k572403k008874
39617F687345j561930j268374r30049k18392O84078R75365K55721p51014j053160
39608B819590o25890k15647k06453l09988k27086k9529R7418P1626j00071k60513
39598A013457j33539L29346P77293Q35796M68504j42124p41017r22322m04877
39589A080517L98804O56302K53172J4685M04796P65505M52323o3699q6284K0959
39579C897080m55370j094305q62826Q7334M92171o4843n56843k22128L18030K39488
$$ plain form
39643 3847489 3746904 3511982 3974108 4695560 4882205 4775855 5127307 5861195 6336015
39634 6336015 6565421 7090951 7811802 8042162 7832084 8284457 10271174 13480553 16896052
39625 16896052 19573007 20773712 20043764 17609369 14378171 11268622 8696219 6687345
39617 6687345 5125415 3857041 2926992 2708600 3392678 4368043 4623764 3872750 2819590
39608 2819590 2193700 1978053 1771600 1461612 1234526 1204997 1302415 1374041 1273970 1013457
39598 1013457 879918 1209264 1986557 2822353 3290857 3148733 2407716 1485394 1080517
39589 1080517 1479321 2135623 2388795 2403480 2808276 3573781 4026104 3962405 3876121 3897080
39579 3897080 3441710 2347405 1484579 1571913 2064084 1999241 1442398 1220270 1538300 1777788
39569A777788j83887k42425k9587j46144n77642o95080k47721K94773M20634J56850
39559E27559r3649j8792L54640P27140Q08945N74557K12771j10582l08270k95544
39549B378775r9562L8851l4168p6113J93257N22688M07498r3356l98797l32699
39539B506374l54096o53061p21116k44080K12762K1249m70682m19189K49399P39463
39529H67023M84050k25126p06273n36442K37560J108845J367579P81291L87j38008
39519C240886L21461N55540J37798m40995n73251l33549j99668l64124o17906
39510A726192o51706k75969L72292P12834K30632o90267r53203j48027P50357
39501A073135O47862j55305m86526m6179L14238M3469l77125m23883l14166k95783
$$ plain form
39569 1777788 1593901 1351476 1321889 1175745 598103 -96977 -344698 -49925 370709 527559
39559 527559 433910 415118 769758 1496898 2305843 2880400 3093171 2982589 2674319 2378775
39549 2378775 2279213 2318064 2283896 2207783 2401040 2923728 3331226 3237870 2839073 2506374
39539 2506374 2152278 1499217 778101 534021 746783 768032 297350 -121839 127560 867023
39529 867023 1351073 1125947 419674 -116768 120792 1229637 2597216 3378507 3378894 3240886
39519 3240886 3562347 4117887 4255685 3814690 3241439 2907890 2708222 2344098 1726192
39510 1726192 1074486 798517 1170809 1883643 2114275 1424008 470805 322778 1073135
39501 1073135 1720997 1565692 1079166 1032987 1347225 1390694 1013569 589686 275520 -20263
39491b0263j2915O75942R75225K43036o82365m38343P34106J107618l5049j249362
39481A297630r28831N14764J379335R32021o1276o88247p19803j89697Q02908
39472B338804J646739J454325J83813j076978j360873q59390l35813n2176J68177
39463B106628K60935K5534l01782k91903p5526j47191l79363j8652J053813J817286
39453D049779J418992M01625r5492M8487n645n63518r54527p23067l04610j15057
39443C156967J50992O90670Q65117J89013n59803l01417O49335J051188P33769
39434F625831P58716J447076J739587J114318P35819J693510L245566M063115
39426B1423538M332340N237180P066792R341188J2070842J4799536J4703936Q435693
$$ plain form
39491 -20263 -33178 642764 1617989 1861025 1178660 740317 1474423 2582041 2546992 1297630
39481 1297630 368799 883563 2262898 3194919 3133643 2445396 1725593 1535896 2338804
39472 2338804 3985543 5439868 5623681 4546703 3185830 2326440 1990627 1938451 2106628
39463 2106628 2367563 2393097 2091315 1799412 1723886 1576695 1197332 1178680 2232493 4049779
39453 4049779 5468771 5870396 5774904 5823391 5817746 5254228 4299701 3576634 3272024 3156967
39443 3156967 3307959 3998629 4863746 5052759 4492956 4191539 4840874 5892062 6625831
39434 6625831 7384547 8831623 10571210 11685528 12421347 14114857 17360423 21423538
39426 21423538 25755878 30993058 38059850 47401038 59471880 74271416 88975352 97411045
39418I7411045l020050j3450383j7177263j4581882j0414932p852439o310196
39411B4603900m464086k769875k218190k423544k251800j492019q59203p83223
39403G341960j007442j153454j063276o95640j30182L75188N86701M59760O460
39394D720075p11435j306477j199503l71120L66932K93425k68218l97630J66932
39385A292981P43366O69529M9600n84661r07131q43712l51560M53564J106564
39376A628540J138858O56115K55063K41678K26149k40253q57594q74287k00895
39367A973374L06567k1925o91292p18412l6494M52020K25373j76392j04181J99078
39357A407716Q9299l83747n28950o1499M86437N16418J17169j32242J02063N46539
$$ plain form
39418 97411045 94390995 80940612 63763349 49181467 38766535 30914096 24603900
39411 24603900 20139814 17369939 15151749 12728205 10476405 8984386 8125183 7341960
39403 7341960 6334518 5181064 4117788 3422148 3291966 3667154 4253855 4713615 4720075
39394 4720075 4008640 2702163 1502660 1131540 1498472 1791897 1523679 1126049 1292981
39385 1292981 2036347 2705876 2755476 2170815 1263684 419972 68412 521976 1628540
39376 1628540 2767398 3423513 3678576 3920254 4146403 3906150 3048556 2174269 1973374
39367 1973374 2279941 2258016 1566724 848312 811818 1263838 1489211 1312819 1208638 1407716
39357 1407716 1497015 1113268 584318 522819 1009256 1525674 1642843 1510601 1612664 2159203
39347B159203O48386K15340l15825l81310l3175J43799l8342q855O17253J228457
39337D234931J054385N11506P57853J841300K296271J064390r73433k089021j805592
39328F892590j111786q77317r28769p46045l28816n0022o5316j75103j03183K14345
39318B720578N05349L78414j46578m92629k69143K5594l68397j196117j320547
39309a63476l68190N87018N43595K3053J07075N72912K33919r45171j446606l95774
39299a251645J015173J189424L60567J9628N87817R60084L51612o18172j025348
39290A589140q37024n15834k40018q5039k89231p13492o50151J51703Q43066O10286
39280a36594r7623l47850j88352k45260l02140L39617J222246J000935l69063
$$ plain form
39347 2159203 2807589 3022929 2707104 2325794 2292619 2436418 2398076 2389221 3006474 4234931
39337 4234931 5289316 5800822 6558675 8399975 10696246 11760636 10787203 8698182 6892590
39328 6892590 5780804 4903487 3974718 3228673 2899857 2849835 2784519 2609416 2506233 2720578
39318 2720578 3225927 3604341 3457763 2965134 2695991 2721585 2353188 1157071 -163476
39309 -163476 -531666 55352 598947 622000 729075 1301987 1535906 590735 -855871 -1251645
39299 -1251645 -236472 952952 1313519 1333147 1920964 2881048 3232660 2614488 1589140
39290 1589140 752116 236282 -3736 -88775 -378006 -1091498 -1741649 -1589946 -746880 -136594
39280 -136594 -234217 -582067 -770419 -1015679 -1317819 -978202 244044 1244979 875916
39271H75916j200914m42668Q43652J168559N82335r504l82685o51311l43072P58057
39261A198365J520577P47284q48682j472983q15924j95066j93883P5183R85387
39252A000258J396523M84704p72920r72736j91409M61699M69155J61096j10060
39243A926310k41409k21039k60085o07181q55575k21300R98164J283365L5206
39234A836456j211306q76067L36257O72175J04001N0044P31074Q35321o3581p22230
39224A692144l94076m437l48592p13883l60787J8222l92271r05232m67901M32813
39214a444000N48123l2328j59744L10584L82916j54308k94025L52397P61504J80688
39204D51807o30421o56942j32982J31571J44932M23880Q04265O29181p0057n21025
$$ plain form
39271 875916 -324998 -767666 75986 1244545 1826880 1817376 1434691 783380 440308 1198365
39261 1198365 2718942 3466226 2617544 1144561 328637 133571 -60312 14871 1000258
39252 1000258 2396781 2881485 2108565 1135829 944420 1406119 1875274 2036370 1926310
39243 1926310 1684901 1463862 1203777 596596 -258979 -480279 517885 1801250 1836456
39234 1836456 625150 -250917 85340 757515 861516 911560 1642634 2477955 2414374 1692144
39224 1692144 1298068 1293631 945039 231156 -129631 -111409 -503680 -1408912 -1876813 -1444000
39214 -1444000 -895877 -928205 -1087949 -777365 -394449 -548757 -842782 -490385 271119 451807
39204 451807 -178614 -835556 -968538 -836967 -692035 -268155 536110 1165291 1095234 574209
39194E74209l44338K3197J27088P3712J47329L46140M84848M23845J07359l40895
39184A622494n70885l78891p3765r1831l20618k85381J8634P1578k67420m12176
39174f88261P1186P22374P64204J36607m60971m39734O4406M19071K12761k36297
39164E65346j91026N06283J016319N72827k88068l97883K18526L18531m74644
39155A846211q82414n6594Q15599L03349q61695q89184J32416M06013n02662q97662
39145e86623J38405J079601M28023p74369n92348P12516J163684K03975n71019
39136A201845Q632J029868J050060Q3759p91181r82163o65238o0119O71334J029414
39126B576211N38499m22804q48203m05317N6681k91819j002866r34026Q9175R62568
$$ plain form
39194 574209 229871 253068 380156 453868 601197 947337 1432185 1856030 1963389 1622494
39184 1622494 1051609 672718 598953 507122 186504 -98877 -80243 -8665 -276085 -688261
39174 -688261 -617075 105299 869503 1006110 545139 105405 169811 588882 801643 565346
39164 565346 374320 880603 1896922 2469749 2181681 1783798 2002324 2320855 1846211
39155 1846211 963797 907203 1722802 2026151 1164456 275272 407688 813701 311039 -586623
39145 -586623 -448218 631383 1059406 285037 -307311 405205 1568889 1772864 1201845
39136 1201845 1210477 2240345 3290405 3374164 2582983 1600820 935582 875463 1546797 2576211
39126 2576211 3114710 2691906 1843703 1438386 1495067 1203248 200382 -733644 -644469 318099
39116C18099Q25612J61226r9395M3155p2676m83679n16905K3628M59618K60090
39106I18773k40076m38980k05858K47990O77400P31050J70537n55885o08055L5853
39096G32749L81177j10274o27468k77444M63645M92311j96640n52271q2832N01717
39086G24670L65619m00222r75200o98045K66678R73592O32215l54515p65047k00450
39076d30705L79916K12448r5384K42252P16963M09567l59646o33294n45912r02967
39066a006762j355165p48061O78274J253023M33916l20858Q6376P85268O52238
39057D58249J64186K63849N33523j210r74621j114682k68135L82844J32709l73400
39047g96688k97691K58269O45713N95029L48523J65184L0747j57788k81295n6512
$$ plain form
39116 318099 1143711 1304937 1205542 1248697 1176021 692342 175437 199065 658683 918773
39106 918773 678697 239717 33859 281849 959249 1690299 1860836 1304951 696896 732749
39096 732749 1113926 1003652 376184 98740 562385 1054696 858056 305785 222953 724670
39086 724670 1090289 690067 -285133 -983178 -716500 257092 889307 534792 -230255 -430705
39076 -430705 -50789 161659 66275 308527 1025490 1435057 1075411 442117 -103795 -1006762
39066 -1006762 -2361927 -3109988 -2431714 -1178691 -744775 -1065633 -979257 -193989 458249
39057 458249 622435 886284 1419807 1418597 443976 -670706 -938841 -555997 -423288 -796688
39047 -796688 -1094379 -836110 -190397 404632 753155 918339 949086 791298 510003 453491
39037D53491M78227P49087K77509n88754j033633q09973m02716j96448r9309j5234
39027a187753m029R6767M73376P00462J89335n95246m34284P68268J529103Q21162
39017B357161m78008r61243n72223j79261p6309L6049J55139R2684Q2693L83598
39007H40280O53350N06733K42752K32740J16126n13611j145717j042014m32558
38998e41919n0367O2287K60051L08333j33492m75457M1824Q49288P29049j42890
38988I06707l31625N78170J329644R76195J53916j67055j7860J32043K82835N46682
38978D389652O42226L73517J6336k22602n06141p65087n44644R1462K73658m51290
38968C297087j280227j229185n01946j7429K9048K56428Q50000J076610L55069
$$ plain form
39037 453491 931718 1680805 1958314 1369560 335927 -474046 -876762 -1073210 -1172519 -1187753
39027 -1187753 -1191782 -1095015 -621639 78823 268158 -327088 -761372 6896 1535999 2357161
39017 2357161 1879153 917910 345687 166426 90117 126166 281305 373989 456682 840280
39007 840280 1493630 2000363 2243115 2475855 2591981 2078370 932653 -109361 -541919
38998 -541919 -592286 -529999 -269948 38385 -95107 -570564 -528740 320548 1049597 906707
38988 906707 575082 1153252 2482896 3459091 3613007 3445952 3428092 3560135 3842970 4389652
38978 4389652 5031878 5405395 5421731 5199129 4692988 3927901 3383257 3474719 3748377 3297087
38968 3297087 2016860 787675 285729 268300 297348 553776 1403776 2480386 2835455
38959B835455p26378j001121k34697M91348J90694o62558q26008j36665L09737
38950B39807l39j48806N53173J193254O94364k65940k42905O15595Q25360j9782
38940C443781p45516o06575k06224q7177R1239M67242M57138n2563k57306J39285
38930B643324K62063l90418q95010l56038N69104O69453j566l55978J24565Q98306
38920C167805J202745P47647j77904q73622q18998l21276j07500j86671J41569
38911B773795R86278J487778J082670K81388j88274j98186J01999N56813P61550
38902G645811N02357M85117J433253K514578K259959J091396R38612K035716K438043
38893B1344842J414034P55181J612699K742299L381728M970135Q031170J0416029
$$ plain form
38959 2835455 2109077 1107956 873259 1364607 1555301 892743 66735 -69930 239807
38950 239807 239468 90662 643835 1837089 2531453 2265513 2022608 2638203 3463563 3443781
38940 3443781 2698265 2091690 1885466 1798289 1889528 2356770 2813908 2761345 2504039 2643324
38930 2643324 2905387 2514969 1619959 1263921 1833025 2502478 2500912 2144934 2269499 3167805
38920 3167805 4370550 5118197 4940293 4066671 3247673 2926397 2818897 2632226 2773795
38911 2773795 3760073 5247851 6330521 6611909 6423635 6225449 6327448 6884261 7645811
38902 7645811 8148168 8633285 10066538 12581116 14841075 15932471 16871083 18906799 21344842
38893 21344842 22758876 23514057 25126756 27869055 31250783 36220918 44252088 54668117
38885E4668117J1200138J3158533J8322981K4742770L1613007M2686227N7130409
38878B53522182O0564322L6659485r881199n1597608o5207985n3948470l7856044
38871A32254683k8742234k3258461j6302121r994505p724075p678188o465279
38864C2089820m376644l348378k946074j749466n14501q81434k289142k773136
38856A3211045j989264j262363j177837j041866n00982r8768k06592n68846r09484
38847E455043j104338q82847j75911M08953K39068l87140o65437m51981k37806
38838B197604j86051p1555l6548m18244q00337l04535Q94425J394755M69812p60840
38828B378486q47883J4034N01310J67288k20520k15510l38419q78254j110373
$$ plain form
38885 54668117 65868255 79026788 97349769 122092539 153705546 196391773 253522182
38878 253522182 314086504 350745989 340864790 289267182 224059197 170110727 132254683
38871 132254683 103512449 80253988 63951867 53957362 46233287 38555099 32089820
38864 32089820 27713176 24364798 21418724 19669258 19154757 18273323 15984181 13211045
38856 13211045 11221781 9959418 8781581 7739715 7238733 7139965 6933373 6364527 5455043
38847 5455043 4350705 3467858 3291947 3700900 3939968 3552828 2887391 2435410 2197604
38838 2197604 2011553 1939998 1903450 1485206 684869 380334 1274759 2669514 3139326 2378486
38828 2378486 1530603 1544637 2045947 2213235 1992715 1777205 1438786 560532 -549841
38819e49841l83216P16236J046427L74747n02959q30520m80633K62427Q61711
38810E14379O67601l89279j332712j101986K4558P44072N47493L13643P52458
38801G40227J203217P15460l66461q58881m39822R3643K16483L35624P74635R63328
38791C377453K77333q22081j244057p10052l4105J17862P0515L80304P94452O39167
38781B846791J8351j60720M98036J225813J139960M27752n8953m7712m9683m42503
38771E397132r66816j217083j150283r45469p09369m90644l42419k37893q7612
38762g50456R9064J99184J17681j44525m42137m15294K29057J119784J298798
38753A311156L67958p79141j004022m38229j48908m19258l74248M50738J162410
$$ plain form
38819 -549841 -933057 -216821 829606 1204353 701394 -129126 -609759 -347332 514379
38810 514379 1181980 792701 -540011 -1641997 -1617439 -873367 -325874 -12231 740227
38801 740227 1943444 2658904 2292443 1433562 993740 1087383 1303866 1639490 2414125 3377453
38791 3377453 3654786 2832705 1588648 878596 844491 962353 1032868 1413172 2207624 2846791
38781 2846791 2865142 2704422 3202458 4428271 5568231 5995983 5937030 5889318 5839635 5397132
38771 5397132 4430316 3213233 2062950 1117481 408112 -82532 -424951 -662844 -750456
38762 -750456 -651392 -452208 -334527 -479052 -921189 -1336483 -1107426 12358 1311156
38753 1311156 1679114 899973 -104049 -542278 -691186 -1110444 -1484692 -1033954 128456
38744A28456P40016m72403j230776r61033j89433L80984N71839N13236K81953
38735b37161k2180j34833J35066N28942M37852l74930j222564j090758M2693R65628
38725i72245P16531j49971m06901J24642N43373L53483J3393l7255M2258P4538
38715C01846J66621K16835l5978k78022J00602P24765L67482j103748k065251
38706a604848j251492M55567J327534J024001M15743q9223p06310j157239p64582
38697b350849L17345J044609Q04258K8443n22006m15884L72856J317506J442310
38688B038588L78224q50022r53882j25101L38289K3911j78475K19771M81070K3410
38678A395783n17281l84276K4275j02510n82155n66543L6353M30694J95332j59251
$$ plain form
38744 128456 868472 396069 -834707 -1795740 -1985173 -1604189 -1032350 -519114 -237161
38735 -237161 -259341 -394174 -259108 269834 707686 332756 -889808 -1980566 -1937873 -972245
38725 -972245 -255714 -405685 -812586 -687944 -144571 208912 222305 185050 227308 301846
38715 301846 468467 685302 649324 371302 471904 1196669 1564151 460403 -1604848
38706 -1604848 -2856340 -2400773 -1073239 -49238 366505 277282 -429028 -1586267 -2350849
38697 -2350849 -2033504 -988895 -184637 -156194 -678200 -1094084 -721228 596278 2038588
38688 2038588 2416812 1566790 612908 487807 826096 850007 671532 891303 1372373 1395783
38678 1395783 878502 494226 518501 415991 -166164 -732707 -696354 -265660 -70328 -229579
38668b29579r1553J81657J69842o4766m8617L25342O48193O42331N02824M02212
38658B437886R9170n34759r40085m75362N09013R40416M62879j53637k77961k46556
38648A821004m52371m64002J50381P94117O22609q5337l81161k02215l53036r80139
38638D69850j211259n58965L03071N64969K91587j0795j56214j54957R1844M88662
38628A17793N87307J92617k25252j36006L24883O04879M54344N1429l70251o61260
38618I40483o64872l33786P0129J35952k55796p34810p65193k23225L94771N06407
38608i29940J71919j4100J72822K58084p8231l43223K4389O51275O86186P0293
38598F69474l70117p5933O19090J033116P93961K305p73356q14659j11515L45942
$$ plain form
38668 -229579 -321132 -139475 30367 -34399 -83016 242326 890519 1532850 2035674 2437886
38658 2437886 2537056 2002297 1062212 586850 1095863 2036279 2499158 2345521 2067560 1821004
38648 1821004 1368633 904631 1055012 1849129 2471738 2386401 2005240 1803025 1449989 469850
38638 469850 -741409 -1300374 -997303 -432334 -140747 -151542 -307756 -462713 -370869 117793
38628 117793 705100 897717 672465 536459 861342 1466221 1920565 1971994 1601743 940483
38618 940483 275611 -58175 11954 147906 -107890 -842700 -1607893 -1831118 -1436347 -929940
38608 -929940 -758021 -772121 -599299 -341215 -419446 -762669 -738280 -87005 599181 669474
38598 669474 299357 223424 842514 1875630 2669591 2671896 1898540 1083881 972366 1318308
38588A318308j75524r08744n50621P22228J392700Q41785J58851L05491P38718
38579C843192O44090M78382J177885K434744K883731J838546m100j553646k344407
38570I398417k510031k282130j760173j015326k77917J00021J7866j68970j21505
38561A380252n7015l66272q07937p07978M023O07043N70151J18965k99287m87399
38551d5454l28142J60131M80998J50250l51635n2089Q75904J065397K270j052366
38541I05264r19811j67549O0990j31299J8074L10259L223n79438l55437O60332
38531a95392J187471N90595k34130l07008Q6143R9282l14054m58345j0837N32117
38521I75842N47921O9249l17116k58158o0176j52659l69794k11272K66967M25530
$$ plain form
38588 1318308 1142784 234040 -316581 405647 1798347 2640132 2798983 3104474 3843192
38579 3843192 4487282 4965664 6143549 8578293 11462024 13300570 13296470 11742824 9398417
38570 9398417 6888386 4606256 2846083 1830757 1552840 1652861 1670727 1501757 1380252
38561 1380252 1323237 956965 149028 -558950 -554927 52116 622267 741232 441945 -45454
38551 -45454 -373596 -213465 267533 417783 66148 14059 889963 1955360 1957630 905264
38541 905264 -14547 -182096 -121106 -252405 -234331 75928 79151 -500287 -855724 -195392
38531 -195392 992079 1582674 1348544 1041536 1127679 1226961 912907 454562 443725 975842
38521 975842 1523763 1593012 1275896 1017738 957562 804903 435109 223837 490804 916334
38511I16334K1952m05545l89792j62153q3830m7963J08901J39703j66227n02348
38501e70968m60872n5738M69990Q81823P96301j5573r10550q55303j6154K06731
38491e30313o63246j212595k82627J116746J331593M84468j35513k61122n24141
38482f76750p58211k78941M50162L00570m47315l64204O79155J183803M90071
38473E78340k49326j49496R1023k14088m16467J18121O58795L19240l89380m27573
38463h0811J02121L16282N3774o1485K35600N35864M49078O172m84602o23868
38453D48125k50837J94662J16456k69392j32925N44860O91189j78696r87370o49031
38443d72959K44995L74722k70688n27744K5291N09816K30462k92867j86504N18506
$$ plain form
38511 916334 938286 532741 142949 -19204 -103034 -150997 -42096 97607 -68620 -570968
38501 -570968 -1031840 -1087578 -617588 264235 1060536 1044963 134413 -720890 -737044 -530313
38491 -530313 -1193559 -2406154 -2688781 -1572035 -240442 244026 108513 -152609 -676750
38482 -676750 -1434961 -1713902 -1263740 -963170 -1410485 -1774689 -1095534 88269 578340
38473 578340 329014 179518 270541 56453 -360014 -241893 416902 736142 346762 -80811
38463 -80811 21310 337592 391366 329881 565481 1101345 1550423 1556595 1071993 448125
38453 448125 197288 391950 508406 239014 106089 650949 1342138 1163442 176072 -472959
38443 -472959 -227964 146758 -123930 -651674 -626383 -116567 113895 -178972 -365476 153030
38433A53030R65513N54491l92058j027143q92076l13475J36165L38273N15289
38424C8009O47884N05015J51651j50694m82389j017735j287927n93198P05642
38415a483742J306206P31358k1546r9476k733m08744p93557l22908N86997Q18512
38405C10367K88377k7169L18108O55498K96277n56479j128178q30794K48449J242187
38395H16643J155334O1441p58453m26010L04945K05304n61391p98631k11258K56313
38385D4237N5060k10672K85K70189J27393j5661L96117R34947O65055m30673j253527
38374E82750r59012p30N15718K31495j70123n7269K92946K82554Q923L0887L07248
38363A065387K02743l60052o35401k61789J24429j1895k16997N4278M04647K11331
$$ plain form
38433 153030 1118543 1673034 1280976 253833 -638243 -951718 -815553 -477280 38009
38424 38009 685893 1190908 1342559 1191865 709476 -308259 -1596186 -2189384 -1483742
38415 -1483742 -177536 553822 532276 432800 430067 21323 -772234 -1095142 -508145 310367
38405 310367 598744 571575 889683 1545181 1841458 1284979 156801 -673993 -425544 816643
38395 816643 1971977 2033418 1274965 848955 1153900 1359204 797813 -818 -212076 44237
38385 44237 99297 -111375 -111090 159099 286492 270831 666948 1601895 2266950 1836277 582750
38374 582750 -376262 -376992 138726 370221 200098 142829 435775 718329 727252 758139 1065387
38363 1065387 1268130 908078 272677 10888 135317 123422 -93575 -39297 365350 576681
38353E76681k46427l34276k31879n00636q48508m73557N02781J059150P58443
38344B61772K01266r3781k90240n21823m82927m4665M27549O33505O21970L91151
38334A103777j44105o76414o87891k53592O706r6654j05018J83310L37237O4043
38324b68601l16710m10883j62345L94869J112582J376815O20244o33761j139938
38315E72272o06073m1955r9097j59542L40949Q00811N47320Q7512J84393M34576
38305B061166j4287q48305j001790m35744j70602n14610n64371J72796Q17524
38296d98223M52148m25359o19821O4898O96345O14079J65069q5201j98017n00848
38286c34930q07772o03661Q1670N82713N37772L74150N17393O31352K24752l58612
$$ plain form
38353 576681 330254 -4022 -235901 -736537 -1585045 -2058602 -1555821 -496671 261772
38344 261772 463038 369257 79017 -442806 -925733 -970398 -542849 90656 712626 1103777
38334 1103777 959672 283258 -404633 -658225 -651519 -748173 -853191 -669881 -332644 -268601
38324 -268601 -585311 -996194 -1158539 -763670 348912 1725727 2345971 1712210 572272
38315 572272 -33801 -75756 -174853 -334395 6554 807365 1354685 1442197 1626590 2061166
38305 2061166 2046879 1198574 196784 -238960 -409562 -924172 -1488543 -1315747 -498223
38296 -498223 -46075 -471434 -1091255 -1026357 -330012 284067 449136 363935 165918 -334930
38286 -334930 -1142702 -1746363 -1664693 -1081980 -544208 -170058 347335 978687 1203439 844827
38276H44827l37105K35424M24119k17230r78063r98413l34860L42963O21681N38463
38266A41806L11023J96838K76964J95350m17227j104704q61011L92548J344485
38257D76072R16554k76900q42118m74993m2357j10119l31940k64852J7678K41401
38247f91574K70570O8674k08523j53166L49356O70195J76915p01405r20066l16676
38237a455700J82243k1093m52700n21764l31962r1099M19477J132990J246218
38228A06610L51200n94183m41440M28448O90607J36448j52470K45644L75647l60732
38218G85779j056541p67155o3842M220l36001j99247J96686m7003o24671l17308
38208b425083P38940R42143q2166n81225M75752J455821O09725r16429p78929
$$ plain form
38276 844827 507722 743146 1167265 950035 -28028 -1026441 -1361301 -1018338 -396657 141806
38266 141806 452829 649667 926631 1121981 704754 -399950 -1260961 -868413 476072
38257 476072 1392626 1115726 273608 -201385 -243742 -353861 -685801 -950653 -932975 -691574
38247 -691574 -421004 -352330 -560853 -714019 -364663 305532 482447 -218958 -1139024 -1455700
38237 -1455700 -1273457 -1294550 -1747250 -2269014 -2600976 -2692075 -2272598 -1139608 106610
38228 106610 457810 -136373 -577813 -149365 541242 677690 525220 770864 1146511 785779
38218 785779 -270762 -1037917 -1101759 -1097539 -1433540 -1632787 -1436101 -1483104 -2107775 -2425083
38208 -2425083 -1686143 -744000 -826166 -1407391 -931639 524182 1133907 217478 -561451
38199e61451P60700J200885k33743j470977r02143M12293P99249L70943J04090
38190D79846l322m03288o76171k00069N48635O90638M26764N90944J120000J171629
38180C745606N23693k48223q17670j296289j508990j105040l68321J3170j3670
38171a075734Q5743L99549M88849L22457L29972M50292J20235n93079q33142k59968
38161e64826L94198M88046L26236L44362K75932j77038n26583j75989N34608P87905
38151A706851N22533L85942N67367N21947l4m16868k19687J43337j08270q46403
38141B256715j115195n07807K09487J98786k99376n26241m68348o57393q92656
38132a802028l20735R55685J538692O89707m09545l36811M76151N80911j53650
$$ plain form
38199 -561451 199249 1400134 1166391 -304586 -1206729 -794436 4813 375756 479846
38190 479846 476524 73236 -602935 -803004 -254369 436269 863033 1453977 2573977 3745606
38180 3745606 4269299 4021076 3203406 1907117 398127 -706913 -1075234 -1062064 -1075734
38171 -1075734 -989991 -590442 -101593 220864 550836 1001128 1121363 528284 -304858 -564826
38161 -564826 -170628 317418 643654 988016 1263948 1086910 560327 384338 918946 1706851
38151 1706851 2229384 2615326 3182693 3704640 3704606 3287738 3068051 3211388 3103118 2256715
38141 2256715 1141520 633713 843200 1041986 742610 216369 -251979 -909372 -1802028
38132 -1802028 -2122763 -1167078 371614 1061321 651776 314965 791116 1372027 1218377
38123A218377n34931j58562M3152m29787p77583l30019L65467N65072M49625M91932
38113I02743N33636K57373j07743k92469n66578j056105j101361j86015R65498
38104f51021J176105M21785k66728l32698j93058k29536k16240Q931P5313k90812
38094d97959o60339l88970M88158J189953J016409J05619o94306p31895k39985
38085d13315O2206o1512k05927j21719m9861n8328K17368P10235N84204m52860
38075B10491j199445m51388R98895J222031o3777j037067m38933P24921Q81604
38066H47332O8770o21705q25153q74375o28489K63719J185664J036913k4155o06364
38056a77843j39670L37992k2438m96847r4737P08060P25229k6529m46067j58819
$$ plain form
38123 1218377 683446 524884 568036 138249 -639334 -969353 -603886 -38814 410811 902743
38113 902743 1436379 1693752 1586009 1293540 726962 -329143 -1430504 -1616519 -651021
38104 -651021 525084 946869 680141 347443 154385 -75151 -291391 -282460 -207147 -497959
38094 -497959 -1158298 -1547268 -1059110 130843 1147252 1252871 558565 -173330 -413315
38085 -413315 -351109 -412621 -618548 -740267 -790128 -848456 -631088 79147 663351 210491
38075 210491 -988954 -1440342 -441447 780584 716807 -320260 -759193 -34272 847332
38066 847332 916102 294397 -530756 -1405131 -2033620 -1769901 -584237 452676 428521 -177843
38056 -177843 -317513 20479 -1959 -498806 -593543 114517 839746 813217 367150 208331
38046B08331O4050k07467l74169j9950K55084r5030m82049o2997Q05296R57649
38036A048748J15007o93898n47001K09621N41848P7431n02827l62204M25531Q84258
38026A196514L19921o81992q76797m022Q09234O06442j05210k69379P6919N0879
38016A122509m53283n51041O8946M82315l1623p61331n55717M83903J140227P10806
38006A655711k21642o72305l56148K32895M72900J62132l86573o55145l98869
37997a67044J16138L78262J49697k84264m01344l1282L65277J96404m17318o20702
37987g16176P0400R56130R55733O1724o37529m24494J98710L52394q0947n09899
37977B26046m43234R1335O71372P82430K54704m36465o11886k53259k2856k67188
$$ plain form
38046 208331 272381 64914 -309255 -329205 -74121 -169151 -651200 -714197 91099 1048748
38036 1048748 1163755 469857 -77144 132477 674325 751756 248929 -113275 312256 1196514
38026 1196514 1516435 834443 -42354 -46376 762858 1369300 1264090 994711 1071630 1122509
38016 1122509 669226 118185 187131 669446 637823 -123508 -679225 -195322 944905 1655711
38006 1655711 1434069 761764 405616 638511 1111411 1273543 886970 231825 -167044
37997 -167044 -50906 327356 477053 192789 -208555 -239837 125440 321844 -95474 -716176
37987 -716176 -645776 310354 1266087 1327811 690282 265788 464498 816892 735945 226046
37977 226046 -217188 -125853 545519 1327949 1582653 1146188 534302 281043 258187 -9001
37967i001n19161k89977J72581L70336L55485M89616P09845O23623J76965l04769
37957A775543o55323r47595j061551o76314J64897Q47608P90897J25889m25349
37948f1298l65020L0384J51062l4465N9558N80122P35362m2464r35527p05495
37938e87781M24086J006160N03110r5214m5928J36601O347J02679O45421O69106
37928B764587l27447j088015m43020O02567L81058o61908p37673K10538M47007
37919A147694n25389j129958m20021M58341L85624K6244L08915O82683K67478
37910A201611m15004l14390L40607N03818P1245j12365K53545N38744K14379n66009
37900A716181j339486j645991j150601n1886Q39964R61177O56621N01383L83738
$$ plain form
37967 -9001 -528162 -818139 -645558 -275222 80263 569879 1279724 1903347 2080312 1775543
37957 1775543 1120220 172625 -888926 -1565240 -1400343 -552735 238162 364051 -61298
37948 -61298 -426318 -395934 -244872 -279337 -219779 360343 1095705 1053241 117714 -587781
37938 -587781 -163695 842465 1345575 1250361 1204433 1341034 1347381 1450060 2095481 2764587
37928 2764587 2437140 1349125 906105 1508672 1889730 1227822 490149 700687 1147694
37919 1147694 622305 -507653 -927674 -469333 -83709 -57465 251450 934133 1201611
37910 1201611 786607 472217 812824 1316642 1387887 1275522 1529067 2067811 2282190 1716181
37900 1716181 376695 -1269296 -2419897 -2471783 -1631819 -670642 -14021 487362 871100
37891H71100r4740o85388p32268j78730L38886L47048q807k82309j56726K68725
37881c13209M22255j22038q03260n34548O60125J353387O70957l98498n29148
37872D06023L7169K73446K03883M82982P61124J79551p95960q30936j2273J42973
37862H47982p47566j199403l27692O86804N60658j62563l25958n8752j22832l06354
37852a155676J12085Q96141J169873Q31764M95257L13041n4338n04720n44812
37843A558615j64202J99936M09060N34121K97871m75484j107825q04618q505Q4390
37833E23359o40953j009694l67501N08366O90491L24399O6566Q5394J54548J41597
37823D76572l9879m49650p76958n36077J34050N08460L83137L91984Q44719J070202
$$ plain form
37891 871100 776360 90972 -641296 -820026 -481140 -134092 -142899 -425208 -581934 -313209
37881 -313209 109046 -12992 -816252 -1350800 -690675 662712 1333669 935171 406023
37872 406023 443192 716638 920521 1403503 2164627 2344178 1548218 717282 705009 847982
37862 847982 100416 -1098987 -1426679 -739875 -179217 -341780 -667738 -726490 -849322 -1155676
37852 -1155676 -1043591 -147450 1022423 1854187 2349444 2662485 2608147 2103427 1558615
37843 1558615 1394413 1594349 2003409 2537530 2835401 2359917 1252092 447474 438969 523359
37833 523359 -117594 -1127288 -1494789 -986423 -295932 28467 95033 180427 334975 476572
37823 476572 436693 -12957 -789915 -1325992 -1191942 -683482 -300345 91639 936358 2006560
37813B006560M92445l74975o97822m72603k04260M679K80149L76524N6447l07523
37803A159621k80419j50907l88837o92883m58082J12997L20355J78231L05156
37794A05232O86263N97104j25978p02895n32069J01054O34553Q14382N33932j43966
37784A967612o64569m53874J65935L36448n223j14284J51285P8170m51178n36728
37774D73594J42139N63966M514p13992n83467K4169K47929K29536M61581N01981
37764A351950k18856r57754n85446M54940P02629j3316m18988N3703N47384M35600
37754A351846K04369K68176K52096l6990j38197L0992j68680q29426j032450l44556
37744d42820L20215J61093j98274J54504Q03776O40174m04169j295672j309485
$$ plain form
37813 2006560 2499005 2124030 1426208 953605 749345 754024 1034173 1410697 1467144 1159621
37803 1159621 879202 728295 339458 -353425 -811507 -698510 -378155 -199924 105232
37794 105232 791495 1388599 1262621 559726 27657 128711 763264 1577646 2111578 1967612
37784 1967612 1303043 849169 1015104 1351552 1346329 1232045 1383330 1461500 1010322 473594
37774 473594 615733 1179699 1184213 470221 -113246 -89077 158852 388388 849969 1351950
37764 1351950 1133094 175340 -410106 44834 747463 734147 315159 368862 916246 1351846
37754 1351846 1556215 1824391 2076487 2039497 1901300 1932292 1763612 934186 -98264 -442820
37744 -442820 -122605 38488 -159786 -5282 798494 1438668 1034499 -261173 -1570658
37735a570658o70446L0133L98998L64000J93464K25337L71805K92383J42281L99046
37725A76343P61865K94634q49999j096432K57870J597333J120355n42847j362050
37716C57072q47426k53887k39906j42387L75776O47847L24464l2559p8892j67529
37706e7427l30908k6949O51979P45982l6331p19235o33694m23157o88375p69955
37696b288070N9527J105049J175521M17862K3755M13030Q04272N10904k39041
37687A982809q15588q56087m10692R7602J58020j91972k76379K52236P53300M79835
37677A173084k82280o66367m86777k55363j83087l0742J68849J22453j6419J66479
37667b90170M22713N5629p72544r54500o8281Q26370O31084l00441q28773n96921
$$ plain form
37735 -1570658 -2241104 -2210971 -1811973 -1447973 -1254509 -1029172 -657367 -364984 -222703 176343
37725 176343 938208 1232842 382843 -713589 -455719 1141614 2261969 1719122 357072
37716 357072 -490354 -744241 -984147 -1126534 -750758 -102911 221553 188994 110102 -57427
37706 -57427 -388335 -415284 236695 982677 946346 227111 -406583 -829740 -1518115 -2288070
37696 -2288070 -2228543 -1123494 52027 469889 493644 906674 1710946 2221850 1982809
37687 1982809 1167221 311134 -99558 -1956 156064 -35908 -312287 -60051 693249 1173084
37677 1173084 890804 224437 -262340 -517703 -700790 -731532 -562683 -440230 -456649 -290170
37667 -290170 132543 188172 -584372 -1538872 -1607153 -780783 -149699 -450140 -1278913 -1875834
37657a875834j37348J76561M31971O06659M96657K31335K05735M08972L77450
37648I22158m9357m18258k98364J60138M96219M64896J45195k07100l10409j33147
37638G71971n9115m21285q45631n80321L56720R69727N99574j40410l02308M9793
37628C98715J85237q632l9502Q0915j78384o83211n45572L93893J021279N14953
37618A139691m16075o40164k22513k6449k57136m12058l29620k75793j83701K28461
37608a395357P07285P71714O45490Q65362J051665K78859j192083j839671r79058
37599a085794K43637N65103K21444P0387R9162j67850m98671l00487K71540N35032
37589d6497L60533K01907K57681L25544K82352Q6329l95963r57245q87563J0225
$$ plain form
37657 -1875834 -2013182 -1836621 -1404650 -797991 -301334 -69999 135736 544708 922158
37648 922158 872801 454543 156179 316317 812536 1277432 1422627 1215527 905118 771971
37638 771971 712856 291571 -554060 -1134381 -777661 192066 791640 651230 348922 398715
37628 398715 583952 575320 535818 616733 438349 -244862 -790434 -396541 624738 1139691
37618 1139691 723616 83452 -139061 -165510 -422646 -834704 -1164324 -1440117 -1623818 -1395357
37608 -1395357 -688072 83642 729132 1594494 2646159 2925018 1732935 -106736 -1085794
37599 -1085794 -842157 -277054 -55610 14777 113939 -53911 -552582 -853069 -581529 -46497
37589 -46497 314036 515943 773624 1099168 1381520 1467849 1071886 114641 -772922 -762697
37579g62697P19371K41478q71542j245676o15248J14939M77995P88771R46876
37570b05733L81259n45194n55025N37265J194694L70764q38279q20736K29896
37561b51089Q70949O24520K69075K14785l6357o71901r80736m59739K77946K92475
37551A49928l91601q15598k97940P54975J328077R20886L3140m78846l26526J23024
37541I99519M80156O36995N04475j434n64477n96726n0971L61592J09091m39811
37531A438409o28295m27500k58660k51980k32382j99976k70731k91008k9880L43281
37521h08722M47504K75667J49033J73920J94542K11334L60179M90220K60011k66376
37511A487312n74295m16585k04249m25737q95711q82571j7223J092370J373764
$$ plain form
37579 -762697 -43326 198152 -673390 -1919066 -2534314 -2419375 -1941380 -1152609 -205733
37570 -205733 175526 -369668 -924693 -387428 807266 1178030 339751 -480985 -251089
37561 -251089 619860 1244380 1513455 1728240 1691883 1019982 39246 -420493 -142547 149928
37551 149928 -241673 -1057271 -1355211 -600236 727841 1648727 1681867 1203021 876495 999519
37541 999519 1479675 2116670 2621145 2619711 2055234 1458508 1407537 1769129 1878220 1438409
37531 1438409 810114 382614 123954 -128026 -360408 -560384 -831115 -1122123 -1152003 -808722
37521 -808722 -361218 -85551 63482 237402 431944 643278 1003457 1493677 1753688 1487312
37511 1487312 913017 496432 292183 -133554 -1029265 -1911836 -1929059 -836689 537075
37502E37075N11812n72424p62494o5231N92986P20486O70734O86641M72779L4101
37492B826465j0853N12984Q79145P00670O49147J111071J217993L90201k22619
37483H054204N63698J680445J148604p79231j937027j561850j045494j162149
37475D961200r21400J09271O52333N7201k97154N82649J362070O34447n07327
37466F633290k56099P88105N94731r34599j891790j382794n07539k84136m53253
37457B305916n48483n57929l16391L43414P43394P2370j046939j206657m19684
37448f30989m933k15966P5933R88803J037397k50304j141088l48955Q67932P47175
37438A125005k97633o96948k73093J3727N5791N08847J137320R56104p5010r36099
$$ plain form
37502 537075 1048887 476463 -286031 -351262 241724 962210 1632944 2319585 2792364 2826465
37492 2826465 2815612 3328596 4207741 4908411 5557558 6668629 7886622 8276823 8054204
37483 8054204 8617902 10298347 11446951 10667720 8730693 7168843 6123349 4961200
37475 4961200 4039800 4149071 4801404 4858605 4561451 5144100 6506170 7140617 6633290
37466 6633290 6377191 7165296 7760027 6825428 4933638 3550844 3043305 2759169 2305916
37457 2305916 1757433 1199504 883113 1226527 1969921 2042291 995352 -211305 -630989
37448 -630989 -635922 -851888 -775955 212848 1250245 999941 -141147 -490102 377830 1125005
37438 1125005 827372 130424 -142669 -128942 -73151 435696 1573016 2529120 2454110 1518011
37428A518011j120046j064133r99640n87379J38970N31362K96118j06230k08344
37419a601311n578L61228P09783O36196l6910o72251m54563L97317Q60916N70047
37409G64874J79445J63534J74881q2125j74407L36289J049454J142762L67116
37400C921823p15308j322022j114621m21668J45814L68979N26171P05613M89804
37391B584585k46640p45208k92558O35953J006034P22065N54932P61328Q44642
37382E825133O94110Q74136J599735K407827L020448L511545L427347J946740
37374B3307021o10046k567518k864583k298319k119384k290419j945265q29904
37366G781583N46044J639322K119025K003051K050047L108521M404391L630637
$$ plain form
37428 1518011 397965 -666168 -1665808 -2253187 -2114217 -1582855 -1286737 -1392967 -1601311
37419 -1601311 -1606889 -1245661 -535878 100318 63408 -608843 -1063406 -666089 194827 764874
37409 764874 944319 1107853 1282734 1200609 1026202 1362491 2411945 3554707 3921823
37400 3921823 3206515 1884493 769872 348204 494018 862997 1389168 2094781 2584585
37391 2584585 2337945 1592737 1300179 1936132 2942166 3664231 4219163 4980491 5825133
37382 5825133 6519243 7393379 8993114 11400941 14421389 17932934 21360281 23307021
37374 23307021 22696975 20129457 17264874 14966555 12847171 10556752 8611487 7781583
37366 7781583 8327627 9966949 12085974 14089025 16139072 19247593 23651984 27282621
37358B7282621q3956m266691n676791m184127k462331k178176k334170j574666
37350D521713l28150J74963k23962p15553p99664o18626m02952k23592j06954
37341A277223k1710Q9444J17975r1656l55090k67418J80277N06798L88504J5222
37331A839569k91976m02624k42404J83904N14011K76337l97274p85278n15251
37322A79014k4930J45265L9324l7161p3039j86041k28863K9457M98128Q20629
37312A161783P14377J52484n49398p81311j85605P03176Q40354n5345j075958
37303I24557j273445p37789j45626K09721L64613J80178l15230m25530M24960
37294g93591J513617J453155J59888q45506n49491J39624j05053r27698q89926
$$ plain form
37358 27282621 27198665 22931974 17255183 13071056 10608725 8430549 6096379 4521713
37350 4521713 4193563 4368526 4144564 3429011 2629347 2010721 1607769 1384177 1277223
37341 1277223 1255513 1344957 1462932 1371276 1016186 748768 929045 1435843 1824347 1839569
37331 1839569 1547593 1144969 902565 1086469 1600480 1876817 1479543 694265 179014
37322 179014 154084 299349 338673 301512 228473 42432 -186431 -156974 341154 1161783
37312 1161783 1876160 2028644 1479246 697935 512330 1215506 2055860 2000515 924557
37303 924557 -348888 -1086677 -1232303 -1022582 -657969 -477791 -793021 -1218551 -793591
37294 -793591 720026 2173181 2333069 1487563 938072 1077696 972643 44945 -844981
37285h44981K06063R81101O23376L5852J99257N18375j09786j292122j544857
37276a227722n15210M97968M49733j56661l34235j0428K84354L88419M42538L68647
37266A87403R5010r0619L817O3402j58002l28003j66113l669l6524K84844J180719
37255A032265J560063M06591j321962j689878n08713N21984M61574K00944M73011
37246A135879N36300k70792j145181j131480o44436m71647k68628O05735J547132
37237a07118J459805N65205N0277J94499J95540k65363n97840n05695m20837n38248
37227C0225m69638j20457K5449k01756l13313k2153L03514L63026M03851O33622
37217F32370P63400N05513N2591k34865k45611q0954K2779k47164q17665r62565
$$ plain form
37285 -844981 -638918 342183 965559 1001411 1200668 1719043 1609257 317135 -1227722
37276 -1227722 -1742932 -1244964 -795231 -951892 -1286127 -1296555 -1012201 -623782 -181244 187403
37266 187403 282413 191794 195611 259013 101011 -226992 -393105 -396774 -433298 -148454 1032265
37255 1032265 2592328 2998919 1676957 -12921 -521634 350 461924 662868 1135879
37246 1135879 1672179 1401387 256206 -875274 -1519710 -1991357 -2259985 -1654250 -107118
37237 -107118 1352687 1917892 1968169 2162668 2358208 2092845 1495005 989310 568473 30225
37227 30225 -439413 -559870 -534421 -736177 -1049490 -1071643 -768129 -405103 -1252 632370
37217 632370 1395770 1901283 1953874 1719009 1473398 1392444 1415223 1168059 350394 -612171
37207f12171j85793P68836P18350j58688m46738L56002J052224O56176j27037
37198B021161k04093J73891J05503l19294l28494Q0784K67993K36518N25708R20985
37188C480662N76688m10864q09302q0982O77668L13439p03353j021462l14411
37179A708083M39592M01478j78124n27788l02610K47009O78864O68507J35770
37170C270781o32948j046785p10877K6620L11206j86530p35613m64288L86158
37161B17724P81976M43923J97627M86534N37494k41274r31482l68089Q32897R74334
37151B931664j31956q37801k13739O09610L88848l10017k72039K99627K60073
37142B724270n04014r84349p40412l76951k77852p0931L52948L72815k71371p66566
$$ plain form
37207 -612171 -797964 -29128 689222 530534 83796 439798 1492022 2148198 2021161
37198 2021161 1817068 1990959 2096462 1777168 1448674 1529458 1797451 2033969 2559677 3480662
37188 3480662 4057350 3646486 2837184 2756202 3433870 3747309 3043956 2022494 1708083
37179 1708083 2147675 2549153 2371029 1843241 1540631 1787640 2466504 3135011 3270781
37170 3270781 2637833 1591048 880171 906791 1217997 1031467 295854 -168434 217724
37161 217724 999700 1443623 1641250 2127784 2665278 2424004 1492522 1124433 1957330 2931664
37151 2931664 2799708 1961907 1748168 2357778 2746626 2436609 2164570 2464197 2724270
37142 2724270 2220256 1235907 495495 118544 -159308 -230239 122709 495524 224153 -542413
37132e42413k97649P08418J098693M68808m74217q94785o60961j77460J99685
37123e71881L93986M42275L34432R0218j24673j60433j48048l12510m53827o0321
37113e70782P75460J069072J65487j131972j447387o59738N8450K7087j29769
37104a844092K53714P93041Q11132M27777J88893J56281P1552J3741K02259M41143
37094A515441L87792J29555o1340k52056n48022o03490j26630M04519L18111j31695
37084A032185o9260O12250J036280O50927p0176m97584o50424p19997m62445L15636
37074A177392J056477R06213j60555j138356j073467j42113N64044L40231k86754
37065A243112l07719L41100P07091K93996j79942J82L29834m9333q32668j003314
$$ plain form
37132 -542413 -840062 -131644 967049 1435857 961640 66855 -594106 -771566 -571881
37123 -571881 -177895 264380 598812 689030 564357 403924 255876 -56634 -510461 -570782
37113 -570782 204678 1273750 1439237 307265 -1140122 -1799860 -1741410 -1714323 -1844092
37104 -1844092 -1590378 -797337 13795 441572 630465 786746 858298 872039 1074298 1515441
37094 1515441 1903233 2032788 1971448 1719392 1171370 567880 441250 845769 1163880 1032185
37084 1032185 962925 1575175 2611455 3262382 3192206 2694622 2044198 1324201 861756 1177392
37074 1177392 2233869 3140082 2979527 1841171 767704 625591 1189635 1529866 1243112
37065 1243112 935393 1276493 1983584 2277580 2097638 2097820 2427654 2378321 1545653 542339
37055E42339m99895k23509m25029l37876L59177R04058P15987K62982J35487J66660
37045A600381M3713l9042P1679O2572j45288n2572M59208O53757J32861l21663
37035B465606O6287Q04241R92292P66732Q70354J376541J908656K581774L530659
37026A5363142L913915K694763K67839j864489k938329l336465l308094k586035
37018H206247j388555n67363m60175n98872p30348j059590j310186p72126L36613
37009A655645P78045J19206n15163k21318K79671l6779p39998o95245M2458L30640
36999I97162k82096r44200p16550L40029J355264J442483L97934r50252j293895
36990C45879k33837J096620J295622L22468p03912j044230r16095o66064k51305
$$ plain form
37055 542339 42444 -181065 -606094 -943970 -584793 319265 1035252 1298234 1433721 1600381
37045 1600381 1644094 1605052 1676731 1739303 1594015 1541443 2000651 2654408 2787269 2465606
37035 2465606 2531893 3336134 4328426 5095158 5965512 7342053 9250709 11832483 15363142
37026 15363142 19277057 21971820 22239659 20375170 17436841 14100376 10792282 8206247
37018 8206247 6817692 6250329 5790154 5191282 4460934 3401344 2091158 1319032 1655645
37009 1655645 2433690 2552896 2037733 1816415 2096086 2059307 1319309 624064 666522 997162
36999 997162 715066 -229134 -945684 -605655 749609 2192092 2590026 1639774 345879
36990 345879 112042 1208662 2504284 2826752 2122840 1078610 162515 -503549 -754854
36981g54854K64301M49567J32802k21218j60248J11490J51457M5988K61289Q30763
36971A111337J197311R85054N16390K75563J56793k91897r72720j168866n73645
36962A235320J40120K08396j80436l15773j33669j88474n46604n75000k6817M61428
36952G8491L45981k1602m8232K13923L66002L41663K07830k26468r06016j066258
36942g14686j50490J048400J140204M6610q09877m66561L60723N16950M9931j69684
36932H51520O6529J58381j21974k49482P1929L52008J53144j49023k7914K35026
36922A340144m304n82045o40694M0968O53060N76490K67505M39140R47369J105350
36912D142983P06608J15106l80115p07351p40504m59175j85099j41081m4938L08026
$$ plain form
36981 -754854 -490553 -40986 91816 -129402 -289650 -178160 -26703 19285 280574 1111337
36971 1111337 2308648 3293702 3810092 4085655 4242448 3950551 2977831 1808965 1235320
36962 1235320 1375440 1583836 1403400 1087627 953958 765484 218880 -356120 -382937 78491
36952 78491 424472 402870 354638 568561 934563 1276226 1484056 1257588 351572 -714686
36942 -714686 -865176 183224 1323428 1370038 560161 93600 454323 971273 1021204 851520
36932 851520 918049 1076430 954456 704974 776903 1128911 1282055 1133032 1105118 1340144
36922 1340144 1335840 753795 113101 154069 807129 1383619 1651124 2090264 3037633 4142983
36912 4142983 4849591 4964697 4584582 3877231 3136727 2677552 2492453 2351372 2306434 2614460
36902B614460M55289O863m22931p563Q23237Q59073P112n14895n2831O58152R02644
36891E328610R89428J290640J462327J401559J931250L564632N377993O061916
36883B7408355N443401M083044K060968p52973l675201n534319n860382n027827
36875A8145066l573205k111162j451018j848785k424435k177415j298068o56094
36867B604884l78388O5285O35791O83030R7010m55526m92454j42324L25811O46387
36857C589506L93226m99382j224248r94356k60615o8971m00924l00783M07840
36848F41293P98420M01086j33529k55381k67064m29771l71887Q2145M09672K62230
36838A137214M4420J31035K65399J93854J40920K03589L7180m01756n75180k84010
$$ plain form
36902 2614460 3069749 3076612 2653681 2646118 3469355 4328428 4335540 3820645 3767814 4425966 5328610
36891 5328610 6318038 7608678 9071005 10472564 12403814 15968446 21346439 27408355
36883 27408355 32851756 36934800 38995768 38242795 34567594 29033275 23172893 18145066
36875 18145066 14571861 12460699 11009681 9160896 6736461 4559046 3260978 2604884
36867 2604884 2226496 2291781 2927572 3610602 3707612 3252086 2759632 2617308 2943119 3589506
36857 3589506 3982732 3483350 2259102 1264746 1004131 935160 534236 233453 641293
36848 641293 1439713 1840799 1707270 1451889 1184825 755054 383167 465312 874984 1137214
36838 1137214 1181634 1312669 1578068 1771922 1912842 2116431 2153611 1751855 1176675 892665
36828H92665o4858j97178j89419K00714L81804N0129q4486M25435P12321n5752
36818B071375j060411r08960J85595P33811K65249j59631J54407N13840J81896
36809A977171l92178m23999r0252j37465o15652q14759l83354J54132J66615k44612
36799h04353m80134k71953J02122L74281O18242Q76884Q91109N41507J94711J46826
36789B189242O6083l90607p28036k55777N59102M72047o05994j177953k34593
36780a06486J187521J354682J06193j121952j205224m39377J69649J01563k60704
36771b14135j30443P21035J478304J127145j47646j006757o43089K35881N05789
36762A926084M0424n03265p09413n78495j64837L22933M47033J24590j01163J37539
$$ plain form
36828 892665 827807 630629 441210 641924 1023728 1073857 989371 1414806 2127127 2071375
36818 2071375 1010964 102004 287599 1021410 1286659 1127028 1281435 1795275 1977171
36809 1977171 1584993 1160994 1070742 933277 317625 -497134 -880488 -726356 -559741 -804353
36799 -804353 -1284487 -1556440 -1454318 -1080037 -461795 415089 1306198 1847705 2042416 2189242
36789 2189242 2255325 1864718 1136682 880905 1440007 1912054 1306060 128107 -106486
36780 -106486 1081035 2435717 2541910 1419958 214734 -224643 -54994 46569 -214135
36771 -214135 -344578 376457 1854761 2981906 2834260 1827503 1184414 1420295 1926084
36762 1926084 1966508 1463243 753830 175335 10498 333431 780464 905054 803891 941430
36752I41430M30169K95297l5577j02785M7917J84789L59715M79255R6708o99267
36742A997651r73425l33798K16905j76865p12855k39135P13319P51119o8839m21442
36732G52635P1408N01101M68542N24353P00725K74893o84477j093995o07538j56111
36722G51536l00836m63495k63165j64320k49733J47349R26180R04502j25897o25377
36712E36744K95020J235115O75588n70963p57742Q828K30842m21300q86039p14031
36702c67938n25652n36363k40846L22630M51929J36167J87275P25908Q24978J05603
36692A083691n00325j96431M70119N76533K21027J44616M61040N71940J81122
36683C013332k37017p8903N68633R06159K85098r09281j523713j015983j95176
$$ plain form
36752 941430 1371599 1666896 1631319 1528534 1576451 1761240 2120955 2600210 2696918 1997651
36742 1997651 1024226 690428 907333 730468 17613 -221522 491797 1242916 1174077 752635
36732 752635 824043 1325144 1793686 2318039 3018764 3293657 2609180 1515185 907647 751536
36722 751536 450700 -12795 -275960 -440280 -690013 -542664 383516 1288018 1162121 536744
36712 536744 831764 2066879 2742467 2171504 1413762 1422590 1653432 1232132 346093 -367938
36702 -367938 -893590 -1429953 -1670799 -1348169 -896240 -760073 -572798 153110 978088 1083691
36692 1083691 583366 386935 857054 1433587 1654614 1799230 2260270 2832210 3013332
36683 3013332 2776315 2697412 3266045 4172204 4457302 3548021 2024308 1008325 813149
36674H13149j05124n31812l88830N65622J312907J024676R6925n96453p79432
36665A411628o73357l99070K171L07727L15496J06109j34055l06969l06455r5802
36655B27423K8183k62150o48511m30838L16173O32225J46452j91233M08223J146211
36645A372158P68615l93605q16506p8554N83905K57068l80046l49689J25277K63803
36635A352426Q7095J38639L17737M6215n53895o48427M311N62192K53069n58286
36625A001076q70688k93930N55319P83002J59068o26832o61074J60731R67516
36616A174188R72815L93714q7185l90783q32358j091116m50955P87081J258479
36607A733880M25161m90516k41397O37263P70794K8528n66034o34072p83015j142349
$$ plain form
36674 813149 708025 176213 -212617 353005 1665912 2690588 2787513 2191060 1411628
36665 1411628 738271 339201 341372 649099 964595 1070704 936649 629680 323225 227423
36655 227423 255606 -6544 -655055 -1085893 -769720 -137495 8957 -182276 225947 1372158
36645 1372158 2140773 1747168 930662 852108 1436013 1693081 1313035 963346 1088623 1352426
36635 1352426 1439521 1578160 1895897 1942112 1388217 739790 744101 1306293 1559362 1001076
36625 1001076 130388 -163542 391777 1174779 1333847 707015 45941 206672 1174188
36616 1174188 2147003 2540717 2453532 2062749 1230391 139275 -311680 475401 1733880
36607 1733880 2159041 1668525 1427128 2064391 2835185 2863713 2297679 1663607 880592 -261757
36597b61757r14050J88301J160395J038006K24124k19276k6867K61395L48156
36588A798427M34203N50278L81713q8417l38262n5245K42591j57715r91887j097076
36578F78610K4217J249536J135969r8734q34058l27385L74051K38224j93310M7384
36568B294504O23988N67973L3900l1923L58499K80550l58584n44565J70302R64927
36558D359571J025412M77806j61262m69887K469J229032K078746J478299J97938
36549A0218124O027J029265J697218J435583J352033J874504K049768J898587
36541B1561109K906327N091752O373270O361133P717699J1685542J5772709J8902841
36533I6372382K4675120L4012138L7672323K4145844m273537l0380671l9775154
$$ plain form
36597 -261757 -1175807 -987506 172889 1210895 1435019 1215743 1188876 1450271 1798427
36588 1798427 2232630 2782908 3164621 3076204 2737942 2682697 2925288 2767573 1775686 678610
36578 678610 702827 1952363 3088332 2989598 2155540 1828155 2202206 2440430 2247120 2294504
36568 2294504 2918492 3486465 3520365 3488442 3846941 4127491 3768907 3224342 3394644 4359571
36558 4359571 5384983 5862789 5701527 5231640 5234109 6463141 8541887 10020186 10218124
36549 10218124 10224151 11253416 12950634 14386217 15738250 17612754 19662522 21561109
36541 21561109 24467436 29559188 35932458 42293591 50011290 61696832 77469541 96372382
36533 96372382 121047502 155059640 192731963 216877807 212604270 182223599 142448445
36526A42448445l4350430k5362782j8989315j3968817r205229o443470n948104
36519B8180298n289564l466158k268647k561727k611116j329835k36197o53451
36511I763603j398895r93308k16219n52563j511305j471769l70993L05834j18090
36502C436295p46583p03618k13501J31984K22224K18186J61370J00960J60690
36493B768007K69568K04251L3872R6496L53053K61107l39636o88056q6217Q48672
36483C721117P79519m25504j294068p37275M12586O49204r9328o94021o82177
36474A630053o33334o61212r7357R94086J404378O20958j64961J32898P69462
36465C994971M65233m56149o80688j00369J61770k71746n56057k33627R2006L6056
$$ plain form
36526 142448445 108098015 82735233 63745918 49777101 40571872 34128402 28180298
36519 28180298 22890734 19424576 17155929 14594202 11983086 10653251 10417054 9763603
36511 9763603 8364708 7371400 7155181 6602618 5091313 3619544 3248551 3554385 3436295
36502 3436295 2689712 1986094 1772593 1904577 2126801 2344987 2506357 2607317 2768007
36493 2768007 3037575 3241826 3275698 3372194 3725247 3986354 3646718 2958662 2872445 3721117
36483 3721117 4500636 4075132 2781064 2043789 2456375 3105579 3006251 2312230 1630053
36474 1630053 996719 335507 238150 1232236 2636614 3257572 3092611 3225509 3994971
36465 3994971 4460204 4004055 3323367 3222998 3384768 3113022 2556965 2323338 2415344 2451400
36455B451400J10733N82925P65384J67286n31395m70458P1435J89319k37574m71118
36445B627937n8838O68375J218085J460732J445774J180062P97476O19349P69476
36436A0728428R09328O75340L19921N00391J291596J922215J955580K226955L731469
36427B4261223N886287P159660P508350Q705402J1791091J5915973K0531450K6297408
36419A28056844L1493909K9707198J5451921p496336k7108973l4221514l0367672
36412A05515377k3339013j7975800j3939463j0115543p081171n297864m043863
36405B3722660k954085k576882k792666k467935j341817o54840j127802j721823
36397H084810j298449l28876K8751l55768p45888p38174m60628r7508J06754j21790
$$ plain form
36455 2451400 2562133 3145058 3910442 4077728 3546333 3075875 3147310 3336629 3099055 2627937
36445 2627937 2569099 3237474 4455559 5916291 7362065 8542127 9339603 9958952 10728428
36436 10728428 11637756 12313096 12633017 13133408 14425004 16347219 18302799 20529754 24261223
36427 24261223 30147510 37307170 44815520 53520922 65312013 81227986 101759436 128056844
36419 128056844 159550753 189257951 204709872 197213536 170104563 135883049 105515377
36412 105515377 82176364 64200564 50261101 40145558 33064387 27766523 23722660
36405 23722660 20768575 18191693 15399027 12931092 11589275 10934435 9806633 8084810
36397 8084810 6786361 6457485 6486236 6130468 5384580 4646406 4185778 4088270 4195024 4073234
36387D073234m96964k22011P93400J448050Q80809k64641p99375o03060l78655
36378D430787l40259j94300n6859k74424n17796j66531M58244L76240m43045r05231
36368B366826n09357r0749l16947n36277J4800P14129L96229p42227j263916n19069
36358d86558M83765N58916j10674m73231j49880K36024J50581j18853p5091J32001
36348A47000l6468n69362p95237l24512L92032P30410P01098O64864N73410Q5868
36338A569103o70279j063909p80928k05757J55170K34230K35657K54023K40848
36329c1842J27233j06831l12745k04993K17213M62279J83938j86078l6985L84320
36319D95509L25800j79227l40970J3816K09174Q9587L45481R61888P40797p04188
$$ plain form
36387 4073234 3576270 3354259 4147659 5595709 6476518 6211877 5412502 4809442 4430787
36378 4430787 4090528 3896228 3839369 3564945 3047149 2880618 3338862 3715102 3272057 2366826
36368 2366826 1857469 1766720 1449773 913496 928296 1642425 2038654 1296427 32511 -486558
36358 -486558 -2793 556123 445449 -27782 -177662 58362 208943 90090 14999 147000
36348 147000 110532 -458830 -1254067 -1578579 -1186547 -456137 244961 909825 1483235 1569103
36338 1569103 898824 -165085 -946013 -1151770 -996600 -762370 -526713 -272690 -31842
36329 -31842 95391 -11440 -324185 -529178 -311965 150314 334252 148174 111189 495509
36319 495509 821309 642082 301112 314928 524102 613689 959170 1921058 2661855 1957667
36309A957667j804983j194402J25439L63215k30140k3854J052287J376957M10095
36300B032281n09770m99759k88857m18440j93397O33411Q94568l8730q72901l99650
36290C38756M48778K05114n85190l45451P21398Q82413k70112j203597r04806
36281g12697j82900K236j1813M25512J026961J145878P73812K49025l28321p75870
36271A611823o32187N8719M25825l1258n16150n9421R00430J065241K00076n49874
36261B473224l75211J54166J78172j42834j11933K29287J97360k86876m44590
36252A870765J22044P04125N38756K9665J70762J046192J744555J732656J496864
36243I456384J691230K436859L650670N130186N869114M310711K22395m283213
$$ plain form
36309 1957667 152684 -1041718 -916279 -553064 -783204 -807058 245229 1622186 2032281
36300 2032281 1522511 1022752 733895 315455 122058 755469 1650037 1611307 738406 338756
36290 338756 787534 992648 407458 62007 783405 1665818 1395706 192109 -712697
36281 -712697 -895597 -893361 -905174 -479662 547299 1693177 2466989 2716014 2387693 1611823
36271 1611823 979636 1038355 1464180 1432922 916772 857351 1757781 2823022 3023098 2473224
36261 2473224 2098013 2252179 2430351 2287517 2175584 2404871 2602231 2315355 1870765
36252 1870765 1992809 2696934 3235690 3265355 3436117 4482309 6226864 7959520 9456384
36243 9456384 11147614 13584473 17235143 22365329 28234443 32545154 32767549 28484336
36235B8484336o572217o044935m168096k475690j505977j298192j667719j935957
36227B815553j448550n43968j53169l75026l83923J53200O03750N39659L24455
36218A531981J75037k90925j043198j205369l44590O81400R28355O20133M01073
36209A453897J44421n00937j047890q03078j28360Q0730j02101J61531Q67437
36200A25650R93948J33377p84379q08269j56237L76327N07022M42076K78371j0405
36190A097481k74626l40024l20205m38042o01261m21173K85907J113118J313528
36181A414703O00076l46103n23136J10495M84606j11095r55554r39282k19540
36172d84830Q4227l59783o96810l20618L09417N88122N77806M73196J10125m43515
$$ plain form
36235 28484336 21912119 15867184 11699088 9223398 7717421 6419229 4751510 2815553
36227 2815553 1367003 823035 669866 294840 -89083 64117 667867 1207526 1531981
36218 1531981 1707018 1416093 372895 -832474 -1177064 -495664 432691 1052824 1453897
36209 1453897 1598318 1097381 49491 -753587 -881947 -801217 -903318 -741787 125650
36200 125650 1119598 1252975 468596 -339673 -495910 -119583 387439 829515 1107886 1097481
36190 1097481 822855 482831 162626 -275416 -876677 -1297850 -1011943 101175 1414703
36181 1414703 2014779 1668676 1145540 1256035 1740641 1629546 673992 -265290 -484830
36172 -484830 -400603 -760386 -1457196 -1777814 -1468397 -880275 -302469 170727 280852 -162663
36162a62663n81291p6873L88831K89132J19278M01038N66957q1845r03786p28970
36152g70192J89293N04571Q096o6658P12892J081865K21747o97945l59105N06287
36142A330851L22463o96057q97262R0330Q03912L35832l91642l59115r000j32786
36132C97526l56600P5779P74702P16706j09975p27874o61011l51873j39484J66860
36122b15244N78493P05313M73493K91340K75841P1708l13506l16415J53660L23146
36112B027829k26481p07558k93534M51171L05088p28714j330938p25374L10718
36103i17793O34421J95369k14468j70450N9475J99358L47116N61843N36119J5083
36093A246073o44902p19296j308Q22608R09969K49672l68511l70283p1629j60013
$$ plain form
36162 -162663 -743954 -820827 -431996 -142864 -23586 377452 944409 862564 -41222 -770192
36152 -770192 -580899 -76328 -68232 -134890 578002 1659867 1881614 1183669 824564 1330851
36142 1330851 1653314 957257 59995 150325 954237 1290069 898427 539312 530312 397526
36132 397526 40926 116705 891407 1608113 1498138 770264 109253 -242620 -382104 -215244
36122 -215244 363249 1068562 1542055 1833395 2109236 2180944 1867438 1551023 1704683 2027829
36112 2027829 1801348 1093790 800256 1251427 1556515 827801 -503137 -1228511 -917793
36103 -917793 -283372 -88003 -302471 -472921 -413446 -214088 133028 694871 1230990 1246073
36093 1246073 601171 -118125 -119433 703175 1613144 1862816 1494305 1124022 1052393 892380
36083H92380p11928j041717n72061L62961P93783K09927p98746j174754n85881
36074b626036K94374P14142O51260M84144K92743l4246k74250o8118M23050O42784
36064D99847M52481K59484K60035J56405j95139m58919m25354l71283m47623k58335
36054e28401M38957J050091P91847j78224q48495n52327L13572P98323L90027
$$ plain form
36083 892380 180452 -861265 -1433326 -1070365 -276582 -66655 -865401 -2040155 -2626036
36074 -2626036 -2331662 -1617520 -966260 -482116 -189373 -223619 -497869 -565987 -142937 499847
36064 499847 952328 1211812 1471847 1628252 1433113 974194 548840 177557 -270066 -528401
36054 -528401 -89444 960647 1752494 1574270 725775 173448 487020 1285343 1675370
$$ [...]
##END NTUPLES=NMR SPECTRUM
##END=
