##TITLE=31Pdec_PR90_RM
 D2O, 24 sc
 4.6.2019
##JCAMPDX= 6.0         $$ Bruker NMR JCAMP-DX V2.0
##DATA TYPE= NMR SPECTRUM
##DATA CLASS= NTUPLES
##ORIGIN= UXNMR, Bruker Analytische Messtechnik GmbH
##OWNER= root
$$ XWIN-NMR		Version 3.5
$$ Tue Jun  4 14:04:13 2019 Russian Standard Time (UT+4h)  she@DPX200
##.OBSERVE FREQUENCY= 81.013821
##.OBSERVE NUCLEUS= ^31P
##.ACQUISITION MODE= SIMULTANEOUS
##.ACQUISITION SCHEME= undefined
##.AVERAGES= 24
##.DIGITISER RES= 17
##SPECTROMETER/DATA SYSTEM= spect
##.PULSE SEQUENCE= zgpg30
##.SOLVENT NAME= D2O
##.SHIFT REFERENCE= (INTERNAL, D2O, 0, 182.463)
##AUDIT TRAIL= $$ (NUMBER, WHEN, WHO, WHERE, WHAT)
$$ ##TITLE= Audit trail, XWIN-NMR		Version 3.5
$$ ##JCAMPDX= 5.01
$$ ##ORIGIN= Bruker BioSpin GmbH
$$ ##OWNER= she
$$ F:/spectra/data/she/nmr/P31/1/pdata/1/auditp.txt
$$ ##AUDIT TRAIL=  $$ (NUMBER, WHEN, WHO, WHERE, WHAT)
(   1,<2019-06-04 14:02:47.75 +0400>,<she>,<DPX200>,
      <created by zg, POWCHK disabled, PULCHK disabled
       configuration hash MD5:
       00 E9 B6 7A A2 85 ED C7 34 08 36 98 17 FE 4E 26
       data hash MD5: 32K
       68 BF 3E A1 3C 0B 3D CB 9A 72 AD 44 D4 44 3D 79>)
(   2,<2019-06-04 14:02:54.10 +0400>,<she>,<DPX200>,
      <Start of raw data processing
       efp BC_mod = 2 LB = 1 FT_mod = 6 PKNL = 1 PHC0 = -2178.951 PHC1 = 91.59911 SI = 64K 
       data hash MD5: 64K
       30 46 12 07 28 48 9B 90 56 1B D0 46 87 EC 1C 1E>)
(   3,<2019-06-04 14:02:58.34 +0400>,<she>,<DPX200>,
      <abs ABSG = 5 
       data hash MD5: 64K
       DF D9 FA AF D3 EC DE A0 34 AA 63 6A 75 31 9A E7>)
(   4,<2019-06-04 14:03:21.57 +0400>,<she>,<DPX200>,
      <pk PHC0 = -34.00502 PHC1 = 7.6 
       data hash MD5: 64K
       2A 2B 74 5E 46 EC C2 AB 8C A3 67 F3 FC 8B 64 2E>)
(   5,<2019-06-04 14:03:24.93 +0400>,<she>,<DPX200>,
      <abs ABSG = 5 
       data hash MD5: 64K
       AB 07 92 7F 72 AB C9 7B 78 E2 50 29 41 55 FB 4D>)
$$ ##END=
$$ 
$$ hash MD5
$$ 54 9B C7 54 DD 91 04 E6 B6 1F 47 46 36 BF 96 F5
##$RELAX= 
##$RELAX= 
##$RELAX= 
##$RELAX= 
##$RELAX= 
##$RELAX= 
##$RELAX= 
##$RELAX= 
$$ Bruker specific parameters
$$ --------------------------
##$DU= <F:/spectra>
##$EXPNO= 1
##$NAME= <P31>
##$PROCNO= 1
##$TYPE= <nmr>
##$USER= <she>
##$AMP= (0..31)
100 100 100 100 100 100 100 100 100 100 100 100 100 100 100 100 100 100 
100 100 100 100 100 100 100 100 100 100 100 100 100 100 
##$AQSEQ= 0
##$AQ_mod= 1
##$AUNM= <au_zg>
##$AUTOPOS= <>
##$BF1= 81.014009
##$BF2= 200.13
##$BF3= 200.13
##$BF4= 200.13
##$BF5= 200.13
##$BF6= 200.13
##$BF7= 200.13
##$BF8= 200.13
##$BYTORDA= 1
##$CFDGTYP= 0
##$CFRGTYP= 5
##$CHEMSTR= <none>
##$CNST= (0..31)
1 1 145 1 1 1 1 1 1 1 1 1 1 1 1 1 1 1 1 1 1 1 1 1 1 1 1 1 1 1 1 1 
##$CPDPRG= <waltz16>
##$CPDPRG1= <>
##$CPDPRG2= <waltz16>
##$CPDPRG3= <>
##$CPDPRG4= <mlev>
##$CPDPRG5= <mlev>
##$CPDPRG6= <mlev>
##$CPDPRG7= <mlev>
##$CPDPRG8= <mlev>
##$CPDPRGB= <>
##$CPDPRGT= <>
##$D= (0..31)
0 1 0 0 0 0 0 0 0 0 0 0.03 2e-05 3e-06 0 0 0 0 0 0 0 0 0 0 0 0 0 0 0 0 
0 0 
##$DATE= 1559642567
$$ [...]
##$SUBNAM3= <"">
##$SUBNAM4= <"">
##$SUBNAM5= <"">
##$SUBNAM6= <"">
##$SUBNAM7= <"">
##$SUBNAM8= <"">
##$SUBNAM9= <"">
##$SW= 369.568048894756
##$SWIBOX= (0..15)
0 1 3 0 0 0 0 0 0 0 0 0 0 0 0 0 
##$SW_h= 29940.119760479
##$TD= 32768
##$TD0= 1
##$TE= 0
##$TE2= 300
##$TE3= 300
##$TEG= 300
##$TL= (0..7)
0 120 53 12 22 120 120 120 
##$TP= (0..7)
150 150 150 150 150 150 150 150 
##$TP07= 0
##$TPNAME0= <>
##$TPNAME1= <>
##$TPNAME2= <>
##$TPNAME3= <>
##$TPNAME4= <>
##$TPNAME5= <>
##$TPNAME6= <>
##$TPNAME7= <>
##$TPOAL= (0..7)
0.5 0.5 0.5 0.5 0.5 0.5 0.5 0.5 
##$TPOFFS= (0..7)
0 0 0 0 0 0 0 0 
##$TUNHIN= 0
##$TUNHOUT= 0
##$TUNXOUT= 0
##$USERA1= <user>
##$USERA2= <user>
##$USERA3= <user>
##$USERA4= <user>
##$USERA5= <user>
##$V9= 5
##$VALIST= <valist>
##$VCLIST= <CCCCCCCCCCCCCCC>
##$VD= 0
##$VDLIST= <DDDDDDDDDDDDDDD>
##$VPLIST= <PPPPPPPPPPPPPPP>
##$VTLIST= <TTTTTTTTTTTTTTT>
##$WBST= 1024
##$WBSW= 4
##$XGAIN= (0..3)
0 0 0 0 
##$XL= 0
##$YL= 0
##$YMAX_a= 38420
##$YMIN_a= -61041
##$ZGOPTNS= <>
##$ZL1= 120
##$ZL2= 120
##$ZL3= 120
##$ZL4= 120
##$ABSF1= 182.463
##$ABSF2= -187.1042
##$ABSG= 5
##$ABSL= 3
##$ALPHA= 0
##$AQORDER= 0
##$ASSFAC= 0
##$ASSFACI= 0
##$ASSFACX= 0
##$ASSWID= 0
##$AUNMP= <proc_1d>
##$AZFE= 0.1
##$AZFW= 0.5
##$BCFW= 0
##$BC_mod= 2
##$BYTORDP= 0
##$COROFFS= 0
##$CY= -3
##$DATMOD= 1
##$DC= 0
##$DFILT= <>
##$DTYPP= 0
##$F1P= 0
##$F2P= 0
##$FCOR= 1
##$FTSIZE= 65536
##$FT_mod= 6
##$GAMMA= 0
##$GB= 0
##$INTBC= 1
##$INTSCL= 5.30512e-09
##$ISEN= 30
##$LB= 1
##$LEV0= 0
##$LPBIN= 0
##$MAXI= 10000
##$MC2= 0
##$MEAN= 0
##$ME_mod= 0
##$MI= 50
##$NCOEF= 0
##$NC_proc= -5
##$NLEV= 6
##$NOISF1= 182.463
##$NOISF2= 159.3651
##$NSP= 0
##$NTH_PI= 0
##$NZP= 0
##$OFFSET= 182.463
##$PC= 4
##$PHC0= -2212.956
##$PHC1= 99.19911
##$PH_mod= 1
##$PKNL= yes
##$PPARMOD= 0
##$PSCAL= 0
##$PSIGN= 0
##$REVERSE= no
##$SF= 81.0140089999434
##$SI= 65536
##$SIGF1= 159.3651
##$SIGF2= -187.1042
##$SINO= 113.3802
##$SIOLD= 16384
##$SREGLST= <1H.CDCl3>
##$SSB= 0
##$STSI= 65536
##$STSR= 0
##$SW_p= 29940.119760479
##$SYMM= 0
##$S_DEV= 0
##$TDeff= 32768
##$TDoff= 0
##$TI= <>
##$TILT= no
##$TM1= 0
##$TM2= 0
##$TOPLEV= 0
##$USERP1= <user>
##$USERP2= <user>
##$USERP3= <user>
##$USERP4= <user>
##$USERP5= <user>
##$WDW= 1
##$XDIM= 65536
##$YMAX_p= 411931029
##$YMIN_p= -11311335
$$ End of Bruker specific parameters
$$ ---------------------------------
##NTUPLES= NMR SPECTRUM
##VAR_NAME=  FREQUENCY,     SPECTRUM/REAL,   SPECTRUM/IMAG
##SYMBOL=    X,             R,               I
##VAR_TYPE=  INDEPENDENT,   DEPENDENT,       DEPENDENT
##VAR_FORM=  AFFN,          ASDF,            ASDF
##VAR_DIM=   65536,         65536,           65536
##UNITS=     HZ,            ARBITRARY UNITS, ARBITRARY UNITS
##FACTOR=    0.456856943014862, 1,           1
##FIRST=     14782.0589164792, 0,            0
##LAST=      -15158.0608439998, 0,           0
##MIN=       -15158.0608439998, -11311335,   0
##MAX=       14782.0589164792, 411931029,    0
$$ Real data points
##PAGE= N=1
##DATA TABLE= (X++(R..R)), XYDATA
$$ [...]
42935I59800N45593j93373r88697q13890J69600P39675K65611m64634m72364N0771
42925b01908K59673k9032l26287l68452k12656K31009R17594J220896O81298o9797
42915B102338j24640K24883k3229q11642j096082o61500l54824l23074K96123
42906g71647J421903J552863J76217j028594o82199J20820k62535j241636j100653
42897a815461L7049N27645L2797j67832L54413N15596j39454n67978j22492L64674
42887i81043J67264j09544K39786P76993P83843L55078j47764p56974j276332
42878i48693j014890L5349P29048L53414k58533j35362K86340J49733j79968J80369
42868h03193R07300Q85659L7058n92893m54226l3648J66433J44978n1707l43098
$$ plain form
42935 959800 1505393 1312020 323323 -490567 -320967 418708 684319 219685 -252679 -201908
42925 -201908 57765 28733 -297554 -666006 -878662 -647653 269941 1490837 2172135 2102338
42915 2102338 1977698 2202581 2179352 1367710 271628 -389872 -744696 -1067770 -771647
42906 -771647 650256 2203119 2379336 1350742 668543 789363 526828 -714808 -1815461
42897 -1815461 -1778412 -1250767 -1217970 -1385802 -1031389 -515793 -655247 -1223225 -1345717 -981043
42887 -981043 -813779 -923323 -683537 93456 877299 1232377 1084613 327639 -948693
42878 -948693 -1963583 -1928234 -1199186 -845772 -1104305 -1239667 -953327 -803594 -983562 -803193
42868 -803193 104107 989766 1026824 433931 -20295 -53943 112490 257468 205761 -137337
42858a37337k72343M10437R98810O81380q1084k16453J20881j69846j001198r46727
42848f13480L09221J084043K15437j010605p76407N44732J147028N62295k0979
42839A441285M6795O0779m19353o55649j08961M46400J27278n31933l55408N58693
42829F09926Q56607p0820j145011j110438k04157L92503K74307J02394L23397
42820B8708N20342K57603j91870l74222l29003k85885j88439j990j1434k63092
42810h39282k02660M58782R99877O57998n7215n5268N64593O29623j98639q90691
42800A067118p27409l05282l28412n07750l97550l38443o50932p05439J46733
42791b747366J292809J576520Q94179N7617n64345j140849j362397o20895O87500
$$ plain form
42858 -137337 -409680 757 999567 1680947 1599863 1383410 1504291 1334445 333247 -613480
42848 -613480 -304259 779784 995221 -15384 -791791 -247059 899969 1462264 1441285
42839 1441285 1488080 1548859 1129506 473857 364896 811296 938574 406641 51233 609926
42829 609926 1466533 1395713 250702 -859736 -1063893 -671390 -397083 -294689 28708
42820 28708 549050 806653 614783 240561 -88442 -374327 -562766 -564756 -576190 -839282
42810 -839282 -1041942 -583160 416717 1074715 1017500 962232 1526825 2156448 1957809 1067118
42800 1067118 339709 34427 -293985 -801735 -1199285 -1537728 -2188660 -2894099 -2747366
42791 -2747366 -1454557 121963 1016142 1073759 509414 -631435 -1993832 -2614727 -1927227
42782a927227J241515N52056l41279l80993J74296M75519L65722K29332J23891
42773E12832j52375m18576k52260L08553P40341O88362K60644k52722n87596n30590
42763C16613j33778J49349n2976m28252l01357L73531Q23806M98747j32223k45882
42753H67578J49895K74821k02307o24669l32151L03267L86778j71627n07769p2643
42743G1173N75168O05628Q5362k18466K4175L32384J86441k99317o30987n48950
42733A82611k02123J14560K42183K30912J77638J3152l87754q03213o71306J91353
42723i11987J121957J305526P80679K37951o2226m78946j040376j108755l75513
42714e31690M77567O59267L05798L6125r4000m53179r09056q65785k31140L71911
$$ plain form
42782 -1927227 -685712 -133656 -474935 -855928 -681632 -206113 159609 388941 512832
42773 512832 360457 -58119 -310379 -1826 738515 1426877 1687521 1434799 847203 316613
42763 316613 182835 332184 279208 -149044 -450401 -76870 746936 1245683 1113460 867578
42753 867578 1017473 1292294 1089987 465318 133167 436434 823212 651585 143816 71173
42743 71173 646341 1251969 1337331 1118865 1143040 1475424 1661865 1362548 731561 182611
42733 182611 -19512 95048 337231 568143 745781 758933 371179 -432034 -1103340 -911987
42723 -911987 209970 1515496 2296175 2534126 2471900 1992954 952578 -156177 -531690
42714 -531690 -54123 605144 910942 947067 853067 399888 -509168 -1374953 -1606093 -1234182
42704a234182M91460L34301J98309O279l17749n12794l73472r4871J08003L68857
42694a025859P84138R81567N56641k16021n80080k13510M04939O08916K75085
42685A575816j48223k04999N9930J77204j08831l85793n8670P00610R60076K35266
42675B802386p82971j164280r84948r66207j137277p56992L48057J262709J221419
42666a58104O64076M46502N08461J18744p51763j157128m93908N47385Q35500
42657E59765L02116J0039O48326J477937J228529j77318j438259j538399r15714
42648A57022n08681l07712K35719P67885K99396r52918j345890j10562J269648
42639d96093J039517l07829q21353M8924Q69412N29316k98699m96480j55338r6877
$$ plain form
42704 -1234182 -742722 -408421 -210112 -203833 -521582 -1034376 -1407848 -1502719 -1394716 -1025859
42694 -1025859 -241721 739846 1296487 1080466 500386 286876 691815 1300731 1575816
42685 1575816 1427593 1222594 1282524 1459728 1350897 965104 906434 1607044 2567120 2802386
42675 2802386 2019415 855135 -129813 -1096020 -2233297 -2990289 -2642232 -1379523 -158104
42666 -158104 505972 952474 1460935 1579679 827916 -329212 -823120 -275735 559765
42657 559765 861881 871920 1520246 2998183 4226712 4049394 2611135 1072736 157022
42648 157022 -351659 -659371 -423652 344233 643629 -309289 -1655179 -1765741 -496093
42639 -496093 543424 235595 -585758 -536834 332578 861894 563195 66715 -88623 -185500
42629a85500m58462o12490j96337M44603P72986O25352L03471K73937O49791R36808
42619B554159N77095k50275q02549p89218o42545o26811l92786J84916M33685
42610B45671j79014j022644j006827p5303P39535O82964M6709m50974m71461j18940
42600a610284L34374N94199N08584K33106P2758J38342K91216L46515J79923k09108
42590H79625n48878m30026J47747O00898M60097O295j68650O871J51367J17200
42580A222546P2711K6327j66166l65432k70211K0700R4550j01967j90937l32K42977
42569E84766L86818M70814L45334j78114o89488m30406N32639J098848N47846
42560B669057m52925q22643n40072m38333q18110j026094m57177N80579J213194
$$ plain form
42629 -185500 -643962 -1256452 -1452789 -1008186 -235200 390152 693623 967560 1617351 2554159
42619 2554159 3131254 2880979 2078430 1289212 646667 19856 -372930 -188014 245671
42610 245671 66657 -955987 -1962814 -2038117 -1298582 -615618 -568909 -1019883 -1491344 -1610284
42600 -1610284 -1275910 -681711 -173127 59979 132737 271079 562295 908810 1088733 879625
42590 879625 330747 -99279 48468 649366 1109463 1115758 947108 953979 1105346 1222546
42580 1222546 1295257 1321584 1155418 789986 519775 540475 635025 533058 342121 341789 584766
42569 584766 971584 1442398 1787732 1609618 920130 489724 1022363 2121211 2669057
42560 2669057 2216132 1393489 853417 415084 -403026 -1429120 -1886297 -1305718 -92524
42551i2524R62699K18418j89815J26204O90709P38449J18866o45117j091808j140321
42541c04240p13796K45453J158794J016087k23103j115227m64621Q87237J035641
42532A522225l68635j587612j141512L00481R87180L65503n22715o52139j91507
42523a288731Q7274k9340q1689K25944N57408M62668O2772j11649J09924L00250
42513B94831R2956k39133j64520L00738N29670R0686o42200q85130l85826K37017
42503g70911K26615l48763o58516k22690M08168M45229L8064M0651O50155J015165
42493H23167M79896m20351p13695l05170O5447m2184k79458j58288K72148N41395
42483B62907L33719j41928l28476M5507N34036M57962j46349m99814j66190L62274
$$ plain form
42551 -92524 870175 1088593 898778 1024982 1715691 2454140 2573006 1927889 836081 -304240
42541 -304240 -1018036 -772583 386211 1402298 1179195 63968 -400653 486584 1522225
42532 1522225 1153590 -434022 -1575534 -1275053 -287873 77630 -445085 -1097224 -1288731
42523 -1288731 -1201457 -1230797 -1312486 -1086542 -529134 -66466 -3694 -115343 -5419 294831
42513 294831 387787 148654 -15866 284872 814542 905228 263028 -622102 -1007928 -770911
42503 -770911 -544296 -893059 -1551575 -1774265 -1366097 -920868 -882804 -842153 -191998 823167
42493 823167 1303063 882712 169017 -136153 -70706 -112890 -392348 -550636 -278488 262907
42483 262907 596626 454698 126222 171729 705765 1163727 1017378 517564 351374 713648
42473G13648M90543L67235L83684L47813j19012p17694q19098m90684l49123m51124
42463f43812j93061N59915J051566O50798l11296j029461j082907n76178J20615
42454a453821N38664M26344J04973J39515N28128O64004K55520k17190k22499
42445G63638Q9380J91968j01667n07290o22161k47084M10651Q00913N92830J52003
42435A523181O2523K52116J58876k68330m73894l07258k97259o14742o09060J00585
42425d73262Q06626O47517j74220p38309n47663J98959J006641J256672N40711
42416B523672n97345q73611P1871Q78495K51650j056801j246459r0652Q02656
42407F63476L75023n62657p71587k32773K59126L38600K09824M2093j34996j67964
$$ plain form
42473 713648 1204191 1571426 1955110 2302923 2183911 1466217 647119 156435 -192688 -643812
42463 -643812 -836873 -276958 774608 1425406 1114110 84649 -998258 -1574436 -1453821
42454 -1453821 -915157 -488813 -383840 -244325 283803 947807 1203327 986137 763638
42445 763638 853018 1044986 943319 436029 -186132 -433216 -22565 778348 1371178 1523181
42435 1523181 1585704 1837820 1996696 1728366 1254472 947214 649955 35213 -573847 -473262
42425 -473262 333364 980881 806661 68352 -479311 -280352 726289 1982961 2523672
42416 2523672 1926327 1052716 1124587 2003082 2254732 1197931 -48528 -139180 663476
42407 663476 1038499 475842 -295745 -528518 -269392 69208 279032 321125 186129 18165
42397A8165J06473N41052P27097L78370l33243p79806m25268M28872P75686J54894
42387A592292o26547o02099m9533N1942l61352m63046q9387j2191m35985m98157
42377a494063J92374P04992K91663k71712R4343R46607R31232j18526q71082l26732
42367G9096R38966J582589R71025l42225j272632j220023n76469j77812k59272
42358b76757k99163N8501N10253P28370P86966O08492j63914j165637j148085
42349c60974K41923J412698Q33903o16069q76436J69962O59173j65197q37634
42340D61349k39513N82052K85286n50438n13038L31421P27005K66406k74785l77210
42330F98535k75080r2615L48032P58511M68478m52727j000843n15625M62717R33959
$$ plain form
42397 18165 124638 665690 1392787 1771157 1437914 658108 232840 661712 1437398 1592292
42387 1592292 965745 363646 314113 366055 4703 -458343 -547730 -559921 -995906 -1494063
42377 -1494063 -1301689 -596697 -305034 -576746 -482403 464204 1395436 1276910 405828 79096
42367 79096 1018062 2600651 3571676 3229451 1956819 736796 160327 -17485 -276757
42358 -276757 -575920 -517419 -7166 721204 1508170 2116662 1952748 787111 -360974
42349 -360974 -119051 1293647 2127550 1511481 635045 805007 1464180 1298983 461349
42340 461349 221836 803888 1089174 538736 25698 357119 1084124 1350530 1075745 698535
42330 698535 423455 330840 678872 1437383 1905861 1453134 452291 -63334 399383 1333342
42320A333342N67727j59090n84374m20993N5845L14961K27752K31324N50890O53148
42310B770532O2185o55277n84803O6727K40604k39095l86416J99195N34690j37372
42300A870970j008038r00517k2897M96431K72296j64680m68808p11228p17916
42291a354387j69732O70754J153732J107564P84092J58991q08961j412089q02446
42282f72482N93412J377209J052471M75231K27858j55082q55765j027005k33111
42273G82736N32015L16013l04837l76278k59854p43469j215139m62489J039203
42264f92099J466355L78885o15186l50700L53659L80756Q9962L22027P25169L70491
42254B429319n69350r77890m05854M30725O87950K26596n06816q79887m97559
$$ plain form
42320 1333342 1901069 1741979 1157605 736612 792457 1107418 1335170 1566494 2117384 2770532
42310 2770532 2832717 2177440 1592637 1659364 1899968 1660873 1274457 1473652 2008342 1870970
42300 1870970 862932 -37585 -60482 435949 708245 543565 74757 -636471 -1354387
42291 -1354387 -1524119 -853365 300367 1407931 2192023 2351014 1542053 129964 -672482
42282 -672482 -79070 1298139 2350610 2825841 3053699 2898617 2042852 1015847 782736
42273 782736 1314751 1630764 1325927 949649 689795 -53674 -1268813 -1731302 -692099
42264 -692099 774256 1153141 537955 187255 540914 921670 1011632 1333659 2058828 2429319
42254 2429319 1859969 882079 476225 906950 1594900 1821496 1314680 434793 -62766
42245f2766L16373P00801L45082o228L11859P47482L63581n62167q24857j17969
42235A211191N05209K31552m07420m93155l1708K87964J57867j26794k61439k57365
42225H15902k50717k86242k64094j4632M40498P19111M63718r7503l68059k07317
42215I50665m8042q5288J8800L28527K47212m71480r41890k54740R82872J251922
42205A978558K54067o18206k82858N23800M45624m66507q91657j75734Q22860
42196A589947R92348L18590m08868o95267o15389l08350J87093O16234N55104
42187B231442l6988o31835p10206l37038N529Q660j94419k42732Q2536N97003
42177G71952P62569J93429p67579j221380p02534J93401M90926L0248l99506j36599
$$ plain form
42245 -62766 253607 954408 1299490 1293262 1605121 2352603 2716184 2154017 1329160 1211191
42235 1211191 1716400 1947952 1540532 1047377 1015669 1303633 1461500 1334706 1073267 815902
42225 815902 565185 278943 14849 217 440715 1159826 1623544 1526041 1157982 950665
42215 950665 902623 817335 836135 1164662 1411874 940394 -1496 -256236 726636 1978558
42205 1978558 2232625 1614419 1331561 1855361 2300985 1834478 942821 767087 1589947
42196 1589947 2582295 2900885 2492017 1796750 1181361 873011 1060104 1676338 2231442
42187 2231442 2194454 1562619 852413 515375 520904 529564 335145 92413 174949 771952
42177 771952 1534521 1727950 960371 -261009 -963543 -770142 -279216 -248968 -648474 -785073
42167g85073N37689Q49170N18654J169j78125l5709L4877j30390k78286k04718
42157C29258j30177l15431m72277o5751P18850R06084K2720j024679r98804q32
42147a031039O45383J63197p53814r97342l92421L79034P32845O15045K66692
42138c72420j7205j3929K49704N16938O23269O18116M93397J40520k47983j77228
42128A813179L98817P46007K76041n40262q19843n69752n26761p54052m02475
42119c79101P57564J511378P40237p89859j247179k09168P95531N19748k79258
42110A419893j43685P98403J048124P5418q21627m22856O59040R24291M6546r44232
42100B639315j218330r24577m68483M1853M13252K51405l60140o79148k65876
$$ plain form
42167 -785073 -247384 601786 1120440 1121609 943484 907775 942652 812262 533976 329258
42157 329258 199081 -116350 -588627 -654378 64472 970556 993276 -31403 -1030207 -1031039
42147 -1031039 -385656 -222459 -976273 -1973615 -2366036 -1987002 -1254157 -639112 -372420
42138 -372420 -389625 -403554 -153850 363088 986357 1604473 2097870 2238390 1990407 1813179
42128 1813179 2211996 2958003 3234044 2693782 1873939 1304187 777426 23374 -379101
42119 -379101 378463 1889841 2630078 1840219 593040 383872 1179403 1699151 1419893
42110 1419893 1276208 2074611 3122735 3198153 2376526 1953670 2612710 3537001 3583547 2639315
42100 2639315 1420985 496408 27925 69778 483030 734435 374295 -304853 -570729
42091e70729L43913L96356k7217k14943J64578P26553R15866N22672k36369q54822
42081A165858q75549l51774J55278K32508O6413L4705J24049O3333j82961l83569
42071D8291l56419p5633L44835N77377K88002l31975n93764j86948L56939M48127
42061E18832K35640J25286j2746m53739q22662n44556J06726K97810p0084k31500
42051h50993K00590P09000P80434N54909L03149k0133l77902m62060k54018j84377
42041C98599m00135m59775j05318K69427L26896L55450O38916Q16099M49679k09968
42031B079870o06222o43939n26407k10672L53282P49570N31485m0926k98345q0246
42021A307450J79451J66986l5019k89382n08476m82246r2563L42059L87542J05005
$$ plain form
42091 -570729 -226816 169540 142323 -72620 91958 818511 1734377 2257049 2020680 1165858
42081 1165858 290309 -61465 93813 326321 392734 427439 551488 614821 431860 48291
42071 48291 -308128 -383761 -38926 538451 826453 494478 -99286 -286234 70705 518832
42061 518832 754472 879758 867012 413273 -409389 -953945 -847219 -549409 -619493 -850993
42051 -850993 -650403 58597 839031 1393940 1697089 1676956 1299054 836994 582976 398599
42041 398599 -1536 -461311 -566629 -297202 29694 385144 1024060 1840159 2289838 2079870
42031 2079870 1473648 829709 303302 92630 445912 1195482 1726967 1686041 1387696 1307450
42021 1307450 1486901 1653887 1618868 1329486 821010 338764 246201 588260 975802 1080807
42011A080807r4646j03763j19304p6707L02154Q28886Q33354Q1481p56328q76468
42001A099466k93636K62305K28893k38375n36681l10959J48199K62636o5597k76697
41991B79554P1509O11191O16970J4760m91421l20375L19716P70649O86035L24193
41981B882781J64793K90149K33519l75369j111906j151826m28029K07280K24564
41972I35956J09343L32171M11012j69396p58034l66134O81441J106626N27294
41963B810279k26477n69903o80806n09247L35211J377327J344318M1750j075763
41954B846689r20418j89744M2076k7443K50962N43743J93342m27644m90626r7142
41944A723795Q6016O7275K29522L01603j03252l91075J78288R40492O45875m04341
$$ plain form
42011 1080807 986161 882398 763094 686387 988541 1817427 2650781 2732262 1975934 1099466
42001 1099466 805830 1068135 1297028 1058653 521972 211013 359212 621848 556251 279554
41991 279554 351063 962254 1579224 1593984 1102563 782188 1101904 1872553 2558588 2882781
41981 2882781 3047574 3337723 3571242 3195873 2083967 932141 504112 711392 935956
41972 935956 1045299 1377470 1788482 1619086 861052 494918 1176359 2282985 2810279
41963 2810279 2583802 2013899 1333093 823846 1159057 2536384 3880702 3922452 2846689
41954 2846689 1926271 1736527 1778603 1751160 2002122 2545865 2739207 2311563 1820937 1723795
41944 1723795 1809811 1877086 2106608 2408211 2304959 1913884 2092172 3032664 3678539 3274198
41934C274198p18423q0028J67636m20871n63779L99065J120899L69453r07092
41925B641058j029553o9408N58944K95426j74214l22842k92800j69032J56175
41916A593754M24453K26358k20634k69842J80985N71316N17932K04471k8941p896
41906C191956K55783M53487J20669o77272j129343o62571K26405O96492O92388
41897C167994O60917N93442K37976n2841L36556J219158J761440J620783J153799
41888A0699224O95902M77560R83558K410832M014472N016997N766452O674803
41880C6739800O487084L552890j127507m273449m373231l378859l458880m100784
41872B6067064l853878l075600k963444l171093k533642j349897q57149r40251
$$ plain form
41934 3274198 2555775 2475747 2643383 2222512 1658733 2057798 3178697 3548150 2641058
41925 2641058 1611505 1542097 2101041 2396467 2222253 1899411 1606611 1437579 1593754
41916 1593754 2018207 2244565 2023931 1754089 1935074 2506390 3024322 3228793 3199852 3191956
41906 3191956 3447739 3901226 4021895 3344623 2215280 1552709 1779114 2475606 3167994
41897 3167994 3828911 4422353 4660329 4607488 4944044 6163202 7924642 9545425 10699224
41888 10699224 11395126 11872686 12856244 15267076 19281548 24298545 30064997 36739800
41880 36739800 43226884 46779774 45652267 41378818 37005587 33626728 30167848 26067064
41872 26067064 22213186 19137586 16174142 13003049 10469407 9119510 8262361 7322110
41864G322110l97471P60190J244226P03283J57705J17103N6245k1028O72508J968732
41854A2583603K550172K170583K380756M110800N977695O042681M065216J073692
41846D0955198k063443m548693n347128m354992l066062k805280l009259k473370
41838A3286971j509323j349068j925380j915222r11201j6927m4147m00970k02019
41829E012714M93972J025478J017754N58983j6405l00124j59884L8714o1739k25040
41819G384423k8880L84675N99391O88699Q86903P53923l00171j722363k194837
41810F451763j483063p74868q27631r33940l45090L59499K54587l70815n11482
41801A818960n5536J67674k01771n56983l46250J54689L40651M7249m28033p50124
$$ plain form
41864 7322110 6924639 7684829 8929055 9632338 9790043 9907146 9963391 9942363 10614871 12583603
41854 12583603 15133775 17304358 19685114 23795914 29773609 35816290 39881506 40955198
41846 40955198 38891755 34343062 28995934 24640942 21574880 18769600 15760341 13286971
41838 13286971 11777648 10428580 8503200 6587978 5676777 5659850 5615703 5214733 5012714
41829 5012714 5506686 6532164 7549918 8108901 8092496 7792372 7632488 7671202 7609463 7384423
41819 7384423 7355543 7740218 8339609 9028308 9915211 10669134 10368963 8646600 6451763
41810 6451763 4968700 4193832 3366201 2432261 2087171 2446670 2701257 2330442 1818960
41801 1818960 1763424 1931098 1729327 1172344 826094 980783 1321434 1368683 940650 190526
41791A90526p74798n41197j94265J49714M75906P38249P35687K99974l97541q88864
41781b06609q21933k71536L72122P62378Q16132O34751L29072J0049j49729o8263
41771A406434L7335j23031m12458l49899J41061M89952L00089k6759M0632K75737
41761A779093J16874l18005l90562K4860M23784N24872M82619K97005j46002m38535
41751B356003j8146O97978O09378l34350q47601l01603J98320l66608j119922
41742H73449o04272Q15568J377882N12506m71273m49443P7330J12551l05506m57661
41732A481131j94963l6411k59710n47947n40265k65659Q9080N00873R50035J124583
41722B300747O70395j81228o11168j59424N80677O65574M6219m45709l15285M1193
$$ plain form
41791 190526 -584272 -1125469 -1319734 -1170020 -694114 44135 779822 1079796 682255 -206609
41781 -206609 -1028542 -1300078 -927956 -165578 650554 1285305 1614377 1624426 1474697 1406434
41771 1406434 1443769 1320738 908280 558381 699442 1189394 1489483 1462724 1503356 1779093
41761 1779093 1895967 1577962 1187400 1212260 1636044 2160916 2643535 2940540 2794538 2356003
41751 2356003 2337857 3035835 3645213 3310863 2463262 2161659 2359979 1993371 873449
41742 873449 269177 1084745 2462627 2975133 2503860 2054417 2131747 2244298 1938792 1481131
41732 1481131 1286168 1249757 990047 442100 -98165 -363824 -274744 226129 1176164 2300747
41722 2300747 2971142 2789914 2178746 2019322 2599999 3265573 3311792 2866083 2550798 2591991
41712B591991J20214j2748r7940j29223r2962J89484O05074O67533K45015j77480
41702C908958k96266m06303o34587n21403P4259M30820M8433m47525l14133Q6461
41692A928714J2934l38739k97932L6193J17972M6179J85252J77722l96750q40110
41682F31435k71607O21893M31326n68795p19423K28277O28274k53381r51997k67736
41672d91734P77279P32512J4714o4463N15033P76642M86335J84498r148l44537
41662B577131n66610k45349K90312L59940K7173j13292K9772Q3656O081J0409
41652B459223j6514k20111k18382L51259J049499J214275R71555Q29010O64220
41643G084034P0527o50383q74800p45201q16314q95403l96567L50590M11707j81457
$$ plain form
41712 2591991 2712205 2699457 2601517 2472294 2379332 2568816 3173890 3841423 4086438 3908958
41702 3908958 3612692 3206389 2571802 2050399 2124658 2555478 2603911 2156386 1842253 1928714
41692 1928714 1941648 1602909 1304977 1341170 1459142 1505321 1690573 1868295 1471545 631435
41682 631435 359828 981721 1413047 844252 124829 353106 981380 727999 -223998 -491734
41672 -491734 285545 1018057 1032771 968308 1483341 2259983 2746318 2930816 2921668 2577131
41662 2577131 2010521 1765172 2055484 2415424 2442597 2329305 2359077 2442733 2448814 2459223
41652 2459223 2442709 2222598 2004216 2355475 3404974 4619249 5590804 6419814 7084034
41643 7084034 7154561 6504178 5629378 4884177 4067863 3172460 2775893 3126483 3538190 3356733
41633C356733m52059j41599n0368n01190p59951l77144R3599J91819K41036M23915
41623B024791K75790k74583m25677J81674O32405P5084r20075j222188o80677
41614c33456M3135N67428Q64226P95651M08965J92749K74502l5569j046162j718431
41604A3038j016942L23683P00724P008l19331M12372J214801J073164K66972m40222
41594B235267q46471r49707m86486M39892J003611O84446R8186Q0830M17465K56456
41584B933489n25518j153903j041002l89837K61576N64261M27486L0978j99280
41575I08250r93L35806L18671n7827l30953k39386K056R7551r052k10255l06953
41564E06915n5150M85337P37502K44556n15887n93441N3107L77619k09690q77573
$$ plain form
41633 3356733 2904674 2763075 2712707 2211517 1451566 1074422 1168021 1359840 1600876 2024791
41623 2024791 2300581 2025998 1600321 1781995 2414400 2489484 1569409 347221 -333456
41614 -333456 -290321 277107 1141333 1936984 2345949 2538698 2813200 2777631 1731469 13038
41604 13038 -1003904 -680221 20503 27511 -291820 120552 1335353 2408517 2675489 2235267
41594 2235267 1388796 439089 -47397 392495 1396106 2080552 2178738 2259568 2677033 2933489
41584 2933489 2407971 1254068 213066 -176771 84805 649066 1076552 1107530 908250
41575 908250 907257 1243063 1561734 1503907 1172954 933568 935624 1033175 1024123 813868 506915
41564 506915 451765 937102 1674604 1919160 1403273 809832 862939 1240558 1030868 153295
41554A53295n96610K76720N40953k2480l75085J50857Q79839Q38162R0639m91225
41544A445065l73943K30929Q34916J077104Q26437L20846J28258N69024J189834
41535F248470J183858L81120n32823r04461q69133r52505j166444r44604k8928
41526B414550R57219J110119K79888p79862j252138r53194j92941O51949J226374
41517C461964J231287P41266K73302J84827K07960k6895k57269M8778P44081J121936
41507G731237J014999J018531J403942J586575J131205O24733R07648J888270
41499A7307140K806139L392040M067253N064954N919792N846045M268851J165093
41491D9837307k619569n529815o411723n594947m453914l843965l414400k547343
$$ plain form
41554 153295 -443315 -166595 374358 351878 -23207 127650 1007489 1845651 1936290 1445065
41544 1445065 1071122 1302051 2136967 3214071 4040508 4361354 4489612 5058636 6248470
41535 6248470 7432328 7813448 7280625 6376164 5507031 4554526 3388082 2443478 2414550
41526 2414550 3371769 4481888 4761776 3981914 2729776 1776582 1583641 2235590 3461964
41517 3461964 4693251 5434517 5707819 5892646 6100606 6073711 5816442 5865220 6609301 7731237
41507 7731237 8746236 9764767 11168709 12755284 13886489 14511222 15418870 17307140
41499 17307140 20113279 23505319 27572572 32637526 38557318 44403363 48672214 49837307
41491 49837307 47217738 41687923 35276200 29681253 25227339 21383374 17968974 15421631
41483A5421631j434248q32397r85466j198107o04731P70439J935158K050862J468327
41474A6591468J292267J951875K694851K613159J592255r148j911049l599483
41466B1216195m144122l203691j838215j422182j951599k277829j819037j061409
41458C498111m43672J42171N61748K56462o98395j277356q23741M5152M21534
41449A682014L28593L24615M68339M18137J82956N9921L8778j19112l55795m06706
41439B621740k95234k35931j30525L28069J019759J317913Q14453j35762p59086
41430D545396o41246p0944L35404K57109j32516n08933p09015o40246k16161L42789
41420B561637M62766q6552o79149n41418J88880O88445O03506L19230J37997o6916
$$ plain form
41483 15421631 13987383 13154986 12169520 10971413 10366682 11137121 13072279 15123141 16591468
41474 16591468 17883735 19835610 22530461 25143620 26735875 26726727 24815678 21216195
41466 21216195 17072073 13868382 12030167 10607985 8656386 6378557 4559520 3498111
41458 3498111 3054439 3196610 3758358 4014820 3316425 2039069 1215328 1260480 1682014
41449 1682014 2010607 2335222 2803561 3221698 3404654 3464575 3503353 3384241 3028446 2621740
41439 2621740 2326506 2090575 1960050 2288119 3307878 4625791 5440244 5304482 4545396
41430 4545396 3904150 3833206 4168610 4425719 4293203 3784270 3075255 2435009 2218848 2561637
41420 2561637 3024403 2937851 2258702 1717284 1906164 2594609 3198115 3517345 3655342 3588426
41410C588426l02028k80096L4811L17441M12136L77815N4733o44642j091180n73819
41400A893597M05659O26387O0924n9570N88753P59323j67399r33001m55332L34119
41390C053460J36344m88117k32555N83293O23362j06308m09180o6065K3319k53213
41380B864340l1986O83370P77161k1500n70790k06446K86747J78757j16408j35836
41370C707409k68323p67341r92305m88146J37960K47828J98146M90904P24275
41361B990407L38700k40730j89430M05549O96881K92862l79509p49717o16694
41352B548319j68607J41325j9565l73591l15675J43758L04806r0845l64255K4628
41342A830298N98238O41865K68619N3309P5301j4258l05998n83598p03733o12093
$$ plain form
41410 3588426 3286398 3006302 3041113 3358554 3770690 4148505 4203238 3558596 2467416 1893597
41400 1893597 2299256 2925643 2986567 2926997 3515750 4275073 4107674 3174673 2719341 3053460
41390 3053460 3189804 2701687 2469132 3052425 3675787 3569479 3160299 3094234 3117553 2864340
41380 2864340 2832354 3515724 4292885 4271385 3700595 3494149 3780896 3959653 3843245 3707409
41370 3707409 3439086 2671745 1679440 1191294 1329254 1577082 1775228 2266132 2990407
41361 2990407 3329107 3088377 2898947 3304496 4001377 4294239 3914730 3165013 2548319
41352 2548319 2379712 2521037 2501472 2127881 1812206 1955964 2260770 2169925 1805670 1830298
41342 1830298 2428536 3070401 3339020 3392329 3467630 3453372 3147374 2563776 1860043 1247950
41332A247950k84416M8312L2495k00665j17491K74271K91155k54773n95925k39441
41322B01472K41156L16004M49571J042895J335390N17147p58118j205056p28441
41313A412020j98107J02023M75322O64460J68239m84843k74579N14184N35004
41304B913723m32010j054900n69732J53975K36242Q5187K99935N15254K83370
41295B431044O9142L29953M67484j75508r40915o92189L67306R13999M24276k27545
41285B967047k11526J74812K25587o5623j32850K49622O50572N76296J03786k69498
41275D268225l46683m81392q89939j066503m43751N36635P96138J66802k79557
41266B259975J86818Q77555Q19749K33025j0645R7802k10975j030940j440639
$$ plain form
41332 1247950 963534 1011846 1044341 843676 726185 1000456 1291611 1036838 440913 201472
41322 201472 442628 758632 1208203 2251098 3586488 4103635 3345517 2140461 1412020
41313 1412020 1213913 1315936 1791258 2455718 2623957 2139114 1864535 2378719 2913723
41304 2913723 2481713 1426813 857081 1011056 1247298 1332485 1632420 2147674 2431044
41295 2431044 2500186 2830139 3297623 3122115 2181200 1489011 1856317 2770316 3194592 2967047
41285 2967047 2755521 2930333 3155920 3090297 2957447 3207069 3857641 4433937 4537723 4268225
41275 4268225 3921542 3440150 2550211 1483708 1039957 1576592 2372730 2539532 2259975
41266 2259975 2446793 3324348 4144097 4377122 4366477 4464279 4253304 3222364 1781725
41257A781725q05920L55703J095661J045955M64620k17894o10099n15251j51945
41248B442555N6178N1764J68056M70188N27431R9576l79160l91237r6929n5643
41238B892779l73778o07988m86898k85459l47323n47721m65815K1484N22297N60194
41228H81772J45579k12305j33627J33873P8766k83504l74723P5053N55245M97772
41218A363901R8138o8404L5339J0327j11054J11264N52331M38564l83332r00584
41208A146490l12951O78067Q04441L7171m97868k12948L38535N76066O00327N44084
41198C701414J71641m21071n40104P3340O20390L22592m20060o38184j15344N80011
41188C334625R68390Q51143N9956j121866j627213p11174P41326J063568P507
$$ plain form
41257 1781725 975805 1331508 2427169 3473124 3937744 3719850 3109751 2594500 2442555
41248 2442555 2498733 2550497 2718553 3188741 3716172 3815748 3436588 3045351 2948422 2892779
41238 2892779 2519001 1911013 1424115 1138656 791333 243612 -222203 -200719 321578 881772
41228 881772 1027351 815046 681419 815292 894058 610554 235831 310884 866129 1363901
41218 1363901 1462039 1393635 1428974 1439301 1328247 1439511 1991842 2430406 2047074 1146490
41208 1146490 833539 1511606 2316047 2353218 1855350 1642402 1980937 2557003 3157330 3701414
41198 3701414 3873055 3451984 2911880 2985220 3605610 3928202 3508142 2869958 2754614 3334625
41188 3334625 4303015 5154158 5214114 4092248 2465035 1753861 2495187 3558755 3566262
41179C566262r59517p59365r323K32817j700o6063Q5646N8001q8495K0764K87696
41168B366723K70957l6933k37807k16828j46292R1980P41906J402444J219798
41159E455948J18034q47542p88336r8192K29112k6871k41887j8697L42710M58065
41149D582344L43972J20624k58403o83770p20734j88077L71227K99751k19708
41140C647226l62247J51370O27295M03757j96614l50237J28314O40540O98072
41131E387476M58047K86697K29304J56078J29315K71770L82775P0158o23671j030876
41121E717073n99734K90469O59810J71313l70852q3668P77464J178052P00908
41112H440835m5038m28631n53037p91515j136468j335417j240768p64475M8709
$$ plain form
41179 3566262 2606745 1847380 1838057 2070874 2069174 2003111 2088757 2146758 2058263 2079027 2366723
41168 2366723 2637680 2600747 2362940 2146112 1999820 2091800 2833706 4236150 5455948
41159 5455948 5573982 4726440 3938104 3839912 4069024 4042153 3800266 3781569 4124279 4582344
41149 4582344 4926316 5046940 4788537 4104767 3384033 3195956 3567183 3866934 3647226
41140 3647226 3284979 3436349 4063644 4467401 4270787 3920550 4048864 4689404 5387476
41131 5387476 5845523 6132220 6361524 6517602 6646917 6918687 7301462 7371620 6747949 5717073
41121 5717073 5117339 5407808 6067618 6238931 5868079 5784411 6561875 7739927 8440835
41112 8440835 8395797 7967166 7414129 6622614 5486146 4150729 2909961 2145486 2194195
41103B194195O72590M34804m46646q51840k95908K72449m9272n98081j94439Q32058
41093A969910J019163K6147q62724o89571k9036J98424M0546J8243J55013J78673
41083B024788R8246M418k04913m30776k41147L85273P34943L39953k14502r8897
41073B397386N32465P99342L45948l15269o23848n73450m41578l15795m1193M72328
41063B236336R44239Q53313J02264n97292m79298J84290L78362j80318o21073
41054B820823k70341L53953M23392O652k62308k04774p9576O8065L28319M61523
41044C645728J79049k80816m32929k43467l9203Q1703K18578K31271j09244o24953
41034B625717q59079o31425j10953M94940R62927R93608N35247k5518l32427m52167
$$ plain form
41103 2194195 2866785 3301589 2854943 2003103 1707195 1979644 1930372 1332291 1137852 1969910
41093 1969910 2989073 3015220 2152496 1462925 1433889 1632313 1672859 1691102 1846115 2024788
41083 2024788 2123034 2127452 1922539 1491763 1250616 1635889 2370832 2710785 2496283 2397386
41073 2397386 2929851 3729193 4075141 3759872 3136024 2562574 2120996 1805201 1764008 2236336
41063 2236336 3180575 4033888 4136152 3538860 3059562 3243852 3622214 3441896 2820823
41054 2820823 2550482 2904435 3327827 3334479 3072171 2867397 2787821 2855886 3184205 3645728
41044 3645728 3824777 3543961 3111032 2867565 2828362 2910065 3128643 3359914 3250670 2625717
41034 2625717 1766638 1135213 1024260 1519200 2482127 3475735 4010982 3985464 3653037 3200870
41024C200870m97210k85535J87378M06055M4325l91614k68033J95667L34028Q7711
41014C013642q8295q7501j45976j78092J01566N11329N67080K10841k33517o10922
41004C060155q13959m73398M34295J040948O08979k01297j67350O16178R13691
40995E018242L27897k26425j72373m8448k60354l24530P0351L63968J65758L1778
40985D945864M62612R38469P20206k8031o19223q12408p90300o57000m94630m63585
40975C201974m20049M2573P95336J063804N63836M5836J52143M38345K23916k13375
40965E894339j13476N22887R55996P22177Q392p38216j057982o43216K30730P32154
40955F513785L97416k75250n55615m08364k50534k09000j28551K4325K10090M38264
$$ plain form
41024 3200870 2703660 2418125 2605503 3011558 3055883 2664269 2396236 2591903 2925931 3013642
41014 3013642 2925347 2837846 2691870 2513778 2615344 3126673 3693753 3904594 3671077 3060155
41004 3060155 2246196 1772798 2207093 3248041 3857020 3655723 3488373 4104551 5018242
40995 5018242 5346139 5119714 4947341 4898893 4638539 4314009 4384360 4748328 4914086 4945864
40985 4945864 5408476 6346945 7067151 7039120 6419897 5607489 4817189 4160189 3665559 3201974
40975 3201974 2781925 2824498 3619834 4683638 5247474 5293310 5445453 5883798 6107714 5894339
40965 5894339 5780863 6303750 7259746 7981923 7990315 7252099 6194117 5550901 5781631 6513785
40955 6513785 6911201 6635951 6080336 5671972 5421438 5212438 5083887 5108212 5318302 5756566
40945E756566N24660J89014l17513l14334K16529M11253r5755m34692J36010R66596
40935G038334J023969M32744N235j21795k89148l07983J79712P44728P15250L19458
40925I740504J89030J68884j50979j98943P79426J981920J806079L74402l93141
40916A4297182M72350J789396K274491K230967K428083K654177K373803J864927
40908C0385376J814208K473564L796758N640046P395610Q392035R129564J1036935
40900H0064096J4521906J8556237K2670259K7342560L0945846K8337678J5477405
40893B37915987m695772k3261648l2724655l2306073k6352650j9663222j4833746
40886H4078221j2056380r896082o909614l383160r87730l76398j42461J115452
$$ plain form
40945 5756566 6281226 6470240 6152727 5838393 6054922 6466175 6370420 5935728 6071738 7038334
40935 7038334 8062303 8495047 8500282 8378487 8089339 7781356 7961068 8705796 9421046 9740504
40925 9740504 9929534 10098418 9947439 9748496 10527922 12509842 14315921 14690323 14297182
40916 14297182 14769532 16558928 18833419 21064386 23492469 26146646 28520449 30385376
40908 30385376 32199584 34673148 38469906 44109952 51505562 59897597 69027161 80064096
40900 80064096 94586002 113142239 135812498 163155058 194100904 222438582 237915987
40893 237915987 233220215 209958567 177233912 144927839 118575189 98911967 84078221
40886 84078221 72021841 62125759 55216145 51832985 50845255 50468857 50326396 51441848
40878E1441848K683420K777769J073925r71456k001308j821243o84410J312802
40870E3811347L840589O268526Q386801J0370805J1469684R568088L228372n849982
40862A01094230j3373427j5989399j4013585j0459415p836879o421506n348684
40855B7651335m375726l918494l837668l230805j753587m12502l35695j115942
40847H670916j251601k36097P22817M47108n85213j066361o93609k43032j58592
40838E606336j43422j19195m76909j085553j071163j26614P82067O68850j66608
40829C867789p40233o85886k52525M00767J047084J017779k7960j252115j518823
40820A855877r06343l70296j41747L51160J019454R42772m048o38235k09302M50029
$$ plain form
40878 51441848 54125268 56903037 57976962 57005506 55004198 53182955 52498545 53811347
40870 53811347 57651936 63920462 72307263 82678068 94147752 103715840 106944212 101094230
40862 101094230 87720803 71731404 57717819 47258404 39421525 33000019 27651335
40855 27651335 23275609 19357115 15519447 12288642 10535055 10122553 9786858 8670916
40847 8670916 7419315 7183218 7906035 8353143 7767930 6701569 6007960 5764928 5606336
40838 5606336 5462914 5343719 4866810 3781257 2710094 2583480 3365547 4034397 3867789
40829 3867789 3127556 2441670 2189145 2589912 3636996 4654775 4626815 3374700 1855877
40820 1855877 949534 579238 437491 788651 1808105 2750877 2746829 2108594 1899292 2349321
40810B349321L23283j80156l9261O18166P38068O5611m47997p8275O57277P35930
40800D741967p8334r75069r62895J12111J348094J639913Q06198k81636p34473
40791E615876n32270k58897k90982n08998n87585l37226R3186K55485j20787o48415
40781B679387o50988j01081K75102J6443m52006n12343j98024K8929l9042k55043
40771G91334l76559j57981M34329Q95492N95124k41299o32238k66430n106l87321
40761F49345n53964L79033J620680J621728L04750q76453r70482m32115J9664
40752A762186K82669L99233K29635p7921j11794P1406J4018k21295j04360K36403
40742B480180J3124p60021r58018j02585O73557K87947o07126o81798K9993L73576
$$ plain form
40810 2349321 2672604 2492448 2453187 3071353 3809421 3875032 3427035 3348760 4006037 4741967
40800 4741967 4663633 3688564 2725669 2837780 4185874 5825787 6631985 6350349 5615876
40791 5615876 5083606 4824709 4533727 4024729 3437144 3099918 3193104 3448589 3327802 2679387
40781 2679387 2028399 1927318 2202420 2218863 1766857 1254514 1056490 1085419 1046377 791334
40771 791334 414775 256794 691123 1586615 2181739 1940440 1308202 1041772 1036666 649345
40761 649345 95381 474414 2095094 3716822 4021572 3145119 2174637 1742522 1762186
40752 1762186 2044855 2444088 2673723 2595802 2484008 2555414 2569432 2348137 2243777 2480180
40742 2480180 2493304 1733283 775265 672680 1346237 1634184 1027058 345260 375253 748829
40732G48829k0395l21684K9520N21554M74795l4989m31205l03963L02119Q51366
40722A815947O33414l68809j076228m86156Q26258J252401L04541p47860p53297
40713A400211j78611l8677k24015M3050O40767O88027J11737j62713K09860L74253
40703B863889k62453r43341p13982P6724L62371k2960l11743j63147l4758j69401
40693F81199j77522J26508L13544J37815L1418L57719P78498Q38514O36148M16579
40683D140420L5932n76416r05754n13054J28750J96494k89712n46643j87948L73021
40673A855090O35219M95099L5180n64415q80872n89686M757K98671K31072K24331
40663A744446L19869Q3952n04097p84035l29224M28365P97176O14871J93484j29784
$$ plain form
40732 748829 728434 406750 436270 957824 1432619 1397630 966425 662462 964581 1815947
40722 1815947 2449361 2080552 1004324 518168 1344426 2596827 2901368 2153508 1400211
40713 1400211 1221600 1182923 958908 1001958 1642725 2330752 2442489 2279776 2489636 2863889
40703 2863889 2601436 1658095 944113 1020837 1383208 1360248 1048505 885358 850600 681199
40693 681199 503677 630185 943729 1081544 1112962 1470681 2249179 3087693 3723841 4140420
40683 4140420 4176352 3599936 2694182 2181128 2309878 2506372 2216660 1670017 1482069 1855090
40673 1855090 2490309 2985408 3020588 2456173 1575301 985615 990372 1289043 1520115 1744446
40663 1744446 2064315 2148267 1644170 860135 530911 959276 1756452 2371323 2564807 2435023
40653B435023j86490o3985r4113m10982n89687k28098K59573J74718k33098n3635
40643A009226O73823Q24104N5326m53032R9449O88278O3177j147266j339746l66068
40633A07271M41698M24584K52282L50868J68659n21060q59195k09477O84268P08065
40623A547963m3220n36746l21943J5258j33326n68210o47314j36638N29948P65708
40613D71480M65987L4544j88956k80347l62167k16700L07039P24517L83876m78179
40603H61094q08809j12229Q21518R51848K93882l09430m02108l06363l94613n49314
40593D5476m88018k11061J10736M30750P49791R11387P66831M77334L29190K28029
40583C350445k18119r13367j035331r6278J070223J149008J37887n66013j17652
$$ plain form
40653 2435023 2248533 2184548 2090435 1679453 1089766 861668 1121241 1295959 1062861 1009226
40643 1009226 1683049 2507153 2562479 2109447 2208896 2897174 2960351 1813085 473339 107271
40633 107271 548969 973553 1225835 1576703 1745362 1224302 365107 155630 839898 1547963
40623 1547963 1504743 967997 646054 661312 527986 -40224 -687538 -824176 -294228 471480
40613 471480 937467 972011 783055 502708 140541 -76159 230880 955397 1339273 861094
40603 861094 52285 -59944 761574 1713422 2007304 1697874 1295766 989403 594790 45476
40593 45476 -442542 -653603 -542867 -112117 637674 1549061 2315892 2793226 3122416 3350445
40583 3350445 3132326 2218959 1183628 1087350 2157573 3306581 3444468 2878455 2760803
40574B760803O60378O77400J97515J16421K94683j07625r08742r41441o382N50736
40564C293746j81422j212589j045062K03309J061631P21287j43818n04115j64461
40555B028506L11375L79032L1766k52505m6746M65775O42958K20252l04325l60549
40545C115539m6345J76519K09524K64548L09437J28335j26371P556N92273J076872
40535E707887R82726N09793K61939N34641J046262J320941J210857R58719P48448
40526A3282213L91310l08114j030218j226367r29812p55769r52903j035341o43751
40517F791248j74151j20623l53766n54580p75039r51838n17456O46627J454289
40508E444711Q95408l41169p27859q8663M29257M15588O16539J119973Q81512
$$ plain form
40574 2760803 3421181 4098581 4296096 4412517 4707200 4599575 3690833 2749392 2743010 3293746
40564 3293746 3112324 1899735 854673 1057982 2119613 2840900 2697082 2192967 2028506
40555 2028506 2339881 2718913 2750679 2498174 2451428 2917203 3560161 3780413 3476088 3115539
40545 3115539 3069194 3245713 3455237 3719785 4029222 4157557 4031186 4038742 4631015 5707887
40535 5707887 6690613 7200406 7462345 7996986 9043248 10364189 11575046 12533765 13282213
40526 13282213 13673523 13365409 12335191 11108824 10179012 9423243 8470340 7434999 6791248
40517 6791248 6617097 6496474 6142708 5588128 4813089 3861251 3343795 3990422 5444711
40508 5444711 6340119 5998950 5271091 5182428 5611685 6027273 6643812 7763785 8645297
40499H645297k88135r24316j22522R02959P52369N5640K06026R17072Q71496J63125
40489A1179011J35451J007021J585972J473333J689110K653485L282229K869983
40481B5875595K390882K952933M177341N172240O095491P606423R564753J1388270
40473G5223928J2934426J3735413J2008153O141902k691059j0725549j4853321
40466I1773893j4958825j2974565j0655581q703577p170743n865867m558908l277551
40458B3608276k373888k108939k267767k303330j818132r46093l32277n38831
40450A0919019j278497j521726p23771L35931M56996m31254j242218j188344n90843
40441D735293j46141m8605j11072k31359l89289n08698n80017o69865o78674l92205
$$ plain form
40499 8645297 8357162 7432846 7310324 8213283 8965652 9021292 9227318 10144390 11015886 11179011
40489 11179011 11314462 12321483 13907455 15380788 17069898 19723383 23005612 25875595
40481 25875595 28266477 31219410 35396751 40568991 46664482 54270905 63835658 75223928
40473 75223928 88158354 101893767 113901920 120043822 117352763 106627214 91773893
40466 91773893 76815068 63840503 53184922 44481345 37310602 31444735 26885827 23608276
40458 23608276 21234388 19125449 16857682 14554352 12736220 11790127 11457850 10919019
40450 10919019 9640522 8118796 7395025 7730956 8187952 7756698 6514480 5326136 4735293
40441 4735293 4589152 4540547 4429475 4198116 3808827 3300129 2720112 2050247 1371573 979368
40431I79368J14230M43180L50249l7051m76959p23334m54594L52996R82325N98523
40421B128933n21193j096233m76223N34631Q74084N26728J01452k05791n00870
40412A365518n61003j24273M83090P08520N27643K50018q5271m53225l76414M28339
40402B162942J208343R46487j18111p10014k83170M13823O63407O18932M89570
40393E392209m5613r71214j374294o16242N14128P22427m0540o13772k88592L78032
40383C056529N11912J1044n85554q58023p78448m49086O9952O29901R04607O51490
40373C164324R3977j74733J21307N13832L81999j36635l03462J13381M42645O4620
40363D281255p34911j235784j198092q69410m31826K6530K22383o2400n06357
$$ plain form
40431 979368 1093598 1536778 1887027 1849976 1373017 649683 195089 548085 1530410 2128933
40421 2128933 1607740 511507 35284 569915 1443999 1970727 2072179 1866388 1365518
40412 1365518 804515 680242 1163332 1871852 2399495 2649513 2564242 2111017 1734603 2162942
40402 2162942 3371285 4317772 4199661 3489647 3206477 3620300 4283707 4902639 5392209
40393 5392209 5346596 4375382 3001088 2384846 2898974 3621401 3580861 2967089 2678497 3056529
40383 3056529 3568441 3579485 2993931 2135908 1357460 908374 978326 1608227 2512834 3164324
40373 3164324 3258301 3083568 3204875 3718707 4100706 3964071 3660609 3773990 4216635 4281255
40363 4281255 3546344 2310560 1112468 243058 -188768 -162238 60145 -2255 -508612
40354e08612n37495q2956L95926N74796N26933L52271N8909j33117J03434O28678
40344A378767Q31569M24144j58750l87437k83825j68899j26102n5567J8168L7231
40334A509299Q7019J76705Q5208k52940m82569l40274j51541l16713n44987k44801
40324d75594M30410O63661J92476k73852j08881M09055O83049O04980L30756j83314
40314B272746q37888j058744m99679K52998L91323M0300o5561J47603N9733m23350
40304B79481n96763j38700L41792L50081K85070O09534R24916N72663l01366r55914
40294A370794j002324n52961K41458J137051J514280Q75405l82114j246205j187952
40285G67432n86031r9860k967j02191m320M71488R50039Q17343J06433l71506
$$ plain form
40354 -508612 -1046107 -1129063 -733137 -158341 368592 720863 779772 646655 750089 1378767
40344 1378767 2210336 2634480 2475730 2088293 1804468 1635569 1509467 1453900 1472068 1509299
40334 1509299 1596318 1773023 1858231 1605291 1122722 782448 630907 314194 -230793 -475594
40324 -475594 -45184 618477 810953 537101 428220 837275 1520324 2125304 2456060 2272746
40314 2272746 1434858 376114 -123565 129433 520756 561056 495495 643098 702831 279481
40304 279481 -317282 -455982 -114190 235891 520961 1130495 2055411 2628074 2326708 1370794
40294 1370794 368470 -184491 56967 1194018 2708298 3583703 3201589 1955384 767432
40285 767432 181401 81541 78574 -23617 -27937 443551 1393590 2210933 2317366 1945860
40275A945860j68010P8165l17151q65239o34188J82436N20807J44927o7553L28054
40265A148108O33191K30009m37446o31813l39482q292J44660J24950l1485j16428
40255G15972O9644J96724k62144r75673r05131J02007Q22142L90648l71521k11683
40245d29015P24855J312246J143539P56502M95247J92121j34724k03555j04706
40236C752510k28066n00587l86511K44030Q16735P69883J92713l14382j90673
40227D155652N67622J270924J194700N17150R8307J42783r9578q64465j162278
40218E820817m18758K28463l88092j342895r00909N77869J011535j45609j080703
40209C361718n28839M50095M90172j3964q6879k841m66308r81357n92429L71978
$$ plain form
40275 1945860 1777850 1856015 1538864 673625 39437 221873 742680 887607 820054 1148108
40265 1148108 1781299 2011308 1573862 942049 602567 594275 738935 863885 832400 715972
40255 715972 785616 982340 720196 -255477 -1160608 -1058601 -236459 154189 -217332 -429015
40245 -429015 295840 1608086 2751625 3508127 4003374 4195495 4060771 3857216 3752510
40236 3752510 3524444 3023857 2637346 2881376 3698111 4467994 4660707 4346325 4155652
40227 4155652 4723274 5994198 7188898 7706048 7804355 7947138 7847560 6983095 5820817
40218 5820817 5402059 5630522 5242430 3899535 2998626 3576495 4588030 4442421 3361718
40209 3361718 2832879 3282974 3773146 3759182 3672303 3669462 3203154 2221797 1629368 2001346
40199B001346P63004M47402L08039N90163N63524r3663p14532o92286k26139K24819
40189C171677N04979N64533L38849L8753K8590K64943L47184J98000J43645K33986
40179E835139J04596k88251m05673P0958O67132P27433K47701k41900l30945K2860
40169F409050N94069R38260O60208n668j96304N31738J411801J330482L73413
40160A2047049k13477K53935R67950Q75574K20212P8660P01528J231014J079759
40151A7242204O91280O45091Q31035J027299J572834K705186L740157L824558
40143C2279644L277261L262918M136109M984839N035943M784838N362371P270658
40135G0394581J0100634J3194828J6297760J9672642K3753280K8843518L5306369
$$ plain form
40199 2001346 2764350 3211752 3519791 4109954 4673478 4579815 3865283 3172997 2946858 3171677
40189 3171677 3676656 4241189 4580038 4618791 4647381 4912324 5259508 5457508 5601153 5835139
40179 5835139 5939735 5651484 5245811 5316769 5983901 6711334 6959035 6717135 6386190 6409050
40169 6409050 7003119 7941379 8601587 8595919 8399615 8931353 10343154 11673636 12047049
40160 12047049 11833572 12087507 13055457 13931031 14151243 14229903 14931431 16162445 17242204
40151 17242204 17933484 18578575 19409610 20436909 22009743 24714929 28455086 32279644
40143 32279644 35556905 38819823 42955932 47940771 52976714 57761552 63123923 70394581
40135 70394581 80495215 93690043 109987803 129660445 153413725 182257243 217563612
40128B17563612M3362194N1057140N2111551L8614972R221560k5736613n0718563
40121C35475853n7974489n2457272m3674361l5947151k8412566k0947005j5569852
40114H0493157j2793882j0609367p802895n503492m647698m318566l616597l120892
40106B8079768l328060l403980k729669k126657k223004k045236p54492M73517
40098A1942187P2972j299950j657077o82685L0935l65330r06570o93929k54367
40089F186186l70259p56527p08812k63977M7514P8792M0793m1984k82221n46284
40079C383221n71478l57114j27382m058M5572K8002j02547l25469n20629n26785
40069I21333k38904K33613N30930L68291p3161k91478n6090L53228N59828M97885
$$ plain form
40128 217563612 260925806 311982946 364094497 402709469 411931029 386194416 335475853
40121 335475853 277501364 225044092 181369731 145422580 117010014 96063009 80493157
40114 80493157 67699275 57089908 49287013 43783521 39135823 34817257 31200660 28079768
40106 28079768 24751708 21347728 18618059 16491402 14268398 12223162 11468670 11942187
40098 11942187 12015159 10715209 9058132 8375447 8406382 8041052 7134482 6440553 6186186
40089 6186186 5815927 5059400 4350588 4086611 4134125 4212917 4253710 4211726 3929505 3383221
40079 3383221 2811743 2454629 2327247 2323189 2368761 2396763 2294216 1968747 1448118 921333
40069 921333 682429 916042 1446972 1815263 1742102 1450624 1394534 1747762 2307590 2805475
40059B805475K91176j3038l63635n44822l84060o0720M8181j66469m54577o00756
40049E56755o57134o74683m57257J56350Q84413J173874Q00601Q2008n17518p51570
40039E95839n48713M6446P16124R62165O37076J79488N2827J52632Q4187j67536
40029B710535k50924l3119K39867L52634L19546J65648j41835n01787p05378o67068
40019A488119m14531J3702L66754J49011o83524j221607n46999Q45555J396531
40010A393011M47626r14779j310334o45778J83141N18783L27653j33221m70881
40001f04779l22297J96454N32049M75843M21597N37817L44442l84663r72784p77781
39991e54102k00961R12j06938J1633K90784K77540Q2831J47151K96664K9372m11264
$$ plain form
40059 2805475 3096651 3083613 2719978 2175156 1791096 1730376 1778557 1612088 1157511 556755
40049 556755 -100379 -775062 -1232319 -1075969 -191556 982318 1782919 1864927 1347409 595839
40039 595839 47126 93572 809696 1771861 2408937 2588425 2641252 2793884 2878071 2710535
40029 2710535 2459611 2426492 2666359 3018993 3338539 3504187 3362352 2860565 2155187 1488119
40019 1488119 1073588 1087290 1454044 1603055 919531 -302076 -849075 -3520 1393011
40010 1393011 1840637 925858 -384476 -1030254 -847113 -328330 -677 -133898 -604779
40001 -604779 -927076 -730622 -198573 277270 698867 1236684 1581126 1196463 223679 -554102
39991 -554102 -755063 -754151 -861089 -849456 -558672 -281132 -198301 -51150 245514 274886 -136378
39980a36378k86617L34209N41059k9679o78464o64941L3593J022564J731477J417970
39970C284793n9806j458701j288485J04693Q30148J33146n99918j40703O83219
39961A488386M71849m70242p18715J9039O06507K71402m30384n69947o732O02500
39951A263663N77674o3941n74317l91327l3632m39093j343074j318041J15485
39942b206603J486976J303893N6065p21084n93846k68862j14671O6401J87198
39933h04533L5961p492M25651P37860K61482l04903J50296J071781Q71112l98507
39923B038708r44148j45137M45543k15565r03984k87270P85715P30079k28138
39914A275803o39093j86648J99232J38222J42604L38082K45543j35919k22244
$$ plain form
39980 -136378 -422995 -88786 452273 422594 -255870 -920811 -887218 135346 1866823 3284793
39970 3284793 3224987 1766286 477801 582494 1412642 1545788 945870 805167 1488386
39961 1488386 1960235 1489993 771278 790317 1396824 1668226 1237842 667895 661163 1263663
39951 1263663 1841337 1777396 1203079 811752 778120 339027 -1004047 -2322088 -2206603
39942 -2206603 -719627 584266 640331 -80753 -674599 -943461 -1058132 -991731 -804533
39933 -804533 -768572 -776064 -350413 387447 648929 344026 494322 1566103 2437215 2038708
39923 2038708 1094560 949423 1394966 1179401 275417 -11853 773862 1503941 1275803
39914 1275803 636710 450062 649294 787516 930120 1268202 1513745 1377826 1155582
39905A155582R0074K87197K44309L75222O55082M79517k37120o97609l35355L78199
39895B395098O07728J37948n87224r94098p74229j32027K75300J6638n08620n62062
39885a25548n9611M53502O85788P78892O79082J45713n26987o42790j90039J9681
39875A217683l75736o92881l44172J95377J95519j75705k33049J19835L94479
39866C01350L73791L00607L24015K97500R9514k08091m78804n25439k61896M3168
39856B65715J0918j81765O4804O71715O47677m31282j428852j059540K36665R28917
39846b75028N67660Q1052J7738j14310n09529m45214L78931J043246P63054Q3188
39836A590788j74988k74685p84537j188354o15663M72869P77764K14847j0092
$$ plain form
39905 1155582 1245656 1532853 1777162 2152384 2807466 3286983 3049863 2352254 2016899 2395098
39895 2395098 3002826 3140774 2553550 1559452 785223 653196 928496 945134 436514 -125548
39885 -125548 -185159 268343 954131 1733023 2412105 2557818 2030831 1388041 1198002 1217683
39875 1217683 841947 149066 -195106 271 195790 20085 -212964 -93129 301350
39866 301350 675141 975748 1299763 1597263 1696777 1488686 1009882 484443 222547 265715
39856 265715 276633 94868 159672 831387 1479064 1047782 -381070 -1440610 -1203945 -275028
39846 -275028 292632 373684 391422 277112 -232417 -677631 -298700 744546 1507600 1590788
39836 1590788 1415800 1141115 356578 -831776 -1447439 -974570 -196806 18041 7949
39827G949M47454L95331p92877j803916j192328M30094J276208Q52662K38254
39818a41169J80372K59207N4614p4966J80344M07499J94785j34513q0925K37186
39808A082434L86394L12997K11471L5216l17843n74617l83771R3647L65461K79945
39798A491334R5176o695m3602K0389J97445K27070j08345m65839k80123L39986
39788A466796O24853K27395k48164j20376L96506N28501K3021n43095n28845r25
39778A825667L90376K18220j92565j87940L14639O78360M70734J44124L66768
39769D028383R79418J240445R86844Q49726J239621J772361J883316J428872N02813
39760A4911799p22071j742778j984637j624861j481660j731034j541219n39459
$$ plain form
39827 7949 455403 850734 57857 -1746059 -2938387 -2508293 -1232085 -379423 -141169
39818 -141169 39203 298410 353024 278058 458402 865901 1060686 926173 845248 1082434
39808 1082434 1468828 1781825 1993296 2028512 1710669 1136052 752281 845928 1211389 1491334
39798 1491334 1586510 1579815 1536213 1556602 1754047 1981117 1872772 1406933 1126810 1466796
39788 1466796 2091649 2319044 2070880 1950504 2347010 2875511 2898532 2355437 1826592 1825667
39778 1825667 2216043 2434263 2241698 2053758 2368397 3046757 3517491 3661615 4028383
39769 4028383 5007801 6248246 7235090 8084816 9324437 11096798 12980114 14408986 14911799
39760 14911799 14189728 12446950 10462313 8837452 7355792 5624758 4083539 3544080
39752C544080K37341k28682j249949j342968m38498R8803l88656r79098p59829
39743a507456j52640j1860k28546o4255N45149Q31532L17357m68260o07465Q0248
39733a266196P49910M77213n66188j181139n66006O58186J238343Q24847J55829
39724E24799j19673r3304l9046O3137J97169J22867j44038j81451J39023K74635
39714G44118k12041q70001q73669j26153O23015P07718K33071j85728j45112J40293
39704C5511J15052l88559q02834m79356L61527P86373L76707j87467p8609N57225
39694B95570Q68850M36606l18366p64403p02914l57956R154L72726Q58806J357126
39684B055199J337472L83963j048835j840595j396308k95594M88126O56342N62028
$$ plain form
39752 3544080 3781421 3552739 2302790 959822 521324 620127 231471 -747627 -1507456
39743 -1507456 -1660096 -1671956 -1900502 -1964757 -1419608 -588076 -270719 -738979 -1346444 -1266196
39733 -1266196 -516286 -39073 -605261 -1786400 -2352406 -1694220 -455877 368970 524799
39724 524799 405126 311822 272776 335913 533082 655949 511911 330460 469483 744118
39714 744118 532077 -337924 -1211593 -1337746 -714731 -7013 226058 40330 -104782 35511
39704 35511 150563 -237996 -1040830 -1520186 -1158659 -372286 4421 -183046 -261655 295570
39694 295570 1164420 1601026 1282660 518257 -184657 -542613 -533459 -160733 698073 2055199
39684 2055199 3392671 3776634 2727799 887204 -509104 -804698 -316572 339770 901798
39675I01798M87466M03708K44808L178l22150n64187l93332J66437M99228J43608
39665A570562m49245m61423J34099N90227N23003L43536M18554M73060J55339
39656C297712l50136o90948q92586j068475r52201l00248M57032O15341K06776
39647C22267m5856J12625P2921n16466r15632k86669Q96790J315116N86347k93583
39637A247860m24472n8812J28411j1132l73387j010643j580841j176424L54604
39628b904836J576841J127070k56617o98602R8185O42935J92521k13540K38851
39619a97192P23629L17070l71839l01895K58201L47245l9701j68472N7537J26257
39609G50840J169Q2753K99976K27849n2458r7269P3233J05803K5514J0500k00483
$$ plain form
39675 901798 1389264 1792972 2037780 2040958 1718808 1154621 761289 927726 1426954 1570562
39665 1570562 1121317 659894 793993 1384220 1907223 2250759 2669313 3142373 3297712
39656 3297712 2947576 2256628 1364042 295567 -656634 -956882 -499850 115491 322267
39647 322267 276411 389036 461957 -54509 -970141 -1256810 -360020 955096 1541443 1247860
39637 1247860 823388 764576 892987 881855 508468 -502175 -2083016 -3259440 -2904836
39628 -2904836 -1327995 -200925 -457542 -1156144 -1057959 -415024 -222503 -436043 -197192
39619 -197192 526437 843507 471668 169773 427974 775219 735518 567046 624583 750840
39609 750840 752009 834762 1134738 1362587 1310129 1212860 1286093 1391896 1417410 1427910 1227427
39598A227427p69841j013077k53108Q83489J178159N90427Q4251j00245n59944
39589A267538j144013q80729J77832O26988j22591p85474k04162Q29084Q60691
39580F25164n7848p02290n67270k43972j95598j92259N1170M27942P04172P53470
39570F02681N06681o678n63362q52198o48048L9572P68424Q20394K6428p61226
39560f7332o56137Q920K42741l730P0710M81133L28079m18472n44951L50408R41425
39549G32794K85225n63310l17457M08021K75688m50923n21230J5584M729o05341
39539g36220o00620L40333J009990N97301j68922l49131q9336L3385N875N2720
39529I5375K2834k68573n55138m71202q6719K12435J58741j74637l68833p744
$$ plain form
39598 1227427 457586 -555491 -808599 74890 1253049 1843476 1927727 1827482 1267538
39589 1267538 123525 -757204 -579372 47616 -74975 -860449 -1064611 -235527 625164
39580 625164 567316 -134974 -702244 -946216 -1141814 -1334073 -1282903 -854961 -150789 602681
39570 602681 1109362 1102684 539322 -312876 -960924 -921352 -152928 667466 693894 -67332
39560 -67332 -723469 -714549 -471808 -475538 -404828 76305 404384 -14088 -559039 -208631 732794
39549 732794 1018019 454709 137252 545273 820961 370038 -151192 -135608 -130879 -736220
39539 -736220 -1336840 -996507 13483 610784 441862 92731 3395 36780 42655 95375
39529 95375 118209 -150364 -705502 -1176704 -1263423 -1050988 -892247 -1066884 -1435717 -1443461
39519a443461O54273P11699j51910q61538k53696J114646J548203N35022o91489
39510A161749j056722q73364p40688m17825M14692J158889J013871K08065k96102
39501E72565q4513L42595L56340q6718m70064k90914K73714L80838l89957j144060
39491e40174o43568Q20081J526992O25090p08651r99629l70669J64321L96339
39482B70132P00119P33144j66485j403596j422035P2610J438236J285469L01622
39473A809216k1333L33457J69301p11424j025789j02683Q30184L81514q49721
39464H12722j129825k09274L85732j67765p14784o8966J009986R85590q8951p44775
39454F9690l12077L61374M13094J7716k80181l19798j24866K63245N15552K83528
$$ plain form
39519 -1443461 -789188 -77489 -229399 -1090937 -1344633 -229987 1318216 1853238 1161749
39510 1161749 105027 -768337 -1509025 -1926850 -1512158 -353269 660602 868667 572565
39501 572565 488052 830647 1186987 1100269 630205 339291 613005 993843 603886 -540174
39491 -540174 -1183742 -363661 1163331 1788421 1079770 80141 -290528 -126207 270132
39482 270132 970251 1703395 1536910 133314 -1288721 -1216111 222125 1507594 1809216
39473 1809216 1787883 2121340 2290641 1579217 553428 450745 1280929 1662443 812722
39464 812722 -317103 -526377 -140645 -308410 -1023194 -1092160 -82174 903416 814465 69690
39454 69690 -242387 118987 532081 549797 269616 -50182 -175048 88197 603749 887277
39444H87277j14167j2110M90045N83429Q0374k50172K3923L28097J53733j08927
39434B061502J4372K42593J57495l8608l3467l5485k34075k36953K34682O16113
39424B748169K32902o17077j034918o96642m3351M34753N29562J73280m77685
39415A248993r50597q52040k51509M92339J002254R19503J90069n75219o71684
39406E52109l45643m42335q73981n86484N25699J010073K5033j119732p98256
39397b053517N39721J184894O54076o6653k81291j98667o6545Q1065K8372k40058
39387d18603j42825N03470P17836j67031r81660k95955J068060J055452l57858
39378I80886j080024k30847O47023L01029l75151k06242K92974Q5798n46462o20186
$$ plain form
39444 887277 773110 761000 1251045 1834474 1914848 1664676 1688599 2016696 2170429 2061502
39434 2061502 2075874 2318467 2475962 2437354 2403887 2368402 2134327 1897374 2132056 2748169
39424 2748169 2981071 2363994 1329076 632434 589083 1023836 1553398 1726678 1248993
39415 1248993 298396 -553644 -805153 -312814 689440 1608943 1799012 1223793 552109
39406 552109 206466 -235869 -1109850 -1696334 -1170635 -160562 -135529 -1255261 -2053517
39397 -2053517 -1513796 -328902 325174 258521 -22770 -221437 -287982 -206917 -178545 -418603
39387 -418603 -561428 -57958 659878 492847 -488813 -784768 283292 1338744 980886
39378 980886 -99138 -329985 317038 618067 242916 36674 329648 415446 -131016 -751202
39368g51202j4175O40124R22277O87836p2353p83318n60889M34104Q75046J52254
39358A529704o98853o99152l60442m44252m88167J61129Q63664O83994R5123J73201
39348H15949O69254M61639m04879p29940j70940K33988k13245q65618q29054j33419
39338a166265N59618P40894L17082l61034o50405k82718J99320J77912j11072
39329e76668m0157L08122L41193O6485N6009L33950K57342l51144q11812n83508
39319a000188L1610M10616K95685j61105n41836l58134L64958Q08886K99189o29888
39309d80207q73347l20637J22973K5776r7937P3857J39003j00131j78633J20980
39299a568303L13169J51358J41233N37479O77961M0281p41944p05062J21413R27312
$$ plain form
39368 -751202 -765377 -125253 797024 1484860 1412507 629189 68300 502404 1377450 1529704
39358 1529704 830851 131699 -228743 -672995 -1161162 -1000033 -136369 547625 642748 815949
39348 815949 1485203 1946842 1541963 812023 641083 875071 661826 -203792 -1032846 -1166265
39338 -1166265 -606647 134247 451329 90295 -560110 -842828 -643508 -465596 -576668
39329 -576668 -616825 -308703 32490 98975 154984 488934 746276 395132 -416680 -1000188
39319 -1000188 -968578 -557962 -262277 -423382 -965218 -1323352 -958394 -149508 149681 -480207
39309 -480207 -1353554 -1674191 -1551218 -1525442 -1623379 -1549522 -1410519 -1510650 -1689283 -1568303
39299 -1568303 -1255134 -1103776 -962543 -425064 252897 293178 -448766 -1153828 -1032415 -105103
39289a05103J196312R13970J89505o16240q21026k29772L58951K00106k40492
39280H46211m1470O10931O82589K840m42672j39024J38968l43611j039611r68098
39270f92947j94394L91984M38302L81280M32477K22011l24511n67740j10451M51766
39260D27777M03113O0429J93525N78864K44896p55273j057661l5237J008177O64884
39250A733494m62241p55708p9352K60992j70566l46843K55879P12707L23840j76610
39240A295592j703K95565p1732n98458l53145L28862L85644j63692l32646Q5460
39230H69747K36629k48803o80822n68641l61761m96973o21297k96823K31545N01111
39220a436088N01832M02518J04965m29202p96699n99581l8066L44580L45264K25316
$$ plain form
39289 -105103 1091209 2005179 2194684 1578444 757418 527646 886597 1086703 846211
39280 846211 804741 1415672 2098261 2101101 1658429 1519405 1658373 1314762 275151 -692947
39270 -692947 -887341 -495357 -57055 324225 756702 978713 654202 86462 -23989 427777
39260 427777 830890 891319 1084844 1663708 1908604 1153331 95670 60433 1068610 1733494
39250 1733494 1271253 515545 436193 697185 526619 179776 435655 1148362 1472202 1295592
39240 1295592 1293889 1589454 1517722 919264 566119 894981 1280625 1116933 784287 869747
39230 869747 1106376 857573 176751 -391890 -753651 -1250624 -1871921 -2168744 -1937199 -1436088
39220 -1436088 -934256 -531738 -426773 -855975 -1652674 -2252255 -2290321 -1945741 -1600477 -1375161
39210a375161K77065M76301M82784n0949r90027j598127j251035k28746O40338
39201c617557J069204J428598J742144J405990K82727p06735p10394q4575K73817
39192A083219K32300K58191L33304L953n79204o37336L4802O51827N51514O6569
39182A999139j30940j7428l0845k46151k97200j2085L21255L54743O8395k75885
39172A732998l99042k26822L8104J17996K5985J00576N16883R13585P73667J10812
39162C704742n28526p61200p29987o56097m04494J74672P21639O70065O3527l99642
39152A854699k88998J8302N594j70310j7178L75894L74369k28412q50343r32683
39142A40934o32258m01228k75430J3664M72726Q09094Q33666N69683Q6119m57661
$$ plain form
39210 -1375161 -1098096 -621795 -139011 -189960 -1179987 -2778114 -4029149 -4257895 -3617557
39201 -3617557 -2548353 -1119755 622389 2028379 2311106 1604371 893977 809402 1083219
39192 1083219 1315519 1573710 1907014 1910967 1331763 694427 729229 1381056 1932570 1999139
39182 1999139 1868199 1850771 1819926 1573775 1276575 1264490 1585745 1940488 2008883 1732998
39172 1732998 1333956 1107134 1145238 1263234 1289219 1389795 1906678 2820263 3593930 3704742
39162 3704742 3176216 2415016 1685029 1028932 624438 799110 1520749 2190814 2254341 1854699
39152 1854699 1565701 1584003 1589597 1419287 1402109 1778003 2152372 1923960 1073617 140934
39142 140934 -491324 -892552 -1167982 -1154318 -681592 127502 961168 1530851 1616970 1159309
39132A159309p35950n75327k38998m1279J75079P19143J307802J225146L17222
39123C312147p14399j199784j174772r26567m22385L50292Q94488O63934j30398
39114F52556o77940n00800J46756P38924R44233O70072N8688n01769o90286o18024
39104B22410n87002n26620r9930N78399Q40988L37794l92430n54699l2295O11742
39094C98357Q19851M24729l81154j072616j019899j75486N98857M32352l59877
39085c34886n89933J76836R71771P70356r0653m64373j4291M69973L26566j51213
39075A070153l69129l06989l11129m03029l07191j1425J68497Q9236j0082J33472
39065b57616M80323P63305P04984K03622m55582o58483j09992N82540M61206n03116
$$ plain form
39132 1159309 423359 -151968 -390966 -432245 -257166 461977 1769779 2994925 3312147
39123 3312147 2597748 1397964 223192 -703375 -1125760 -775468 119020 782954 652556
39114 652556 -25384 -526184 -379428 359496 1303729 1973801 2032489 1530720 840434 222410
39104 222410 -364592 -891212 -991142 -412743 428245 766039 373609 -181090 -213385 398357
39094 398357 1218208 1642937 1261783 189167 -830732 -1006218 -407361 24991 -334886
39085 -334886 -924819 -747983 223788 994144 903491 439118 424827 894800 1221366 1070153
39075 1070153 701024 394035 82906 -320123 -627314 -638739 -470242 -381006 -391088 -257616
39065 -257616 222707 986012 1690996 1894618 1439036 780553 670561 1253101 1714307 1211191
39055A211191j213763q43736J10406O80781Q10019J062325J287891P10609n21812
39046C293911j050930j80867R25808Q52353R957r0337P35544J095100L35935l54590
39036E571884J16164R09185N19388q41861j504856p92001J29756J05452m61853
39027C751258n43913j05485P0935k70551n55748l25180K04055N80366N98066K35886
39017C639689m29150j063484j181966o54925O9473M15755K38480j46290l39431
39008E48151j90599J17639K50297P8701j49622j37163K9777L0618j14313K6126
38998D89612O35348J233989J198321N13932k59164o66672p39910p31584p25767
38989I48105o04041k98422J9727P6717j22452j69496K56605Q20527Q15920J24391
$$ plain form
39055 1211191 -2572 -846308 -735902 -55121 754898 1817223 3105114 3815723 3293911
39046 3293911 2242981 2062114 2987922 3840275 3850232 3759895 4495439 5590539 5926474 5571884
39036 5571884 5688048 6597233 7116621 6274760 4769904 3977903 4107659 4213111 3751258
39027 3751258 3207345 3101860 3172795 2902244 2346496 2021316 2225371 2805737 3403803 3639689
39017 3639689 3210539 2147055 965089 310164 379637 795392 1033872 887582 548151
39008 548151 357552 475191 725488 804189 654567 517404 547181 577799 463486 489612
38998 489612 1124960 2358949 3557270 4071202 3812038 3145366 2405456 1673872 948105
38989 948105 344064 45642 65369 142086 19634 -149862 106743 927270 1743190 1867581
38979A867581n12064m36440P4535K89794L6842k74240m27258n71481o39047k49800
38969h41578N91684J234850J143208N48490M4770j45441j75151j42938o8838j16334
38959B072722m08568o81136n07956Q9824N72934N01563n947m90836o16744l54873
38949A70983P1864L21389J91844j27491k15731N3959L20162K24728q2991j84197
38939G44519j614J56952J20436L8840m339j41054l17096j95634K36963M31991
38929A069964J01359j79048J59477O26191M01513j69089j5358P29277O83506m70006
38919B937786j168517m03777M83379j03950j324490j207076J04538O39170r0445
38910a33382m35457L75937R27971K42499m54532l288N33181j86170j173036o29223
$$ plain form
38979 1867581 1355517 919077 993612 1283406 1320248 1046008 618750 47269 -591778 -841578
38969 -841578 -249894 984956 2128164 2676654 2721424 2575983 2400832 2257894 2189056 2072722
38959 2072722 1664154 983018 475062 564886 1137820 1639383 1633436 1142600 525856 170983
38949 170983 242847 564236 756080 628589 412858 466817 786979 1011707 928716 744519
38939 744519 742905 899857 1020293 1059133 1054794 913740 596644 401010 637973 1069964
38929 1069964 1171323 992275 1151752 1777943 2179456 2010367 1995009 2724286 3407792 2937786
38919 2937786 1769269 1365492 1848871 1744921 420431 -786645 -682107 -42937 -133382
38910 -133382 -568839 -192902 735069 977568 523036 519748 1052929 866759 -306277 -935500
38900i35500Q95404J215228k1355q87525k93907O08534O35009K41816J61344m57
38890A618591p05289j270593r13496j39019N1789k68296k31015L85920R54872
38881e16536J007809O47981J03818m45674p01623m75427j4691L31865N94527Q88567
38871A420616R05412K97443n57548q18695k80056L15464K22654m40229r73420
38862I1641r50946n38071r6858K41009N23262O73269N04650R6092j39068J944
38852D06924J50914p4847l84353k21208K69353L70306n7999l09896L0603M18799
38842E98596K56552j63340k05426Q8609J69275j27357m46218m96106k88202M6453
38832e67164K90816K06537q5034q3317L52903O32496K87881k07025j21700L65068
$$ plain form
38900 -935500 -40096 1175132 1153777 266252 -27655 580879 1215888 1457704 1619048 1618591
38890 1618591 913302 -357291 -1270787 -1409806 -1358017 -1626313 -1857328 -1471408 -516536
38881 -516536 491273 1139254 1243072 797398 95775 -379652 -394343 -62478 532049 1420616
38871 1420616 2326028 2623471 2065923 1247228 967172 1282636 1505290 1065061 91641
38862 91641 -859305 -1397376 -1494234 -1253225 -729963 -56694 447956 544048 404980 406924
38852 406924 557838 482991 98638 -122570 146783 517089 459090 149194 179797 598596
38842 598596 855148 691808 486382 574991 744266 616909 170691 -325415 -613617 -567164
38832 -567164 -276348 -69811 -154845 -238162 114741 747237 1035118 828093 706393 1071461
38822A071461M55383q148l98344l71980k51871k44448q4544K80295L72065n4348
38812G65521m91198l69134J37456M32022L29019J47075J51558K79402L44386K36354
38802A962461m7291l64760m58788j96262K23614M27015K44354j52279m91919o73103
38792D73042p17230n76039k24115N0110j87515q17914j015552k80339O67845P31646
38782a896061M1487j70050N93201J360657J182323L83311k52389o13855p96573
38773a67949m16733N68939J131468M85922m67500l69618M31393M95426k47602
38764A443746m58875J45129K41721o54015j083038j8230J228988Q79858o20412
38755A104872j280699l31601J028822J376083M74413q77248j578549r98780L12018
$$ plain form
38822 1071461 1526844 1518696 1120352 748372 496501 252053 167509 447804 819869 765521
38812 765521 274323 -94811 42645 474667 803686 950761 1102319 1381721 1726107 1962461
38802 1962461 1915170 1550410 1091622 895360 1118974 1545989 1790343 1638064 1146145 473042
38792 473042 -244188 -820227 -1044342 -994232 -1181747 -1999661 -3015213 -3295552 -2627707 -1896061
38782 -1896061 -1854574 -2024624 -1431423 -70766 1111557 1494868 1242479 628624 -167949
38773 -167949 -584682 -15743 1115725 1601647 1134147 764529 1195922 1691348 1443746
38764 1443746 984871 1130000 1371721 717706 -365332 -383562 845426 1725284 1104872
38755 1104872 -175827 -507428 521394 1897477 2371890 1494642 -83907 -1082687 -770669
38746g70669R67345L74476m55987l85927K07276K04339m03628o31503j82051K32490
38736h43839K21897J96557L58772K84488j82362n20620l70728l6576J47273K43849
38726e01289K52042l6719m15490k71015L80811O43917O6031n19377j93704N97161
38716B368O71491j54891q87299q19764l03354J04911M63441R83771J301395Q35139
38706B197208k77588j133173j050454k88213L62512M56939J71046j07215j60121
38697A70941K9757L24858M60905K86030K9143O7607L71219N02036K67579k2418
38687B487657j34252k73141n32867m86697J05018N74617J03672r49180j302454
38678d07627m57534N79201O01894l11517j032266p62095K06259R49648Q47376
$$ plain form
38746 -770669 196676 571152 115165 -270762 -63486 140853 -262775 -894278 -1076329 -843839
38736 -843839 -621942 -425385 -66613 217875 35513 -485107 -855835 -892411 -745138 -501289
38726 -501289 -249247 -285966 -701456 -972471 -591660 52257 118288 -401089 -594793 2368
38716 2368 673859 518968 -368331 -1188095 -1491449 -1386538 -923097 60674 1362069 2197208
38706 2197208 1919620 786447 -264007 -552220 -189708 267231 438277 331062 170941
38697 170941 200698 525556 986461 1272491 1301634 1369241 1740460 2242496 2510075 2487657
38687 2487657 2353405 2080264 1547397 1060700 1165718 1740335 1844007 894827 -407627
38678 -407627 -865161 -285960 315934 4417 -1027849 -1789944 -1583685 -634037 213339
38669B13339R2671n98178p73007o38177n55259m01468J76423J018861J493130
38660B8335J310590Q22132M13640P7989k85801o02540p95582q12297m17403M87918
38650B26981J263174R94470j44578q06109k70747M55552J44233p47847p99527
38641C15602J08299N73306j51106j006977p40891K83293P45965L11183o1967L35625
38631G12332R59743Q62929J7522o95219o51599j83065O221k18965l95235k44960
38621A69704n1663j15365k24457j7336L67338M42976J10225j92630j23324J69666
38611E35134L95029M90135M72442K70542n1290k05549j09653j21441m91787q35742
38601C47820o12773K5282M07111L22407K30058L78969L70038o7057m44988k19097
$$ plain form
38669 213339 306010 -292168 -1065175 -1703352 -2258611 -2660079 -2483656 -1464795 28335
38660 28335 1338925 2161057 2574697 2652686 2366885 1764345 968763 156466 -260937 226981
38650 226981 1490155 2484625 2340047 1533938 1263191 1718743 1862976 1115129 315602
38641 315602 423901 997207 846101 -160876 -901767 -618474 127491 438674 376707 712332
38631 712332 1672075 2535004 2552526 1857307 1205708 1022643 1028864 809899 414664 169704
38621 169704 118041 2676 -221781 -239117 128221 571197 681422 488792 365468 535134
38611 535134 930163 1420298 1892740 2163282 2111992 1906443 1796790 1675349 1183562 347820
38601 347820 -264953 -239671 167440 489847 719905 1098874 1468912 1401855 956867 737770
38591G37770L00849M14134J53555J66276N14881M64531k59579p96124l12620O91180
38581B074853R87438L06244l19994L9227J065095J700666J418931O58806J81974
38572H113240L03312P70176J209937J556732K033280K808514L744408M394525
38564B4934124M160167K654102K33885j955984k962887l051406l170996l349392
38556A7491613k517046l97663J423292J377030K06927l84J137571J778429O74126
38547B1173895j041110j730240j624381j995414k782440k661838j339111k37776
38539G761585m69377j285435j297109m55243J02811j84284o44635n48410j46026
38530B833877j13888m62452o03755l42113j50114l24644m64149j76658J70140
$$ plain form
38591 737770 1038619 1452753 1606308 1772584 2287465 2751996 2492417 1696293 1383673 2074853
38581 2074853 3062291 3368535 3048541 3087768 4152863 5853529 7272460 7931266 8113240
38572 8113240 8416552 9186728 10396665 11953397 13986677 16795191 20539599 24934124
38564 24934124 29094291 31748393 31982278 30026294 27063407 24012001 20841005 17491613
38556 17491613 14974567 14576904 16000196 17377226 17584153 17583769 18721340 20499769 21173895
38547 21173895 20132785 18402545 16778164 14782750 12000310 9338472 7999361 7761585
38539 7761585 7292208 6006773 4709664 4254421 4357232 4172948 3528313 2979903 2833877
38530 2833877 2719989 2257537 1653782 1311669 1161555 836911 372762 196104 366244
38521C66244J1252m03748l28945K17151L79630j27924m28773J58378R02308O40438
38511A386011m42787r73130k65629Q16834J085510M23860l76543o78842m73187
38502E02097o4971K86708M49878L77875N9375m70136j006024j173288p79332j26961
38492a944779L06382M83591P29498R88838O84583l48013j227359r26433L29660
38483i24032J192401Q33606q7097m04946M0646L83226R733p04649j000486o16631
38473a278229J06650O64250P30102L57067K4878J82980N48847K77557q16773j670684
38463h73355j221435O1929P02039K08404l27942J22609J088479J327205M77908
38454A565841o10457r65395m33943L60790O93335M15635P5816K14505N88193M93187
$$ plain form
38521 366244 377496 -26252 -355197 -138046 241584 113660 -315113 -156735 745573 1386011
38511 1386011 943224 -29906 -295535 521299 1606809 2030669 1654126 975284 502097
38502 502097 437126 723834 1173712 1551587 1610962 1140826 134802 -1038486 -1817818 -1944779
38492 -1944779 -1638397 -1154806 -425308 563530 1248113 900100 -327259 -1253692 -924032
38483 -924032 268369 1101975 1014878 609932 650578 1033804 1043537 338888 -661598 -1278229
38473 -1278229 -1171579 -507329 222773 579840 604718 787698 1336545 1614102 797329 -873355
38463 -873355 -2094790 -2032861 -1330822 -1122418 -1450360 -1327751 -239272 1087933 1565841
38454 1565841 955384 -10011 -443954 -83164 610171 1025806 1101622 1316127 1904320 2397507
38444B397507j27839n17503k55940R8452n1422m10224m13893k29579l57720o21744
38434d89905m09659K62641P48711P68660O46733N55070K79569j50898l10498o9940
38424A830484J40300J406k40618k22230L3276K52664K41496k9802l91898n34434
38414A080644l88312l11522n10437n41284R108O09004L95421m09152o92385j49145
38404i08060L05244J22000k6815M15221P71895K69743n29472n13072K72609P71746
38394I51039N09150L0899j41575r1138j9542L4320o9931m24325o11036j03691
38384F4170P55711R13984J9456r52143q91140O8120P94993N39003l14361p82804
38374B14989l60294M51895O77909n19p87668p06902J49553P41849M53028j83647
$$ plain form
38444 2397507 2269668 1752165 1496225 1594677 1543255 1133031 719138 489559 131839 -489905
38434 -489905 -899564 -636923 111788 880448 1527181 2082251 2361820 2210922 1900424 1830484
38424 1830484 1970784 1972190 1731572 1509342 1542618 1795282 2036778 2006976 1615078 1080644
38414 1080644 692332 380810 -129627 -670911 -661803 -52799 342622 -66530 -758915 -908060
38404 -908060 -602816 -480816 -507631 -92410 679485 949228 419756 -93316 179293 951039
38394 951039 1460189 1491088 1349513 1258375 1238833 1273153 1203222 778897 167861 64170
38384 64170 819881 1733865 1753321 801178 -89962 -21842 773151 1312154 997793 214989
38374 214989 -145305 306590 984499 983980 196312 -510590 -361037 380812 833840 650193
38364F50193l31281N5605L76206L02478N1039j55006l76836n93506m86978P6943
38354d31143O19033N53102N5786r4715L12293N03370q9628p69423m89726M73965
38344F42914Q03475J30462l96611J8675N02900n5725j118879j228057j76771P79049
38334i8568P79369K87720L2614M0050L9632K7913O1545Q5668J96017M92970N77132
38323B522062o8569j042224j240857m26553L31783K43946j11451M7629L61013
38314F16779R3850m63682m93305r4598l4231k60020P7467J013757J380602M71825
38304B308444q43436j280376p28750k7618L45661N94294Q12765O48538n8707p94110
38294I76705q90243l58913J37954J44990j07541k42920l52379o06476n73342K63759
$$ plain form
38364 650193 318912 374517 750723 1053201 1104240 949234 572398 -21108 -508086 -431143
38354 -431143 187890 740992 796778 702063 1014356 1517726 1428098 658675 168949 642914
38344 642914 1446389 1576851 1180240 1198915 1701815 1646090 527211 -700846 -877617 -98568
38334 -98568 680801 968521 1001135 1041185 1080817 1108730 1170275 1255943 1451960 1944930 2522062
38323 2522062 2453493 1411269 170412 -256141 75642 319588 208137 255766 616779
38314 616779 710629 246947 -246358 -340956 -375187 -635207 -557740 456017 1836619 2308444
38304 2308444 1465008 184632 -544118 -571736 -226075 368219 1180984 1829522 1770815 976705
38294 976705 86462 -272451 -134497 10493 -97048 -339968 -692347 -1298823 -1872165 -1608406
38284a608406J328385J313764J09782o98073n6033Q29942K59384j192609j360629
38275a074493K27013J568104J113874j76302n71513L314M51396M27278M39175
38266B407846N76971M02073j02185m87075o19991o81354n77201j71939J19075
38257H66220j54799n69144l66533K44914L69902n1006j43234L36772N34953n288
38247A062757n09616k61310K49398K47755m9917J8207L31590K74030j08365j93174
38237A061355J07369J96673j92013n74428m97321j65536k2357j05067j16477P4972
38227b32830K77648K93594K19264K88747M16233J51403o41579j284299r82604
38218a494423J6562N99752K57208k98032k77722J23446L13842K93118L73835M28749
$$ plain form
38284 -1608406 -280021 1033743 1143525 445452 389419 1219361 1478745 286136 -1074493
38275 -1074493 -847480 720624 1834498 1658196 1086683 1089997 1541393 1968671 2407846
38266 2407846 2984817 3386890 3284705 2797630 2177639 1496285 919084 747145 866220
38257 866220 711421 142277 -224256 20658 390560 339554 196320 533092 1068045 1062757
38247 1062757 553141 291831 541229 788984 739067 757274 1088864 1362894 1254529 1061355
38237 1061355 1168724 1365397 1173384 598956 101635 -63901 -86258 -191325 -307802 -232830
38227 -232830 44818 338412 557676 846423 1262656 1414059 772480 -511819 -1494423
38218 -1494423 -1477861 -878109 -620901 -918933 -1196655 -1073209 -759367 -466249 -92414 336335
38208C36335J85644r4134o462K23310J44872k5007J96408M80751N6618q49118
38198F49217j046485j45328P23631M70335m70642q65574l40530L59005M79934
38189a86437N9761l14164j91719L00841O12203M20574L7772p1335L6576M8686
38179G52758J28155O60842J299057J126578K4912r39035r03146k71709R8282Q7431
38169B064125O5911K7105k84345p12545q28034n29514j3649N85640J054334R49821
38159B378849J83149n45495n31783o5301J2590m26763o97652m17930k546Q4441
38149b8441n1158q8059J6934J41234K49259K98944J50045k24726n83723o12490
38139g32181k24027L39187O47956M38391o3955l23728j51550K5834k19573o52041
$$ plain form
38208 336335 521979 427845 421383 644693 789565 764558 960966 1441717 1498335 649217
38198 649217 -397268 -542596 181035 651370 180728 -684846 -1025376 -666371 -186437
38189 -186437 -126676 -440840 -632559 -331718 280485 701059 738831 667496 704072 752758
38179 752758 880913 1541755 2840812 3967390 3992302 3053267 2150121 1878412 1976694 2064125
38169 2064125 2130036 2157141 1872796 1160251 332217 -197297 -210946 374694 1429028 2378849
38159 2378849 2561998 2016503 1484720 1419419 1432009 1005246 307594 -110336 -112882 -28441
38149 -28441 -79599 -167658 -150724 -9490 239769 538713 688758 464032 -119691 -732181
38139 -732181 -956208 -617021 30935 469326 405371 81643 -69907 -44073 -263646 -915687
38129i15687o57592o9064O31778Q94051O20281J54333n6585J32016L58950J36841
38119A229322m39841o77418k00809M84822P03430N00446L44157K75308j6337m60468
38109A742612o29810m57535k92665j93406J92134Q48002J082502L92167p10610
38100A973391j168644o07113K29212L80159j55440m43534R1789P95773O84955
38091A780548o2822l49021J07448L15651k97680q16746k82750O63508O89588k40235
38081A507489r42087p49289o6360N89132J011371R18348K10695m59186l87232
38072A632881M0202n1911m99047m07683J75426L42351M2641J25519N27664K01352
38062B129395p36487p11351O40316J422623L34760j160216j096812M1386M80187
$$ plain form
38129 -915687 -1573279 -1642343 -1010565 -116514 503767 658100 601515 733531 1092481 1229322
38119 1229322 789481 112063 -88746 396076 1099506 1599952 1944109 2219417 2203080 1742612
38109 1742612 1112802 655267 362602 169196 361330 1209332 2291834 2684001 1973391
38100 1973391 804747 197634 426846 807005 651565 208031 299820 1095593 1780548
38091 1780548 1717726 1368705 1476153 1791804 1494124 677378 394628 1058136 1747724 1507489
38081 1507489 565402 -183887 -250247 338885 1350256 2268604 2479299 2020113 1632881
38072 1632881 1673083 1621172 1122125 714442 889868 1232219 1274860 1400379 1928043 2129395
38062 2129395 1392908 681557 1321873 2744496 3079256 1919040 822228 863614 1343801
38053A343801R2340R0398N34204L38936m82351o52822J64388P99873N23377k8449
38043B723695k56076m62090q05354p18022M516O44724P05260O13385P10276N36704
38033C697018j92132p99941o01821Q3598N76399P89075Q31621M04366n28935j075182
38023C184066m49237O98013J021427L47552k44440j71939o9833m72810q03815
38014C038984l49307M47111N29647k13369p83993n10231J01474K56583m631j34862
38004B377406j15947l83616q04619o03196L95098J209545R62409J14462k78950
37995B872592j12299j20160m29079k94140N28079J142460P66370j47487o92626
37986C513710q16036j045018j298246r25252Q2678Q06683O19781K6167j45630
$$ plain form
38053 1343801 1436141 1526539 2060743 2399679 1917328 1264506 1428894 2228767 2752144 2723695
38043 2723695 2467619 2005529 1200175 482153 486669 1131393 1836653 2450038 3160314 3697018
38033 3697018 3504886 2704945 2103124 2186722 2763121 3552196 4383817 4788183 4259248 3184066
38023 3184066 2734829 3432842 4454269 4801821 4557381 4385442 4315609 3842799 3038984
38014 3038984 2689677 3136788 3666435 3453066 2669073 2158842 2260316 2516899 2512268 2377406
38004 2377406 2261459 1877843 1073224 470028 865126 2074671 3037080 3151542 2872592
37995 2872592 2760293 2640133 2211054 1916914 2444993 3587453 4353823 4206336 3513710
37986 3513710 2697674 1652656 354410 -570842 -488164 318519 938300 964467 818837
37977H18837J21510K63123J64035K52391N91361N85857j01068q58369q43023j13535
37967H81119M74865M17579Q9541O0056L41637N33166L83284l3781m81571o75746
37957A990149m07137K17945P37285P06020J17374n76379q37497n16148m3458L368
37947A391522l25125l15916L37780Q46260L68840n60068o21146L12862R29551
37938B364560M92080r5830J09360N45646K18321n37636o17465K1958L73181N1431
37928B925606k33094M6463M95021N61761K70565m0574j31283J01729N07641O39023
37918E142858L21044P7694L78863P47547M62575o9350K74127J503137K238248
37909A1076743J621143N30030L54300J304654K515048L263038L518125L638987
$$ plain form
37977 818837 940347 1203470 1367505 1619896 2211257 2797114 2696046 1837677 994654 881119
37967 881119 1355984 1773563 1863104 1923160 2264797 2797963 3181247 3147466 2665895 1990149
37957 1990149 1583012 1800957 2538242 3244262 3361636 2785257 1947760 1431612 1388154 1391522
37947 1391522 1066397 750481 1088261 1934521 2303361 1743293 1122147 1435009 2364560
37938 2364560 2856640 2760810 2870170 3415816 3634137 3096501 2479036 2500994 2874175 2925606
37928 2925606 2692512 2738975 3233996 3795757 4066322 4025748 3894465 3996194 4503835 5142858
37918 5142858 5463902 5541596 5920459 6668006 7130581 7061231 7335358 8838495 11076743
37909 11076743 12697886 13227916 13582216 14886870 17401918 20664956 24183081 27822068
37901B7822068M006113M759217N576572N792752M838779K558005o51037l765041
37893E0937428n626118o004140n800129n681629n134937l683754k272024k078219
37885A4656478k489374j952560o22984k18704j069265j418044l41895O89083L10948
37876G543683n12827k88152M88196L66837n68467j056384p84521m51023k02391
37867D534951L39711P89565L09847q55534j509074j147188l38428M11575J011869
37858C547294J151098N46071j91495j07639O21995Q49431J34626p49580j024351
37849D777450o42930J48082R88206J210523N11922k71747j37615N25676O09812
37840G719379K83889P09179J765013J943016R27944L46582J101210J825475J282543
$$ plain form
37901 27822068 31828181 36587398 42163970 47956722 52795501 55353506 54702469 50937428
37893 50937428 45311310 39307170 33507041 27825412 22690475 19006721 16734697 14656478
37885 14656478 12167104 10214544 9591560 9372856 8303591 6885547 6543652 7232735 7543683
37876 7543683 7030856 6742704 7230900 7597737 7029270 5972886 5188365 4737342 4534951
37867 4534951 4874662 5664227 5974074 5118540 3609466 2462278 2123850 2535425 3547294
37858 3547294 4698392 5244463 5052968 4945329 5567324 6416755 6551381 5801801 4777450
37849 4777450 4134520 4282602 5270808 6481331 6993253 6721506 6583891 7109567 7719379
37840 7719379 8003268 8712447 10477460 12420476 13348420 13695002 14796212 16621687 17904230
37831A7904230O47196J660003L684357M568798L829339L031242L130188L239059
37823D1694412K387970J062244L61727O31707J560163K899592M446662N798852
37815F0843329O792860Q010457J0357376J4148084J8905380K3993873K8907823
37808A71959182L2433605L1747620K3495453P056008j3084443k9281814l6137364
37801A88188247l4196825k8292845k2750915j8640918j5027130j1483764q682021
37794D9113829p095570o133811m917217l476397k612464k599213k652775k040827
37786A7585555j193867j057236j626205j937490j492644q54848o41371p15754
37778H066140p30901p41793p86735m99885K48294Q20896N78661j78673o49600
$$ plain form
37831 17904230 18551426 20211429 23895786 28464584 32293923 35325165 38455353 41694412
37823 41694412 44082382 45144626 45506353 46138060 47698223 50597815 55044477 60843329
37815 60843329 67636189 75646646 86004022 100152106 119057486 143051359 171959182
37808 171959182 204392787 236140407 259635860 266691868 253607425 224325611 188188247
37801 188188247 153991422 125698577 102947662 84306744 69279614 57795850 49113829
37794 49113829 42018259 35884448 30967231 27490834 24878370 22279157 19626382 17585555
37786 17585555 16391688 15334452 13708247 11770757 10278113 9423265 8781894 8066140
37778 8066140 7335239 6593446 5806711 5306826 5555120 6376016 6954677 6776004 6126404
37769F126404o12384m59618m06939l17651j80399j58094k17450k09532k21819
37760C342518l61316l34104J79721Q13236Q03807M5706p09258p98792l07589K86693
37750B960622O09489M38281k02253q22341q44714l85108j51943l77521m51919
37741G72593M3208N73314M85841Q0531R2805M24334K55101o10950j341858j222156
37731d47237n18451R6625L88515M56634L39524K10614M89442J160157J370123
37722C545946M36589r81919j521584q53414K7751L03765K39777L40577M86499
37713B023987M11808L18776M10246L94079O5934j64489J601L8159o00821j409597
37703A489683j451901p29670j4947M16136Q60520J145073O43399n22639j308522
$$ plain form
37769 6126404 5514020 5054402 4647463 4329812 4149413 3991319 3773869 3564337 3342518
37760 3342518 2981202 2647098 2826819 3640055 4443862 4489568 3780310 2981518 2673929 2960622
37750 2960622 3570111 4008392 3806139 2983798 2139084 1753976 1602033 1224512 772593
37741 772593 815801 1389115 1874956 1955487 2048292 2472626 2727727 2116777 774919 -447237
37731 -447237 -965688 -869063 -480548 -23914 315610 526224 1015666 2175823 3545946
37722 3545946 3982535 3000616 1479032 625618 653369 957134 1196911 1537488 2023987
37713 2023987 2435795 2754571 3164817 3558896 3624830 3460341 3461942 3500101 2899280 1489683
37703 1489683 37782 -691888 -706835 -290699 569821 1714894 2358293 1835654 527132
37694E27132j061745k10787N52833R71935R30476L40788l97840o26595l53210
37685F72987j59796p3835M39572J144583R49499l10956j246743q60440m082P3835
37675F24624l70637k69136M67062J057697J172182R93272M64135m13975r87614
37666B737610p51238k89818l28729l95693K76454J043591O35972o11314j030547
37657A286288j82355N53520K63651k67483j81449J22921P9006M2214L46964L94245
37647B457522k93987j013290q89576k10572K16509L39125N02805M79446m6306
37638A541676n25449k26403M73453O06863J75757J1794K02744n0341q36143j069336
37628C04615j52063R36440R55105P5227n68447n17910l29174m60776o27310l77513
$$ plain form
37694 527132 -534613 -745400 -192567 779368 1709844 2050632 1652792 1026197 672987
37685 672987 513191 439356 878928 2023511 2973010 2662054 1415311 554871 550789 624624
37675 624624 253987 -15149 451913 1509610 2681792 3675064 4139199 3725224 2737610
37666 2737610 1986372 1696554 1367825 972132 1248586 2292177 2928149 2316835 1286288
37657 1286288 1103933 1657453 1921104 1653621 1472172 1595093 1674099 1716313 2063277 2457522
37647 2457522 2163535 1150245 260669 50097 266606 605731 1108536 1587982 1541676
37638 1541676 1016227 789824 1263277 1870140 2045897 2057691 2260435 2210094 1373951 304615
37628 304615 152552 1088992 2044097 2119324 1550877 1032967 703793 243017 -384293 -761806
37618g61806K43950Q28817J045898P63650L4465p87690j116657o56767J55733
37609b50407N19704J83196k37018n1673N58655P48416J70051m70515l09092M73357
37599A334674Q02484J00955r08810j081412k67981N60077N63118l7117m52921
37590F13067l69547j13459O894N8910J79843L22144M11996M30382K35181l20058
37580A455353r17970q64515j220Q26492P13235r7240n14227p0735N19376M63389
37570A511938r691j07337K94768N01661J01119l86277l15801O3678K7840l74114
37560A307784l23478L46587O64214M5184n69058j23775O65932K73824j069129
37551A218085j465039k63213Q55491M73138m91591m99375J80770L10623m7564
$$ plain form
37618 -761806 -517856 310961 1356859 2120509 2154974 1367284 250627 -406140 -250407
37609 -250407 269297 452493 215475 163802 722457 1470873 1640924 1170409 861317 1334674
37599 1334674 2137158 2238113 1329303 247891 -20090 539987 1103105 1065988 613067
37590 613067 243520 130061 136955 195865 375708 697852 1109848 1540230 1775411 1455353
37580 1455353 537383 -327132 -328352 498140 1211375 1114135 599908 529173 1048549 1511938
37570 1511938 1502247 1394910 1689678 2191339 2292458 1906181 1590380 1654058 1681898 1307784
37560 1307784 984306 1330893 1995107 2040291 1471233 1347458 2013390 2287214 1218085
37551 1218085 -246954 -510167 345324 818462 326871 -172504 8266 318889 271325
37542B71325J27649P72777Q31224J85816j91923m7547j90709q18537j013382l46625
37532d19932L46333L23724n7495j98088j09183L6999K61039L22969j25506o81354
37522c00494n67106o4465k34643r02112n52855J078384K055897J026005o08695
37513I29916p85565K38359P21043K61848j01720k9400j81312n62914l50893M68637
37503F07999P91789O1332r28650j198649o30223L02604R87266Q19497k29105j187549
37493f03689j074432k07410L66736M92568P98458J163672P32851m06792j013972
37484B47990n52815O6705J03513L3366L31318M71988J0937m31217k37985Q7895
37474A31695r6244l16022J65519R12991R47969L41644k4228L3862o3284l86547
$$ plain form
37542 271325 398974 1171751 2002975 2188791 1996868 1949321 1758612 940075 -73307 -419932
37532 -419932 -73599 250125 192630 -5458 -114641 -77642 183397 506366 380860 -300494
37522 -300494 -867600 -932065 -1166708 -2068820 -2621675 -1543291 512606 1538611 929916
37513 929916 144351 382710 1103753 1365601 1263881 1234481 1053169 490255 139362 607999
37503 607999 1399788 1461120 532470 -666179 -1296402 -993798 -6532 812965 583860 -603689
37493 -603689 -1678121 -1885531 -1518795 -1026227 -227769 935903 1668754 1261962 247990
37484 247990 -304825 -238120 -134607 -101241 230077 702065 713002 281785 43800 131695
37474 131695 35451 -280571 -115052 797939 1745908 2087552 2063324 2097186 2033902 1647355
37464A647355l76864j3166N0488l10824m16545J5032L96472L83395M63171Q86401
37454B724915R52186J35667q30748r25138l35643m082o8827J20602N96632N90767
37444B956331p8149n75255m17856k23342m91238o35459r2475M65365J44915n51802
37434E01035m15449M94013R24311M35323m1837J56738N51784O55995P01676P19089
37424D682678J89462o74263o24647O67446J636496J069475J51866O36243J897977
37415I632733J832099K73351o30981L43691J853727K205388J579442J137825J166756
37406A9394031J136099P77040J86640n98072j444233j975252k044170j921431
37398A3510652j758500j450965j193043j357062j599861j082747M0768M73379
$$ plain form
37464 1647355 1270491 1257325 1307813 996989 580444 595476 991948 1375343 1838514 2724915
37454 2724915 3677101 3812768 2982020 2056882 1721239 1717157 1648330 1768932 2365564 2956331
37444 2956331 2878182 2302927 1885071 1661729 1170491 535032 442557 907922 1052837 501035
37434 501035 85586 579599 1503910 1939233 1897396 2054134 2605918 3261913 3963589 4682678
37424 4682678 4872140 4197877 3573230 4240676 5877172 6946647 7098513 7734756 9632733
37415 9632733 11464832 11738183 11107202 11450893 13304620 15510008 17089450 18227275 19394031
37406 19394031 20530130 21307170 21493810 20895738 19451505 17476253 15432083 13510652
37398 13510652 11752152 10301187 9108144 7751082 6151221 5068474 5109242 5582621
37390E582621k94458j062393p72836j36976k68265p23286l77638M67665N28967
37381B943401k33400n21256J22190O30296K56762l30136l80570k50594m83613
37372A753080p18903m25834L4078M2165j21855K45209R56748J096831M28861k59097
37362C031283l27813j1563K52022M70009O78270N22077j65344p93295o68683J2313
37352B999276M52528L92954K95368M09990L98832Q2911j19736J26555M96933N20624
37342F056235K35976m9403k07478j12745M77544J394730J929497J765181J478435
37333A2967972J510045J361320P07824N76520K117215M629347O224083O235412
37325C6329738N493479M323389K049668j182765l849489n014782n356380n484537
$$ plain form
37390 5582621 5288163 4225770 3452934 3315958 3047693 2324407 1946769 2414434 2943401
37381 2943401 2710001 2188745 2310935 2941231 3197993 2867857 2487287 2236693 1753080
37372 1753080 1034177 608343 642421 684586 562731 807940 1764688 2861519 3290380 3031283
37362 3031283 2703470 2691907 2943929 3413938 4092208 4614285 4448941 3655646 2986963 2999276
37352 2999276 3451804 3844758 4140126 4550116 4948948 5031859 4912123 5038678 5535611 6056235
37342 6056235 6292211 6242808 6035330 5922585 6400129 7794859 9724356 11489537 12967972
37333 12967972 14478017 15839337 16547161 17123681 19240896 23870243 30094326 36329738
37325 36329738 41823217 46146606 48196274 47013509 43164020 38149238 32792858 27308321
37317B7308321m818909l174469j928774k171760k877611k462762j226433o36906
37309H010697r34810j138441r38166q84226r43937n07004K39144M46233J04222
37300C453712m2441m6063o48571j509564j253835K53819J312856Q06711k34492
$$ plain form
37317 27308321 22489412 19314943 17386169 15214409 12336798 9874036 8647603 8010697
37309 8010697 7075887 5937446 4999280 4115054 3171117 2664113 2903257 3349490 3453712
37300 3453712 3411271 3365208 2716637 1207073 -46762 207057 1519913 2326624 2092132
$$ [...]
##END NTUPLES=NMR SPECTRUM
##END=
