##TITLE=31Pdec_PR90_R9
 DMSO-d6, 48 sc
 9.1.2019
##JCAMPDX= 6.0         $$ Bruker NMR JCAMP-DX V2.0
##DATA TYPE= NMR SPECTRUM
##DATA CLASS= NTUPLES
##ORIGIN= UXNMR, Bruker Analytische Messtechnik GmbH
##OWNER= root
$$ XWIN-NMR		Version 3.5
$$ Wed Jan  9 14:49:19 2019 Russian Standard Time (UT+4h)  she@DPX200
##.OBSERVE FREQUENCY= 81.013821
##.OBSERVE NUCLEUS= ^31P
##.ACQUISITION MODE= SIMULTANEOUS
##.ACQUISITION SCHEME= undefined
##.AVERAGES= 48
##.DIGITISER RES= 17
##SPECTROMETER/DATA SYSTEM= spect
##.PULSE SEQUENCE= zgpg30
##.SOLVENT NAME= DMSO
##.SHIFT REFERENCE= (INTERNAL, DMSO, 0, 182.463)
##AUDIT TRAIL= $$ (NUMBER, WHEN, WHO, WHERE, WHAT)
$$ ##TITLE= Audit trail, XWIN-NMR		Version 3.5
$$ ##JCAMPDX= 5.01
$$ ##ORIGIN= Bruker BioSpin GmbH
$$ ##OWNER= she
$$ F:/spectra/data/she/nmr/P31/1/pdata/1/auditp.txt
$$ ##AUDIT TRAIL=  $$ (NUMBER, WHEN, WHO, WHERE, WHAT)
(   1,<2019-01-09 14:47:55.51 +0400>,<she>,<DPX200>,
      <continue with go, POWCHK disabled, PULCHK disabled
       configuration hash MD5:
       00 E9 B6 7A A2 85 ED C7 34 08 36 98 17 FE 4E 26
       data hash MD5: 32K
       42 91 64 F4 99 48 A7 69 6F 37 93 52 6E 0C DC 09>)
(   2,<2019-01-09 14:48:16.59 +0400>,<she>,<DPX200>,
      <Start of raw data processing
       efp BC_mod = 2 LB = 1 FT_mod = 6 PKNL = 1 PHC0 = -1485.856 PHC1 = 114.599 SI = 64K 
       data hash MD5: 64K
       35 EC 5D 4A 2B 01 2C 4E 3F 82 5E F9 A1 12 95 AB>)
(   3,<2019-01-09 14:48:32.92 +0400>,<she>,<DPX200>,
      <abs ABSG = 5 
       data hash MD5: 64K
       E8 C6 C5 56 96 7F 2D 76 33 2C C0 82 8C FA 98 B0>)
$$ ##END=
$$ 
$$ hash MD5
$$ 7F FC 7E 3C 04 70 46 A5 06 E0 42 ED 08 0D E5 05
##$RELAX= 
##$RELAX= 
##$RELAX= 
##$RELAX= 
##$RELAX= 
##$RELAX= 
##$RELAX= 
##$RELAX= 
$$ Bruker specific parameters
$$ --------------------------
##$DU= <F:/spectra>
##$EXPNO= 1
##$NAME= <P31>
##$PROCNO= 1
##$TYPE= <nmr>
##$USER= <she>
##$AMP= (0..31)
100 100 100 100 100 100 100 100 100 100 100 100 100 100 100 100 100 100 
100 100 100 100 100 100 100 100 100 100 100 100 100 100 
##$AQSEQ= 0
##$AQ_mod= 1
##$AUNM= <au_zg>
##$AUTOPOS= <>
##$BF1= 81.014009
##$BF2= 200.13
##$BF3= 200.13
##$BF4= 200.13
##$BF5= 200.13
##$BF6= 200.13
##$BF7= 200.13
##$BF8= 200.13
##$BYTORDA= 1
##$CFDGTYP= 0
##$CFRGTYP= 5
##$CHEMSTR= <none>
##$CNST= (0..31)
1 1 145 1 1 1 1 1 1 1 1 1 1 1 1 1 1 1 1 1 1 1 1 1 1 1 1 1 1 1 1 1 
##$CPDPRG= <waltz16>
##$CPDPRG1= <>
##$CPDPRG2= <waltz16>
##$CPDPRG3= <>
##$CPDPRG4= <mlev>
##$CPDPRG5= <mlev>
##$CPDPRG6= <mlev>
##$CPDPRG7= <mlev>
##$CPDPRG8= <mlev>
##$CPDPRGB= <>
##$CPDPRGT= <>
##$D= (0..31)
0 1 0 0 0 0 0 0 0 0 0 0.03 2e-05 3e-06 0 0 0 0 0 0 0 0 0 0 0 0 0 0 0 0 
0 0 
##$DATE= 1547030759
##$DBL= (0..7)
120 120 120 11 120 120 24 19 
##$DBP= (0..7)
150 150 150 150 150 150 150 150 
##$DBP07= 0
##$DBPNAM0= <>
##$DBPNAM1= <>
##$DBPNAM2= <>
##$DBPNAM3= <>
##$DBPNAM4= <>
##$DBPNAM5= <>
##$DBPNAM6= <>
##$DBPNAM7= <>
##$DBPOAL= (0..7)
0.5 0.5 0.5 0.5 0.5 0.5 0.5 0.5 
##$DBPOFFS= (0..7)
0 0 0 0 0 0 0 0 
##$DE= 6
$$ [...]
##$SUBNAM3= <"">
##$SUBNAM4= <"">
##$SUBNAM5= <"">
##$SUBNAM6= <"">
##$SUBNAM7= <"">
##$SUBNAM8= <"">
##$SUBNAM9= <"">
##$SW= 369.568048894756
##$SWIBOX= (0..15)
0 1 3 0 0 0 0 0 0 0 0 0 0 0 0 0 
##$SW_h= 29940.119760479
##$TD= 32768
##$TD0= 1
##$TE= 0
##$TE2= 300
##$TE3= 300
##$TEG= 300
##$TL= (0..7)
0 120 53 12 22 120 120 120 
##$TP= (0..7)
150 150 150 150 150 150 150 150 
##$TP07= 0
##$TPNAME0= <>
##$TPNAME1= <>
##$TPNAME2= <>
##$TPNAME3= <>
##$TPNAME4= <>
##$TPNAME5= <>
##$TPNAME6= <>
##$TPNAME7= <>
##$TPOAL= (0..7)
0.5 0.5 0.5 0.5 0.5 0.5 0.5 0.5 
##$TPOFFS= (0..7)
0 0 0 0 0 0 0 0 
##$TUNHIN= 0
##$TUNHOUT= 0
##$TUNXOUT= 0
##$USERA1= <user>
##$USERA2= <user>
##$USERA3= <user>
##$USERA4= <user>
##$USERA5= <user>
##$V9= 5
##$VALIST= <valist>
##$VCLIST= <CCCCCCCCCCCCCCC>
##$VD= 0
##$VDLIST= <DDDDDDDDDDDDDDD>
##$VPLIST= <PPPPPPPPPPPPPPP>
##$VTLIST= <TTTTTTTTTTTTTTT>
##$WBST= 1024
##$WBSW= 4
##$XGAIN= (0..3)
0 0 0 0 
##$XL= 0
##$YL= 0
##$YMAX_a= 22079
##$YMIN_a= -37203
##$ZGOPTNS= <>
##$ZL1= 120
##$ZL2= 120
##$ZL3= 120
##$ZL4= 120
##$ABSF1= 182.463
##$ABSF2= -187.1042
##$ABSG= 5
##$ABSL= 3
##$ALPHA= 0
##$AQORDER= 0
##$ASSFAC= 0
##$ASSFACI= 0
##$ASSFACX= 0
##$ASSWID= 0
##$AUNMP= <proc_1d>
##$AZFE= 0.1
##$AZFW= 0.5
##$BCFW= 0
##$BC_mod= 2
##$BYTORDP= 0
##$COROFFS= 0
##$CY= -3
##$DATMOD= 1
##$DC= 0
##$DFILT= <>
##$DTYPP= 0
##$F1P= 0
##$F2P= 0
##$FCOR= 1
##$FTSIZE= 65536
##$FT_mod= 6
##$GAMMA= 0
##$GB= 0
##$INTBC= 1
##$INTSCL= 5.30512e-09
##$ISEN= 30
##$LB= 1
##$LEV0= 0
##$LPBIN= 0
##$MAXI= 10000
##$MC2= 0
##$MEAN= 0
##$ME_mod= 0
##$MI= 50
##$NCOEF= 0
##$NC_proc= -5
##$NLEV= 6
##$NOISF1= 182.463
##$NOISF2= 159.3651
##$NSP= 0
##$NTH_PI= 0
##$NZP= 0
##$OFFSET= 182.463
##$PC= 4
##$PHC0= -1485.856
##$PHC1= 114.599
##$PH_mod= 1
##$PKNL= yes
##$PPARMOD= 0
##$PSCAL= 0
##$PSIGN= 0
##$REVERSE= no
##$SF= 81.0140089999434
##$SI= 65536
##$SIGF1= 159.3651
##$SIGF2= -187.1042
##$SINO= 113.3802
##$SIOLD= 16384
##$SREGLST= <1H.CDCl3>
##$SSB= 0
##$STSI= 65536
##$STSR= 0
##$SW_p= 29940.119760479
##$SYMM= 0
##$S_DEV= 0
##$TDeff= 32768
##$TDoff= 0
##$TI= <>
##$TILT= no
##$TM1= 0
##$TM2= 0
##$TOPLEV= 0
##$USERP1= <user>
##$USERP2= <user>
##$USERP3= <user>
##$USERP4= <user>
##$USERP5= <user>
##$WDW= 1
##$XDIM= 65536
##$YMAX_p= 298859972
##$YMIN_p= -71060519
$$ End of Bruker specific parameters
$$ ---------------------------------
##NTUPLES= NMR SPECTRUM
##VAR_NAME=  FREQUENCY,     SPECTRUM/REAL,   SPECTRUM/IMAG
##SYMBOL=    X,             R,               I
##VAR_TYPE=  INDEPENDENT,   DEPENDENT,       DEPENDENT
##VAR_FORM=  AFFN,          ASDF,            ASDF
##VAR_DIM=   65536,         65536,           65536
##UNITS=     HZ,            ARBITRARY UNITS, ARBITRARY UNITS
##FACTOR=    0.456856943014862, 1,           1
##FIRST=     14782.0589164792, 0,            0
##LAST=      -15158.0608439998, 0,           0
##MIN=       -15158.0608439998, -71060519,   0
##MAX=       14782.0589164792, 298859972,    0
$$ Real data points
##PAGE= N=1
##DATA TABLE= (X++(R..R)), XYDATA
$$ [...]
$$ plain form
41201 832956 -126527 -393908 -17800 318025 265797 251347 812767 1803243 2478698 2321379
41191 2321379 1622419 1128617 1111885 1017632 273059 -772622 -1230105 -981561 -922033 -1563680
41181 -1563680 -2074603 -1403653 55776 813244 222835 -775131 -1028100 -517324 51892
41172 51892 374988 688283 1122547 1460584 1433330 931095 74304 -676874 -764542 -233220
41162 -233220 118839 -236732 -665895 -143352 1244582 2342201 2486517 2144870 1732877
41153 1732877 776894 -1044521 -2799983 -3261439 -2570511 -1930036 -1853218 -1827668 -1667656
41144 -1667656 -1891869 -2417786 -2198715 -910963 147731 -115072 -839309 -630564 17874
41135 17874 -577342 -2411993 -3459800 -2593132 -1193463 -1019561 -1770811 -1872486 -783775
$$ packed form
41201H32956r59483k67381L76108L35825n2228j4450N61420R90476O75455j57319
41191B321379o98960m93802j6732r4253p44573j045681m57483K48544N9528o41647
41181a563680n10923O70950J459429P57468n90409r97966k52969N10776N69216
41172E1892L23096L13295M34264L38037k7254n02235q56791p51178q7668N31322
41162b33220L52059l55571m29163N22543J387934J097619J44316l41647m11993
41153A732877r55983j821415j755462m61456O90928O40475P6818K5550J60012
41144a667656k24213n25917K19071J287752J058694k62803p24237K08745O48438
41135A7874n95216j834651j047807Q66668J399669J73902p51250j01675J088711
$$ plain form
41126 -783775 667597 1709922 2219042 2115327 1234508 -116113 -1226252 -1730991 -1776597
41117 -1776597 -1472040 -772332 16181 209560 -448868 -1249680 -1122736 194385 1739287
41108 1739287 2257324 1604295 930777 1193735 1869882 1769550 803760 -41162 -391399
41099 -391399 -877895 -1585964 -1555752 -552218 75497 -552011 -1177421 -299871 1249779
41090 1249779 1435772 122596 -885314 -688063 -219374 -231873 -294977 -239880 -758600 -1808345
41080 -1808345 -2070069 -986369 67636 -241544 -1263243 -1583232 -1129350 -707827 -258212
41071 -258212 896446 2411127 2954828 1966357 375386 -578020 -570583 -187073 -175380 -680603
41061 -680603 -940340 -49077 1662862 2559606 1565493 -420480 -1673706 -1740850 -1549252
$$ packed form
41126g83775J451372J042325N09120j03715q80819j350621j110139n04739m5606
41117a776597L04557O99708P88513J93379o58428q00812J26944J317121J544902
41108A739287N18037o53029o73518K62958O76147j00332r65790q44922l50237
41099c91399m86496p08069L0212J003534O27715o27508o25410Q77550J549650
41090A249779J85993j313176j007910J97251M68689j2499o3104N5097n18720j049745
41080a808345k61724J083700J054005l09180j021699l19989M53882M21523M49615
41071b58212J154658J514681N43701r88471j590971r53406P437L83510J1693n05223
41061f80603k59737Q91263J711939Q96744r94113j985973j253226o7144J91598
$$ plain form
41052 -1549252 -1750875 -1918163 -1387796 -142936 1263901 2178754 2252665 1790539 1560981
41043 1560981 1860863 2020044 1306221 7020 -986064 -1396330 -1671678 -2039036 -2166628
41034 -2166628 -1785403 -1100991 -567943 -615554 -1413368 -2497120 -2915169 -2249794 -1187844
41025 -1187844 -571553 -344667 -120335 -219492 -1075777 -1952451 -1554728 -6246 970549
41016 970549 215718 -1422618 -2193748 -1323509 467585 1710184 1320022 -361114 -1609714
41007 -1609714 -1113688 369810 1081676 818522 1002319 1992536 2088895 187869 -2060188
40998 -2060188 -2269700 -594871 641065 165624 -986787 -1423512 -1132994 -880500 -979255
40989 -979255 -1247731 -1480757 -1460234 -996637 -333995 -62731 -308473 -468393 -111139 327542
$$ packed form
41052a549252k01623j67288N30367J244860J406837R14853P3911m62126k29558
41043A560981K99882J59181p13823j299201r93084m10266k75348l67358j27592
41034b166628L81225O84412N33048m7611p97814j083752m18049O65375J061950
41025a187844O16291K26886K24332r9157q56285q76674L97723J548482R76795
41016I70549p54831j638336p71130Q70239J791094J242599l90162j681136j248600
41007a609714M96026J483498P11866k63154J83797R90217R6359j901026k248057
40998b060188k09512J674829J235936m75441j152411m36725K90518K52494r8755
40989i79255k68476k33026K0523M63597O62642K71264k45742j59920L57254M38681
$$ plain form
40979 327542 226785 -232532 -388145 -192307 -252373 -705783 -782440 108340 1373556 1906122
40969 1906122 1498989 970145 965215 1293118 1530710 1587882 1369804 537440 -851333 -1919500
40959 -1919500 -1807498 -689340 518125 1155140 1072886 369744 -419237 -317051 955991
40950 955991 2111621 1671211 136967 -454755 656323 1892907 1623741 295465 -570664
40941 -570664 -521132 -230164 -99869 22210 58230 -266806 -677829 -568898 -34305 105550
40931 105550 -535333 -1361903 -1618747 -1255953 -736969 -349131 -1985 398860 593136 169392
40921 169392 -740935 -1224148 -570810 550408 681781 -426956 -1298813 -750295 464344
40912 464344 899223 511696 310906 442208 55387 -1032837 -1947081 -2190443 -2185907 -2085086
$$ packed form
40979C27542j00757m59317j55613J95838o0066m53410p6657Q90780J265216N32566
40969A906122m07133n28844m930L27903K37592N7172k18078q32364j388773j068167
40959a919500J12002J118158J207465O37015q2254p03142p88981J02186J273042
40950I55991J155630m40410j534244n91722J111078J236584k69166j328276q66129
40941e70664M9532K90968J30295J22079L6020l25036m11023J08931N34593J39855
40931A05550o40883q26570k56844L62794N18984L87838L47146M00845J94276m23744
40921A69392r10327m83213O53338J121218J31373j108737q71857N48518J214639
40912D64344M34879l87527k00790J31302l86821j088224r14244k43362M536J00821
$$ plain form
40902 -2085086 -1338098 7628 808559 422144 -211603 30814 877386 1465687 1863146
40893 1863146 2520127 2843019 1853536 109749 -571765 396091 1483063 1207417 97081
40884 97081 -299930 436006 1342668 1503625 875773 -71823 -798827 -882400 -408213 -111883
40874 -111883 -545536 -1173190 -941805 236214 1274706 1341338 788788 364891 207617
40865 207617 148508 406710 1225853 2136197 2328270 1654051 644756 -314125 -1114948 -1335172
40855 -1335172 -424784 1272148 2498342 2547403 2116504 2172051 2533580 2296112 1301720
40846 1301720 374434 139342 323407 372968 176887 -108206 -497841 -1005546 -1235441 -649918
40836 -649918 619786 1570074 1301822 142210 -630821 -344823 244770 112418 -493947
$$ packed form
40902b085086P46988J345726Q00931l86415o33747K42417Q46572N88301L97459
40893A863146O56981L22892r89483j743787o81514R67856J086972k75646j110336
40884I7081l97011P35936R06662J60957o27852r47596p27004q3573M74187K96330
40874a11883m33653o27654K31385J178019J038492O6632n52550m23897j57274
40865B07617n9109K58202Q19143R10344J92073o74219j009295r58881q00823k20224
40855a335172R10388J696932J226194M9061m30899N5547L61529k37468r94392
40846A301720r27286k35092J84065M9561j96081k85093l89635n07705k29895N85523
40836f49918J269704R50288k68252j159612p73031K85998N89593j32352o06365
$$ plain form
40827 -493947 -464028 377595 924162 522837 32804 444667 1258083 1248359 382212 -175689
40817 -175689 117514 456074 32760 -786446 -1109371 -724684 -136389 238234 409557 498760
40807 498760 445127 61301 -708477 -1552147 -1896514 -1474252 -741607 -440159 -734681 -1083533
40797 -1083533 -985179 -534937 -190675 -294078 -864563 -1529226 -1607990 -684343 723748 1409212
40787 1409212 656681 -1008622 -2417830 -2910704 -2721299 -2366546 -1870965 -701016 1439542
40778 1439542 3803909 4985434 4391338 2980946 2098177 1943694 1852459 1697978 1970038
40769 1970038 2507996 2388327 1467122 894416 1380715 1931987 1292796 -75580 -608403
40760 -608403 183716 1315040 1930751 2137579 2136333 1652150 657724 -165762 -201414 424861
$$ packed form
40827d93947K9919Q41623N46567m01325m90033M11863Q13416r724q66147n57901
40817a75689K93203L38560m23314q19206l22925L84687N88295L74623J71323Q9203
40807D98760n3633l83826p69778q43670l44367M22262P32645L01448k94522l48852
40797a083533R8354M50242L44262j03403n70485o64663p8764R23647J408091O85464
40787A409212p52531j665303j409208m92874J89405L54753M95581J169949K140558
40778A439542K364367J181525n94096j410392q82769j54483r1235j54481K72060
40769A970038N37958j19669r21205n72706M86299N51272o39191j368376n32823
40760f08403P92119J131324O15711K06828j246m84183r94426q23486l5652O26275
$$ plain form
40750 424861 1297341 2236259 2926866 2640701 1053463 -928134 -1851125 -1255725 -95823
40741 -95823 401449 -58344 -816962 -1126606 -857263 -445492 -252684 -66582 599223 1717129
40731 1717129 2609757 2871576 3119104 4271607 6080512 6968962 5725573 3067637 1039776
40722 1039776 862890 1777664 2170131 1475327 548345 276158 422920 199593 -422439
40713 -422439 -646869 -132372 367057 83898 -557407 -561496 3113 -102315 -1508321 -3149356
40703 -3149356 -3525842 -2500607 -1137628 -157661 553984 1042522 899984 61239 -800528
40694 -800528 -1071114 -790429 -145588 892200 1939509 2023218 880856 -153355 390562
40685 390562 2089094 3164171 2931603 2489880 2771562 3168890 2751140 1857618 1541244
$$ packed form
40750D24861Q72480R38918O90607k86165j587238j981597r22991N95400J159902
40741i5823M97272m59793p58618l09644K69343M11771J92808J86102O65805J117906
40731A717129Q92628K61819K47528J152503J808905Q88450j243389k657936k027861
40722A039776j76886R14774L92467o94804r26982k72187J46762k23327o22032
40713d22439k24430N14497M99429k83159o41305m089N64609j05428j406006j641035
40703c149356l76486J025235J362979R79967P11645M88538j42538q38745q61767
40694h00528k70586K80685O44841J037788J047309Q3709j142362j034211N43917
40685C90562J698532J075077k32568m41723K81682L97328m17750q93522l16374
$$ plain form
40676 1541244 1999252 2492483 2551526 2417068 2340674 2162686 1693577 1033897 438014 206734
40666 206734 656395 1753141 2781166 2860096 1939299 921840 668741 1199277 1981096
40657 1981096 2602799 2888758 2697530 2068068 1476462 1506863 2137484 2636232 2353196 1435369
40647 1435369 553842 81925 -159914 -417756 -658028 -817281 -1049193 -1495704 -2050303
40638 -2050303 -2531148 -2807393 -2583636 -1526678 1131 846585 380254 -473275 -378830
40629 -378830 492089 775783 128149 -198838 558570 1317998 839601 -200698 -105066 1360300
40619 1360300 2647554 2491726 1173190 -370721 -1648039 -2477840 -2612207 -2087300 -1504707
40610 -1504707 -1423727 -1606210 -1201981 262537 2134061 2963982 1876347 -282224 -1595109
$$ packed form
40676A541244M58008M93231N9043j34458p6394j77988m69109o59680n95883k31280
40666B06734M49661J096746J028025P8930r20797j017459k53099N30536P81819
40657A981096O21703K85959j91228o29462n91606L0401O30621M98748k83036r17827
40647A435369q81527m71917k41839k57842k40272j59253k31912m46511n54599
40638b050303m80845k76245K23757J056958J527809Q45454m66331q53529R4445
40629c78830Q70919K83694o47634l26987P57408P59428m78397j040299R5632J465366
40619A360300J287254j55828j318536j543911j277318q29801j34367N24907N82593
40610a504707Q0980j82483M04229J464518J871524Q29921j087635k158571j312885
$$ plain form
40601 -1595109 -1211720 -331304 -497828 -1487282 -1867355 -1294943 -899718 -1213289 -1118767 370759
40591 370759 2320097 2930837 1873063 550954 244213 853442 1476465 1483684 873916
40582 873916 120884 -127463 430071 1367031 1930655 1877158 1612093 1463589 1203120 484990
40572 484990 -533624 -1292566 -1411259 -959462 -282974 181153 17737 -840395 -1767640
40563 -1767640 -1778663 -551922 1035006 1781612 1557396 1422644 2266707 3718349 4616210
40554 4616210 4232682 2804167 1190182 294162 467347 1104674 1132122 278875 -478704
40545 -478704 -173528 890615 1724881 2004277 1970531 1432810 84374 -1299861 -1352020
40536 -1352020 -63657 1028836 1028504 713601 766501 474737 -641710 -1272404 -100278
$$ packed form
40601a595109L83389Q80416j66524r89454l80073N72412L95225l13571R4522J489526
40591C70759J949338O10740j057774j322109l06741O09229O23023P219o09768
40582H73916p53032k48347N57534R36960N63624n3497k65065j48504k60469p18130
40572D84990j018614p58942j18693M51797O76488M64127j63416q58132r27245
40563a767640j1023J226741J586928P46606k24216j34752Q44063J451642Q97861
40554D616210l83528j428515j613985q96020J73185O37327K7448q53247p57579
40545d78704L05176J064143Q34266K79396l3746n37721j348436j384235n2159
40536a352020J288363J092493l32l14903N2900k91764j116447o30694J172126
$$ plain form
40527 -100278 1718618 1818409 47401 -1335070 -984212 -39848 183619 232003 1142617
40518 1142617 2459949 2991931 2630283 2072465 1398908 340736 -428536 214558 1978733
40509 1978733 3081222 2397902 711786 -554733 -962183 -941011 -867119 -901807 -1195482
40500 -1195482 -1589272 -1476570 -548896 589461 1065932 755329 197857 -168032 -130977
40491 -130977 581919 1924214 2994125 2743262 1346244 131472 -13500 566403 1267672
40482 1267672 2058057 2829710 2827410 1612211 40473 -656834 -415518 -20346 427275
40473 427275 1513751 2967311 3438947 2375969 1038816 795190 1170191 666600 -856728
40464 -856728 -1819709 -1102653 365828 782891 -252607 -1321130 -1028658 266387 940324
$$ packed form
40527a00278J818896R9791j771008j382471L50858R44364K23467M8384R10614
40518A142617J317332N31982l61648n57818o73557j058172p69272O43094J764175
40509A978733J102489o83320j686116j266519m07450K1172P3892l4688k93675
40500a195482l93790J12702R27674J138357M76471l10603n57472l65889L7055
40491a30977P12896J342295J069911k50863j397018j214772j44972N79903P01269
40482A267672P90385P71653k300j215199j571738o97307K41316L95172M47621
40473D27275J086476J453560M71636j062978j337153k43626L75001n03591j523328
40464h56728r62981P17056J468481M17063j035498j068523K92472J295045O73937
$$ plain form
40455 940324 129525 -1265620 -1842476 -1505258 -1382743 -2068083 -2742588 -2352940 -992442
40446 -992442 435696 1447213 2176166 2633198 2571153 2109932 1789145 1818360 1865981 1818279
40436 1818279 2117940 2901356 3338577 2555226 1016267 233459 965203 2342138 3112077
40427 3112077 3218103 3561243 4504082 5392757 5660858 5676183 6055998 6668245 6957240 6997540
40417 6997540 7489860 8691273 10040172 11078895 12142799 13676439 15253442 15847246
40409 15847246 15016690 13412036 12024847 11161305 10260747 8656655 6421014 4327490
40401 4327490 2933829 1983811 1034485 370548 610946 1458167 1752614 1152852 906088
40392 906088 2188792 4275741 5331143 4776442 3887036 3969548 4803637 5184345 4404730
$$ packed form
40455I40324q10799j395145n76856L37218J22515o85340o74505L89648J360498
40446i92442J428138J011517P28953M57032o2045m61221l20787K9215M7621m7702
40436A818279K99661P83416M37221p83351j538959p82808P31744J376935P69939
40427C112077J06026L43140R42839Q88675K68101J5325L79815O12247K88995M0300
40417F997540M92320J201413J348899J038723J063904J533640J577003N93804
40409A5847246q30556j604654j387189q63542r00558j604092k235641k093524
40401D327490j393661r50018r49326o63937K40398Q47221K94447n99762k46764
40392I06088J282704K086949J055402n54701q89406Q2512Q34089L80708p79615
$$ plain form
40383 4404730 2896871 1827396 2235212 4112856 6156623 6891726 6246820 5524851 5607144
40374 5607144 5850784 5270476 4197007 3866471 4551325 5077562 4492921 3439755 3219093
40365 3219093 3905239 4245103 3483627 2434413 2192754 2426727 1950318 834984 678407
40356 678407 2200588 3653790 2828662 161096 -1557699 -681823 1364080 2191547 1377191
40347 1377191 353308 118615 279603 193082 -97343 -348514 -669165 -1085389 -1159402 -657103
40337 -657103 -221812 -658897 -1630686 -1819779 -671999 628761 495955 -1062575 -2473488
40328 -2473488 -2589817 -1902132 -1464244 -1310103 -634884 786137 2168202 2745480 2580251
40319 2580251 2171348 1818804 1673242 1929174 2498874 2756010 2108599 820809 -96076
$$ packed form
40383D404730j507859j069475M07816J877644K043767P35103o44906p21969Q2293
40374E607144K43640n80308j073469l30536O84854N26237n84641j053166k20662
40365C219093O86146L39864p61476j049214k41659K33973m76409j115334j56577
40356F78407J522181J453202q25128k667566j718795Q75876K045903Q27467q14356
40347A377191j023883k34693J60988q6521k90425k51171l20651m16224p4013N02299
40337f57103M35291m37085r71789j89093J147780J300760j32806j558530j410913
40328b473488j16329O87685M37888J54141O75219J421021J382065N77278j65229
40319B580251m08903l52544j45562K55932N69700K57136o47411j287790r16885
$$ plain form
40310 -96076 68533 950883 1489218 1034288 26427 -500428 -108900 517357 438822 -308125
40300 -308125 -756746 -323437 405984 485545 -185101 -933175 -1379961 -1814953 -2369470 -2382513
40290 -2382513 -1138085 889796 2125142 1550908 -22877 -821835 -159067 921594 1183295
40281 1183295 740807 569466 944776 1156585 677383 -150570 -749860 -1008713 -1102965 -1124979
40271 -1124979 -1144247 -1184040 -922008 50900 1373505 1921386 1175656 75105 -122558
40262 -122558 572401 1133375 1021012 582399 104732 -539810 -1122696 -852807 552096
40253 552096 2190483 2905678 2502074 1626421 877606 549586 858835 1730470 2516750
40244 2516750 2590512 2188355 2057846 2288991 2212876 1588983 1095243 1255968 1630589 1673168
$$ packed form
40310i6076J64609Q82350N38335m54930j007861n26855L91528O26257p8535p46947
40300c08125m48621M33309P29421P9561o70646p48074m46786m34992n54517j3043
40290b382513J244428K027881J235346n74234j573785p98958O62768J080661K61701
40281A183295m42488j71341L75310K11809m79202q27953n99290k58853r4252k2014
40271a124979j9268l9793K62032R72908J322605N47881p45730j100551j97663
40262a22558O94959N60974j12363m38613m77667o44542n82886K69889J404903
40253E52096J638387P15195m03604q75653p48815l28020L09249Q71635P86280
40244B516750P3762m02157j30509K31145p6115o23893m93740J60725L74621M2579
$$ plain form
40234 1673168 1749389 2472802 3502581 4002555 4053119 4497630 5389891 5795226 5447545 5431678
40224 5431678 6600633 8359969 9890829 11694454 14760007 18658430 21583363 22169514
40216 22169514 20506505 17632658 14813525 12960469 11834076 10112739 7190164 4514223
40208 4514223 3949783 5101070 5682503 4507126 2613683 1314034 779935 967486 2162119
40199 2162119 3742708 4028907 2552957 1128220 1330699 2155420 1750354 428070 27637
40190 27637 841754 1207503 183635 -1147545 -1466003 -918606 -496155 -721284 -1443966
40181 -1443966 -2163100 -2176141 -1084413 524124 1435322 1060242 -113002 -1293835 -2015898
40172 -2015898 -2013457 -1195693 76787 1199149 1890928 2184961 2050223 1590883 1366877
$$ packed form
40234A673168P6221P23413J029779M99974N0564M44511Q92261M05335l47681j5867
40224E431678J168955J759336J530860J803625L065553L898423K924933N86151
40216B2169514j663009k873847k819133j853056j126393j721337k922575k675941
40208D514223n64440J151287N81433j175377j893443j299649n34099J87551J194633
40199B162119J580589K86199j475950j424737K02479Q24721m05066j322284m00433
40190B7637Q14117L65749j023868j331180l18458N47397M22451k25129p22682
40181a443966p19134j3041J091728J608537R11198l75080j173244j180833p22063
40172b015898K441Q17764J272480J122362O91779K94033j34738m59340k24006
$$ plain form
40163 1366877 1772504 2273931 2072616 1393995 1247261 1962379 2829378 3146196 2757125
40154 2757125 1651744 43922 -1142336 -924601 439738 1678838 2013680 1528050 315816
40145 315816 -1389252 -2369341 -1400021 673340 1526128 459011 -836732 -1187017 -1576557
40136 -1576557 -2798234 -3491798 -2254887 -157694 789369 522881 319984 290464 -341639
40127 -341639 -1052306 -394995 1529225 3008882 3228652 2974542 2667961 1618336 -272382
40118 -272382 -1811963 -2234802 -2138333 -2032675 -1463157 -441759 -247827 -1531945 -2800588
40109 -2800588 -2313298 -747798 -335524 -1571601 -2391284 -1006535 1672775 3265290 2891495
40100 2891495 1938791 1944228 2688784 2962586 2565758 2445562 2878002 2791318 1531034 205974
$$ packed form
40163A366877M05627N01427k01315o78621j46734P15118Q66999L16818l89071
40154B757125j105381j607822j186258K17735J364339J239100L34842m85630j212234
40145C15816j705068r80089R69320K073361Q52788j067117j295743l50285l89540
40136a576557j221677o93564J236911K097193R47063k66488k02897k9520o32103
40127c41639p10667O57311J924220J479657K19770k54110l06581j049625j890718
40118b72382j539581m22839R6469J05658N69518J021398J93932j284118j268643
40109b800588M87290J565500M12274j236077q19683J384749K679310J592515l73795
40100B891495r52704N437P44556K73802l96828j20196M32440q6684j260284j325060
$$ plain form
40090 205974 198992 1129775 1611108 1446368 1487284 1614577 764730 -808532 -1264274 47778
40080 47778 1302692 900873 -42788 491619 2200700 2916143 1841809 512905 427002
40071 427002 1228209 1665173 1233591 366922 -213758 59683 1152110 2105604 1827853
40062 1827853 536580 -242294 422222 1551429 1472165 -19088 -1407765 -1307249 45968
40053 45968 1282778 1448022 782483 217453 453122 1515126 2872554 3772482 3645339
40044 3645339 2539812 1238034 684438 1103976 1790154 1923223 1511330 1300412 1710118
40035 1710118 2092548 1361148 -561917 -2236669 -2052433 -46753 2089435 2952703 2838826
40026 2838826 2902263 3537134 4286356 4895299 5457850 5614273 4672190 2819728 1367752
$$ packed form
40090B05974o982R30783M81333j64740M0916J27293q49847j573262m55742J312052
40080D7778J254914m01819r43661N34407J709081P15443j074334j328904q5903
40071D27002Q01207M36964m31582q66669n80680K73441J092427R53494k77751
40062A827853j291273p78874O64516J129207p9264j491253j388677J00516J353217
40053D5968J236810J65244o65539n65030K35669J062004J357428Q99928j27143
40044C645339j105527j301778n53596M19538O86178J33069m11893k10918M09706
40035A710118L82430p31400j923065j674752J84236K005680K136188Q63268j13877
40026B838826O3437O34871P49222O08943N62551J56423r42083j852462j451976
$$ plain form
40017 1367752 1366424 2629415 4438682 6421703 8223357 9114493 8781998 8102859 8381367
40008 8381367 10027936 12489987 15078326 17214325 18257474 17940754 16865154 15842971
40000 15842971 14819141 13116313 10683833 8359355 6792568 5780366 4884596 4160648
39992 4160648 3966723 4363916 4924446 5028030 4438905 3771434 4027732 5176485 5593395
39983 5593395 3830258 839246 -696994 394106 2263805 2488603 1135172 266077
39975 266077 877255 1726160 1391933 241254 -406621 -226701 68640 278107 1095899
39966 1095899 2724590 4132636 4320906 3628425 3032978 2694164 2101970 1321638 1014471
39957 1014471 1268524 1451505 1334866 1337890 1479473 1231841 770368 1128468 2497091 3603795
$$ packed form
40017A367752j328J262991J809267J983021J801654Q91136l32495o79139K78508
40008H381367J646569K462051K588339K135999J043149l16720j075600j022183
40000A5842971j023830j702828k432480k324478j566787j012202q95770p23948
39992D160648j93925L97193N60530J03584n89125o67471K56298J148753M16910
39983E593395j763137k991012j536240J091100J869699K24798j353431q69095
39975B66077O11178Q48905l34227j150679o47875J79920K95341K09467Q17792
39966A095899J628691J408046J88270o92481n95447l38814n92194p80332l07167
39957A014471K54053J82981j16639L024J41583k47632m61473L58100J368623J106704
$$ plain form
39947 3603795 3597861 3287868 3442486 3205984 1748386 350412 877847 2882235 4306941
39938 4306941 4643276 5097785 5737182 5053210 2920693 1497119 2049216 3037164 2775703
39929 2775703 2051888 2317552 2946827 2473759 1405258 1419566 2341885 2319098 1018957
39920 1018957 434009 1930250 4259706 5354348 4832760 3885048 3620667 4350795 5802913
39911 5802913 7203055 7494253 6164918 3847623 1822131 950915 1072848 1217646 498667
39902 498667 -892794 -1703902 -1004440 628822 1790661 1898046 1544566 1383588 1445107
39893 1445107 1577840 1767006 1820154 1440232 875493 881446 1717830 2662549 2798882 1914148
39883 1914148 491021 -745931 -1159723 -569710 522708 1412388 1875243 1999404 1634951
$$ packed form
39947C603795n934l09993J54618k36502j457598j397974N27435K004388J424706
39938D306941L36335M54509O39397o83972k132517j423574N52097R87948k61461
39929B775703p23815K65664O29275m73068j068501J4308R22319k2787j300141
39920A018957n84948J496241K329456J094642n21588r47712k64381P30128J452118
39911E802913J400142K91198j329335k317295k025492q71216J21933J44798p18979
39902D98667j391461q11108O99462J633262J161839J07385l53480j60978O1519
39893A445107J32733J89166N3148l79922n64739N953Q36384R44719J36333q84734
39883A914148j423127j236952m13792N90013J092418Q89680M62855J24161l64453
$$ plain form
39874 1634951 780791 276712 985625 2238676 2379982 1218129 570730 1641897 3182557
39865 3182557 3396712 2579421 2376254 3116529 3540496 2982176 2261587 2205199 2568853 2811324
39855 2811324 2897264 2886697 2565241 1930712 1395863 1177689 1093128 1158588 1637769 2236960
39845 2236960 2136830 1290854 826686 1493180 2481870 2624430 2116045 2040555 2603856 2947453
39835 2947453 2579198 1916767 1331571 654182 -109610 -469492 -260404 -5014 -20188 123271
39825 123271 698201 1068019 602652 -149279 -103116 775232 1416399 1180029 629774 593937
39815 593937 1104114 1535821 1335658 411926 -775662 -1386366 -925383 63908 522574
39806 522574 196562 -165999 -77648 32315 -171764 -104462 813258 2005287 2394755 1862127
$$ packed form
39874A634951q54160n04079P08913J253051J41306j161853o47399J071167J540660
39865C182557K14155q17291k03167P40275M23967n58320p20589n6388L63654K42471
39855B811324Q5940j0567l21456o34529n34849k18174q4561O5460M79181N99191
39845B236960j00130q45976m64168O66494R88690J42560n08385p5490N63301L43597
39835B947453l68255o62431n85196o77389p63792l59882K09088K55390j5174J43459
39825A23271N74930L69818m65367p51931M6163Q78348O41167k36370n50255l5837
39815E93937N10177M31707k00163r23732j187588o10704M60983R89291M58666
39806E22574l26012l62561Q8351J09963k04079O7302R17720J192029L89468n32628
$$ plain form
39796 1862127 1251050 1195425 1710377 2646980 3647939 3842662 2597536 610602 -629134
39787 -629134 -536191 237504 1080600 1961539 2629325 2530222 1883776 1637882 1873051 1541694
39777 1541694 478346 218457 1643267 3131538 2717418 1152026 830817 2109566 2852609
39768 2852609 1825114 435160 319275 978448 1046630 580880 579593 1007078 868160 10936
39758 10936 -526957 -104118 688749 1087874 1180148 1431957 1855204 2171817 2378840 2607802
39748 2607802 2667265 2265998 1639949 1480463 2122459 3136386 3877297 4157708 4161468 3937860
39738 3937860 3346325 2468763 1750408 1592252 1914946 2179144 1812358 736131 -412496
39729 -412496 -785905 -287905 222026 71734 -184953 454926 1816203 2648728 2475935
$$ packed form
39796A862127o11077n5625N14952R36603J000959J94723j245126j986934j239736
39787f29134R2943P73695Q43096Q80939O67786r9103o46446k45894K35169l31357
39777A541694j063348k59889J424810J488271m14120j565392l21209J278749P43043
39768B852609j027495j389954j15885O59173O8182m65750j287M27485j38918q57224
39758A0936n37893M22839P92867L99125R2274K51809M23247L16613K07023K28962
39748B607802N9463m01267o26049j59486O41996J013927P40911K80411L760k23608
39738C937860n91535q77562p18355j58156L22694K64198l66786j076227j148627
39729d12496l73409M98000N09931j50292k56687O39879J361277Q32525j72793
$$ plain form
39720 2475935 2257075 2718838 3098019 2423587 1192362 642573 935122 1253527 1302868
39711 1302868 1412831 1406012 827681 327169 1251637 3453421 4947652 4441617 2945424
39702 2945424 2057530 1875841 1690234 1646923 2280072 3077399 3070352 2578753 2860849 3970169
39692 3970169 4388361 3220336 1586342 1151595 2090057 3261585 3893886 4306341 5104604
39683 5104604 6246636 7031030 6803564 5634725 4314506 3567105 3306733 2919624 2269246
39674 2269246 1997929 2600430 3550820 3781835 2944431 1799375 1276436 1449687 1641554
39665 1641554 1326253 617541 -63960 -422747 -303058 306719 1007052 1109499 479327
39656 479327 -29462 459186 1652695 2518259 2708842 2700714 2593372 1929453 978142 893552
$$ packed form
39720B475935k18860M61763L79181o74432j231225n49789K92549L18405M9341
39711A302868J09963o819n78331n00512R24468K201784J494231n06035j496193
39702B945424q87894j81689j85607m3311O33149P97327p047m91599K82096J109320
39692C970169M18192j168025j633994m34747R38462J171528O32301M12455P98263
39683E104604J142032P84394k27466j168839j320219p47401k60372l87109o50378
39674B269246k71317O02501R50390K31015q37404j145056n22939J73251J91867
39665A641554l15301p08712o81501l58787J19689O09777P00333J02447o30172
39656D79327n08789M88648J193509Q65564J90583q128j07342o63919r51311q4590
$$ plain form
39646 893552 1844528 2202210 801285 -917227 -596658 1654902 3289993 2797833 1517745
39637 1517745 1436705 2564109 3443383 3354848 2916001 2869219 3169879 3247858 2658711 1507720
39627 1507720 523308 565930 1782841 3348201 4199377 3900016 2759583 1448352 656673
39618 656673 786953 1654291 2558516 2773908 1990977 504149 -797613 -950230 65439
39609 65439 1070012 1075984 644345 983271 1960921 2299384 1813430 1887199 3098735 3921891
39599 3921891 2981418 1367837 1168256 2507734 3715443 3934778 3787348 3610988 2953506
39590 2953506 2154097 2599551 4556024 6204289 5948708 4627549 4236849 5208859 6187469
39581 6187469 6065988 5074876 4020065 3469034 3688355 4544203 5414546 5863292 6324070
$$ packed form
39646H93552R50976L57682j400925j718512L20569K251560J635091m92160j280088
39637A517745q1040J127404Q79274q8535m38847m6782L00660P7979n89147j150991
39627A507720r84412M2622J216911J565360Q51176k99361j140433j311231p91679
39618F56673J30280Q67338R04225K15392p82931j486828j301762j52617J015669
39609F5439J004573N972m31639L38926R77650L38463m85954P3769J211536Q23156
39599C921891r40473j613581j99581J339478J207709K19335j47430j76360o57482
39590B953506p99409M45454J956473J648265k55581j321159l90700R72010R78610
39581F187469j21481r91112j054811n51031K19321Q55848Q70343M48746M60778
$$ plain form
39572 6324070 7423954 8822035 9674391 10231550 11841716 15046728 18755140 21869760
39564 21869760 24703088 27900199 30815260 32166865 31890747 31135004 30521760 29522602 27625121
39555 27625121 25072702 22244075 19295630 16717636 15213851 14524651 13342195 11085178
39547 11085178 8900295 8094715 8364099 8530126 8311323 8177384 7973437 7060228 5629375
39538 5629375 4564259 4032416 3514999 3247335 4115432 5758394 6315261 4859166 2823949
39529 2823949 2045733 2434923 2662323 2255755 1770984 1491445 1227732 1088021 1329729
39520 1329729 1662093 1680162 1724546 2283423 2817712 2378515 1288809 917316 1626175 2214491
39510 2214491 1799026 1053182 915271 1084533 727479 15126 -77244 705440 1435391 1184331
$$ packed form
39572F324070J099884J398081Q52356N57159J610166L205012L708412L114620
39564B1869760K833328L197111K915061J351605k76118p55743o13244r99158j897481
39555B7625121k552419k828627k948445k577994j503785o89200j182456k257017
39547A1085178k184883q05580K69384J66027k18803j33939k03947r13209j430853
39538E629375j065116n31843n17417k67664Q68097J642962N56867j456095k035217
39529B823949p78216L89190K27400m06568m84771k79539k63713j39711K41708
39520A329729L32364J8069M4384N58877N34289m39197j089706l71493P08859N88316
39510B214491m15465p45844j37911J69262l57054p12353r2370P82684P29951k51060
$$ plain form
39500 1184331 144915 -649730 -508295 213538 629268 451186 330345 912983 1911139
39491 1911139 2545060 2649554 2730857 3019328 3136682 2780959 2142416 1517524 1054698 957414
39481 957414 1321052 1655672 1266429 331723 -95461 528497 1536906 2111465 2328614
39472 2328614 2598424 2677543 1970460 512231 -929621 -1560831 -1041485 386894 1895136
39463 1895136 2594027 2487632 2520749 3295803 4218347 4383612 3784933 3022338 2284994 1384016
39453 1384016 485046 21820 14340 125204 256273 491832 642009 496174 363179 668059
39443 668059 1130035 1053776 377923 -269355 -519299 -535708 -344404 305528 1254978 1848695
39433 1848695 1797400 1532249 1486773 1598082 1711035 1863959 1924487 1561724 923878 779608
$$ packed form
39500A184331j039416p94645J41435P21833M15730j78082j20841N82638R98156
39491A911139O33921J04494Q1303K88471J17354l55723o38543o24892m62826r7284
39481I57414L63638L34620l89243r34706m27184O23958J008409N74559K17149
39472B328614K69810P9119p07083j458229j441852o31210N19346J428379J508242
39463A895136O98891j06395L3117P75054R22544J65265n98679p62595p37344r00978
39453A384016q98970m63226p480J10864J31069K35559J50177j45835j32995L04880
39443F68059M61976p6259o75853o47278k49944j6409J91304O49932R49450N93717
39433A848695n1295k65151m5476J11309J12953J52924O0528l62763o37846j44270
$$ plain form
39423 779608 1553592 2648053 3135562 2790023 2074318 1435717 1021322 899270 1202200
39414 1202200 2048937 3371736 4704583 5295806 4845699 4073430 4012739 4710146 5225455
39405 5225455 5008054 4530556 4291428 3979466 3147670 2085090 1426654 1399189 2002069
39396 2002069 3356241 5138931 6177057 5583009 4143569 3656075 4773119 6246571
39388 6246571 6543579 5642249 4898232 5459435 7106324 8567086 8860183 8301520 8084035
39379 8084035 8892246 10264672 11429231 12289974 13265864 14633810 16538766 19259128 22820765
39370 22820765 26579484 29843931 32856853 36673398 42194721 49799054 59774794 72593250
39362 72593250 88658562 107612118 126969991 141117319 143372268 131251713 109663345
$$ packed form
39423G79608P73984J094461M87509l45539p15705o38601m14395j22052L02930
39414A202200Q46737J322799J332847N91223m50107p72269o0691O97407N15309
39405E225455k17401m77498k39128l11962q31796j062580o58436k7465O02880
39396B002069J354172J782690J038126n94048j439440m87494J117044J473452
39388F246571K97008r01330p44017N61203J646889J460762K93097n58663k17485
39379H084035Q08211J372426J164559Q60743R75890J367946J904956K720362L561637
39370B2820765L758719L264447L012922L816545N521323P604333R975740J2818456
39362G2593250J6065312J8953556J9357873J4147328K254949j2120555k1588368
$$ plain form
39355 109663345 87268985 69456809 55990708 44898795 35980951 29635876 24770291
39348 24770291 20034841 15943771 13822141 13327968 12783941 11569134 10516945 10083808
39340 10083808 9652327 8718161 7463636 6063858 4599456 3667466 3817169 4290203 3647055
39331 3647055 1889153 641217 842656 1554631 1592984 1094769 761799 680016 704722 1045569
39321 1045569 1643908 1830454 1354026 863683 673101 145240 -811996 -903260 617645
39312 617645 2326468 2540230 1861378 1924903 2405827 1597184 -307605 -1043239 232277
39303 232277 1659569 1763021 1615639 2582925 3784342 3586034 2319352 1615301 1822877
39294 1822877 1906876 1488507 1285096 1620709 1968046 2029058 2033484 1929322 1475315 1189105
$$ packed form
39355A09663345k2394360j7812176j3466101j1091913q917844o345075m865585
39348B4770291m735450m091070k121630m94173n44027j214807j052189m33137
39340A0083808m31481r34166j254525j399778j464402r31990J49703M73034o43148
39331C647055j757902j247936K01439P11975L8353m98215l32970q1783K4706L40847
39321A045569N98339J86546m76428m90343j90582n27861r57236r1264J520905
39312F17645J708823K13762o78852O3525M80924q08643j904789p35634J275516
39303B32277J427292J03452j47382R67286J201417j98308j266682p04051K07576
39294A822877Q3999m18369k03411L35613L47337O1012M426j04162m54007k86210
$$ plain form
39284 1189105 1921381 3247297 3572338 2353618 1062520 1180158 2155094 2312786 1242055
39275 1242055 256229 559127 1729930 2284939 1429247 -1396 -421832 701857 2221307
39266 2221307 2765255 2482447 2645824 3644548 4321169 3643582 2188621 1277157 1160370
39257 1160370 869386 -296435 -1831391 -2671068 -2331353 -1231542 -118716 638652 1172802
39248 1172802 1621450 1761876 1376159 767248 448428 404441 250338 148501 800715 2217237
39238 2217237 3249454 2940767 1786374 971462 796902 650258 255696 35024 188610
39229 188610 247764 -133067 -488675 -80084 1071519 1971065 1514767 -398699 -2617561
39220 -2617561 -3789365 -3712597 -3289458 -3042630 -2356065 -701325 1066454 1619761 1062902
$$ packed form
39284A189105P32276J325916L25041j218720j291098J17638R74936J57692j070731
39275A242055r85826L02898J170803N55009q55692j430643m20436J123689J519450
39266B221307N43948k82808J63377R98724O76621o77587j454961r11464j16787
39257A160370k90984j165821j534956q39677L39715J099811J112826P57368N34150
39248A172802M48648J40426l85717o08911l18820m3987j54103j01837O52214J416522
39238B217237J032217l08687j154393q14912j74560j46644l94562k20672J53586
39229A88610N9154l80831l55608M08591J151603Q99546m56298j913466k218862
39220b617561j171804P6768M23139K46828O86565J654740J767779N53307n56859
$$ plain form
39211 1062902 833052 1675190 2768515 3109694 2741014 2123956 1221179 -56275 -1136106
39202 -1136106 -1323323 -685966 232394 1204884 2162182 2600314 1951298 436683 -1106815
39193 -1106815 -2152404 -2631138 -2372738 -1251307 99704 635293 261468 70850 783928
39184 783928 1656440 1561663 625553 40 275787 952642 1506205 2173301 3293377 4400328
39174 4400328 4573184 3624340 2492560 2248657 2861622 3195794 2344177 843626 279336
39165 279336 1531917 3640935 4757090 4193971 3123035 3038713 3925717 4452499 3873189
39156 3873189 3074168 3362833 4643821 5441547 4699022 2924410 1318105 341066 -331720
39147 -331720 -844421 -923136 -565023 -211897 -11757 457007 1363625 2090699 2029855 1477934
$$ packed form
39211A062902k29850Q42138J093325L41179l68680o17058r02777j277454j079831
39202a136106j87217O37357R18360R72490R57298M38132o49016j514615j543498
39193a106815j045589m78734K58400J121431J351011N35589l73825j90618P13078
39184G83928Q72512r4777r36110o25513K75747O76855N53563O67096J120076J106951
39174D400328J72856r48844j131780k43903O12965L34172q51617j500551n64290
39165B79336J252581K109018J116155n63119j070936q4322Q87004N26782n79310
39156C873189p99021K88665J280988P97726p42525j774612j606305r77039o72786
39147c31720n12701p8715L58113L53126K00140M68764R06618P27074o0844n51921
$$ plain form
39137 1477934 1163011 1231477 1372021 1663194 2462449 3496423 3903417 3355454 2436940
39128 2436940 1724346 1199729 802535 769542 1038102 1090841 900663 1234918 2354158 3236760
39118 3236760 3054733 2707362 3622810 5453525 6418969 5914826 5303284 5746104 6627089
39109 6627089 6865511 6687366 7082282 8195850 9289639 9950211 10449207 11064053 11801263
39100 11801263 12765569 14172570 15904337 17491299 18663411 19715309 21322176 24067429
39092 24067429 27945633 32189175 35845019 38671796 41140803 43422814 44887629 44905478
39084 44905478 43586312 41269147 37851083 33298422 28380380 24072306 20454916 17008857
39076 17008857 13865048 11872228 11318340 11410524 11365275 11405849 12208937 13644276 14451750
$$ packed form
39137A477934l14923O8466J40544K91173P99255J033974M06994n47963r18514
39128B436940p12594n24617l97194l2993K68560N2739j90178L34255J119240Q82602
39118C236760j82027l47371R15448J830715R65444n04143o11542M42820Q80985
39109F627089K38422j78145L94916J113568J093789O60572M98996O14846P37210
39100A1801263R64306J407001J731767J586962J172112J051898J606867K745253
39092B4067429L878204M243542L655844K826777K469007K282011J464815J7849
39084D4905478j319166k317165l418064m552661m918042m308074l617390l446059
39076A7008857l143809j992820n53888R2184m5249M0574Q03088J435339Q07474
$$ plain form
39067 14451750 13218429 9725908 5437269 2438775 1577220 1776262 1495619 613055 367486
39058 367486 1606356 3698058 5218889 5242230 3923481 2254474 1280588 1203711 1303029
39049 1303029 1043849 970314 1917951 3576101 4615157 4245121 2953177 1685226 1011661
39040 1011661 1110259 1735246 2048304 1317702 45007 -403086 417308 1432659 1614876
39031 1614876 1250625 1086130 1062922 736491 346967 528200 1213586 1632893 1318739 521591
39021 521591 -306430 -930472 -1251526 -1210421 -849605 -335237 33292 -108554 -789153 -1396149
39011 -1396149 -1296009 -826262 -980502 -1843953 -2116110 -753644 1505004 2934163 2780738
39002 2780738 1834630 1297889 1605259 2223826 2278919 1505728 666282 691791 1457959 2037481
$$ packed form
39067A4451750j233321l492521m288639k998494q61555J99042k80643q82564k45569
39058C67486J238870K091702J520831K3341j318749j669007r73886p6877R9318
39049A303029k59180p3535R47637J658150J039056l70036j291944j267951o73565
39040A011661R8598O24987L13058p30602j272695m48093Q20394J015351J82217
39031A614876l64251j64495k3208l26431l89524J81233O85386M19307l14154p97148
39021E21591q28021o24042l21054M1105L60816N14368L68529j41846o80599o06996
39011a396149J00140M69747j54240q63451k72157J362466K258648J429159j53425
39002B780738r46108n36741L07370O18567N5093p73191q39446K5509P66168N79522
$$ plain form
38992 2037481 2129127 2276585 2531291 2157635 1175634 836198 1656392 2273882 1488984 294799
38982 294799 353610 1384739 1809699 1333361 1001017 1072775 819523 359741 698215 1677005
38972 1677005 1798169 634993 -299958 199866 1463210 2375958 2893152 3188641 2702384
38963 2702384 1230330 -120278 -297219 173131 129193 -486587 -933069 -1085248 -1392502
38954 -1392502 -1831765 -1947814 -1667983 -1212857 -516843 416327 928449 419714 -553026
38945 -553026 -802378 -68073 761974 975586 821762 882210 1307263 1867983 2331741 2626984
38935 2626984 2870352 3214365 3486794 3187399 2145370 963618 438448 693224 1224888
38926 1224888 1635908 1938950 2221037 2346932 2054117 1266244 355650 -41089 221970
$$ packed form
38992B037481R1646J47458K54706l73656r82001l39436Q20194O17490p84898j194185
38982B94799N8811J031129M24960m76338l32344P1758k53252m59782L38474R78790
38972A677005J21164j163176r34951M99824J263344R12748N17194K95489m86257
38963B702384j472054j350608j76941M70350m3938o15780m46482j52179l07254
38954a392502m39263j16049K79831M55126O96014R33170N12122n08735r72740
38945e53026k49352P34305Q30047K13612j53824O0448M25053N60720M63758K95243
38935B626984K43368L44013K72429k99395j042029j181752n25170K54776N31664
38926A224888M11020L03042K82087J25895k92815p87873r10594l96739K63059
$$ plain form
38917 221970 399040 -226610 -1136424 -1150558 -325811 -214880 -1688774 -3459525 -3635076
38908 -3635076 -2101765 -466012 -48231 -750079 -1600771 -1687182 -764281 471827 972874
38899 972874 622938 457652 1140598 1930715 1890781 1390029 1409967 1939469 2197290 2040264
38889 2040264 1955055 1914840 1486858 981401 1241055 2167917 2594521 1874203 660321 -109540
38879 -109540 -132753 510850 1598397 2480528 2415815 1545653 861440 940793 1348838 1475436
38869 1475436 1292638 1069682 962595 1085043 1426947 1586048 1137221 328576 -126474
38860 -126474 86622 743789 1548000 2048204 1507128 -137269 -1526211 -1356843 -385781
38851 -385781 -473135 -1649068 -1849383 49684 2619319 3965913 3864394 2965574 1408191
$$ packed form
38917B21970J77070o25650r09814j4134Q24747J10931j473894j770751j75551
38908c635076J533311J635753M17781p01848q50692q6411R22901J236108N01047
38899I72874l49936j65286O82946P90117l9934n00752J9938N29502K57821j57026
38889B040264q5209m0215m27982n05457K59654R26862M26604p20318j213882p69861
38879a09540k3213O43603J087547Q82131o4713q70162o84213P9353M08045J26598
38869A475436j82798k22956j07087J22448L41904J59101m48827q08645m55050
38860a26474K13096O57167Q04211N00204n41076j644397j388942J69368R71062
38851c85781q7354j175933k00315J899067K569635J346594j01519q98820j557383
$$ plain form
38842 1408191 -605474 -2076162 -2321704 -1952746 -1724319 -1375942 -628454 -237932 -791355
38833 -791355 -1423664 -1109030 -354065 -130690 44077 1241708 2929409 3519391 2871270
38824 2871270 2399436 2643409 2521311 1341348 -68563 -808297 -1107741 -1420818 -1494764
38815 -1494764 -1096614 -740912 -945082 -1439804 -1711210 -1710334 -1527262 -996609 -158640 443060
38805 443060 446569 199094 176382 360584 631930 1270877 2489010 3765436 4193860 3402493
38795 3402493 1867009 507997 144903 955348 2113122 2262132 811556 -1299211 -2417005
38786 -2417005 -1734888 95369 1751672 2383955 2002902 1038759 -160071 -1287680 -1859351
38777 -1859351 -1558580 -861135 -726865 -1349899 -1770429 -1232594 -379644 -333120 -982888 -1180433
$$ packed form
38842A408191k013665j470688k45542L68958K28427L48377P47488L90522n53423
38833g91355o32309L14634P54965K23375J74767J197631J687701N89982o48121
38824B871270m71834K43973j22098j179963j409911p39734k99444l13077p3946
38815a494764L98150L55702k04170m94722k71406Q76J83072N30653Q37969O01700
38805D43060L509k47475k2712J84202K71346O38947J218133J276426M28424p91367
38795C402493j535484j359012l63094Q10445J157774J49010j450576k110767j117794
38786b417005O82117J830257J656303O32283l81053r64143j198830j127609n71671
38777a859351L00771O97445J34270o23034m20530N37835Q52950M6524o49768j97545
$$ plain form
38767 -1180433 -535740 9031 -371026 -1222052 -1531379 -1046070 -457989 -564401 -1426479
38758 -1426479 -2147393 -1604680 195934 1749950 1691919 559149 11013 438444 580436
38749 580436 -257104 -937280 -165592 1614487 2911793 3032268 2331561 1246591 88207
38740 88207 -560466 -225660 756217 1633814 2217065 2823378 3422761 3547350 3022159 2171141
38730 2171141 1286373 426416 -257387 -527546 -478221 -512086 -782412 -976333 -773133 -347006
38720 -347006 -341813 -1285644 -2804027 -3500515 -2225704 323108 1990489 1644381 544026
38711 544026 502439 1456076 2015678 1856323 1966486 2571082 2549380 1482846 699254 1209484
38701 1209484 1853485 951391 -970224 -1744886 -622815 847258 1196830 784276 523480
$$ packed form
38767a180433O44693N44771l80057q51026l09327M85309N88081j06412q62078
38758a426479p20914N42713J800614J554016n8031j132770n48136M27431J41992
38749E80436q37540o80176P71688J780079J297306J20475p00707j084970j158384
38740H8207o48673L34806R81877Q77597N83251O06313N99383J24589n25191q51018
38730B171141q84768q59957o83803k70159M9325l3865k70326j93921K03200M26127
38720c47006N193r43831j518383o96488J274811K548812J667381l46108j100355
38711E44026m1587R53637N59602j59355J10163O04596k1702j066534p83592N10230
38701A209484O44001r02094j921615p74662J122071J470073L49572m12554k60796
$$ plain form
38692 523480 199393 -789790 -1808020 -1475157 346438 2174963 2696392 2103835 1411248
38683 1411248 1134977 1018693 578374 -392552 -1498656 -1793500 -668784 1150430 2134695
38674 2134695 1738528 957859 759389 839452 576649 267386 376659 340343 -542758 -1538443
38664 -1538443 -1337978 -258209 121405 -398352 -234737 1170714 2041504 950668 -725687
38655 -725687 -645169 1201776 2701539 2559616 1429681 377390 -249687 -411476 -201164
38646 -201164 -253211 -1156744 -2292230 -2392013 -1471534 -1007546 -1811674 -2912127 -3137683 -2687364
38636 -2687364 -2297616 -1841485 -867938 132978 253831 -312212 -458281 118970 489940
38627 489940 70654 -343792 263873 1594616 2407690 2138586 1423951 1064788 1139700 1335274
$$ packed form
38692E23480l24087r89183j018230L32863J821595J828525N21429n92557o92587
38683A411248k76271j16284m40319r70926j106104k94844J124716J819214R84265
38674B134695l96167p80669j98470Q0063k62803l09263J09273l6316q83101r95685
38664a538443K00465J079769L79614n19757J63615J405451Q70790j090836j676355
38655g25687Q0518J846945J499763j41923j129935j052291o27077j61789K10312
38646b01164n2047r03533j135486r9783R20479M63988q04128j100453k25556M50319
38636b687364L89748M56131R73547J000916J20853n66043j46069N77251L70970
38627D89940m19286m14446O07665J330743Q13074k69104p14635l59163P4912J95574
$$ plain form
38617 1335274 1591511 2003289 2397418 2464419 2191365 1781457 1222363 344312 -669351
38608 -669351 -1216211 -855987 255782 1511584 2178208 1711320 241907 -1209462 -1523553
38599 -1523553 -648272 455563 1084911 1402130 1658244 1661076 1480145 1854734 3101885
38590 3101885 4205078 3950047 2663877 1843738 2112032 2488137 1927094 824128 495198
38581 495198 1476332 2774756 2918985 1676374 447256 611431 1753949 2320131 1951034
38572 1951034 1895302 2640984 2654675 737583 -1571780 -1743982 249366 2121059 2662855
38563 2662855 2867987 3485749 3613428 2544672 1225663 736740 717978 504224 658429
38554 658429 2040791 4162700 5722088 6214534 5969790 5191585 4062371 3313358 3562499
$$ packed form
38617A335274K56237M11778L94129O7001k73054m09908n59094q78051j013663
38608f69351n46860L60224J111769J255802O66624m66888j469413j451369l14091
38599a523553Q75281J103835O29348L17219K56114K832j80931L74589J247151
38590C101885J103193k55031j286170q20139K68294L76105n61043j102966l28930
38581D95198R81134J298424J44229j242611j229118J64175J142518N66182l69097
38572A951034n5732P45682J3691j917092k309363j72202J993348J871693N41796
38563B662855K05132O17762J27679j068756j319009m88923j8762k13754J54205
38554F58429J382362K121909J559388M92446k44744p78205j129214p49013K49141
$$ plain form
38545 3562499 4345555 4705728 4434394 3913527 3168857 2015343 768275 -128747 -822958
38536 -822958 -1477703 -1453738 -193471 1471729 2201207 2115441 2491052 3519906 3885246
38527 3885246 2884816 1558337 1114126 1447550 1946519 2688433 3876795 4815716 4456553
38518 4456553 2715031 635165 -532547 -104543 1718037 3916278 5452950 6265718
38510 6265718 6960871 7447913 6855995 5225290 4110540 4549097 5371309 4785345 2996969
38501 2996969 1835075 2117138 2909573 3400451 3951576 4878206 5557392 5467595 5069387
38492 5069387 4912226 4779748 4498591 4683104 5673242 6498902 6140006 5361381 5967581
38483 5967581 8344367 10978348 12509567 13089493 13441796 13722204 13853752 14102553 14725061
$$ packed form
38545C562499P83056L60173k71334n20867p44670j153514j247068q97022o94211
38536h22958o54745K3965J260267J665200P29478q5766L75611J028854L65340
38527C885246j000430j326479m44211L33424M98969P41914J188362R38921l59163
38518D456553j741522k079866j167712M28004J822580K198241J536672Q12768
38510F265718O95153M87042n91918j630705j114750M38557Q22212n85964j788376
38501B996969j161894K82063P92435M90878N51125R26630O79186q9797l98208
38492E069387j57161j32478k81157J84513R90138Q25660l58896p78625O06200
38483E967581K376786K633981J531219N79926L52303K80408J31548K48801O22508
$$ plain form
38474 14725061 15717655 17344595 20109017 23673995 26702421 28536673 30268923 33294142
38466 33294142 37562474 42291900 47678303 54576982 63012508 72563149 84050110 99258734
38458 99258734 118956323 142889625 171878807 207361281 246906723 281362531 298859972
38451 298859972 292641660 265141028 225437895 183697490 146996095 117969102 95789994
38444 95789994 78386710 64276879 52898061 43998102 37287353 32466014 29129763 26709801
38436 26709801 24718458 22861760 20818860 18351624 15806531 13900371 12687388 11451534
38428 11451534 10095880 9736907 10982441 12336530 11645116 8944330 6594608 6363104
38420 6363104 7396126 7524724 5863620 3588906 2483996 3113407 4401415 4937207 4577716
$$ packed form
38474A4725061R92594J626940K764422L564978L028426J834252J732250L025219
38466C3294142M268332M729426N386403O898679Q435526R550641J1486961J5208624
38458I9258734J9697589K3933302K8989182L5482474L9545442L4455808J7497441
38451B98859972o218312k7500632l9703133m1740405l6701395k9026993k2179108
38444I5789994j7403284j4109831j1378818q899959o710749m821339l336251k419962
38436B6709801j991343j856698k042900k467236k545093j906160j212983j235854
38428A1451534j355654l58973J245534J354089o91414k700786k349722k31504
38420F363104J033022J28598j661104k274714j104910O29411J288008N35792l59491
$$ plain form
38411 4577716 4354243 4726050 4761289 3698445 2518687 2758280 4097632 4511335 2983141
38402 2983141 844562 -90491 229958 415297 -384377 -1527884 -1765993 -657997 941966
38393 941966 1778834 1562971 1162956 1300130 1627399 1581635 1447861 1660829 1626032 517517
38383 517517 -995789 -1242129 135515 1708930 2387097 2660612 3234136 3703259 3351392
38374 3351392 2278714 1032103 -38342 -498017 122933 1369811 1950236 1468105 1034355
38365 1034355 1408759 1736050 1160983 496150 894240 1842238 2088756 1862740 2416595
38356 2416595 3736937 4484687 4159253 3648603 3472744 3086933 2311232 1948002 2345280
38347 2345280 2615395 2026470 1104768 565064 110004 -747197 -1396603 -787272 899463
$$ packed form
38411D577716k23473L71807L5239j062844j179758K39593J339352M13703j528194
38402B983141k138579r35053L20449J85339p99674j143507k38109J107996J599963
38393I41966Q36868k15863m00015J37174L27269m5764j33774K12968l4797j108515
38383E17517j513306k46340J377644J573415O78167K73515N73524M69123l51867
38374C351392j072678j246611j070445m59675O20950J246878N80425m82131m33750
38365A034355L74404L27291n75067o64833L98090R47998K46518k26016N53855
38356B416595J320342P47750l25434n10650j75859l85811p75701l63230L97278
38347B345280K70115n88925r21702n39704m55060q57201o49406O09331J686735
$$ plain form
38338 899463 2168869 1851269 256415 -1319462 -1807956 -1087431 107177 821646 592833
38329 592833 -286681 -1093742 -1257309 -803057 -350908 -478082 -930478 -777347 377289
38320 377289 1735398 2295242 2062004 1634194 1048935 17933 -928273 -744261 517548
38311 517548 1510193 1367835 665469 178036 -222028 -721498 -658559 478268 1822318
38302 1822318 2038160 1097708 110940 -368747 -798337 -1446800 -1803701 -1456390 -773893
38293 -773893 -376248 -456593 -862131 -1373832 -1714260 -1703467 -1552819 -1611134 -1768019 -1588555
38283 -1588555 -1088425 -791097 -879968 -925132 -687365 -545309 -791954 -1162019 -1472325 -2011410
38273 -2011410 -2705416 -2674502 -1533472 -481235 -842732 -1855436 -1394998 932827 2908066
$$ packed form
38338H99463J269406l17600j594854j575877m88494P20525J194608P14469k28813
38329E92833q79514q07061j63567M54252M52149j27174m52396J53131J154636
38320C77289J358109N59844k33238m27810n85259j031002r46206J84012J261809
38311E17548R92645j42358p02366m87433m00064m99470O2939J136827J344050
38302A822318K15842r40452r86768m79687m29590o48463l56901L47311O82497
38293g73893L97645q0345m05538n11701l40428J0793J50648n8315j56885J79464
38283a588555N00130K97328q8871m5164K37767J42056k46645l70065l10306n39085
38273b011410o94006L0914J141030J052237l61497j012704M60438K327825J975239
$$ plain form
38264 2908066 2569273 762949 -166849 600603 1779623 1957215 1056565 -50655 -503457
38255 -503457 -16232 851088 1038270 149598 -936211 -1224445 -997263 -1169594 -1600862
38246 -1600862 -1298927 -323486 -97571 -1314589 -2708118 -2699764 -1429515 -308367 -159953
38237 -159953 -621359 -959190 -723902 129891 1142467 1556665 1079846 235263 -298077
38228 -298077 -300875 210779 1144646 1917709 1689733 553744 -336597 -464237 -776335 -1888307
38218 -1888307 -2547121 -1335437 853284 1765625 880409 -169658 -197119 262729 488163
38209 488163 671388 939971 776966 106474 -342367 -432724 -1074272 -2486444 -3325298 -2588504
38199 -2588504 -1230908 -676701 -718830 -245828 753817 1408199 1643233 2108754 2667452
$$ packed form
38264B908066l38793j806324r29798P67452J179020J77592r00650j107220m52802
38255e03457M87225Q67320J87182q88672j085809k88234K27182j72331m31268
38246a600862L01935R75441K25915j217018j393529Q354J270249J121148J48414
38237a59953m61406l37831K35288Q53793J012576M14198m76819q44583n33340
38228b98077k798N11654R33867P73063k27976j135989q90341j27640l12098j111972
38218a888307o58814J211684K188721R12341q85216j050067k7461M59848K25434
38209D88163J83225K68583j63005o70492m48841r0357o41548j412172q38854P36794
38199b588504J357596N54207m2129M73002R99645O54382K35034M65521N58698
$$ plain form
38190 2667452 2430420 1304739 195212 -430757 -954292 -1457906 -1455051 -1081040 -1281367
38181 -1281367 -2253082 -2837653 -2199455 -1120493 -752720 -924903 -718810 -86221 278099
38172 278099 316189 654837 1346830 1700957 1509325 1382098 1536384 1255692 108827 -1126047
38162 -1126047 -1430803 -776160 300544 1671065 3311346 4626085 5167061 5629312 6918757
38153 6918757 8462312 8843764 8138689 8028832 9146923 9891485 8768718 6528015 4791027
38144 4791027 3732295 2553168 1350556 876703 963991 785214 385580 453417 813876
38135 813876 695206 288159 347967 356261 -954764 -3038791 -3650051 -2226032 -1064165
38126 -1064165 -1951711 -3500083 -3413016 -1888826 -903681 -1150201 -1614083 -1615275 -1479586 -1422522
$$ packed form
38190B667452k37032j125681j109527o25969n23535n03614K855L74011k00327
38181a281367r71715n84571O38198J078962L67773j72183K06093O32589L64320
38172B78099L8090L38648O91993L54127j91632j27227J54286k80692j146865j234874
38162a126047l04756O54643J076704J370521J640281J314739N40976M62251J289445
38153F918757J543555L81452p05075j09857J118091P44562j122767k240703j736988
38144D791027j058732j179127j202612m73853Q7288j78777l99634O7837L60459
38135H13876j18670m07047N9808Q294j311025k084027o11260J424019J161867
38126a064165q87546j548372Q7067J524190R85145k46520m63882j192J35689N7064
$$ plain form
38116 -1422522 -1283593 -1239090 -1494478 -1472764 -550227 660376 1064376 860003 1120711 1768762
38106 1768762 1585079 370231 -537922 -345880 82073 -179200 -752106 -986101 -1151186
38097 -1151186 -1617230 -1806883 -1091546 -91799 22023 -832885 -1690124 -1985604 -2038413 -2117248
38087 -2117248 -1904203 -1155499 -311699 -52359 -455362 -878300 -671582 122533 886932
38078 886932 1213098 1310166 1459530 1414087 846413 184338 251108 986838 1321333 683469
38068 683469 -104085 -85048 238160 -483574 -2329872 -3521607 -2363948 677335 3306487
38059 3306487 3677601 2004277 -81553 -1362842 -1883087 -2126144 -1986210 -1040424 382937
38050 382937 1095894 325400 -1249970 -2164036 -1799946 -986951 -834980 -1298823 -1321345 -386726
$$ packed form
38116a422522J38929M4503k55388K1714R22537J210603M04000k04373K60708O48051
38106A768762j83683j214848r08153J92042M27953k61273n72906k33995j65085
38097a151186m66044j89653P15337R99747J13822q54908q57239k95480n2809p8835
38087b117248K13045P48704Q43800K59340m03003m22938K06718P94115P64399
38078H86932L26166R7068J49364m5443n67674o62075O6770P35730L34495o37864
38068F83469p87554J9037L23208p21734j846298j191735J157659L041283K629152
38059C306487L71114j673324k085830j281289n20245k43057J39934R45786J423361
38050C82937P12957p70494j575370r14066L64090Q12995J51971m63843k2522R34619
$$ plain form
38040 -386726 604060 429682 -790258 -1687400 -1394445 -482480 121514 423320 942844
38031 942844 1530479 1499020 848253 510959 1092570 1906939 1682977 57161 -1900601
38022 -1900601 -2654786 -1655743 160950 1344117 1323739 669121 98485 -274724 -627160
38013 -627160 -972573 -1368412 -2037866 -2828745 -3033763 -2276681 -1127394 -271241 431847
38004 431847 1344513 1995668 1576648 282254 -730474 -649076 420230 1903675 2937559
37995 2937559 2452935 280678 -1878292 -1850848 369686 2460848 2569489 1236462 133765
37986 133765 -37788 267384 465949 242222 -519779 -1486863 -1920849 -1498251 -777052 -491205
37976 -491205 -747769 -1191684 -1496870 -1411101 -846184 -276811 -523882 -1699961 -2782591
$$ packed form
38040c86726R90786j74378j219940q97142K92955R11965O03994L01806N19524
38031I42844N87635l1459o50767l37294N81611Q14369k23962j625816j957762
38022a900601p54185R99043J816693J183167k0378o54618n70636l73209l52436
38013f27160l45413l95839o69454p90879k05018P57082J149287Q56153P03088
38004D31847R12666O51155m19020j294394j012728Q1398J069306J483445J033884
37995B937559m84624k172257k158970K7444K220534K091162J08641j333027j102697
37986A33765j71553L05172J98565k23727p62001r67084m33986M22598P21199K85847
37976d91205k56564m43915l05186Q5769N64917N69373k47071j176079j082630
$$ plain form
37967 -2782591 -2687469 -1530416 -527065 -788232 -2264925 -3667306 -3589852 -2100626 -879922
37958 -879922 -1147033 -1930674 -1478691 -3502 541196 -511945 -1500291 -1031030 -5160
37949 -5160 -30857 -1121900 -2138795 -2471319 -2085059 -808929 1098973 2316203 1702369
37940 1702369 -125876 -1463070 -1438366 -479669 630548 1272770 1038908 173755 -380992
37931 -380992 -89826 500672 779819 1019841 1564077 1941271 1727351 1416193 1371074 818424
37921 818424 -868187 -2736751 -3478447 -3285679 -3072998 -2738160 -1886918 -1426760 -2374823
37912 -2374823 -3625439 -3122841 -1034052 457306 465691 212105 354442 -46931 -1266364
37903 -1266364 -1897214 -1082506 142388 705470 915187 1052559 372838 -1257309 -2339411
$$ packed form
37967b782591R5122J157053J003351k61167j476693j402381P7454J489226J220704
37958h79922k67111p83641M51983J475189N44698j053141r88346M69261J025870
37949e160k5697j091043j016895l32524L86260J276130J907902J217230o13834
37940A702369j828245j337194K4704R58697J110217O42222k33862q65153n54747
37931c80992K91166N90498K79147K40022N44236L77194k13920l11158m5119n52650
37921H18424j686611j868564p41696J92768K12681L34838Q51242M60158r48063
37912b374823j250616N02598K088789J491358Q385k53586J42337m01373j219433
37903a266364o30850Q14708J224894N63082K09717J37372o79721j630147j082102
$$ plain form
37894 -2339411 -1706934 -192877 838044 1283221 1491989 1146812 316975 212681 1347401
37885 1347401 2222232 1441024 -119743 -993465 -1664799 -3264902 -4775481 -4127651 -1708193
37876 -1708193 -209538 -811468 -1802340 -1492067 -430326 93070 53404 184795 691706
37867 691706 1371388 2112734 2590636 2287394 1362487 700634 665762 677050 414688 418737
37857 418737 924945 1155784 565958 -117720 -34796 390257 240795 -219845 129493 1431273
37847 1431273 2442805 2147558 951934 -28122 -285964 -164228 -138407 -253990 -222184
37838 -222184 131935 613861 900466 985588 1156990 1405754 1114137 -317269 -2535801
37829 -2535801 -4221926 -4203493 -2580066 -677372 164729 -214583 -828248 -722628 65581
$$ packed form
37894b339411O32477J514057J030921M45177K08768l45177q29837j04294J134720
37885A347401Q74831p81208j560767q73722o71334j600103j510579O47830K419458
37876a708193J498655o01930r90872L10273J061741N23396l9666J31391N06911
37867F91706O79682P41346M77902l03242r24907o61853l4872J1288k62362M049
37857D18737N06208K30839n89826o83678Q2924M25053j49462m60640L49338J301780
37847A431273J011532k95247j195624r80056k57842J21736K5821j15583L1806
37838b22184L54119M81926K86605Q5122J71402K48764k91617j431406k218532
37829b535801j686125J8433J623427J902694Q42101l79312o13665J05620P88209
$$ plain form
37820 65581 841842 1262743 1607871 2096125 2381369 1906206 499285 -1466729 -3203339
37811 -3203339 -3730612 -2500783 -193760 1482138 1349928 19051 -890920 -679568 -129204
37802 -129204 -109722 -381780 -244690 206133 227221 -372129 -951132 -1031309 -860771 -722705
37792 -722705 -334452 576896 1586456 2064745 2047010 1981790 1854771 1317489 614175 522336
37782 522336 1155105 1593709 1124441 214222 -250822 -148246 111940 582071 1686519
37773 1686519 3196766 4106712 3813508 2894343 2339153 2335416 2230113 1581341 819418 681697
37763 681697 1197647 1538891 943477 -431258 -1764733 -2518043 -2799160 -2806901 -2338759 -1147276
37753 -1147276 415798 1509086 1675231 1391287 1485762 2009265 2036875 915196 -566061
$$ packed form
37820F5581P76261M20901L45128M88254K85244m75163j406921j966014j736610
37811c203339n27273J229829K307023J675898j32210j330877r09971K11352N50364
37802a29204J9482k72058J37090M50823K1088n99350n79003q0177J70538J38066
37792g22705L88253R11348J009560M78289j7735o5220j27019n37282p03314r1839
37782E22336O32769M38604m69268r10219m65044J02576K60186M70131J104448
37773A686519J510247R09946k93204r19165n55190l737j05303o48772p61923j37721
37763F81697N15950L41244n95414j374735j333475p53310k81117p741M68142J191483
37753a147276J563074J093288J66145k83944R4475N23503K7610j121679j481257
$$ plain form
37744 -566061 -921310 46676 827953 224635 -1012852 -1402151 -924991 -795086 -1329450
37735 -1329450 -1474314 -634620 382036 789341 1020392 1735560 2580678 2836975 2610056
37726 2610056 2469171 2441778 2250462 2131050 2553569 3415977 4256645 4975637 5657775 6032372
37716 6032372 5850640 5460032 5229113 4751155 3491632 1947363 1213714 1534571 2158988
37707 2158988 2489885 2465814 1974514 975961 222241 713381 2177854 3100998 2606670
37698 2606670 1394189 439080 -284638 -1217809 -2162295 -2538832 -2223305 -1575904 -1026973
37689 -1026973 -1008227 -1768108 -2790927 -2921365 -1647941 121766 1126928 1247683 1305013
37680 1305013 1606804 1460977 296008 -1273537 -1923434 -1101049 250840 670270 -181520
$$ packed form
37744e66061l55249R67986P81277o03318j237487l89299M77160J29905n34364
37735a329450j44864Q39694J016656M07305K31051P15168Q45118K56297k26919
37726B610056j40885k7393j91316j19412M22519Q62408Q40668P18992O82138L74597
37716F032372j81732l90608k30919m77958j259523j544269p33649L20857O24417
37707B158988L30897k4071m91300r98553p53720M91140J464473R23144m94328
37698B606670j212481r55109p23718r33171r44486l76537L15527O47401N48931
37689a026973J8746p59881j022819j30438J273424J769707J005162J20755N7330
37680A305013L01791j45827j164969j569545o49897Q22385J351889M19430q51790
$$ plain form
37671 -181520 -1216318 -1402408 -1021483 -917083 -989944 -418299 768979 1525632 1488493 1681216
37661 1681216 2820139 3906821 3575826 2233568 1612290 2339655 3117950 2552911 865354
37652 865354 -658147 -1220012 -947455 -245262 598994 1279197 1520657 1393123 1240126
37643 1240126 1209171 1160286 1120415 1397873 1954238 2081676 1270663 193185 128482 1363702
37633 1363702 2829934 3498517 3460553 3327341 3275980 3168749 2958326 2392100 981911
37624 981911 -990787 -2097371 -1367436 216410 907195 486529 141603 316801 171452
37615 171452 -677559 -1336887 -1090649 -487744 -318046 -441208 -281543 291387 1144206 2212756
37605 2212756 3166668 3502843 3419894 3724317 4355975 4018428 2019054 -490971 -2015435
$$ packed form
37671a81520j034798j86090L80925J04400p2861N71645J187278P56653l7139J92723
37661A681216J138923J086682l30995j342258o21278P27365P78295n65039j687557
37652H65354j523501n61865K72557P02193Q44256O80203K41460j27534j52997
37643A240126l0955m8885l9871K77458N56365J27438q11013j077478o4703J235220
37633A363702J466232O68583l7964j33212n1361j07231k10423n66226j410189
37624I81911j972698j106584P29935J583846O90785m20666l44926J75198j45349
37615A71452q49011o59328K46238O02905J69698j23162J59665N72930Q52819J068550
37605B212756R53912L36175q2949L04423O31658l37547j999374k510025j524464
$$ plain form
37596 -2015435 -2539421 -2805679 -2661869 -1536426 -23006 541657 -11946 -522131 -301795
37587 -301795 111184 205620 332114 843538 1337466 1319996 958713 644587 316356 -261864
37577 -261864 -913481 -1231336 -1147982 -933199 -736477 -455892 -26404 424040 741519 861888
37567 861888 667245 -38927 -1086511 -1560088 -459196 1910797 3704462 3341728 1288028
37558 1288028 -641660 -1459382 -1546631 -1233558 -210252 1292804 2077087 1544719 692167
37549 692167 640302 1030396 875770 263459 70166 495080 983447 1222416 1147765 333219
37539 333219 -1454346 -3293005 -3858105 -3092499 -2101072 -1477575 -856345 -120912 192027
37530 192027 86 86819 916428 1895403 2324914 2374247 2545571 2700608 2236924 1056533
$$ packed form
37596b015435n23986k66258J43810J125443J513420N64663n53603n10185K20336
37587c01795M12979R4436J26494N11424M93928j7470l61283l14126l28231n78220
37577b61864o51617l17855Q3354K14783J96722K80585M29488M50444L17479J20369
37567H61888j94643p06172j047584m73577J100892K369993J793665l62734k053700
37558A288028j929688q17722q7249L13073J023306J503056P84283n32368q52552
37549F92167n1865L90094j54626o12311j93293M24914M88367K38969p4651q14546
37539C33219j787565j838659n65100P65606R91427O23497O21230P35433L12939
37530A92027j91941Q6733Q29609R78975M29511M9333J71324J55037m63684j180391
$$ plain form
37520 1056533 -45023 -39534 1237609 2627637 2618914 1027408 -723951 -1378860 -1280271
37511 -1280271 -1369802 -1482201 -806574 347612 659625 -229377 -1105138 -902906 -32180
37502 -32180 467661 303110 -4917 102420 664533 1039167 327119 -1517797 -3166151
37493 -3166151 -3191582 -1709068 -5534 1156966 1910607 2273198 2003968 1376955 884722
37484 884722 256418 -953461 -1987236 -1698087 -701563 -831142 -2184554 -2754612 -1608418
37475 -1608418 -311112 -190736 -299404 469352 1173753 558397 -605695 -938851 -897749
37466 -897749 -1601329 -2230720 -1040849 1503991 2969167 2313577 961161 369193 437522
37457 437522 667285 1113750 1579596 1324778 298751 -408829 79321 1455829 2894151
$$ packed form
37520A056533j101556N489J277143J390028q723j591506j751359o54909R8589
37511a280271q9531j12399O75627J154186L12013q89002q75761K02232Q70726
37502c2180M99841j64551l08027J07337N62113L74634p12048j844916j648354
37493c166151k5431J482514J703534J162500P53641L62591k69230o27013m92233
37484H84722o28304j209879j033775K89149R96524j29579j353412n70058J146194
37475a608418J297306J20376j08668P68756P04401o15356j164092l33156M1102
37466h97749p03580o29391J189871K544840J465176o55590j352416n91968O8329
37457D37522K29763M46465M65846k54818j026027p07580M88150J376508J438322
$$ plain form
37448 2894151 3774607 3525421 1779092 -867931 -3026962 -3796250 -3299805 -1983632 -244287
37439 -244287 1214937 1683201 1361510 1165307 1462002 1805546 1898368 1780238 1034224 -912126
37429 -912126 -3352897 -4425435 -3304577 -1327115 -338833 -751284 -1740954 -2491202 -2621386
37420 -2621386 -2139687 -1579353 -1584075 -1952674 -1775187 -811730 135615 558373 898040 1386455
37410 1386455 1418238 833159 637807 1404519 2000454 1194075 -288801 -734147 91682
37401 91682 917079 1104601 1300377 1902443 2266845 1807979 855739 20793 -500005 -672874
37391 -672874 -410843 50039 159296 -221723 -546057 -284689 445942 1082720 1100630 292932
37381 292932 -999854 -1921185 -1814822 -954190 -143300 365664 1036179 2136399 3269474
$$ packed form
37448B894151Q80456k49186j746329k647023k159031p69288M96445J316173J739345
37439b44287J459224M68264l21691j96203K96695L43544R2822j18130p46014j946350
37429i12126k440771j072538J120858J977462R88282m12451r89670p50248j30184
37420b621386M81699N60334m722l68599J77487R63457R47345M22758L39667M88415
37410A386455L1783n85079j95352P66712N95935q06379j482876m45346Q25829
37401I1682Q25397J87522J95776O02066L64402m58866r52240q34946n20798j72869
37391f72874K62031M60882J09257l81019l24334K61368P30631O36778J7910q07698
37381B92932j292786r21331J06363Q60632Q10890N08964O70515J100220J133075
$$ plain form
37372 3269474 3955145 4160360 4084710 3882949 3761857 3913059 4179676 4171080 3815453 3407493
37362 3407493 3067962 2640106 2182247 1997986 2041034 1878800 1435562 1139337 1059163 583997
37352 583997 -583434 -1711031 -1892807 -1202776 -474671 -302755 -726726 -1460505 -1868850
37343 -1868850 -1163707 670445 2464256 3076570 2728350 2404512 2300428 1854191 1119649
37334 1119649 909131 1420658 1858003 1758089 1599838 1598700 1053108 -276569 -1185493 -609408
37324 -609408 532751 460257 -867252 -1710208 -1098002 9015 443166 391850 542007
37315 542007 721605 338532 -490436 -1172667 -1564594 -1791452 -1469248 -64491 2011622
37306 2011622 3524145 3798136 3353869 3016261 2987658 3011797 2877651 2407226 1395934
$$ packed form
37372C269474O85671K05215p5650k01761j21092J51202K66617q596l55627m07960
37362C407493l39531m27856m57859j84261M3048j62234m43238k96225q0174m75166
37352E83997j167431j127597j81776O90031P28105J71916m23971p33779m08345
37343a868850P05143J834152J793811O12314l48220l23838j04084m46237p34542
37334A119649k10518N11527M37345r9914j58251j138n45592j329677r08924N76085
37324f09408J142159p2494j327509q42956O12206J107017M34151n1316J50157
37315E42007J79598l83073q28968o82231l91927k26858L22204J404757K076113
37306B011622J512523K73991m44267l37608k8603K4139j34146m70425j011292
$$ plain form
37297 1395934 9437 -1033402 -1110981 -409284 376769 960196 1672638 2690818 3433207
37288 3433207 3045490 1414326 -545089 -1682561 -1586196 -733100 167999 815801 1337732
37279 1337732 1836973 2005967 1254213 -607644 -2741419 -3646720 -2540681 -291683 1395238
37270 1395238 1685114 1129078 603241 390481 436891 776674 1264199 1448544 1222238 1119451
37260 1119451 1451693 1672342 1275056 814121 1118333 1825798 1791396 892887 274981 535057
37250 535057 769842 39081 -1070252 -1175888 50423 1539079 2149567 1708461 762117
37241 762117 -141642 -722774 -830349 -374000 484753 1180240 1092810 253072 -537537 -590733
37231 -590733 -113098 282720 573389 1199365 2043041 2278294 1433026 52128 -903409
$$ packed form
37297A395934j386497j042839p7579P01697P86053N83427P12442J018180P42389
37288C433207l87717j631164j959415j137472R6365Q53096R01099O47802N21931
37279A337732M99241J68994p51754j861857k133775r05301J106039K248998J686921
37270A395238K89876n56036n25837k12760M6410L39783M87525J84345k26306j02787
37260A119451L32242K20649l97286m60935L04212P07465l4402q98509o17906K60076
37250E35057K34785p30761j109333j05636J226311J488656O10488m41106r46344
37241G62117r03759n81132j07575M56349Q58753O95487q7430q39738p90609n3196
37231e90733M77635L95818K90669O25976Q43676K35253q45268j380898r55537
$$ plain form
37222 -903409 -907138 -63214 1053702 1701428 1607838 1283900 1176178 749289 -702445 -2504506
37212 -2504506 -3120249 -2391242 -1878382 -2457211 -2996494 -2331168 -1230989 -1105944 -1724770
37203 -1724770 -1689247 -577006 814648 1981128 3080495 3956421 4054720 3320383 2183892
37194 2183892 788406 -797992 -1876166 -1783232 -1095022 -965210 -1387409 -1369353 -741015
37185 -741015 -383508 -597490 -727611 -642487 -1036487 -1783792 -1528154 320518 2490385
37176 2490385 3568617 3625728 3297177 2498163 1129595 -37761 -447606 -884423 -2221240
37167 -2221240 -3685228 -3711370 -2166209 -500120 144972 -71691 -496802 -833369 -1080857
37158 -1080857 -1232416 -1119079 -390512 1002849 2222390 2232915 1364986 1112900 1875492
$$ packed form
37222i03409l729Q43924J116916O47726r3590l23938j07722m26889j451734j802061
37212b504506o15743P29007N12860n78829n39283O65326J100179J25045o18826
37203a724770L5523J112241J391654J166480J099367Q75926R8299p34337j136491
37194B183892j395486j586398j078174R2934O88210J29812m22199J8056O28338
37185g41015L57507k13982j30121Q5124l94000p47305K55638J848672K169867
37176B490385J078232N7111l28551p99014j368568j167356m09845m36817j336817
37167b221240j463988k6142J545161J666089O45092k16663m25111l36567k47488
37158a080857j51559J13337P28567J393361J219541J0525q67929k52086P62592
$$ plain form
37149 1875492 2287583 1712786 1765650 3708632 5747798 5188434 2472445 632480 1064418
37140 1064418 2312221 3070437 3831917 5033096 5966295 6441334 7465801 9347759 11122022
37131 11122022 12797274 15901632 20359734 23051129 21516899 17396877 14039434 12190842
37123 12190842 10435058 8608543 7892467 8089916 7715085 6856959 7310915 9393092 10988005
37114 10988005 10524235 8862040 7381170 6098269 4711685 3764932 3499435 2994116 1783968
37105 1783968 1090604 1996877 3419190 3473242 2169227 1166198 1221704 1424469 931917
37096 931917 100836 -397584 -569118 -809744 -1280890 -1854214 -2236587 -2041659 -1151675 -47368
37086 -47368 617720 775086 899570 1240871 1491043 1244254 474346 -465300 -1099728 -1160275
$$ packed form
37149A875492M12091n74797N2864J942982K039166n59364k715989j839965M31938
37140A064418J247803P58216P61480J201179R33199M75039J024467J881958J774263
37131A1122022J675252L104358M458102K691395j534230m120022l357443j848592
37123A2190842j755784j826515p16076J97449l74831q58126M53956K082177J594913
37114A0988005m63770j662195j480870j282901j386584r46753k65497n05319j210148
37105A783968o93364R06273J422313N4052j304015j003029N5506K02765m92552
37096I31917q31081m98420j71534k40626m71146n73324l82373J94928Q89984J104307
37086d7368O65088J57366J24484L41301K50172k46789p69908r39646o34428o0547
$$ plain form
37076 -1160275 -875216 -839441 -1401162 -2293165 -2990787 -3202366 -2878079 -2097162 -1206048 -722358
37066 -722358 -769621 -857506 -469843 396626 1410200 2193642 2311562 1578990 611209 350886
37056 350886 753960 835571 424937 656559 1863207 2320845 613007 -1749185 -2020008
37047 -2020008 -70940 1527396 1275259 461964 590570 1115544 872998 222154 347201
37038 347201 1350105 2310004 2678694 2626231 2504242 2824104 4248611 6752421 9276851
37029 9276851 11075627 12908792 15873033 19328991 21111641 19950804 16883661 13983899
37021 13983899 12186992 10675939 8226299 4908896 2225915 1375241 1721979 1660069 821867
37012 821867 378188 929006 1356747 559315 -737154 -1046939 -315377 217692 -22299
$$ packed form
37076a160275K85059L5775n61721q92003o97622k11579L24287P80917Q91114M83690
37066g22358m7263q7885L87663Q66469J013574P83442J17920p32572r67781k60323
37056C50886M03074Q1611m10634K31622J206648M57638j707838k362192k70823
37047b020008J949068J598336k52137q13295J28606N24974k42546o50844J25047
37038C47201J002904R59899L68690n2463j21989L19862J424507K503810K524430
37029I276851J798776J833165K964241L455958J782650j160837l067143k899762
37021A3983899j796907j511053k449640l317403k682981q50674L46738o1910q38202
37012H21867m43679N50818M27741p97432j296469l09785P31562N33069k39991
$$ plain form
37003 -22299 -392310 -396877 -443008 -950145 -1544754 -1542722 -782512 289426 1145228 1686185
36993 1686185 2228366 2796414 2604922 971468 -1177009 -1801184 -293572 1580440 2107816
36984 2107816 1820017 2071924 2616565 2340206 1596800 1734416 2601458 2625890 1454946
36975 1454946 476322 351027 22073 -1136165 -2015201 -1571972 -408274 423056 846746
36966 846746 1082290 880245 432382 722467 1882791 2496388 1734094 901730 1494607
36957 1494607 2957030 3963020 4788982 6567062 9052689 11098291 12697115 14495852
36949 14495852 15735865 14938209 12569172 10764957 10137480 9065431 6724027 4608434
36941 4608434 4027806 4070241 3439108 2650193 2755984 3177928 2663977 1586350 1405184
$$ packed form
37003b2299l70011m567m6131n07137n94609K032P60210J071938Q55802N40957
36993A686185N42181N68048j91492j633454k148477o24175J507612J874012N27376
36984B107816k87799K51907N44641k76359p43406J37616Q67042K4432j170944
36975A454946r78624j25295l28954j158238q79036M43229J163698Q31330M23690
36966H46746K35544k02045m47863K90085J160324O13597p62294q32364N92877
36957A494607J462423J005990Q25962J778080K485627K045602J598824J798737
36949A4495852J240013p97656k369037j804215o27477j072049k341404k115593
36941D608434n80628M2435o31133p88915J05791M21944n13951j077627j81166
$$ plain form
36932 1405184 2224727 2675043 2208541 1841713 2264007 2675134 2207962 1411595 1408049 2219023
36922 2219023 2822621 2579153 1830567 1160338 755157 673984 1179430 2323657 3407368
36913 3407368 3389668 2021951 259636 -734302 -797157 -646692 -725011 -693305 -167445 580621
36903 580621 1013358 1085121 1186137 1491055 1763817 1764893 1502900 1068590 549721 200216
36893 200216 381563 1109889 1834352 1930329 1378492 729650 387704 211163 -22049 -68830
36883 -68830 424400 1105986 1022435 -195194 -1636167 -2005692 -1050042 237615 717382
36874 717382 150725 -682518 -635570 826031 2935195 4085359 3362888 1478902 -127677
36865 -127677 -789986 -780255 -472947 -161893 -373027 -1281064 -1890959 -999958 849949 1661632
$$ packed form
36932A405184Q19543M50316m66502l66828M22294M11127m67172p96367l546Q10974
36922B219023O03598k43468p48586o70229m05181q1173N05446J144227J083711
36913C407368j7700j367717j762315r93938o2855J50465p8319L1706N25860P48066
36903E80621M32737P1763J01016L04918K72762J076k61993m34310n18869l49505
36893B00216J81347P28326P24463R5977n51837o48842l41946j76541k33212m6781
36883f8830M93230O81586q3551j217629j440973l69525R55650J287657M79767
36874G17382n66657q33243M6948J461601K109164J150164p22471j883986j606579
36865a27677o62309R731L07308L11054k11134r08037o09895Q91001J849907Q11683
$$ plain form
36855 1661632 684742 -472551 -215468 798174 942381 123147 -467373 -448785 -509342
36846 -509342 -798819 -598428 292273 1125737 1346004 1014683 292 -1934911 -3908938
36837 -3908938 -4152293 -2181286 304496 1425661 1142093 604920 426004 450098 505620
36828 505620 493402 262306 69692 497366 1250572 942526 -969192 -2901247 -2999559 -1549947
36818 -1549947 -213116 442949 1013525 1370460 693177 -599641 -935235 -40496 517281
36809 517281 -99769 -702951 -350885 -181527 -1468821 -3168140 -3182112 -1310209 776483
36800 776483 2058726 2997291 3978745 4545423 4452204 4237005 4328197 4477709 4364579 3992557
36790 3992557 3323185 2304360 1415123 1343136 1879489 1948224 1072554 82022 -25387 724001
$$ packed form
36855A661632r76890j157293K57083J013642J44207q19234n90520J8588o0557
36846e09342k89477K00391Q90701Q33464K20267l31321j014391j935203j974027
36837c908938k43355J971007K485782J121165k83568n37173j78916K4094N5522
36828E05620j2218k31096j92614M27674P53206l08046j911718j932055r8312J449612
36818a549947J336831O56065N70576L56935o77283j292818l35594Q94739N57777
36809E17281o17050o03182L52066J69358j287294j699319j3972J871903K086692
36800G76483J282243R38565R81454N66678r3219k15199R1192J49512j13130l72022
36790C992557o69372j018825q89237p1987N36353O8735q75670r90532j07409P49388
$$ plain form
36780 724001 1630283 2254377 2501769 2245168 1435575 396959 -383053 -682782 -610005 -383099
36770 -383099 -139814 142978 462083 410847 -611344 -2363490 -3395717 -2549614 -590454
36761 -590454 621838 490092 101874 263699 474759 300931 383781 1164054 1704494 971043
36751 971043 -427448 -987515 -381776 337950 369694 -54361 -437452 -628216 -592067 -335508
36741 -335508 -154034 -348264 -668976 -610695 -227926 -54085 -197037 -136092 452982 1185994
36731 1185994 1464907 1139696 570794 280696 541031 1079735 1271256 805746 -4271
36722 -4271 -732533 -1274848 -1502498 -1001308 302061 1664214 2301056 2316286 2241997 2048203
36712 2048203 1404963 630057 429640 756190 810626 254115 -364948 -514061 -312958 -131001
$$ packed form
36780G24001R06282O24094K47392k56601q09593j038616p80012k99729P2777K26906
36770c83099K43285K82792L19105n1236j022191j752146j032227Q46103J959160
36761e90454J212292j31746l88218J61825K11060j73828Q2850P80273N40440p33451
36751I71043j398491n60067O05739P19726L1744m24055l83091j90764L6149K56559
36741c35508J81474j94230l20712N8281L82769J73841j42952O0945N89074P33012
36731A185994K78913l25211n68902k90098K60335N38704J91521m65510q10017
36722d271p28262n42315k27650N01190J303369J362153O36842J5230p4289j93794
36712B048203o43240p74906k00417L26550N4436n56511o19063j49113K01103J81957
$$ plain form
36702 -131001 -135341 -309510 -386691 177129 1543890 2906159 3279544 2813188 2538032 2883610
36692 2883610 3333919 3545904 3781917 4035324 3728718 2659213 1437851 685808 557560
36683 557560 1208180 2705237 4138237 3964786 1957984 -68313 -254058 1232631 2758842
36674 2758842 3198143 2632624 1668347 840856 403520 147532 -342783 -1012020 -1356951
36665 -1356951 -1262057 -1090999 -739474 442148 2332789 3650660 3536829 2623371 1855736
36656 1855736 1256681 693793 801145 1970181 3247126 3448795 2720939 1883718 1023231
36647 1023231 23996 -327728 597738 1694663 1382936 118286 -224210 628350 945638
36638 945638 -104762 -1151835 -953752 -285700 -422339 -1102799 -1249140 -768679 -414833
$$ packed form
36702a31001m340j74169p7181N63820J366761J362269L73385m66356k75156L45578
36692B883610M50309K11985K36013K53407l06606j069505j221362p52043j28248
36683E57560O50620J497057J433000j73451k006802k026297j85745J486689J526211
36674B758842M39301n65519r64277q27491m37336k55988m90315o69237l44931
36665a356951R4894J71058L51525J181622J890641J317871j13831r13458p67635
36656A855736n99055n62888J07352J169036J276945K01669p27856q37221q60487
36647A023231r99235l51724R25466J096925l11727j264650l42496Q52560L17288
36638I45638j050400j047073J98083O68052j36639o80460j46341M80461L53846
$$ plain form
36629 -414833 -427940 -410586 -284035 -482448 -1198886 -1954048 -2006286 -1133743 -110635 -141952
36619 -141952 -1376479 -2380369 -1925953 -915743 -1248789 -2909613 -3805078 -2814158 -1283588
36610 -1283588 -709408 -564264 352845 1763578 2608191 2907132 3338349 3632730 2987091
36601 2987091 1670429 689908 100472 -836121 -1886587 -1806628 -321833 1232035 1711094
36592 1711094 1469586 1350747 1382544 1144164 694485 445310 511780 642887 511258 -107233
36582 -107233 -1036896 -1525399 -964489 85350 312231 -615914 -1459772 -993886 464365
36573 464365 1678632 2100422 2146242 2204504 2137984 1772381 1307329 1092616 1304178 1920442
36563 1920442 2792005 3668821 4331797 4816152 5480485 6762648 8736747 10909570 12725158
$$ packed form
36629d14833j3107J7354J26551j98413p16438p55162n2238Q72543J023108l1317
36619a41952j234527j003890M54416J010210l33046j660824q95465R90920J530570
36610a283588N74180J45144R17109J410733Q44613K98941M31217K94381o45639
36601B987091j316662r80521n89436r36593j050466P9959J484795J553868M79059
36592A711094k41508j18839L1797k38380m49679k49175O6470J31107j31629o18491
36582a07233r29663m88503N60910J049839K26881r28145q43858M65886J458251
36573D64365J214267M21790M5820N8262o6520l65603m65052k14713K11562O16264
36563A920442Q71563Q76816O62976M84355O64333J282163J974099K172823J815588
$$ plain form
36554 12725158 14442973 17140078 21351066 25918520 28825668 29145568 27553952 24973275
36546 24973275 21614111 17638559 13818964 10819496 8431627 6265137 4693464 4234427
36538 4234427 4327145 3769490 2401625 1388892 1529241 2101136 1939156 1078179 605190
36529 605190 1072804 1743650 1560430 410353 -887457 -1612975 -1747229 -1544985 -988700
36520 -988700 -43242 811668 884232 184223 -438800 -267273 546071 1374294 1801353 1672702
36510 1672702 997363 228688 147273 886047 1482390 1067511 135470 -163433 322616 795078
36500 795078 1061680 1828147 3171328 3890373 3040409 1275119 -64615 -561220 -691903
36491 -691903 -746890 -633665 -472075 -586103 -958783 -1247993 -1268838 -1059575 -670152 -278448
$$ packed form
36554A2725158J717815K697105M210988M567454K907148L19900j591616k580677
36546B4973275l359164l975552l819595k999468k387869k166490j571673m59037
36538D234427R2718n57655j367865j012733J40349N71895j61980q60977m72989
36529F05190M67614O70846j83220j150077j297810p25518j34254K02244N56285
36520i88700R45458Q54910P2564p00009o23023J71527Q13344Q28223M27059j28651
36510A672702o75339p68675q1415P38774N96343m14879r32041k98903M86049M72462
36500G95078K66602P66467J343181P19045q49964j765290j339734m96605j30683
36491f91903n4987J13225J61590j14028l72680k89210k0845K09263L89423L91704
$$ plain form
36481 -278448 -216826 -430131 -261448 684517 1839646 2453487 2657370 2955079 3036817 2146870
36471 2146870 519665 -622397 -619847 17042 665545 1239725 1536787 997091 -378459
36462 -378459 -1720147 -2367479 -2446697 -2003683 -652017 1224542 2051868 971563 -652008
36453 -652008 -889241 186970 954257 834599 833331 1485907 1908378 1413344 706748 671099
36443 671099 1015212 1072523 1102957 1678827 2303239 1899595 602657 -101841 666162 1992524
36433 1992524 2453734 1919581 1396299 1485789 1799371 1810853 1489486 876599 -228052 -1631811
36423 -1631811 -2342922 -1595034 -121049 402806 -658146 -2135605 -2584792 -1992039 -1491672
36414 -1491672 -1813900 -2628178 -3270711 -3537272 -3635829 -3688349 -3465012 -2588909 -1061662 418880
$$ packed form
36481b78448O1622k13305J68683R45965J155129O13841K03883K97709Q1738q89947
36471B146870j627205j142062K550O36889O48503N74180K97062n39696j375550
36462c78459j341688o47332p9218M43014J351666J876559Q27326j080305j623571
36453f52008k37233J076211P67287j19658j268O52576M22471m95034p06596l5649
36443F71099L44113N7311L0434N75870O24412m03644j296938p04498P68003J326362
36433A992524M61210n34153n23282Q9490L13582J1482l21367o12887j104651j403759
36423a631811p11111P47888J473985N23855j060952j477459m49187N92753N00367
36414a491672l22228q14278o42533k66561r8557n2520K23337Q76103J527247J480542
$$ plain form
36404 418880 940213 360497 -415721 -380542 534583 1543568 1882284 1352650 273831
36395 273831 -723702 -1002423 -395951 617179 1396033 1681907 1541471 1050798 302476
36386 302476 -517022 -1338514 -2247349 -3032696 -3050062 -1983085 -500918 335785 216694
36377 216694 -250433 -363887 60856 753247 1272512 1327050 1091118 1036484 1239290 1188742
36367 1188742 564791 -234502 -727678 -1014529 -1314950 -1381440 -988884 -474839 -91646 585685
36357 585685 1747751 2491970 2004152 1057548 967250 1408412 856112 -863033 -2140119
36348 -2140119 -1991722 -1293819 -1070955 -1061638 -767843 -583854 -887157 -1071372 -496841 445621
36338 445621 1122045 1660227 2243721 2265199 1297953 241544 318444 1365802 2218430 2429213
$$ packed form
36404D18880N21333n79716p76218L5179R15125J008985L38716n29634j078819
36395B73831r97533k78721O06472J013130P78854K85874j40436m90673p48322
36386C02476q19498q21492r08835p85347j7366J066977J482167Q36703j19091
36377B16694m67127j13454M24743O92391N19265N4538k35932n4634K02806n0548
36367A188742o23951p99293m93176k86851l00421o6490L92556N14045L83193O77331
36357E85685J162066P44219m87818r46604r0298M41162n52300j719145j277086
36348b140119J48397O97903K22864R317K93795J83989l03303j84215N74531R42462
36338D45621O76424N38182N83494K1478r67246j056409P6900J047358Q52628K10783
$$ plain form
36328 2429213 2494086 2597599 2309827 1612734 1231620 1634680 2359211 2640690 2336989 2056781
36318 2056781 2589073 4203875 6310698 7868275 8313814 8051474 8006629 8846583 10562116
36309 10562116 12568064 14382767 16478533 19969379 24890107 29600263 33129291 37364408
36301 37364408 45074165 56396825 69999869 87474715 112205809 141449815 163098066
36294 163098066 164874498 146248738 118271477 92336570 72224111 56471145 43907967
36287 43907967 34719666 28665673 24749113 21949420 19281244 16080260 12897256 10991592
36279 10991592 10364485 9529432 7793846 6349715 6300115 6969874 7166695 6905548 6787453
36270 6787453 6717497 6373509 6022803 5711362 4501710 1840820 -925902 -1783153 -523179
$$ packed form
36328B429213O4873J03513k87772o97093l81114M03060P24531K81479l03701k80208
36318B056781N32292J614802K106823J557577M45539k62340m4845Q39954J715533
36309A0562116K005948J814703K095766L490846M920728M710156L529028M235117
36301C7364408P709757J1322660J3603044J7474846K4731094K9244006K1648251
36294A63098066J776432j8625760k7977261k5934907k0112459j5752966j2563178
36287D3907967r188301o053993l916560k799693k668176l200984l183004j905664
36279A0991592o27107q35053j735586j444131m9600O69759J96821k61147j18095
36270F787453o9956l43988l50706l11441j209652k660890k766722q57251J259974
$$ plain form
36261 -523179 1157060 1836200 1554418 934344 273600 -227921 -211772 405412 1174144 1602799
36251 1602799 1673931 1698387 1819045 1824930 1471514 909900 615558 803037 1189117 1559208
36241 1559208 2135935 2889014 2979986 1798233 276041 44635 1254717 2398285 2512542
36232 2512542 2315960 2645868 2984345 2419584 1193842 327716 252254 634508 1135586
36223 1135586 1622594 1951865 2110602 2281889 2401211 2091059 1370650 866297 929743 1128145
36213 1128145 969706 491775 -189832 -1111460 -1855711 -1654666 -627153 72541 -45790
36204 -45790 -66384 594076 958224 157676 -828523 -614993 285714 296631 -638253 -1064723
36194 -1064723 -392055 442218 715015 740470 718668 230413 -655385 -981647 -181843 1107665
$$ packed form
36261e23179J680239O79140k81782o20074o60744n01521J6149O17184P68732M28655
36251A602799P1132K4456J20658N885l53416n61614k94342J87479L86080L70091
36241A559208N76727P53079R0972j181753j522192k31406J210082J143568J14257
36232B512542j96582L29908L38477n64761j225742q66126p5462L82254N01078
36223A135586M87008L29271J58737J71287J19322l10152p20409n04353O3446J98402
36213A128145j58439m77931o81607r21628p44251K01045J027513O99694j18331
36204d5790k0594O60460L64148q00548r86199K13530R00707J0917r34884m26470
36194a064723O72668Q34273K72797K5455k1802m88255q85798l26262P99804J289508
$$ plain form
36184 1107665 1920638 1909818 1213888 211891 -347291 187035 1435243 2213536 1940983
36175 1940983 1185332 694494 639478 961608 1635713 2312740 2455505 2121510 1920387 1967336
36165 1967336 1652568 758628 15196 94029 721530 1254669 1528215 1625890 1366025 638484
36155 638484 -73065 -85431 656670 1495678 1759137 1378519 878520 787170 995547 872269
36145 872269 196075 -356378 -67403 806306 1451137 1616697 1568638 1182775 84817 -1286414
36135 -1286414 -1802163 -1167445 -480252 -824992 -1937982 -2677530 -2311925 -1017673 421817
36126 421817 1108888 626317 -610383 -1841979 -2736139 -3252021 -3017085 -1679413 174641
36117 174641 1417484 1839556 2266932 3020666 3330027 2720843 1935874 1767129 1814457 1216938
$$ packed form
36184A107665Q12973j0820o95930j001997n59182N34326J248208P78293k72553
36175A940983p55651m90838n5016L22130O74105O77027J42765l33995k01123M6949
36165A967336l14768q93940p43432P8833O27501N33139K73546R7675k59865p27541
36155F38484p11549j2366P42101Q39008K63459l80618m99999r1350K08377j23278
36145H72269o76194n52453K88975Q73709O44831J65560m8059l85863j097958j371231
36135a286414n15749O34718O87193l44740j112990p39548L65605J294252J439490
36126D21817O87071m82571j236700j231596q94160n15882K34936J337672J854054
36117A74641J242843M22072M27376P53734L09361o09184p84969j68745M7328n97519
$$ plain form
36107 1216938 5079 -1070499 -1625586 -1840572 -1862068 -1596824 -943779 90557 1265663
36098 1265663 1977720 1740739 922868 367798 150882 -441934 -1453812 -1856989 -1190892
36089 -1190892 -532518 -948103 -1865165 -2030457 -1375830 -766857 -399393 308011 1428301
36080 1428301 2266481 2381728 1958275 1181660 114842 -775340 -806606 29452 985112
36071 985112 1474519 1572197 1610122 1814034 2311359 2944105 3078204 2161518 552573 -658866
36061 -658866 -741219 70187 981957 1347564 1130565 1025927 1898528 3678433 5071608
36052 5071608 4890656 3471589 2240273 2094545 2830758 3982467 5439694 7108981 8562158
36043 8562158 9336470 9442720 9600807 11001131 14336279 18626198 21452567 21045570 17972359
$$ packed form
36107A216938j211859j075578n55087k14986k1496K65244O53045J034336J175106
36098A265663P12057k36981q17871n55070k16916n92816j011878m03177O66097
36089a190892O58374m15585r17062j65292O54627O08973L67464P07404J120290
36080A428301Q38180J15247m23453p76615j066818q90182l1266Q36058R55660
36071I85112M89407R7678L7925K03912M97325O32746J34099r16686j608945j211439
36061f58866q2353Q11406R11770L65607k16999j04638Q72601J779905J393175
36052E071608j80952j419067j231316j45728P36213J151709J457227J669287J453177
36043H562158P74312J06250J58087J400324L335148M289919K826369m06997l073211
$$ plain form
36034 17972359 14303697 11510713 9787056 8876010 8481652 8015503 6989995 5760138
36026 5760138 5040637 4693682 3943085 2877236 2664900 3871829 5465435 6077804 5628895
36017 5628895 5113688 5197228 5560997 5472881 4665836 3657277 3198470 3353813 3444310 3179849
36007 3179849 3287737 4322549 5383156 5109560 3717896 2815686 3198226 4092271 4698326
35998 4698326 5069490 5128820 4381022 3330061 3689059 6099973 8892457 10311698 10847577
35989 10847577 12038246 14133978 16629953 20076740 25199821 30821898 35150869 39157036
35981 39157036 46164821 57678591 72392970 90350529 114481401 144470616 170864386
35974 170864386 180019242 166469551 138151479 108335444 84513785 66400930 51862043
$$ packed form
36034A7972359l668662k792984j723657r11046l94358m66149j025508j229857
36026E760138p19501l46955p50597j065849k12336J206929J593606O12369m48909
36017E628895n15207Q3540L63769q8116q07045j008559m58807J55343R0497k64461
36007C179849J07888J034812J060607k73596j391664r02210L82540Q94045O06055
35998D698326L71164N9330p47798j050961L58998K410914K792484J419241N35879
35989A0847577J190669K095732K495975L446787N123081N622077M328971M006167
35981C9157036P007785J1513770J4714379J7957559K4130872K9989215K6393770
35974A70864386R154856j3549691k8318072k9816035k3821659j8112855j4538887
$$ plain form
35967 51862043 40847556 33560603 28253547 22875344 17571461 13920980 12324723 11491561
35959 11491561 10206488 8402902 6530454 4944440 4091762 4346198 5279404 5814971 5506428
35950 5506428 5056379 5163255 5465343 5195576 4392525 3745295 3491252 3211281 2704975
35941 2704975 2386978 2595117 2996603 3009630 2531123 1925854 1455770 1056858 660782 404474
35931 404474 360217 290750 -40376 -407617 -320174 281380 905356 1244218 1594281 2180501
35921 2180501 2475907 1820549 537511 -275135 -109899 446011 708408 721192 787556 817425
35911 817425 616001 337000 142014 -176907 -687700 -820947 -65874 1070253 1536388
35902 1536388 1117639 639926 731217 1059293 1021263 601825 213445 128074 411911 1060431
$$ packed form
35967E1862043j1014487p286953n307056n378203n303883l650481j596257q33162
35959A1491561j285073j803586j872448j586014q52678K54436R33206N35567l08543
35950E506428m50049J06876L02088k69767q03051o47230k54043k79971n06306
35941B704975l17997K08139M01486J3027m78507o05269m70084l98912l96076k56308
35931D04474m4257o9467l31126l67241Q7443O01554O23976L38862L50063N86220
35921B180501K95406o55358j283038q12646J65236N55910K62397J2784O6364K9869
35911H17425k01424k79001j94986l18921n10793j33247P55073J136127M66135
35902A536388m18749m77713R1291L28076l8030m19438l88380q5371K83837O48520
$$ plain form
35892 1060431 1830581 2217656 1975201 1484582 1305700 1526495 1819253 1921013 1738404
35883 1738404 1206364 468742 51683 376627 1135222 1604773 1584340 1526720 1687792 1728051
35873 1728051 1411128 1170264 1546224 2379501 2970472 2844050 2049550 936159 -50165
35864 -50165 -563498 -645070 -594770 -375665 397917 1553018 2061817 1306020 117335 -274966
35854 -274966 98189 337070 365066 969109 2233876 3305803 3896855 4597938 5275150
35845 5275150 4684570 2536284 560844 323464 1059688 1025392 118679 -369613 -32189
35836 -32189 278190 168736 243011 748075 997361 510365 -268171 -746688 -906381 -955548
35826 -955548 -889540 -595315 52160 1129519 2212288 2296024 929325 -828229 -1430298
$$ packed form
35892A060431P70150L87075k42455m90619j78882K20795K92758J01760j82609
35883A738404n32040p37622m17059L24944P58595M69551k0433n7620J61072M0259
35873A728051l16923k40864L75960Q33277N90971j26422p94500j113391r86324
35864e0165n13333q1572N0300K19105P73582J155101N08799p55797j188685l92301
35854b74966L73155K38881K7996O04043J264767J071927N91052P01083O77212
35845E275150n90580k148286j975440k37380P36224l4296r06713m88292L37424
35836c2189L10379j09454P4275N05064K49286m86996p78536m78517j59693m9167
35826i55548O6008K94225O47475J077359J082769Q3736j366699j757554o02069
$$ plain form
35817 -1430298 -625430 595693 1458121 1780006 1324718 159893 -523317 511059 2535009
35808 2535009 3403643 2347174 780377 73315 82494 313652 857738 1447685 1188116
35799 1188116 158990 -168651 867828 1910341 1683969 924422 883758 1187501 702042
35790 702042 -503744 -1620846 -2619375 -3719253 -4169007 -3257495 -1885028 -1369436 -1233701
35781 -1233701 -71654 1743475 2290964 1104166 -57840 120058 821032 740248 -86347
35772 -86347 -917333 -1531535 -1883401 -1473993 -90291 1336888 1512728 320684 -928080
35763 -928080 -844313 570783 1854465 1666310 445674 -79560 725615 1440476 767151
35754 767151 -309820 78400 1725583 2499029 1410375 -111634 -398777 412306 1132796
$$ packed form
35817a430298Q04868J221123Q62428L21885m55288j164825o83210J034376K023950
35808B535009Q68634j056469j566797p07062R179K31158N44086N89947k59569
35799A188116j029126l27641J036479J042513k26372p59547m0664L03743m85459
35790G02042j205786j117102r98529j099878m49754R11512J372467N15592J35735
35781a233701J162047J815129N47489j186798j162006J77898P00974q0784q26595
35772h6347q30986o14202l51866M09408J383702J427179J75840j192044j248764
35763i28080Q3767J415096J283682j88155j220636n25234Q05175P14861o73325
35754G67151j076971L88220J647183P73446j088654j522009k87143Q11083P20490
$$ plain form
35745 1132796 1221184 1005213 904916 995884 950190 284333 -851539 -1352214 -496977 600827
35735 600827 103002 -1928477 -3323174 -2560453 -523211 983825 1340255 1123149 978905
35726 978905 1162874 1530765 1537028 849185 108112 227041 864557 729301 -398998 -1260611
35716 -1260611 -1106155 -701888 -762022 -790617 -285335 258125 503177 1148869 2532938 3530777
35706 3530777 3115650 2053364 1772526 2380588 3023486 3377414 3478368 2859341 1310893
35697 1310893 -68485 -5943 1152696 2033835 2169683 2076618 1876571 1240967 420689
35688 420689 -7214 -220014 -742096 -1197899 -723360 569602 1709708 2158497 1819923
35679 1819923 300812 -2269075 -4084520 -3253331 -591042 1035822 471985 -417182 285737
$$ packed form
35745A132796Q8388k15971j00297R0968m5694o65857j135872n00675Q55237J097804
35735F00827m97825k031479j394697P62721K037242J507036L56430k17106j44244
35726I78905J83969L67891O263o87843p41073J18929O37516j35256j128299q61613
35716a260611J54456M04267o0134k8595N05282N43460K45052O45692J384069R97839
35706C530777m15127j062286k80838O08062O42898L53928J00954o19027j548448
35697A310893j379378O2542J158639Q81139J35848r3065k00047o35604q20278
35688D20689m27903k12800n22082m55803M74539J292962J140106M48789l38574
35679A819923j519111k569887j815445Q31189K662289J626864n63837q89167P02919
$$ [...]
##END NTUPLES=NMR SPECTRUM
##END=
