##TITLE=31Pdec_PR90R_k'
 D2O, 24 sc
 4.6.2019
##JCAMPDX= 6.0         $$ Bruker NMR JCAMP-DX V2.0
##DATA TYPE= NMR SPECTRUM
##DATA CLASS= NTUPLES
##ORIGIN= UXNMR, Bruker Analytische Messtechnik GmbH
##OWNER= root
$$ XWIN-NMR		Version 3.5
$$ Tue Jun  4 14:15:23 2019 Russian Standard Time (UT+4h)  she@DPX200
##.OBSERVE FREQUENCY= 81.013821
##.OBSERVE NUCLEUS= ^31P
##.ACQUISITION MODE= SIMULTANEOUS
##.ACQUISITION SCHEME= undefined
##.AVERAGES= 24
##.DIGITISER RES= 17
##SPECTROMETER/DATA SYSTEM= spect
##.PULSE SEQUENCE= zgpg30
##.SOLVENT NAME= D2O
##.SHIFT REFERENCE= (INTERNAL, D2O, 0, 182.463)
##AUDIT TRAIL= $$ (NUMBER, WHEN, WHO, WHERE, WHAT)
$$ ##TITLE= Audit trail, XWIN-NMR		Version 3.5
$$ ##JCAMPDX= 5.01
$$ ##ORIGIN= Bruker BioSpin GmbH
$$ ##OWNER= she
$$ F:/spectra/data/she/nmr/P31/1/pdata/1/auditp.txt
$$ ##AUDIT TRAIL=  $$ (NUMBER, WHEN, WHO, WHERE, WHAT)
(   1,<2019-06-04 14:13:38.48 +0400>,<she>,<DPX200>,
      <created by zg, POWCHK disabled, PULCHK disabled
       configuration hash MD5:
       00 E9 B6 7A A2 85 ED C7 34 08 36 98 17 FE 4E 26
       data hash MD5: 32K
       88 C1 9D 05 9C FC FB F7 E3 B7 49 AA 0A 3A AE 3A>)
(   2,<2019-06-04 14:13:41.48 +0400>,<she>,<DPX200>,
      <Start of raw data processing
       efp BC_mod = 2 LB = 1 FT_mod = 6 PKNL = 1 PHC0 = -2212.956 PHC1 = 99.19911 SI = 64K 
       data hash MD5: 64K
       6F 04 9B 8C 1A B0 93 B2 0A 27 71 4F C5 0E 2D 1B>)
(   3,<2019-06-04 14:14:02.54 +0400>,<she>,<DPX200>,
      <pk PHC0 = 4.198094 PHC1 = 0 
       data hash MD5: 64K
       D6 CD 89 0E F6 3A EB 3F 4B CB 0C 1E B8 8B 4E 85>)
(   4,<2019-06-04 14:14:06.28 +0400>,<she>,<DPX200>,
      <abs ABSG = 5 
       data hash MD5: 64K
       4D FD 0E 5E B1 DC F6 1B 39 77 6B 41 65 6D E6 6C>)
$$ ##END=
$$ 
$$ hash MD5
$$ EF FB CE 67 9B 63 26 CF 1D 3C C9 89 79 F0 A1 D9
##$RELAX= 
##$RELAX= 
##$RELAX= 
##$RELAX= 
##$RELAX= 
##$RELAX= 
##$RELAX= 
##$RELAX= 
$$ Bruker specific parameters
$$ --------------------------
##$DU= <F:/spectra>
##$EXPNO= 1
##$NAME= <P31>
##$PROCNO= 1
##$TYPE= <nmr>
##$USER= <she>
##$AMP= (0..31)
100 100 100 100 100 100 100 100 100 100 100 100 100 100 100 100 100 100 
100 100 100 100 100 100 100 100 100 100 100 100 100 100 
##$AQSEQ= 0
##$AQ_mod= 1
##$AUNM= <au_zg>
##$AUTOPOS= <>
##$BF1= 81.014009
##$BF2= 200.13
##$BF3= 200.13
##$BF4= 200.13
##$BF5= 200.13
##$BF6= 200.13
##$BF7= 200.13
##$BF8= 200.13
##$BYTORDA= 1
##$CFDGTYP= 0
##$CFRGTYP= 5
##$CHEMSTR= <none>
##$CNST= (0..31)
1 1 145 1 1 1 1 1 1 1 1 1 1 1 1 1 1 1 1 1 1 1 1 1 1 1 1 1 1 1 1 1 
##$CPDPRG= <waltz16>
##$CPDPRG1= <>
##$CPDPRG2= <waltz16>
##$CPDPRG3= <>
##$CPDPRG4= <mlev>
##$CPDPRG5= <mlev>
##$CPDPRG6= <mlev>
##$CPDPRG7= <mlev>
##$CPDPRG8= <mlev>
##$CPDPRGB= <>
##$CPDPRGT= <>
##$D= (0..31)
0 1 0 0 0 0 0 0 0 0 0 0.03 2e-05 3e-06 0 0 0 0 0 0 0 0 0 0 0 0 0 0 0 0 
0 0 
##$DATE= 1559643217
##$DBL= (0..7)
120 120 120 11 120 120 24 19 
##$DBP= (0..7)
150 150 150 150 150 150 150 150 
##$DBP07= 0
##$DBPNAM0= <>
##$DBPNAM1= <>
##$DBPNAM2= <>
##$DBPNAM3= <>
$$ [...]
##$SUBNAM3= <"">
##$SUBNAM4= <"">
##$SUBNAM5= <"">
##$SUBNAM6= <"">
##$SUBNAM7= <"">
##$SUBNAM8= <"">
##$SUBNAM9= <"">
##$SW= 369.568048894756
##$SWIBOX= (0..15)
0 1 3 0 0 0 0 0 0 0 0 0 0 0 0 0 
##$SW_h= 29940.119760479
##$TD= 32768
##$TD0= 1
##$TE= 0
##$TE2= 300
##$TE3= 300
##$TEG= 300
##$TL= (0..7)
0 120 53 12 22 120 120 120 
##$TP= (0..7)
150 150 150 150 150 150 150 150 
##$TP07= 0
##$TPNAME0= <>
##$TPNAME1= <>
##$TPNAME2= <>
##$TPNAME3= <>
##$TPNAME4= <>
##$TPNAME5= <>
##$TPNAME6= <>
##$TPNAME7= <>
##$TPOAL= (0..7)
0.5 0.5 0.5 0.5 0.5 0.5 0.5 0.5 
##$TPOFFS= (0..7)
0 0 0 0 0 0 0 0 
##$TUNHIN= 0
##$TUNHOUT= 0
##$TUNXOUT= 0
##$USERA1= <user>
##$USERA2= <user>
##$USERA3= <user>
##$USERA4= <user>
##$USERA5= <user>
##$V9= 5
##$VALIST= <valist>
##$VCLIST= <CCCCCCCCCCCCCCC>
##$VD= 0
##$VDLIST= <DDDDDDDDDDDDDDD>
##$VPLIST= <PPPPPPPPPPPPPPP>
##$VTLIST= <TTTTTTTTTTTTTTT>
##$WBST= 1024
##$WBSW= 4
##$XGAIN= (0..3)
0 0 0 0 
##$XL= 0
##$YL= 0
##$YMAX_a= 47202
##$YMIN_a= -51795
##$ZGOPTNS= <>
##$ZL1= 120
##$ZL2= 120
##$ZL3= 120
##$ZL4= 120
##$ABSF1= 182.463
##$ABSF2= -187.1042
##$ABSG= 5
##$ABSL= 3
##$ALPHA= 0
##$AQORDER= 0
##$ASSFAC= 0
##$ASSFACI= 0
##$ASSFACX= 0
##$ASSWID= 0
##$AUNMP= <proc_1d>
##$AZFE= 0.1
##$AZFW= 0.5
##$BCFW= 0
##$BC_mod= 2
##$BYTORDP= 0
##$COROFFS= 0
##$CY= -3
##$DATMOD= 1
##$DC= 0
##$DFILT= <>
##$DTYPP= 0
##$F1P= 0
##$F2P= 0
##$FCOR= 1
##$FTSIZE= 65536
##$FT_mod= 6
##$GAMMA= 0
##$GB= 0
##$INTBC= 1
##$INTSCL= 5.30512e-09
##$ISEN= 30
##$LB= 1
##$LEV0= 0
##$LPBIN= 0
##$MAXI= 10000
##$MC2= 0
##$MEAN= 0
##$ME_mod= 0
##$MI= 50
##$NCOEF= 0
##$NC_proc= -3
##$NLEV= 6
##$NOISF1= 182.463
##$NOISF2= 159.3651
##$NSP= 0
##$NTH_PI= 0
##$NZP= 0
##$OFFSET= 182.463
##$PC= 4
##$PHC0= -2208.758
##$PHC1= 99.19911
##$PH_mod= 1
##$PKNL= yes
##$PPARMOD= 0
##$PSCAL= 0
##$PSIGN= 0
##$REVERSE= no
##$SF= 81.0140089999434
##$SI= 65536
##$SIGF1= 159.3651
##$SIGF2= -187.1042
##$SINO= 113.3802
##$SIOLD= 16384
##$SREGLST= <1H.CDCl3>
##$SSB= 0
##$STSI= 65536
##$STSR= 0
##$SW_p= 29940.119760479
##$SYMM= 0
##$S_DEV= 0
##$TDeff= 32768
##$TDoff= 0
##$TI= <>
##$TILT= no
##$TM1= 0
##$TM2= 0
##$TOPLEV= 0
##$USERP1= <user>
##$USERP2= <user>
##$USERP3= <user>
##$USERP4= <user>
##$USERP5= <user>
##$WDW= 1
##$XDIM= 65536
##$YMAX_p= 464382087
##$YMIN_p= -2934565
$$ End of Bruker specific parameters
$$ ---------------------------------
##NTUPLES= NMR SPECTRUM
##VAR_NAME=  FREQUENCY,     SPECTRUM/REAL,   SPECTRUM/IMAG
##SYMBOL=    X,             R,               I
##VAR_TYPE=  INDEPENDENT,   DEPENDENT,       DEPENDENT
##VAR_FORM=  AFFN,          ASDF,            ASDF
##VAR_DIM=   65536,         65536,           65536
##UNITS=     HZ,            ARBITRARY UNITS, ARBITRARY UNITS
##FACTOR=    0.456856943014862, 1,           1
##FIRST=     14782.0589164792, 0,            0
##LAST=      -15158.0608439998, 0,           0
##MIN=       -15158.0608439998, -2934565,    0
##MAX=       14782.0589164792, 464382087,    0
$$ Real data points
##PAGE= N=1
##DATA TABLE= (X++(R..R)), XYDATA
$$ [...]
43096g7399j60952K0583J44384O7194j22589j97314o8907R3673R3658k7008p9263
43085c13940k0714K7334L3294R7698K00388J48287j04907l03856k32698l5601
43075e04715J7487n0988l596J82495K52937Q2799j10076q2675Q6073J36801J6843
43064B3385o5488L1782J71623J37857n0317j58741o5702P0481M8719p8999r7766
43053c3166L0983J11740L0830o7298l5826J4520r4354k66391k26718N5383K85828
43042a94469K55585J10431P8410J15209K7567j62528k28421j02078J4789k7049
43032a12554j02239m7103N2474J1795j10643o3456K01802M06623K96985m3984
43022D89700l30548l89552k40265J0424K14370K20887K6996j61105j52324r237
$$ plain form
43096 -77399 -238351 -217768 -73384 -6190 -128779 -326093 -395000 -301327 -207669 -234677 -313940
43085 -313940 -334654 -307320 -274026 -176328 24060 172347 67440 -236416 -469114 -504715
43075 -504715 -487228 -538216 -541812 -359317 -106380 -23581 -133657 -216332 -130259 6542 23385
43064 23385 -42103 -10321 161302 299159 248842 90101 24399 94880 143599 64600 -33166
43053 -33166 -2183 109557 140387 73089 37263 51783 -42571 -308962 -535680 -480297 -194469
43042 -194469 61116 171547 249957 365166 392733 230205 1784 -100294 -85505 -112554
43032 -112554 -214793 -261896 -209422 -197627 -308270 -371726 -169924 236699 533684 489700
43022 489700 159152 -230400 -470665 -460241 -245871 -24984 2012 -159093 -311417 -320654
43012c20654O7826L1603n313j0023p0168j83937k09879q3083Q6872J93311K44067
43001b59378K34736R8492j12995j83963k4416J47230R2832r9095j63832o2905
42991c33294Q566k0133K304J41001K18202R5718p2569n2045J14992J59568l0846
42980B31464k57342k80558j11170N5436J07196J05837J39180J95210K05662J33003
42970E23918j9868k13038l39726k75939l7892J74227J84917N0117m1258k0343
42960a4885L0555N4768O8833M7493n7367j62162j10390N7120R5684p7710k18081
42949b86142j07093J12799J65554N3287m477N7330J06751R6151J09119J25226
42939D28505J8658j55764j55422N6508J71628k7855l10112l09820n5711R6953
$$ plain form
43012 -320654 -252828 -221225 -226538 -236561 -306729 -490666 -700545 -783628 -696756 -503445 -259378
43001 -259378 -24642 73850 -39145 -223108 -247524 -100294 -7462 -106557 -270389 -333294
42991 -333294 -324728 -344861 -342557 -201556 16646 112364 39795 -12250 102742 262310 231464
42980 231464 -25878 -306436 -417606 -362170 -254974 -149137 -9957 185253 390915 523918
42970 523918 504050 291012 -48714 -324653 -362545 -188318 -3401 46716 5458 -14885
42960 -14885 15670 70438 139271 186764 129397 -32765 -143155 -86035 9649 -68061 -286142
42949 -286142 -393235 -280436 -114882 -61595 -66072 -8742 98009 194160 303279 428505
42939 428505 447163 291399 135977 192485 364113 336258 26146 -283674 -339385 -242432
42929b42432M473q4075O1313K97881L14123N6875k04685k09914J2133K05829J69565
42918C81086n2588k37974k24216o6581N5388N9943L0264N6067R7831P4081J4769
42907A88070J6727O8948N1185o5945j45248p9767L9738N7787k4812q5155p5229
42896e3701m6016j3114M4962O9041k4010j48439j03913J14079K46363J20236j03070
42885A02418j72268q7274k1521k2677L493P5779J05462N9560j0691p9235j26831
42874a73785o1421J49373L00381J41421k28997m07517k05965R8747J62483J8466
42864b06814n6247L5412J42261J47375R8529N1316l4227j73873k54868j49360
42854d00496R9962K81549K30623J9805j16542o6602J8558n8111k46168l07039
$$ plain form
42929 -242432 -237959 -322034 -260721 37160 351283 408158 203473 -6441 5692 211521 381086
42918 381086 328498 90524 -133692 -200273 -144885 -84942 -54678 1389 99220 173301 188070
42907 188070 204797 273745 324930 258985 113737 33970 73708 131495 106683 21528 -53701
42896 -53701 -99717 -112831 -67869 1172 -22838 -171277 -275190 -161111 85252 205488 102418
42885 102418 -69850 -157124 -178645 -201322 -197829 -122050 -16588 42972 32281 -46954 -173785
42874 -173785 -235206 -85833 214548 355969 126972 -280545 -486510 -387763 -225280 -206814
42864 -206814 -263061 -227649 -85388 61987 160516 211832 177605 3732 -251136 -400496
42854 -400496 -300534 -18985 211638 231443 114901 48299 66857 8746 -237422 -544461
42844e44461j50244N4216J35845J26020J17363Q7275L09m8148L1375J30033P8657
42833A8240o8427r1900N0363J45007M2952j24980j54637m7961M8109Q3196J23125
42822B3087J64988J02602p7359j94706q0998J65991K57255O6313j93392k23257
42812A0524p418J89771J76805M6194j1055L2342O6389L5665k7457j03779j81624
42801B26357j85731o4582O3737K5399j27727j39832P2843K59858J85546k9114
42791B86754j05963k3183J5649l7963j2408J36112J87359m063k51167k91110j43609
42780b43592k2916o465J452M4026O2634N0476N9851N8301l4002j54100j40011
42769c24346M288Q9476L7457j6916J794k5203j37334j31815J06857L18957J96370
$$ plain form
42844 -544461 -694705 -640489 -504644 -378624 -261261 -173986 -173677 -221825 -190450 -60417 18240
42833 18240 -50187 -142087 -91724 53283 96235 -28745 -183382 -231343 -183234 -100038 23087
42822 23087 188075 290677 213318 18612 -62386 103605 360860 427173 233781 10524
42812 10524 3106 192877 369682 415876 404821 437163 503552 539217 511760 407981 226357
42801 226357 40626 -23956 39781 65180 -62547 -202379 -129536 130322 315868 286754
42791 286754 180791 157608 173257 135294 122886 258998 446357 442294 191127 -99983 -243592
42780 -243592 -266508 -272973 -271521 -227495 -164861 -114385 -54534 3767 -30235 -184335 -324346
42769 -324346 -320058 -230582 -193125 -210041 -208247 -233450 -370784 -502599 -395742 -76785 119585
42758A19585j32422k56058o2006J48413J31861j3965j04754j29785j39122r7104
42748e35357R256Q6706Q6890R2250J46902J62724J01495P0874J05737M7397j77151
42737A97723l40775k21516K1096N7960j07660j61634J3752J76444J39420N2350
42727a72840J16016K45412K18925J9318j72595k40253k08586j14283K2579J09354
42717a76953L3015j57650k49596j10732J44296K94491K56179J21282J215p9219
42707G6328j36380j60356j36028q6572m4119K62O1463Q8024L795j54583k25261
42696g13427j13086O9165J44613J11244J09175J62706J25028n4810j76823n3952
42686c90167J77090K10227K918j61157q3152Q5686J02350k0139r6923q2749q6692
$$ plain form
42758 119585 -12837 -268895 -330901 -182488 -50627 -64592 -169346 -299131 -438253 -535357
42748 -535357 -526101 -439395 -352505 -260255 -113353 49371 150866 221740 327477 374874 197723
42737 197723 -143052 -364568 -343472 -285512 -393172 -554806 -541054 -364610 -225190 -172840
42727 -172840 -56824 188588 407513 426831 254236 13983 -194603 -308886 -286307 -176953
42717 -176953 -143938 -301588 -551184 -661916 -517620 -223129 33050 154332 155547 76328
42707 76328 -60052 -220408 -356436 -443008 -487127 -486865 -425402 -337378 -333583 -488166 -713427
42696 -713427 -826513 -757348 -612735 -501491 -392316 -229610 -104582 -159392 -336215 -390167
42686 -390167 -213077 -2850 68 -161089 -244241 -158555 -56205 -76344 -173267 -256016 -342708
42675c42708j27106r4530K4395Q8757L0155l8302k3822p01m0234m3625R5705K67164
42663b04852K61290O7266j11362j24480j8963Q1336J07064M3281q2554j82983
42653a64957j71250o4779L5583O6889L9719j9212p1848m8833O4226J45646P2138
42642a16678p8598j08713N767O7277m2559j71907j13773R5442K15453R9251j39808
42631b88846k55063j21481J36381K74116J94813M4833P977P9479J24904Q2468
42621B79581j0931j18040j82651r7122J28804K48149N9147k48482l02883p9642
42611c24070R1123N9583L4630J37813J63346k4836k01613j42394J2954L9656J4212
42600a39596J04072J88822M9088k07572k62173n2748J75146K29540J22662o3672
$$ plain form
42675 -342708 -469814 -564344 -539949 -451192 -421037 -459339 -483161 -483862 -524096 -567721 -472016 -204852
42663 -204852 56438 123704 12342 -112138 -131101 -49765 57299 100580 18026 -164957
42653 -164957 -336207 -400986 -365403 -298514 -258795 -278007 -349855 -398688 -334462 -188816 -116678
42642 -116678 -195276 -303989 -298222 -230945 -273504 -445411 -559184 -463742 -248289 -149038 -288846
42631 -288846 -543909 -665390 -529009 -254893 -60080 -15247 -7270 72209 197113 279581
42621 279581 268650 150610 -32041 -129163 -359 247790 306937 58455 -244428 -324070
42611 -324070 -232947 -173364 -138734 -921 162425 137589 -64024 -206418 -193464 -153808 -139596
42600 -139596 -35524 153298 202386 -5186 -267359 -320107 -144961 84579 207241 143569
42590A43569k09489j46889J17742K76872R8115j94208k34219q0777p2771k08880
42580e10935j45310J69890L45474J60585j01369j27995j6034K177m1047P032J04573
42569a52959J10485M0739N461N905k3332o6562o7353k9333K8051J15005J92689
42558A58796J66763L2126r6440j51102j73395j76393j10420n383L2563L830M098
42547c14957J2023p8671j91611j15235J21379K27047J00594j4573M4771J18164
42537i1069O8332K5359P6228N8365q9895j26848N2045J33345r5804l02644j23409
42526d15995J93006J77442p1959q5690J45760J76472q2131j94201M0717K43756
42516A27177R4933j70358j86718m093R1206K3845p9351j43364j53271o2192J17212
$$ plain form
42590 143569 -65920 -212809 -95067 181805 279920 85712 -148507 -229284 -302055 -510935
42580 -510935 -656245 -486355 -140881 19704 -81665 -209660 -225694 -223517 -264564 -257532 -152959
42569 -152959 -42474 -1735 3726 9631 -13701 -80263 -147616 -176949 -148898 -33893 158796
42558 158796 325559 357685 261245 110143 -63252 -239645 -350065 -355448 -322885 -319055 -314957
42547 -314957 -302934 -381605 -573216 -688451 -567072 -340025 -239431 -254004 -209233 -91069
42537 -91069 -22737 2622 78850 137215 47320 -79528 -27483 105862 10058 -292586 -415995
42526 -415995 -222989 -45547 -117506 -203196 -57436 119036 36905 -157296 -116579 127177
42516 127177 222110 51752 -134966 -139059 -47853 -24008 -103359 -246723 -399994 -462186 -344974
42505c44974K50031K42954J53301N4517n4167j39681j23891n3518p9112j84831
42495b79371j62358M3459J97602J20914m8241r8897n1110l6491n3270k8642J8755
42484c77650N1156J12718K00441J77506j2126j74952r8506J50830L26767L05038
42474F61222J37597q6356k71644l06434j83060n3085l0634m0335J2359N4482p108
42463a12996q4226m5635N5774R2003Q5767J12858Q8959r4606l03262l00869j14885
42452f21118J7266M2008J26018K79597K72213K8980j85726j49873r161j8873j47188
42441c65857j66518k5313J02283R4890J6605k8032j7391K8270Q9660J19283O4013
42430h8107m3031q2839Q744J41699J65473N2230o2340m6177N7246Q7919k928q0640
$$ plain form
42505 -344974 -94943 148011 301312 355829 301662 161981 38090 -15428 -94540 -279371
42495 -279371 -441729 -398270 -200668 -79754 -127995 -226892 -278002 -314493 -367763 -396405 -377650
42484 -377650 -326494 -213776 -13335 164171 152045 -22907 -121413 29417 356184 661222
42474 661222 798819 712463 440819 134385 -48675 -101760 -132394 -172729 -160370 -105888 -112996
42463 -112996 -197222 -242857 -187083 -95080 -9313 103545 192504 97898 -205364 -506233 -621118
42452 -621118 -603852 -561844 -435826 -156229 115984 144964 -40762 -190635 -199796 -218669 -365857
42441 -365857 -532375 -557688 -455405 -360515 -343910 -371942 -389333 -361063 -271403 -152120 -88107
42430 -88107 -131138 -213977 -205233 -63534 101939 154169 91829 45652 102898 190817 187889 107249
42418A07249l8667J9618n9901k02816j71357P3660K65396J78037p1569k02084
42408a02434j31172J96Q4692J35196J38082K8318j37691j63933K4304K27793K06378
42397C09729j6069k02137k01403p6954L5139O4882J2119o9189p6266M4957J86931
42386A1739J72406r298j66175j49348k8586L6613l746r3275j70262j78508p4124
42375f52564Q0018J22369O444r3607k4484J04332R4248j7397k7015Q5890J27790
42364a93976K5903n0392K5336J44918J62544J01792N0065N029m6186l1203Q5332
42353B79162J87388J46366l875j37291k01669k16546j86739j16955m3966K2387
42343b71738J10051J77087J10532q4291k20059j59425N173J05462J02010K9497
$$ plain form
42418 107249 68582 88200 28299 -174517 -345874 -272214 -6818 171219 99650 -102434
42408 -102434 -233606 -233410 -148718 -13522 124560 152878 15187 -148746 -124442 103351 309729
42397 309729 293660 91523 -109880 -186834 -151695 -86813 -74694 -143883 -220149 -175192 11739
42386 11739 184145 174847 8672 -140676 -169262 -132649 -136395 -229670 -399932 -578440 -652564
42375 -652564 -572546 -450177 -443733 -537340 -561824 -457492 -363244 -380641 -407656 -321766 -193976
42364 -193976 -168073 -218465 -193129 -48211 114333 216125 266190 271219 225033 193830 279162
42353 279162 466550 612916 609041 471750 270081 53535 -133204 -250159 -294125 -271738
42343 -271738 -161687 15400 125932 41641 -178418 -337843 -332670 -227208 -125198 -95701
42333i5701j02423k12582j29495J35472K63134K6707l12284l04705N9651L42365
42323c29861K69021L5635o5254l4905l7983r0958o7078P5128K05940J64527m5711
42312G8501k06552r9624J84488K90084O8885j70352j03783R9156M9073k06963
42302a7087k46401J9573J88728M3990r8725L1828J79534K2929k32536j75038J27521
42291a55684K36372K9238j73630j52423m3277k039K0465O5438L5974r0758j63517
42280c93841q8100M4472J47844K43813K89173J43289j52441k93756j02177J90819
42270B9095K55243J02812j3923j8802n8802j82855k42358j43400J5193J10417
42260a47380J30863R5460J161r0229p4768J2174O32j37314j92513l6542J39020
$$ plain form
42333 -95701 -198124 -410706 -540201 -404729 -141595 -114888 -427172 -731877 -672226 -329861
42323 -329861 -60840 -25205 -90459 -125364 -163347 -254305 -321383 -246255 -40315 124212 78501
42312 78501 -128051 -227675 -43187 246897 315782 145430 41647 140803 189876 -17087
42302 -17087 -263488 -243915 -55187 -11197 -109922 -78094 101440 124369 -108167 -283205 -155684
42291 -155684 80688 109926 -63704 -216127 -259404 -261443 -240978 -175540 -139566 -230324 -393841
42280 -393841 -481941 -437469 -289625 -45812 243361 386650 234209 -59547 -161724 29095
42270 29095 284338 387150 373227 354425 295623 112768 -129590 -272990 -257797 -147380
42260 -147380 -16517 78943 80104 -10125 -84893 -72719 -72087 -209401 -401914 -438456 -299436
42249b99436R7830o6663q0549P3769J56030Q1411K9609R1561J14049J6305l1101
42238A82815P1232J17060o9862k90189k57176n7406J0956o3400l9556J05044J38981
42227a51501K7469J5036J67156K18042L6043j18684k1825J45081J16409k9902
42217D03324n7005L1424P4010N8496M9176l0968k28953l16327p2296K80402L03268
42206D94551k2022k63525j73730J6421L1357o6203r0916n8347q8735j63869j59848
42195e44866k5609J71116K91315J99941o9052k37905q1571K07162K21654n6329
42185G5856j96194J7594K28197O3517k66611k89433J5367K16156P2699j85066
42175b47918k42254p0055J50319K53513J77057p559j08024J654J91114K13299
$$ plain form
42249 -299436 -201606 -268269 -348818 -275049 -119019 -37608 -7999 83562 197611 213916 182815
42238 182815 254047 371107 301245 11056 -246120 -303526 -292570 -355970 -395526 -290482 -151501
42227 -151501 -124032 -108996 58160 276202 312245 193561 171736 316817 433226 403324
42217 403324 346319 377743 451753 510249 559425 528457 299504 -16823 -89119 191283 494551
42206 494551 472529 209004 35274 51695 83052 16849 -74067 -132414 -221149 -385018 -544866
42195 -544866 -570475 -399359 -108044 91897 22845 -215060 -296631 -89469 132185 75856
42185 75856 -120338 -102744 125453 188970 -77641 -367074 -351707 -135551 -62852 -247918
42175 -247918 -490172 -560227 -409908 -156395 20662 13103 -94921 -93267 97847 311146
42165C11146L3433j38530j44334l3669Q6783J71042J63485Q792j92647k26127
42155C9374o4220M8351n1078j69652l6958K57888L56534J41815r0943n5294J39007
42144E14824J83473K4450j02804o4925j5126j02373k05426j40456N578l236j50618
42133e6639j68518K4539J69399P8009n9758Q876J80352J58702q4874k97482l27246
42122c74640k44137j03422J21473L33813L21390P1919j44747j28584M653M7504
42112i4778q499m7235l9626k1200K8615J27676J90198J25060j9764j23288j46573
42101b9414j24469o6353L1841J25653J60767J34602O7459j9434n9836R590J02812
42090C33218L8691j63676k22824J2615K81035K43092k9436j71318n8020P6394
$$ plain form
42165 311146 344579 206049 61715 28046 114829 285871 449356 458148 265501 39374
42155 39374 -24846 23505 -27573 -197225 -234183 23705 380239 522054 431111 375817 514824
42144 514824 698297 722747 619943 555018 539892 437519 232093 91637 97215 93979 -56639
42133 -56639 -225157 -200618 -31219 46790 -12968 -4092 176260 334962 250088 -47394 -374640
42122 -374640 -618777 -722199 -600726 -266913 54477 126396 -18351 -146935 -142282 -94778
42112 -94778 -103277 -150512 -190138 -211338 -182723 -55047 135151 260211 240447 117159 -29414
42101 -29414 -153883 -220236 -188395 -62742 98025 232627 300086 280652 220816 230406 333218
42090 333218 371909 208233 -14591 -1976 279059 522151 492715 321397 263377 339771
42080C39771N0652m0762q7498j59661k95680l24499j06233J88794K53860M5043
42070a36213j67706j46115M9967J73883R2628p6019j20051N980J31353J03657
42060h8636p642l3225L6914O1837o826n8880k4959K3251K1405L276j8751r8768
42048a91004j98683j59252M6162J94830J15163l9607j7270J42132J70605k1505
42038D1571k30088k51988j02398Q3817J98414J79853M4657o6880j9626J14570
42028h098J32780M830p1675K2502J45006J13850m0609j64359j91210j40149j8620
42017b15752J31039J85999R2262j8631q392N1166N633j08371j17902r444M8184
42006C5791q556m3676K7796R9777Q0216M7778P3830N5946j01332k68529k50188
$$ plain form
42080 339771 390423 349661 262163 102502 -193178 -517677 -623910 -435116 -181256 -136213
42070 -136213 -303919 -450034 -400067 -226184 -133556 -209575 -329626 -323646 -192293 -88636
42060 -88636 -96278 -129503 -92589 -30752 -37578 -96458 -121417 -98166 -76761 -73485 -92236 -191004
42048 -191004 -389687 -548939 -502777 -307947 -192784 -232391 -249661 -107529 63076 41571
42038 41571 -188517 -440505 -542903 -459086 -260672 -80819 -36162 -103042 -122668 -8098
42028 -8098 124682 129512 57837 80339 225345 339195 298586 134227 -56983 -197132 -215752
42017 -215752 -84713 101286 193548 174917 166525 217691 223324 114953 -2949 -12393 35791
42006 35791 27235 -16441 11355 111132 191348 239126 312956 368902 267570 -959 -251147
41995b51147q2879K3871K660j5008M8661J05632Q1894L7657M1133O0789N4195
41984A07458M6430N4058M3039K3489O3199J35943R7156q5227k18958j52203k1044
41973I3340m2179j56906j21009Q2491J81488K1527j95168j98617j0375J33008
41963b12400J05259q154p0335k4986R6502J91563J36612p8948k84320k86690r4169
41952e30066J04552J77639J70026J68635J52942N1681j10172k10076j72519n6010
41942b53368K0971M978n8935r0516m9713K9700O3584L156q1047n2877R7479J79337
41930a87251L2515k04828k25171K9006K61988K27800M9393j5318M4294N8234k120
41919F8542k8417l0756j09622j97673j21717O1917J01946j9723k2825J88465L15464
$$ plain form
41995 -251147 -334026 -310155 -307495 -322503 -273842 -168210 -86316 -48659 -7526 53263 107458
41984 107458 153888 207946 250985 274474 337673 473616 570772 485545 266587 114384 93340
41973 93340 51161 -105745 -226754 -144263 37225 58752 -136416 -335033 -345408 -212400
41963 -212400 -107141 -115295 -185630 -210616 -114114 77449 214061 135113 -149207 -435897 -530066
41952 -530066 -425514 -247875 -77849 90786 243728 295409 185237 -24839 -197358 -253368
41942 -253368 -232397 -227419 -286354 -376870 -426583 -396883 -333299 -330143 -411190 -464067 -366588 -187251
41930 -187251 -154736 -359564 -584735 -555729 -293741 -65941 -16548 -31866 12428 70662 68542
41919 68542 40125 9369 -100253 -297926 -419643 -357726 -255780 -275503 -298328 -109863 205601
41908B05601J38722j11897j34045k9747o8341j79880p8716K12036L54523K03754
41898E12010k4410j22992j24967j14425q8696p7850j46744k08264q4595J67837
41888c13096K52984O3596j34424q9083R2496J54948N5169p4569j60985j91086
41878c44050j06486J05210K98055L17841J96465N9236o6297j94978k40346j20862
41868i6212N2668R5118K2151J2493J03837J32962J9530q7626m7407M2700n480
41857B44734j76401k58387j34962O3573J44036Q7686J8720k511k7583o3809j9045
41846a23949J24405K10489J10473p1939j47715j15505j03466j01906P699J68713
41836d2701J67468o088r2749J9909Q9613p8593k71312j84462P5559J40700m3097
$$ plain form
41908 205601 344323 232426 98381 68634 293 -179587 -258303 -46267 308256 512010
41898 512010 487600 364608 239641 125216 36520 -41330 -188074 -396338 -480933 -313096
41888 -313096 -60112 3484 -130940 -220023 -127527 27421 82590 8021 -152964 -344050
41878 -344050 -450536 -345326 -47271 270570 467035 526271 459974 264996 24650 -96212
41868 -96212 -43544 51574 73725 86218 190055 323017 342547 254921 207514 250214 244734
41857 244734 68333 -190054 -325016 -261443 -117407 -29721 -11001 -13512 -41095 -104904 -123949
41846 -123949 456 210945 321418 249479 101764 -13741 -117207 -219113 -211414 -42701
41836 -42701 124767 118679 25930 45839 135452 56859 -214453 -398915 -323356 -182656 -225753
41825b25753j31971Q3404L55783L26922N321k64145k27053J5416J63861P1088
41815A72873j09538j37219M403J07576N3191k7387J7238J14110R8109j7431p6219
41804A99706k5100M6166P7811Q9951P6560N945p3947p4089j3903q46n4779p9599
41792A73876k1378O0829R3071N6121l5774j27257j21733n026P0643k9778j93552
41781g9958j90736k1969P1894j6612r5668J2837J76083J34448j10080k64935j13530
41770d98226K05110L50348J83691o5568r8504N9177J18750j9643j11119K4094
41760A48110J79462Q4810j42395j83417l9514o249j57951k29659o8043J39905
41750b74941J90705J16490L135j50221k62859j60684J06937K24208O4180r8515
$$ plain form
41825 -225753 -357724 -274320 81463 408385 413706 149561 -77492 -62076 101785 172873
41815 172873 63335 -73884 -69481 38095 91286 63899 81137 195247 293356 275925 199706
41804 199706 174606 220772 298583 388534 465094 471039 397092 323003 309100 308254 253475 173876
41792 173876 152498 213327 306398 362519 326745 199488 77755 72729 143372 113594 -79958
41781 -79958 -270694 -292663 -220769 -237381 -333049 -320212 -144129 -9681 -119761 -384696 -498226
41770 -498226 -293116 57232 240923 175355 76851 136028 254778 235135 124016 148110
41760 148110 327572 412382 269987 86570 47056 40807 -117144 -346803 -414846 -274941
41750 -274941 -84236 32254 35389 -114832 -377691 -538375 -431438 -207230 -143050 -241565
41740b41565l7223O7778p920j05997J7867K02666J14639j62560k19293K9490K18119
41729a23999J13703o7092n9014O6001J03717N3668L5338M4373M983m4900j4771
41718A12007N4774M2271m4468o2879M0272J24994M1824j53659k54505j55082K8528
41707b25923J16821P6106O119k5284l0968j0007O9242J70698J93339J12538J3272
41696D65953n0234j04843j31616m5002J24135J84887M1408j47162j85997r0763
41686F0766J2573Q5974J24564N9544r2439j28668O3439K55029J59420j31028k75773
41675A93401j85722q2140q5254p8753j5418k1164j02740o7606J26383K30411Q9721
41664A119r0356p2883M5366M3912l5073M65J14308Q8754q1996j41832K9674K14629
$$ plain form
41740 -241565 -278788 -211010 -218930 -324927 -307060 -104394 10245 -152315 -371608 -342118 -123999
41729 -123999 -10296 -77388 -136402 -70401 33316 86984 122322 166695 171678 126778 112007
41718 112007 166781 209052 164584 101705 141977 266971 308795 155136 -99369 -254451 -225923
41707 -225923 -109102 -32996 -26877 -52161 -83129 -93136 -23894 146804 340143 452681 465953
41696 465953 415719 310876 179260 134258 258393 443280 484688 337526 151529 60766
41686 60766 73339 159313 283877 343421 250982 122314 185753 440782 600202 469174 193401
41675 193401 7679 -74461 -159715 -238468 -253886 -275050 -377790 -445396 -319013 -88602 1119
41664 1119 -89237 -162120 -116754 -72842 -107915 -107450 6858 95612 13616 -128216 -98542 116087
41652A16087J68640l7271j40374o4424r444j46516l39647k75705J28575N43216
41642e6863N41579Q9101l81091m25925o2433K81029K47989q2554l24327k22882
41632c96377Q8408K81036K15784M4518n2669q1310j14760j19649n6140l4250j51429
41621c76838k39652m3411L37160M72314J81648j78385j96326L8300J19343o7323
41611D6830k22486j10024J24143K05972J10413L4111Q6008J56660R6225p7337
41601D50515j99350j58226k2976M7956n409r1323r3325J344J12266J55475J00335
41590B97282j5652r6576n5764Q2313J79185J30665k297o7800k3703P210p8190
41579C56673j87432j40849N1628J56583L4761j36168j12081L8907M1377j30555
$$ plain form
41652 116087 284727 247456 107082 42658 33214 -113302 -452949 -728654 -600079 -56863
41642 -56863 484716 573817 192726 -233199 -295632 -14603 233386 150832 -173495 -396377
41632 -396377 -307969 -26933 188851 233369 180700 99390 -15370 -135019 -191159 -225409 -376838
41621 -376838 -616490 -659901 -322741 149573 331221 152836 -43490 -5190 114153 46830
41611 46830 -175656 -285680 -161537 44435 154848 188959 274967 431627 527852 450515
41601 450515 251165 92939 69963 117919 112510 21187 -72138 -70794 41472 196947 297282
41590 297282 281630 185054 129290 211603 390788 521453 519156 451356 427653 434863 356673
41579 356673 169241 28392 80020 236603 271364 135196 23115 62022 103399 -27156
41569b7156j93667k5744J16218K7206q8915K8780K31566K02614k747o4937M2350
41558B45568M2288j06081j17831Q2745J83878J8807j30718j0843J75611J19061
41548E02485r6622j72702p1322J2603J2374J4475J7504n2198j37653j01728N2439
41537b0345J89705K17919J19977q0028k44936j75598R6790K52634J21315l7303
41527D40130M6034J77478J7626l03797l42949m8669J50277R295k07816j90549
41517b52940l706J18855J14578N6753K161J2289J32945K52246J78312n8127j93882
41506C59484j09950J1836O590l9289P77P4059Q6342N9973J7953r2786k31338k27202
41494h3551n8816N2694q180m4620J03604K38707J06234j66331k48244j11941l6680
$$ plain form
41569 -27156 -220823 -246567 -130349 -103143 -192058 -163278 68288 270902 268155 203218 245568
41558 245568 287856 181775 63944 146689 330567 349374 218656 207813 383424 502485
41548 502485 405863 233161 161839 174442 186816 201291 218795 166597 28944 -72784 -20345
41537 -20345 169360 387279 507256 427228 182292 6694 103484 356118 477433 440130
41527 440130 486164 663642 681268 377471 34522 -14147 136130 145425 -62391 -252940
41517 -252940 -256646 -137791 -23213 33540 35701 47990 180935 433181 611493 553366 359484
41506 359484 249534 261370 267960 228671 229448 303507 389849 449822 467775 374989 143651 -83551
41494 -83551 -142367 -89673 -97853 -142473 -38869 199838 306072 139741 -108503 -220444 -257124
41483b57124j40617k14524o7957J96301L38213K59490N8727r7646j20244o5682
41473a11063n9834j29238j69768j11841p220R7945K24524L10397J88834j31800
41463A00936l50758k41312K3232J37824J05969J35110K20680J68723k1323j33823
41453A45258r7256n3152m9982J1754R3594J9328j61805j64014N5863J64078j8241
41442e4575j98264q4850J41024J58786M3614P4161J95461J18587j27796j97685
41432F8463J596J60770Q5784k3395K5915Q5998k8729j85249j60563k6154o18n1352
41420d7534L1018K11362J97385r2932l35461k17933J34006L19795J53359j64918
41410A88147l25277k30937l7981M4400l4555j31981q4371Q9380K00574J23857
$$ plain form
41483 -257124 -397741 -612265 -680222 -483921 -145708 113782 172509 74863 -45381 -111063
41473 -111063 -170897 -300135 -469903 -581744 -588964 -491019 -266495 43902 232736 100936
41463 100936 -249822 -491134 -467902 -330078 -224109 -88999 131681 300404 279081 145258
41453 145258 48002 -5150 -55132 -43378 50216 69544 -92261 -256275 -200412 -36334 -54575
41442 -54575 -252839 -337689 -196665 -37879 5735 79896 275357 393944 266148 68463
41432 68463 70059 230829 316613 293218 319133 405131 376402 191153 30590 4436 3818 -47534
41420 -47534 -16516 194846 392231 299299 -36162 -254095 -120089 199706 353065 188147
41410 188147 -137130 -368067 -406048 -361648 -396203 -528184 -612555 -523175 -322601 -198744
41400a98744l8220p5542P4893K51632K47156L3110j98286k16964N007K44547K58723
41389C87312N8399j16158j01416O411K7878m6461r6690j01700j65988l05576l54274
41378h08263j66725J64609L85611L47720J35312n9241j22477o7413M3920J55334
41368H387J96773R6994j10721k43870j46721Q5188J80878L7637j40699j32107
41358a68261Q338P6354K9991j2582k2134q9122k06118k28372j00154N7979J48127
41347e05954K09752K60919K05043J6840j32537q8773N7860J12681N8260L2437
41337B26528P8847Q9098q461j40231j93267j38669k9704O0245Q8080O9741N4415
41326A56622N5297M3482J9127J5156J3081l8931r1676k4139J20361J03905j56049
$$ plain form
41400 -198744 -236964 -312506 -237613 14019 261175 294285 95999 -120965 -115958 128589 387312
41389 387312 445711 329553 228137 234548 262426 215965 119275 17575 -148413 -453989 -808263
41378 -808263 -974988 -810379 -424768 -77048 58264 -977 -123454 -190867 -146947 8387
41368 8387 205160 302154 191433 -52437 -199158 -113970 66908 104545 -36154 -168261
41358 -168261 -159923 -83569 -53578 -66160 -88294 -177416 -383534 -611906 -712060 -654081 -505954
41347 -505954 -296202 -35283 169760 186600 54063 -34710 23150 135831 194091 226528
41337 226528 305375 394473 386012 245781 52514 -86155 -115859 -55614 32466 102207 156622
41326 156622 211919 255401 274528 289684 302765 263834 172158 148019 268380 372285 216236
41315B16236l72042k33879J44387L66061K72333O5970n5785j17049j77569j89136
41305h0473j27838o9515m7763q972L2139j5745j10805p8204Q9760J65804M5776
41294b05836o6036J017J00303N3908q989J00711K31496J04186j75003k09906Q1649
41283G500L41898L19758J85612J69898K15772J82614J16508Q8353p969k40860
41273A379084m08776k97977m0387O1370l2952j22163j36674j79660k28348j29429
41263a35912O8453J05039o7429j56480J8082K22133J69789m3130j21261j2105
41253D7179J06782J61257K12178K16805N2382k13103l31411k05759m311J05304
41243A47303J38980J59598J54871J36259J85011K95338L15678J53182q0190k19781
$$ plain form
41315 216236 -155806 -389685 -245298 120763 393096 459066 403281 286232 108663 -80473
41305 -80473 -208311 -277826 -325589 -334561 -302422 -318167 -428972 -507176 -417416 -251612 -205836
41294 -205836 -271872 -270855 -170552 -116644 -125633 -24922 206574 310760 135757 -74149 7500
41283 7500 349398 669156 854768 1024666 1240438 1423052 1539560 1627913 1619944 1379084
41273 1379084 970308 672331 631944 693314 660362 538199 401525 221865 -6483 -135912
41263 -135912 -67459 37580 -29849 -186329 -168247 53886 223675 180545 59284 47179
41253 47179 153961 315218 527396 744201 796583 583480 252069 46310 41999 147303
41243 147303 286283 445881 600752 737011 922022 1217360 1533038 1686220 1606030 1386249
41233A386249k39384k08906j72161j49758j57351j47805n0157P2610N7631q3508
41223C07460j14228O3425J94271L7160k18836j95682J01355K76033J18721j18712
41213D50967j30746J9147O4211m8104j18882j8208J39614J62938J4429j69222
41203C66144k34089j38716N0114K27593K87236J53608j18958l00108j81702J31913
41193B43035K81058R2456j82700k12834k8357Q0288N727q2630n5626J5241M1165
41182A96823L8063J5939n2590j00129o069J59704J49838r6071l05705k37187o245
41171b43629J20552J00950Q0637R7071N1283o4786j23820o7220J294k8659j22526
41160a98853j50314m7146R7826J26433J8774l1940J26950L15677K08410j44480
$$ plain form
41233 1386249 1146865 937959 765798 616040 458689 310884 260727 333337 390968 307460
41223 307460 193232 256657 450928 488088 269252 73570 174925 450958 569679 450967
41213 450967 320221 339368 403579 355475 236593 218385 357999 520937 535366 366144
41203 366144 132055 -6661 43453 271046 558282 711890 592932 292824 111122 243035
41193 243035 524093 616549 433849 221015 192658 272946 278673 196043 140417 155658 196823
41182 196823 234886 250825 198235 98106 92037 251741 401579 305508 -197 -237384 -243629
41171 -243629 -123077 -22127 58510 155581 206864 142078 18258 -48962 -47668 -76327 -198853
41160 -198853 -349167 -396313 -298487 -172054 -153280 -185220 -58270 257407 465817 321337
41150C21337k76279L3078L48810J67175l04946m09121p203L16141J38998j93851
41140A34139j48794J85994K91886K4535k33098j96013k9903K7562L7798J38862
41130B32968K15883Q4257j36768j43121Q5187K20767N8673j98412k54924j17438
41120D7072R541O2634J13325J16632m6331k71085k63857K9459K77025K00025n0082
41109B24358j54340r0597o9966j17040l4290K00425L05096Q9900k36570l31452
41099b14476j54190L9942P2235K6407N5405J45853J51426Q831j55996j66142j4615
41088b05320J14600Q0192k7825k3919R3347J41012M0848n7084j7887O3799K7044
41077B28807r5203j50815j25456j24049j29316r053K01646K60936P3962j18401
$$ plain form
41150 321337 45058 78136 426946 594121 289175 -119946 -127149 188992 327990 134139
41140 134139 -14655 171339 463225 487760 254662 58649 28746 56308 94106 232968
41130 232968 448851 533108 396340 253219 338406 559173 617846 419434 164510 47072
41120 47072 56613 119247 232572 349204 302873 31788 -232069 -202610 74415 274440 224358
41109 224358 70018 -20579 -90545 -207585 -241875 -41450 263646 353546 116976 -214476
41099 -214476 -368666 -328724 -256489 -230082 -174677 -28824 122602 131433 -24563 -190705 -205320
41088 -205320 -90720 -10528 -38353 -62272 31075 172087 212935 155851 137964 201763 228807
41077 228807 133604 -17211 -142667 -266716 -396032 -405085 -203439 57497 131459 13058
41067A3058p1871J04186J34773N514n7522J4528L8136q3460j91275j45172m0418
41056b79523p661M486P0510Q6930m9047j90692j24193P4776J30772q052j03275
41045c94969j5842R2171L7618j11052j63671n9715J18254K58213K59959R0148
41035A11114j20062j59483k038J41996J18175J9430j3698j5461p1128j19725o2187
41024a73067L9163N3523J265P816R1179J53306J40328P1952l8495j58124j87234
41013A612p9023M9593O3504J387j4458K1839M2360N4892P7578L0682j03855j36366
41001I745N7450K31600P3052k51857k52342J52188M68034L34520O580r5904J2580
40990G45646L5019j00180k14924k23733j92681j31505L590J36812J35979L3351
$$ plain form
41067 13058 -58813 45373 180146 185660 128138 142666 180802 97342 -93933 -239105 -279523
41056 -279523 -287184 -282698 -212188 -125258 -174305 -364997 -489190 -414414 -283642 -291694 -394969
41045 -394969 -410811 -318640 -281022 -392074 -555745 -615460 -497206 -238993 20966 111114
41035 111114 -8948 -168431 -170469 -28473 89702 109132 95434 79973 8845 -110880 -173067
41024 -173067 -133904 -80381 -79116 -71300 19879 173185 313513 385465 346970 188846 1612
41013 1612 -77411 -27818 35686 37073 22615 44454 86814 141706 219284 249966 146111 9745
41001 9745 67195 298795 371847 119990 -132352 19836 487870 822390 828970 733066 745646
40990 745646 780665 680485 465561 241828 49147 -82358 -78768 58044 194023 227374
40980B27374j8078P9m9313k07507l13838k04221Q0348L19002L06278M7238k09489
40969b2127k03578K9335J87538R8582o5659p3496M1530J09664J16002J35773J07630
40958D61194n8515k25986j74732K8016R4623l4639j12079q612Q7683K2144n9039
40947B0058K3664J73610J90695Q8115J9380R707k6217q2686q5144o0879r4791
40936A75512j46659r8034K8861P8015p35q4136p8510l3815m970M9003J44202J79656
40924B08390P7955p2250j32324j08478j04567j19579l9584J51709K90364K31695
40914C83331M3979q3841p7816l4175n9334j38093j72259r6740N3215J59004J19281
40903I6552k3507r1337K1929J83759J69818l4136k08297j95011p3576J1857M4270
$$ plain form
40980 227374 209296 209375 160062 -47445 -361283 -565504 -485156 -166154 140124 187362 -22127
40969 -22127 -225705 -196370 -8832 89750 24091 -49405 -7875 101789 217791 353564 461194
40958 461194 402679 176693 1961 29977 124600 89961 -22118 -30730 56953 79097 20058
40947 20058 43722 217332 408027 496142 515522 525229 499012 416326 331182 270303 175512
40936 175512 28853 -69181 -40320 37695 36960 -47176 -125686 -159501 -164471 -115468 28734 208390
40924 208390 286345 214095 81771 -26707 -131274 -250853 -290437 -138728 151636 383331
40914 383331 427310 343469 265653 231478 172144 34051 -138208 -234948 -181733 -22729 96552
40903 96552 73045 -18292 3637 187396 357214 323078 114781 -80230 -153806 -141949 -97679
40892i7679O3002N0330J3862M6303J56829J80537L7890n5705J17265L85539L94939
40881A293112J50665N625Q8897J27761m3168j79787o7210P3483n3998k97670k84102
40870H13608l4890N5101j57213l43162k03639J12485K50416J10990r2747j33063
40860C77886J441J27908P2337j19511k04582m8301J67670J85168L9755j9723N9637
40849F39685P2321o7585j61958m8143J54213K49571K14902J07560o7139k38373
40839H55054k25444m294J63929P9169r6619j14777l9344q5752k04074j62033K7689
40828A93504J12469K4646l4714K5352M6986n3598j24991o2231J5212P37k4236
40817A19136R122J2018n6848o6168M2554J04746J2019p7452j8729M9723k7740
$$ plain form
40892 -97679 -34677 15653 29515 75818 232647 413184 451074 395369 512634 898173 1293112
40881 1293112 1443777 1449402 1538299 1666060 1622892 1443105 1375895 1449378 1395380 1097710 813608
40870 813608 778718 833819 676606 333444 129805 242290 492706 603696 510949 377886
40860 377886 379327 507235 579572 460061 255479 207178 374848 560016 599771 580048 639685
40849 639685 712006 644421 482463 434320 588533 838104 1053006 1160566 1093427 855054
40839 855054 629610 625316 789245 868414 771795 657018 617674 531922 327848 165815 193504
40828 193504 305973 330619 295905 321257 368243 314645 189654 127423 142635 143372 119136
40817 119136 128258 140276 83428 17260 59814 164560 176579 99127 80398 130121 102381
40806A02381r3652O8157L01323K62392l6518k33340j53708M655N8915P1144J02675
40795D54424N8868p6324j25044p299Q5797k919j28507r3654J5339o557j10045
40784F4079o1859J58353K96074J84906m1095j62146j37525p5805n7820p5613q2654
40773H895m4734K1206M1781k3645q6490j1645J78331K88347K04193N8078L2944
40762F67261Q3821J5293j87007k94203j66132K6555M4891p9466j24600k3099P9998
40751D3312R6122J00067J27860Q5849m3064j03707j7887N2125l3148j26545k2389
40740A58595J72739J72660l4235j54764m7451O4818m5837k53314k54339J87K21431
40729D90J36679j63232k97027m1334L48901M05964N1519k75769k11673N4173J23821
$$ plain form
40806 102381 8729 76886 378209 640601 604083 370743 217035 221690 280605 351749 454424
40795 454424 513292 436968 311924 304625 390422 387503 258996 165342 180681 174124 64079
40784 64079 2220 160573 456647 641553 600458 438312 300787 224982 167162 91549 8895
40773 8895 -35839 -14633 27148 3503 -82987 -94632 83699 372046 576239 634317 667261
40762 667261 751082 766375 579368 285165 119033 145588 190479 111013 -13587 -36686 43312
40751 43312 139434 239501 367361 453210 410146 306439 288552 340677 307529 180984 158595
40740 158595 331334 503994 469759 314995 267544 332362 286525 33211 -221128 -220941 490
40729 490 137169 -26063 -323090 -364424 -15523 390441 441960 166191 -45482 8691 132512
40718A32512j0012o4362q452n9714j86764j03396J77785K70608M6215j29579j5783
40707D9058J02342n6296k56170j61962P9122J22262J9232M7631J53603P1615j30799
40696C9638j38469M5055J11748O314k6605L3994o4709k90187k46563J57177M53521
40685H0914L01553n173m5087Q7222L7945j79663k48893r0673O1878P2291L8486
40674A10800L1696l574o2965m7864L5881N4649k3996o2087K2063J14648Q0517
40663B49768l9312r6728l2190P6570J21204O2906m4665r2213m606J62178K37764
40652F00676J08884j27270k46112j58239j9351j6562j16211j38580l5450P1399
40642g6816J24165J97491K76860J95917o9160k54663j58665M0088N0452q9803
$$ plain form
40718 132512 122500 58138 49686 -10028 -196792 -300188 -122403 148205 194420 64841 49058
40707 49058 151400 95104 -161066 -323028 -243906 -121644 -102412 -54781 98822 170437 39638
40696 39638 -98831 -53776 57972 64286 37681 71675 6966 -283221 -529784 -372607 80914
40685 80914 382467 377294 332207 419429 457374 277711 28818 -61855 23 72314 110800
40674 110800 142496 138922 75957 28093 63974 118623 94627 32540 54603 169251 249768
40663 249768 210456 113728 81538 158108 279312 342218 297553 205340 200734 362912 600676
40652 600676 709560 582290 336178 177939 158588 142026 25815 -112765 -148215 -76816
40642 -76816 47349 244840 521700 717617 648457 393794 235129 275217 325669 235866
40632B35866j17515J5154J05983N7376l0081r5171j60925j61290j9704J13317
40622e6990K2146j73501j31933J65914L62625K82173J41513R6871Q050j70195
40612E46673k00428j5479O2396j34073k60319l1347K29333R2036k28837j85637
40602a25682K12526L98726J08475k82059l51529j37134P5200J28034L9108p6904
40592a1239n4560J47106K99601J56026j66130l02845j33349J12993K33253K46008
40582E26864J90379L2058j57909j96440n2123J00050J49912J68952K11073K14316
40572A187132J53833R2629M6707l866K8013K33816M68912M90622L61807M27638
40562C487243Q36667J369583J799463K106160K234720J967880J215263J89902
$$ plain form
40632 235866 118351 133505 239488 296864 266783 171612 10687 -150603 -170307 -56990
40622 -56990 -34844 -208345 -340278 -174364 188261 470434 611947 708818 716868 546673
40612 546673 346245 330766 393162 259089 -1230 -32577 196756 288792 59955 -125682
40602 -125682 86844 485570 594045 311986 -39543 -176677 -101477 26557 65665 -11239
40592 -11239 -65799 81307 380908 536934 370804 67959 -65390 47603 280856 526864
40582 526864 717243 749301 591392 394952 342829 442879 592791 761743 972816 1187132
40572 1187132 1340965 1433594 1480301 1476435 1504448 1738264 2207176 2697798 3059605 3487243
40562 3487243 4323910 5693493 7492956 9599116 11833836 13801716 15016979 15206881
40554A5206881q37999j729762k324380k396274j949064j322091q42993n65897
40546C238421m33764m22365m11188k25382M0376O1589j83451k83004k1618K45069
40536A604683J62372m0417N7876L97685O19795O94004Q67489J110394J106463
40527F580344P70559L48949j212l53279p20177r72722j070154j063085q85728
40518B633495m80214j00871j03251l96285m98027k21003Q0414P4549j05441j73001
40508G10365j20436j02420j26949j02894l7183J1686N7799J19455J38672Q1197
40498F29292Q189k8563m2557j9896P4156J57967Q9225r2771j82542j19530n9225
40487D13745p2556l6539P6575Q6635o5398j54997l6483R8336N7720j0018R7837
$$ plain form
40554 15206881 14368882 12639120 10314740 7918466 5969402 4647311 3804318 3238421
40546 3238421 2804657 2382292 1971104 1745722 1786098 1847687 1664236 1381232 1359614 1604683
40536 1604683 1767055 1726638 1784514 2182199 2801994 3495998 4363487 5473881 6580344
40527 6580344 7350903 7699852 7698640 7345361 6625184 5652462 4582308 3519223 2633495
40518 2633495 2153281 2052410 1949159 1552874 1054847 833844 914258 988807 883366 710365
40508 710365 589929 487509 360560 257666 220483 232169 289968 409423 548095 629292
40498 629292 637481 608918 566361 546465 620621 778588 867813 775042 592500 472970 413745
40487 413745 341189 304650 381225 467860 402462 247465 210982 309318 367038 357020 454857
40476D54857K35411J35393j13879j87136m3634L1793r3675k14810j40507M2157
40466A05970J47598J26758L8611m5826m5308P6472K03239J54179o7021k40230
40456D54442k00671k8197R0100Q6437L8581L5715P3674O8650k5610j16274o0081
40445D16766J12072J78993L1202j42217j19440K2424M4435p3996j32792m9887
40435B87560M7353P1992P6598P4092k221j07682q7324N9323J38101P0481J7558
40424F45831Q3695J23123o014j91415k42541j57623n1849L3911R2643O5941l2476
40413C63226n0109P0065J33448k5656k43345k42174m4211Q6887N0862n404J5041
40402A08630L7706J4920J6038O8449R4374N3792m729n7921j17204j22169k570
$$ plain form
40476 454857 690268 825661 711782 524646 481012 512805 419130 204320 63813 105970
40466 105970 253568 380326 418937 373111 327803 404275 607514 761693 694672 454442
40456 454442 253771 225574 315674 402111 440692 476407 550081 618731 593121 476847 416766
40445 416766 528838 707831 739033 596816 477376 499800 544235 470239 337447 287560
40435 287560 334913 406905 483503 557595 555374 447692 360368 419691 557792 628273 645831
40424 645831 729526 852649 846635 655220 412679 255056 203207 237118 329761 395702 363226
40413 363226 313117 383182 516630 490974 247629 5455 -38756 48131 98993 93589 108630
40402 108630 146336 161256 177294 245743 340117 393909 389180 331259 214055 91886 89316
40391H9316J46216J46717K0426k6507N8793Q3209o1107k00606j52511k582N0301
40380A51665j9295r0346r1108k2007J10946K44961K41493N8780j42789j95192
40370B47108j29644o4524m120Q8015J24096P351j48242j27416O9457K12288J57685
40359D32054P888p5436o3908k7156k9085r6117j87155j83886k2385J64785J72087
40348I1686q42j41932j25086m9497k0595K5106J48080K12837O0962j93867k50667
40337b43815j8335K41082K39141J1358j65804j37536j2474N8130R4802J86838
40327B53387K71538J84041o6554k33107j29359J17808K30768J26858k6982p2826
40317F55572l7097k5786n6611o2006j2401K4753l5853j69630k32031j26150M6753
$$ plain form
40391 89316 235532 382249 402675 376168 434961 518170 457063 256457 103946 101364 151665
40380 151665 132370 42024 -49084 -71091 39855 284816 526309 585089 442300 247108
40370 247108 117464 52940 48820 136835 260931 268282 120040 -7376 62081 274369 432054
40359 432054 439942 364506 300598 273442 244357 148240 -38915 -222801 -245186 -80401 91686
40348 91686 90844 -51088 -176174 -225671 -246266 -221160 -73080 139757 200719 6852 -243815
40337 -243815 -262150 -21068 218073 229431 63627 -73909 -86383 -28253 66549 253387
40327 253387 524925 708966 642412 409305 279946 397754 628522 755380 728398 655572
40317 655572 618475 592689 536078 474072 461671 486424 450571 280941 48910 -77240 -30487
40306c0487J00551K4422q239P3609J17743J4943r3544m4329O5066M2319o0215
40295B01839k4645J71148L24075L12380J88263r951k66716m15554k64454N5751
40285B72136J78655K4374q4361M5356J69652M2877j59877j46798J7454P6356L2213
40274D68037P2342J61814Q2470j53770k75447j64346k13O2319R1469J65770K00398
40263G10843J08804l6084j20531j42768j52914j50084j24958j14056j32911j22063
40253b76722k3485J32301K50237K49820J22981l9579r9986j4308J01869J14156
40243E17284L6445j8833l511N0319J18468J71005J27104l8256j88684j75943n4007
40232E41391J3715J3998O0914J43096J14653m4149j69262j59990r1922m1498M541
$$ plain form
40306 -30487 70064 94486 86247 159856 277599 292542 198998 154669 219735 262054 201839
40295 201839 177194 348342 672417 984797 1173060 1163109 896393 480839 216385 272136
40285 272136 450791 475165 390804 436160 605812 648689 488812 342014 359468 435824 468037
40274 468037 540379 702193 784663 630893 355446 191100 190887 253206 344675 510445 710843
40263 710843 819647 783563 663032 520264 367350 217266 92308 -21748 -154659 -276722
40253 -276722 -300207 -167906 82331 332151 455132 415553 315567 301259 403128 517284
40243 517284 553729 534896 531385 581704 700172 871177 998281 960025 771341 595398 541391
40232 541391 555106 569104 630018 773114 887767 843618 674356 514366 422444 380946 385487
40221C85487J6828q4324k28561k03217L3336K47508K58750J76506J72469K07013
40211I81795J50886K1771p2319r8800o7185K9394J09195J8080j92340k14452P3068
40200G39093L30758K10715j12278k15084p7588l1170j30254o9302K10489L23886
40190A179265N2739k64691k44257k1845L2768q6094r6873M4627R9052j6058j02206
40179E76427l6798N0537M0196N638K5049K1838p5077j72324j48188l5051M8174
40168C00421N6989K2809k1649l8017J0382P3974L9057q3762j08668P0038K75367
40157E96941K54161K1635j65810j57250o1265l4815o8868n5600K6023Q3736N0164
40146D89052j6179m009Q1721Q9020o9326k27774j44766J33642K91233J92726Q5262
$$ plain form
40221 385487 402315 317991 89430 -113787 -80451 167057 425807 602313 774782 981795
40211 981795 1132681 1154452 1082133 983333 916148 945542 1054737 1072817 880477 666025 739093
40200 739093 1069851 1280566 1168288 953204 875616 844446 714192 644890 855379 1179265
40190 1179265 1232004 967313 723056 701211 733979 647885 551012 595639 694691 678633 576427
40179 576427 539629 590166 630362 636000 661049 682887 607810 435486 287298 252247 300421
40168 300421 357410 380219 358570 320553 330935 404909 443966 360204 251536 321574 596941
40157 596941 851102 872737 706927 549677 488412 453597 384729 329129 355152 438888 489052
40146 489052 472873 468864 550585 639605 570279 342505 197739 331381 622614 815340 900602
40135I00602J94782L55513K94468R7615O7168K30271L52245L90353N43970Q18376
40125D245363R21537P04982L69022R5939j96316n68273q36444q45890p10016n83035
40115B596869m37975k55471j68564k14834k15753j17669j44832l50534l61623
40106C29614N7992M97645M16296n2595l12158j74586K246n404m815J52094K91406
40095A197735K40388P7971n8380j36233j29618j7611R1148Q9442J01448K89165
40085A745455M93439M39379K54694L41714P11945R11524O89495K79793r1823m89969
40075E285646q76559r31572n57208j54034q0457j76808j27137K8921O7894j2096
40065B466590p9751j36738k09363j93474p0529m7305k16409l22091j52444P6805
$$ plain form
40135 900602 1095384 1450897 1745365 1842980 1910148 2140419 2492664 2883017 3426987 4245363
40125 4245363 5166900 5871882 6240904 6336843 6140527 5572254 4735810 3889920 3179904 2596869
40115 2596869 2158894 1903423 1734859 1520025 1304272 1186603 1041771 691237 329614
40106 329614 387606 885251 1301547 1248952 936794 762208 764454 759050 754235 906329 1197735
40095 1197735 1438123 1516094 1457714 1321481 1191863 1174252 1265400 1354842 1456290 1745455
40085 1745455 2238894 2678273 2932967 3274681 3986626 4898150 5587645 5867438 5775615 5285646
40075 5285646 4409087 3477515 2920307 2766273 2685816 2509008 2381871 2410792 2478686 2466590
40065 2466590 2386839 2250101 2040738 1847264 1776735 1729430 1513021 1190930 1038486 1115291
40055A115291N5171j16365j05331J15790K62139J82154Q327r1096p0564M0085
40045A395601J55773J65549P6019L0338Q0892R4245k578o2507N1681K42259L14565
40034B541837J99485l6333k39329k13230O4457K96090K22135N1631J34597L03749
40024C325089J13776k93723k85296J93421M37565J34184j27933J00420L91839
40015C989342K78258O1127J63425L65395L41530L04369M57514M84331K56124L07228
40005G008643Q60157J187386Q00839M18355P57578J274990J268372J299829K123959
39996A7000108L062861L038379K479727K528279L080053L446940M209552O359809
39988D5205708R355571J2314959J6307321K2865478L1419234M1553638N5739302
$$ plain form
40055 1115291 1170462 1054097 948766 1064556 1326695 1508849 1517176 1426080 1355516 1395601
40045 1395601 1551374 1716923 1792942 1823280 1904172 1998417 1995839 1933332 1985013 2227272 2541837
40034 2541837 2741322 2704989 2465660 2252430 2316887 2612977 2835112 2886743 3021340 3325089
40024 3325089 3438865 3145142 2859846 3053267 3490832 3625016 3497083 3597503 3989342
40015 3989342 4267600 4328727 4492152 4857547 5199077 5503446 5960960 6445291 6701415 7008643
40005 7008643 7868800 9056186 9857025 10275380 11032958 12307948 13576320 14876149 17000108
39996 17000108 20062969 23101348 25581075 28109354 31189407 34636347 38845899 45205708
39988 45205708 54561279 66876238 83183559 106049037 137468271 179021909 234761211
39981B34761211P3309673Q1609207O2245134J2456862m4710242p8953288q0180122
39974B60538435o2681534m4958853l3231092k4683134j7686043j3247867j0824122
39967E3225790q405815n755328m165850l731628l355675k811264k692712k827860
39959A9479658k515793j918362j698352j683294j247326o15238m98038p77486
39951H525769p61707m55654m32435o75641o39071l00812j54115k58138k19514
39942D628682l4171q1690l29902l51799j22641o2248k70712l89817k53060q0738
39932B651904o758O0842J05756M936j56533j88608j42768j73580j94805o7349
39922A893037N5508j2659j04172j0621O8888j16028l31024k32356j7507p7591
$$ plain form
39981 234761211 308070884 389680091 451925225 464382087 419671845 340718557 260538435
39974 260538435 197856901 152898048 119666956 94983822 77297779 64049912 53225790
39967 53225790 44819975 39064647 34898797 31167169 27811494 25000230 22307518 19479658
39959 19479658 16963865 15045503 13347151 11663857 10416531 9801293 9303255 8525769
39951 8525769 7764062 7308408 6875973 6200332 5561261 5260449 5106334 4848196 4628682
39942 4628682 4594511 4512821 4182919 3831120 3708479 3646231 3375519 2985702 2732642 2651904
39932 2651904 2645146 2705988 2811744 2816680 2660147 2471539 2328771 2155191 1960386 1893037
39922 1893037 1948545 1935886 1831714 1821093 1889981 1773953 1442929 1210573 1193066 1115475
39912A115475k32628k0912M01474M16379k9982l12828j24208J23128N6311j25542
39902A266667j15984K5695J13848J34149J03145j6456j28551o9432O8756L7745
39892A419582j17039j16271K0048k8263k72549l03873N1271M25172M70039L31874
39882A879991L41938N56085P90654Q46365N77062J6584m88921n84214l84407l10427
39872C240710m42286m67987l05652k54588l99331m02476j13048J26646O2074n6332
39862I87730M1053J73110Q5115q3867q9824j6279m9380j10717o6899k8940j01933
39851G39169j18990K7519Q7660j26714l18247j43219J78546J81870j03404k40890
39841A63300j00991K6540n821j9697P6145J24265N0373q724Q914l455o0290l3850
$$ plain form
39912 1115475 882847 861935 1263409 1679788 1649806 1336978 1212770 1335898 1392209 1266667
39902 1266667 1150683 1176378 1290226 1424375 1527520 1511064 1382513 1313081 1381837 1419582
39892 1419582 1302543 1186272 1206320 1178057 905508 601635 652906 1078078 1548117 1879991
39882 1879991 2221929 2778014 3568668 4415033 4992095 5008679 4519758 3935544 3551137 3240710
39872 3240710 2798424 2330437 2024785 1770197 1370866 968390 855342 981988 1044062 987730
39862 987730 1028783 1201893 1287008 1203141 1113317 1097038 1047658 936941 870042 841102 739169
39851 739169 620179 647698 735358 608644 290397 147178 325724 507594 404190 163300
39841 163300 62309 88849 83028 63331 139476 263741 314114 305390 314304 310849 250559 216709
39829B16709O5718N8841p0305r6789P8521K47401K10987N1209n4899r2599j23441
39818D91353j04096K7413J74320J57058m8777k58074k76925j08322O6703J01535
39808B22188L5223p688j0578l8879n0850P4386K78947L11829P9685j90541k73152
39797D30570k17876j44444q252J96156K38795k1678l03012k46212L6251J40894
39787A01192R667l2121J46096K89914K11439M9100l0276n7949p9743m8686j0530
39776E48103j06617k84362k93579q0232J10592J34066J27641J62251O6713j99472
39766A85104l42801j69383P7500J02977J2023N5098J65846J16811m4510r0527
39756F8138k1850j9899q0326m5839N6628N7875j4267J8004J19539Q3887n7259
$$ plain form
39829 216709 282427 341268 270963 174174 252695 500096 711083 762292 707393 614794 491353
39818 491353 387257 414670 588990 746048 697271 439197 162272 53950 120653 222188
39808 222188 257411 249723 239145 200266 149416 223802 502749 814578 894263 703722 430570
39797 430570 212694 68250 59998 256154 494949 473271 170259 -75953 -39702 101192
39787 101192 110859 78738 224834 514748 726187 775287 745011 687062 607319 558633 548103
39776 548103 441486 157124 -136455 -216687 -106095 27971 155612 317863 384576 185104
39766 185104 -157697 -327080 -249580 -146603 -134580 -79482 86364 203175 158665 68138
39756 68138 46288 26389 -53937 -99776 -43148 14727 460 18464 138003 221890 164631
39745A64631m4090J37698J82149j7329j53809q519J79449J15437o3722l9987J42316
39734E94224J58302m7016j59044N311K02445J17348j81159l34384j74242O7246
39724B49031P0459j59857l08791j65599J07312K05830Q4567l4550j4531M2642
39714G6513L7649N6452J78651K71169J63448o8469j91651j42990p0418o0600l2199
39703B17555N5136Q0592m0133j79366j59057m017J05861R1761M3986L9042K6938
39692B78298n2489j47343j64302r5968k307Q3132J45861J38142M5038k6693L2888
39681B34257J28077M2862k09235l21014j14711J59638J66646k5526r0741J4833
39671a4914K3183j31160j73093J3068J44457L1858n9502J24707L24494J67675
$$ plain form
39745 164631 120541 258239 440388 423059 269250 260731 440180 555617 491895 451908 594224
39734 594224 752526 705510 546466 551777 754222 871570 690411 356027 181785 249031
39724 249031 319490 159633 -149158 -314757 -207445 -1615 82952 48402 33871 76513
39714 76513 114162 170614 349265 620434 783882 715413 523762 380772 310354 249754 217555
39703 217555 272691 353283 313150 133784 -25273 -29290 76571 168332 212318 251360 278298
39692 278298 225809 78466 -85836 -181804 -184111 -100979 44882 183024 228062 201369 234257
39681 234257 362334 405196 195961 -125053 -239764 -80126 86520 60994 -29747 -14914
39671 -14914 8269 -122891 -295984 -282916 -138459 -106601 -166103 -41396 283098 450773
39661D50773j59833j70482J17518K05947l9509j72027M9947K36004L1630k82616
39651B67352k74941n4656j08q2626R545K44960K88549J06198J3169J01543J10582
39640G29567n2658j38816m4395j4876j45873j20272K48778N95962N21986K43121
39630A822524K59981N47580N75038J18611m05572n38908l47480k03542k62261
39621A565971l82977m17333l49986k06763p095J75023K22744J01191p8465j62604
39611D59706j12596l0935k7501r4647j44362j32806q5545k4427M2170O8023J9815
39600f3105k0562N1302J46517N2408k01598k72090K3231L53177K68756j56259
39590A81777l92657j59089K38930L53818J33820j21567j72503m7511P3532O1212
$$ plain form
39661 450773 290940 120458 237976 443923 404414 232387 282334 518338 549968 267352
39651 267352 -7589 -62245 -62353 -144979 -135434 109526 398075 504273 517442 618985 729567
39640 729567 676909 538093 493698 478822 332949 212677 461455 1057417 1579403 1822524
39630 1822524 2082505 2630085 3205123 3323734 2918162 2379254 2031774 1828232 1565971
39621 1565971 1182994 765661 415675 208912 201817 376840 599584 700775 622310 459706
39611 459706 347110 316175 288674 194027 49665 -83141 -168686 -193113 -150943 -82920 -63105
39600 -63105 -83667 -32365 114152 166560 -35038 -307128 -283897 69280 338036 181777
39590 181777 -210880 -369969 -131039 222779 356599 235032 62529 15018 88550 149762
39580A49762n5046j31999q6999m861o17k8929L1570J40099J29738q177q5298j9606
39568B9637L5373l0948q3149K4659J74416J45456m3131j46775k3984J96556K76419
39557E54529J07278j92937l73781k89319o9147L3391k2378l2417J01451J98437
39547A5107J02172n3068p3647k0997n2860j01955q96J71876J82311L1266n7234
39536A42075k8068n3965j70202j79910j4980J18045Q4031K5304O4704P9567k8900
39525C7701r5814L3764K02895J83209M7911K0397Q2534L7574j16705j83478j07643
39514A42345l8128m7802n3487l3007o8424j38317j11568O693O5995N5773J31747
39503h8180K78076K41003m7831k68435j59361P2694O9186j36713k12674n6020
$$ plain form
39580 149762 94716 -37283 -124282 -129143 -129760 -158689 -127119 12980 142718 134541 49243 29637
39568 29637 65010 34062 -49087 -24428 149988 295444 252313 105538 81554 278110 554529
39557 554529 661807 468870 95089 -194230 -263377 -229986 -252364 -284781 -183330 15107
39547 15107 117279 64211 -9436 -30433 -83293 -185248 -186144 -14268 168043 199309 142075
39536 142075 114007 60042 -110160 -290070 -305050 -187005 -102974 -77670 -12966 66601 37701
39525 37701 -58113 -24349 178546 361755 409666 430063 512597 550171 433466 249988 142345
39514 142345 104217 56415 2928 -30079 -98503 -236820 -348388 -341695 -275700 -219927 -88180
39503 -88180 189896 430899 383068 114633 -44728 27966 97152 -39561 -252235 -308255
39493c08255J07277J28463J17081J64510J70399N5397p2037q7766k7017K1857
39483B69909N1359O0513m495j20303j44452m1078k637j64998l23675j71618K31621
39472c59854M83221L57378O7556p8580p2365r0512j45398q0844J19588K41828
39462D42018J28122r3958j80598q7702Q725j5192o9749r703J41326K18728J34361
39451F16378k8577j41196j62610j21646n0678M446j8856j06658j21978L8031K54877
39440A61533K85908Q0315j22079q6380J15281K11181Q9297q8096j37136q3465
39430D26359o5404j01580p9898M0837J40432R6490m4236j27863q9673r441K2302
39419B08325J2861J6123L7927M1739J1178m0449r8304j42408j40336q6073k1009
$$ plain form
39493 -308255 -200978 -72515 44566 209076 379475 434872 362835 275069 248052 269909
39483 269909 321268 381781 377286 256983 112531 71453 68816 -96182 -419857 -591475 -359854
39472 -359854 123367 480745 548301 469721 397356 306844 161446 80602 200190 442018
39462 442018 570140 476182 295584 207882 216607 201415 131666 121963 263289 482017 616378
39451 616378 587801 446605 283995 162349 111671 116117 97261 -9397 -131375 -93344 161533
39440 161533 447441 527756 405677 319297 434578 645759 735056 646960 509824 426359
39430 426359 360955 259375 179477 220314 360746 457236 413000 285137 195464 186023 208325
39419 208325 221186 237309 275236 316975 328153 287704 189400 46992 -93344 -179417 -200426
39408b00426K8243R7075K02821K54563J45189o9256j96865j51649n9435n7580
39398g320r3304l1680J04991J50662M4087o9500l3786J14829K08970J61823M3387
39387E93159l3909l8228j7820k6672p8045j46694j87047j60412p5981j287P213
39376a65723j1958L1748J27684J32557k7942j94329j47247P3473J91125P3693
39366H3081q1157m6514J05235J40578K3797o4822k6445M3371M6914P562l4685
39355A96915q8146j20655n7425P0851J20396M5606k1043J7325O7212Q283j11565
39344A27754j61324j05742N446J21171J63179M8135j43255j69000M3592K25956
39334A55912J29410r6430j45213l4133j2931q5563k2185J57364J51975o9898j33612
$$ plain form
39408 -200426 -172183 -75108 127713 382276 527465 458209 261344 109695 50260 -7320
39398 -7320 -100624 -132304 -27313 123349 167436 97936 64150 178979 387949 549772 593159
39387 593159 559250 521022 503202 476530 398485 251791 64744 -95668 -171649 -172936 -165723
39376 -165723 -177681 -145933 -18249 114308 86366 -107963 -255210 -181737 9388 83081
39366 83081 1924 -44590 60645 201223 225020 160198 133753 177124 224038 231600 196915
39355 196915 108769 -11886 -69311 1540 121936 167542 146499 163824 231036 239319 127754
39344 127754 -33570 -139312 -133866 -12695 150484 198619 55364 -113636 -70044 155912
39334 155912 285322 188892 43679 9546 -3385 -88948 -111133 46231 198206 128308 -5304
39323e304J20181L02366Q2719k38596j89284J21063K03567j1976j24941J3061
39313B72856P1702j35883k99357j31950J44034J54381n7426j58432m9006P6530
39303a12551R9948J00533J27210J09885K2421o2236j00509j04631m7923Q9666
39293A21813J89936R7537j25848k31634j13463O6973J40106J32481J18630M9982
39283D46513j16591k52928k04655l1884O6883L4565p312R724Q863n0306n9295
39272a56423O8524K20476K05284J2232j63356j59698k7982N9571K1974o3903r0082
39261g3383n3536l6212p5661j10100p1458J6030Q3820J30892J99148K40462J31142
39250C81144j16362k72505j56623Q0500J13301j19361l16291k21287M4083J85189
$$ plain form
39323 -5304 114877 417243 499962 261366 72082 193145 396712 384736 259795 272856
39313 272856 344558 208675 -90682 -222632 -78598 75783 18357 -140075 -189081 -112551
39303 -112551 -12603 87930 215140 325025 347446 285210 184701 80070 32147 121813
39293 121813 311749 409286 283438 51804 -61659 5314 145420 277901 396531 446513
39283 446513 329922 76994 -127661 -159545 -92662 -58097 -65409 -55685 -46822 -97128 -156423
39272 -156423 -87899 132577 337861 350093 186737 27039 -943 58628 80602 16699 -73383
39261 -73383 -126919 -163131 -238792 -348892 -420350 -404320 -320500 -189608 9540 250002 381144
39250 381144 264782 -7723 -164346 -83846 29455 -89906 -406197 -627484 -583401 -398212
39240c98212J36089P2741R5151J05774K0253p8901p0733L5440J29615J29712L9811
39229B16740o1399p9111j7419j6334j64267l00400j79897J43649L16945J61810
39219B0317o5790n7145J04375J21399l0084r0829L8964J46361N5897j14271j60264
39208c1070p3103J8757N8672Q5506J25559J60212J54558O8113r9009k40371k15098
39197A2726k8258J50894J89033J10128p740j23593j74920q4891Q4750J40216K5983
39186B94328o4005J7461J22679M6354j24564j36896L2835J60937J25010K1940
39176D96079o5698j71654k70794k39950p5320N6992P0850N8885O1436k5410j82075
39165b86659j61642J33082L86804K62329r9484k73962j46350J7901N1565P3762
$$ plain form
39240 -398212 -262123 -189382 -94231 11543 31796 -47105 -117838 -82398 47217 176929 216740
39229 216740 155341 76230 58811 42477 -121790 -422190 -602087 -458438 -141493 20317
39219 20317 -45473 -102618 1757 123156 93072 2243 41207 187568 243465 129194 -31070
39208 -31070 -104173 -85416 -26744 58762 184321 344533 499091 567204 468195 227824 12726
39197 12726 -15532 135362 324395 434523 426783 303190 128270 43379 128129 268345 294328
39186 294328 230323 247784 370463 416817 292253 155357 188192 349129 474139 496079
39176 496079 430381 258727 -12067 -252017 -327337 -270345 -199495 -140610 -79174 -104584 -286659
39165 -286659 -448301 -315219 71585 333914 234430 -39532 -185882 -167981 -116416 -42654
39155d2654J55550J51022k746j18890p4073k6899j11194j53056L3972K64231K15884
39144B91147o1838k14929j09768M5319J00537J31086J43142j4320k91245l44119
39134c24988m6571K12651O1539k71688k98826k8115Q3554j07622k14681K3369
39124i11378L21839L27821J48174Q0294R9369p84j40938o4130J53055J35663j84174
39113c5189l99418k22620R9460J99386J27256J62503K90681K47899J6514j06284
39103C80188J1896J24295P127j96945k32740j21282n8441o4895k37J35317J74448
39092A58731O7509l6066l9535k7255o7522q0404j0750M0977J246j4007J07661
39081A00585K37725J65113p5743k44004k32689j62008j24801n3299R4559K03961
$$ plain form
39155 -42654 112896 263918 261172 142282 68209 41310 -69884 -222940 -188968 75263 291147
39144 291147 229309 14380 -95388 -50069 50468 181554 324696 310376 19131 -324988
39134 -324988 -371559 -158908 -97369 -369057 -667883 -695998 -612444 -720066 -934747 -911378
39124 -911378 -589539 -261718 -113544 -33250 66119 65335 -75603 -139733 13322 148985 -35189
39113 -35189 -434607 -657227 -557767 -358381 -231125 -68622 222059 469958 486472 380188
39103 380188 392084 516379 523506 326561 93821 -27461 -85902 -150797 -151034 -15717 158731
39092 158731 226240 190174 150639 123384 55862 -24542 -35292 5685 6931 -7076 100585
39081 100585 338310 503423 427680 183676 -49013 -211021 -335822 -389121 -294562 -90601
39071i0601J68631N1032l6286r8994j88883k51615j86912k1197J05197J16009
39061d33619O7307L9929N1185Q3373J20674J29708O6146n5105j34497q7906L2932
39050a19873P4646l1921j59717j23481P9272K47262K20022N7422p4731j04439
39040F4462n8836L0800J06334N2570j46530k80450j33164J91149L64611K57918
39030D48864N3840p3211j42349j76261j01734L8333L9966j23145j70799N1657
39020a54839K54274J07886k22040k94029l4759J95632J54882m637m7692M7490
39010B168J73675K38198J63107m9521k16849j50236N0662J09220j3084q7230l3499
38999A86611m0846j67331j64365J02892L57321K90843J6459j33848q6540k1077
$$ plain form
39071 -90601 78030 129062 92776 -6218 -195101 -446716 -633628 -654825 -549628 -433619
39061 -433619 -366312 -326383 -275198 -191825 -71151 58557 124703 69598 -64899 -152805 -119873
39050 -119873 -45227 -77148 -236865 -360346 -281074 -33812 186210 243632 168901 64462
39040 64462 5626 36426 142760 195330 48800 -231650 -364814 -173665 190946 448864
39030 448864 502704 429493 287144 110883 9149 47482 87448 -35697 -206496 -154839
39020 -154839 99435 207321 -14719 -308748 -343507 -147875 7007 2370 -45322 2168
39010 2168 175843 414041 577148 527627 310778 160542 211204 320424 307340 220110 186611
38999 186611 145765 -21566 -185931 -83039 274282 565125 581584 447736 361196 340119
38989C40119k0762j7973j0366o0848j16615o3928N7372J01832N5937K8229L0564
38978C23561k1868j05324r4370J5116Q6892O8496M9558P5523Q7150P0255P7862
38967F32851P3155m8347k29950k58621q3231P5146M4714n5252l6939O2627Q7498
38956B63651L2201J3661N3925O8842K6292l2997q7806j18449n8965Q9204J66873
38945D16432N3301j10622j03666J3729k3732k31986k93528m0802K50911K55233
38935A85270N9755k3616M2680L1392j04509j41933M038R7794m1782k31553j95128
38924c17592K6207J60797J04315K304k3524j4514k6202k5655R014K4611j0013
38913i0252m2702k4474K1676N4247O4790N3794K4754J1013L1717K6127o7481j71246
$$ plain form
38989 340119 319357 301384 291018 230170 113555 49627 106999 208831 264768 292997 323561
38978 323561 301693 196369 101999 117115 204007 272503 322061 397584 484734 554989 632851
38967 632851 706006 657659 427709 169088 85857 161003 205717 150465 113526 176153 263651
38956 263651 295852 309513 363438 432280 458572 425575 337769 219320 160355 249559 416432
38945 416432 469733 359111 255445 269174 245442 13456 -280072 -320874 -69963 185270
38935 185270 245025 221409 264089 295481 190972 49039 53077 150871 109089 -122464 -317592
38924 -317592 -291385 -130588 -26273 -23969 -47493 -62007 -88209 -113864 -104850 -80239 -90252
38913 -90252 -132954 -157428 -135752 -81505 -16715 37079 61833 72846 104563 130690 63209 -108037
38901a08037j37114K1026J11774M1432m1172K6693J72861K01997P6470n1911n8966
38890B55053J7568N9582R465p7661r4515j0726O4376J3064j04266j09963K1388
38879D3365J06231L7499l4467O0416K25328K19370j0702k81444l99738l00526
38869c34668l1399K41925K87269N0102k03056j80822L4012J03176o9751k22884
38859c26096j58083p721L5850J4050N0082R5572M3829l2424J4185J29373J12862
38848b8521n3679j42223P8K22640K59097N1265k03414k78981j24057J30153K93709
38837A26067K53725M8564j63855k37393j63717o1836l4005n4505k6623P2302J54513
38826h6763J37560M8694j3330Q729Q1578J26425R5183J4781m0563l5176j3744
$$ plain form
38901 -108037 -245151 -224125 -112351 -70919 -112091 -85398 87463 289460 365930 314019 255053
38890 255053 272621 332203 341668 264007 169492 158766 223142 236206 131940 21977 43365
38879 43365 149596 187095 152628 213044 438372 657742 647040 365596 -34142 -334668
38869 -334668 -366067 -124142 163127 213229 10173 -170649 -136637 -33461 -103212 -326096
38859 -326096 -484179 -491900 -456050 -442000 -391918 -296346 -252517 -284941 -270756 -141383 -28521
38848 -28521 -82200 -224423 -224345 -1705 257392 308657 105243 -173738 -297795 -167642 126067
38837 126067 379792 428356 264501 27108 -136609 -198445 -232450 -286955 -313578 -241276 -86763
38826 -86763 50797 99491 86161 94890 176468 302893 398076 412857 372294 337118 323374
38815C23374k9953o8227q9934j10295j41212j08718L8848J77537J39808j0046
38805A21182m5696N6849Q3316k3595m0864J11242J51065j01963l50808k54147
38795b93419K0241R2557J0611R3057K71651J74613j47988k07112R2592K25502
38785C32305q7346l69602j52485K52881K66699m2126j38167R5002K50650J15860
38775E23671o1422p4688n2648j24690j79371j18905n2361p2360q0399J3460J15619
38764a64094J12194M2079j0918m7485o7083P6J56972K58199J84604R997j08863
38753C65678j33120j38433j68762j82698j24908O13J23157J66846J37220J15688
38743A61281J29615R2742m5000j65859j33521j3799J8702m1831m1741M8470P7495
$$ plain form
38815 323374 293421 225194 135260 24965 -116247 -224965 -186117 -8580 131228 121182
38805 121182 75486 132335 215651 192056 151192 262434 413499 311536 -39272 -293419
38795 -293419 -273178 -180621 -170010 -76953 194698 369311 221323 14211 106803 332305
38785 332305 244959 -124643 -277128 -24247 242452 200326 62159 157161 407811 523671
38775 523671 462249 387561 334913 210223 30852 -88053 -140414 -212774 -293173 -279713 -164094
38764 -164094 -51900 -9821 -20739 -68224 -135307 -135231 21741 279940 464544 474541 365678
38753 365678 232558 94125 -74637 -257335 -382243 -381630 -258473 -91627 45593 161281
38743 161281 290896 383638 338638 172779 39258 25459 44161 2330 -39411 9059 86554
38732H6554r306n1756N7419J70342R9762r2136j83326r6933L0067N0027m1778
38721A8936j46401j66407p1046Q3632J92276J84086P1895p1545j57896j28874
38711a91344j7596N4731J9358k3732O8920K52447L13285J45157j13631k60662
38701B46933k39983j27872j3266N1998P1408J16185K34299L25552K26166m3275
38691H48145k49371k33316r8520k8749m7621o9133p4653j00619j17030n1040Q8270
38680a33637J94991J65712j4136k32910k98226j24941J07532J33079k9250p4861
38670c06647J28067L08371J94355o6149j44374l4486p418j34576j91070n7031
38660c10958Q9837P8159q682j9660J8893p109r5603j51373j31004o0365L1671
$$ plain form
38732 86554 77248 25492 82911 253253 353015 260879 77553 -19380 10687 60714 18936
38721 18936 -127465 -293872 -364918 -281286 -89010 95076 166971 95426 -62470 -191344
38711 -191344 -208940 -154209 -134851 -158583 -89663 162784 476069 621226 507595 246933
38701 246933 6950 -120922 -134188 -82190 -10782 105403 339702 665254 891420 848145
38691 848145 598774 365458 266938 238189 190568 121435 46782 -53837 -170867 -221907 -133637
38680 -133637 61354 227066 212930 -19980 -318206 -443147 -335615 -202536 -231786 -306647
38670 -306647 -178580 129791 324146 257997 113623 79137 71719 -62857 -253927 -310958
38660 -310958 -221121 -142962 -151644 -171304 -152411 -159520 -255123 -406496 -537500 -597865 -566194
38649e66194J20932J80084K08369K17707J80154P2596k7024q562Q8771J02150
38639E68983j2012j10086q9718k6272m446J7477O8093N8818l9606q2227J2540
38628C61544P0471o9225k32546j44500J01982J48013o0956j66286L6424K58448
38618C03369J58065j43859k68363j32738K282l1297j16264j05456k3109M8830
38608c08540R0929P9606l2289j80519j82902J9456K26810K11109P695j43427j02197
38597c14269M1516J27419J10542O4464N9555P2995K0635j13686k03216j02742
38587b36787J37770K75537J52278j03903k34545j55456j4586K3432m2401q8532
38577b87193k7125Q3953Q4762r5034k90181k45308N3135L13958K96154R8381k9877
$$ plain form
38649 -566194 -445262 -265178 -56809 160898 341052 413648 386624 378062 466833 568983
38639 568983 556971 446885 357167 330895 326449 343926 412019 470837 431231 349004 361544
38628 361544 432015 362790 130244 -14256 87726 235739 174783 8497 44921 303369
38618 303369 461434 317575 49212 -83526 -81244 -112541 -228805 -334261 -357370 -308540
38608 -308540 -217611 -138005 -170294 -350813 -533715 -514259 -287449 -76340 -68645 -212072 -314269
38597 -314269 -272753 -145334 -34792 29672 89227 162222 182857 69171 -134045 -236787
38587 -236787 -99017 176520 328798 224895 -9650 -165106 -179692 -156260 -198661 -287193
38577 -287193 -314318 -230365 -145603 -240637 -530818 -776126 -722991 -409033 -112879 -14498 -44375
38566d4375l0080n543K9107J22437J73750K8354k07749k30197K2773K53728K27383
38555C39588N8453m5768p9536j04954n9625Q2030J49897K5630j10821m3110J09913
38544C21697P5490j21182k07645j18748n9984j01116n5068J39599K38333P1519
38534A82895j49557j32268O6163J43886n137j75578j48342O6997K92143L59831
38524E01033K21166l4561k40585k76649j49772L9662J73451J65740J9677j41149
38514B78013j77340r8703m0170n0977k8220Q5542J75608J29371K0835j0507K4410
38503C07862J5497m5040o9931m7833m7550o4670k3829N4507M8927n7813j15345
38492d5218k3135J07720J06823k3973j32965j23963m3444J9978M2669O1509J09217
$$ plain form
38566 -44375 -74455 -79998 -50891 71546 245296 273650 65901 -164296 -141523 112205 339588
38555 339588 398041 352273 272737 167783 108158 190188 340085 365715 254894 211784 321697
38544 321697 397187 276005 68360 -50388 -110372 -211488 -266556 -126957 111376 182895
38534 182895 33338 -98930 -32767 111119 105982 -69596 -217938 -150941 141202 501033
38524 501033 722199 687638 447053 170404 20632 60294 233745 399485 419162 278013
38514 278013 100673 1970 -38200 -89177 -117397 -31855 143753 273124 293959 283452 307862
38503 307862 323359 278319 208388 160555 113005 48335 24506 79013 127940 70127 -45218
38492 -45218 -68353 39367 146190 122217 -10748 -134711 -178155 -158177 -115508 -53999 55218
38481E5218J71551J95972J43134L1753p9241j48531j70269j44840p1735K6235
38471I247J07408J39871R7222m4744k42604l44479k22132M2814K14942J85955
38461e6500Q9116P5821J02482M6719o7331j05830l2731O3625J23712J56965J43013
38450E39061M0397r2363j25706m5292J5712k7458j02510j14906p0724p436P4374
38439H3149J35664P9807r0311k04320j31793K6099P1495l0270j38378j26171J8443
38428c06586K17315L28745K30965j2496j65794j21970o9030j88704l27290k12676
38418f27521R8286K89255K62619K19000K37808J36620j37823l18449k10914M749
38408d6370Q7149R6740J93758L00751K65954J84736K30049K91907J35566j60528
$$ plain form
38481 55218 226769 422741 565875 597628 518387 369856 199587 54747 -16988 9247
38471 9247 116655 256526 353748 309004 66400 -278079 -500211 -457397 -242455 -56500
38461 -56500 32616 108437 210919 257638 190307 84477 51746 115371 239083 396048 539061
38450 539061 579458 487095 361389 316097 331809 304351 201841 86935 16211 8775 83149
38439 83149 218813 298620 208309 3989 -127804 -101705 -30210 -60480 -198858 -325029 -306586
38428 -306586 -89271 239474 470439 457943 292149 170179 101149 -87555 -414845 -627521
38418 -627521 -529235 -239980 22639 241639 479447 616067 478244 159795 -51119 -46370
38408 -46370 40779 137519 331277 632028 897982 1082718 1312767 1604674 1740240 1579712
38398A579712k92544k29713k37958l67047l22716L936K61481J48612r8623n7752
38388C87388K34633L53353J28393j39824j53769k709N7408k2550j16828j79662
38378E45833k50430k70207j20560J32028K32996O9657j55888k05362j16037p2166
38368b10136q8105m3235M0166K4098m8989J6203J89130J82246o7455k15816m1173
38357b63066J53206L068k96617k64622J06906L35342J80810n9474q4116J379r589
38346a96773n1523L3134J75441J83606K4814j70412k67594j83488O6381K84796
38336a01618K45042J9412o9996O1256J04792j26218l38466k10113O5270P6046
38326b74593j41395j79441N7984K08544N6298j31316n0019J78852K32648O6248
$$ plain form
38398 1579712 1287168 1057455 819497 452450 129734 133670 395151 543763 445140 387388
38388 387388 622021 975374 1103767 963943 810174 807465 864873 842323 725495 545833
38378 545833 295403 25196 -95364 36664 269660 339317 183429 -21933 -137970 -210136
38368 -210136 -298241 -341476 -301310 -277212 -326201 -309998 -120868 61378 -6077 -221893 -263066
38357 -263066 -109860 -106792 -403409 -668031 -561125 -225783 -44973 -104447 -188563 -187184 -196773
38346 -196773 -248296 -215162 -39721 143885 168699 -1713 -269307 -452795 -386414 -101618
38336 -101618 143424 162836 92840 154096 258888 132670 -205796 -415909 -350639 -274593
38326 -274593 -415988 -595429 -537445 -328901 -272603 -403919 -453938 -275086 -42438 23810
38316B3810p9759m2425J00977J90449J45879j3155j92073k63884j70635O857J27888
38305a66071J36858R0601N2868J4992n8951j47158j80412j37299p2350j8067P3179
38294d11810K11936K62960R7039j67402k52855r2586P1723M7061m6190j0636R9980
38283a90780R6196j7015n6086M2699J51946J69977J27338P3905J5065l7593q0517
38272B95135j55655k46494k08472K1367K28218J74182m709M3491L22547M22990
38262H92600J29502k35989k82882r1850j5430j32076k11314j31249k3980k977
38252a05645l080M8464R6495P4471J5713k9844p9595j41570j47116n2932N2560
38241b72079M8986l3766l9335Q8648K00586J32082o0913j62748p7610O8330J26032
$$ plain form
38316 23810 -55949 -98374 2603 193052 338931 325776 133703 -130181 -300816 -293959 -166071
38305 -166071 -29213 61388 114256 129248 70297 -76861 -257273 -394572 -466922 -484989 -411810
38294 -411810 -199874 63086 160125 -7277 -260132 -352718 -280995 -233934 -280124 -290760 -190780
38283 -190780 -94584 -111599 -167685 -124986 26960 196937 324275 398180 413245 375652 295135
38272 295135 139480 -107014 -315486 -294119 -65901 108281 103572 147063 469610 892600
38262 892600 1022102 786113 503231 411381 395951 263875 52561 -78688 -102668 -105645
38252 -105645 -108725 -60261 36234 110705 126418 96574 16979 -124591 -271707 -324639 -272079
38241 -272079 -223093 -256859 -296194 -207546 -6960 125122 64209 -98539 -176149 -107819 18213
38230A8213R7957M9029k5743j26813j53577m2427P6322M5409m9200K204J58931
38219E0305J44166r7555k32850m236L53423M06607J11654j56277j34734J8365
38209D58868J5265j56611k58277j42535O4958J41142M1092o3579j3079J35290
38199B22534J77467J0600k47954l81211k60698O3872L85964M67625K44367p8953
38189F03613k22676j31171J4568P1120P4510Q3679N6459k9178q2320n1731m7548
38178C39325j67438k99885k62715p5765O7285P0275K5533L6885Q8225J09711O9592
38167A028k3549j29741j74354j05424L3843J39990J52411Q4296j4470p4751m1194
38156a51915M1585L7877r0095j72796n1019J49983J51182p0395k11075o6071J59080
$$ plain form
38230 18213 116170 165199 139456 12643 -140934 -183361 -107039 -61630 -110830 -108626 50305
38219 50305 194471 96916 -135934 -140170 213253 619860 731514 575237 440503 458868
38209 458868 474133 317522 59245 -83290 -18332 122810 163902 100323 87244 222534
38199 222534 400001 410601 162647 -218564 -479262 -415390 -29426 438199 682566 603613
38189 603613 380937 249766 264334 335454 409964 493643 550102 520924 438604 386873 339325
38178 339325 171887 -127998 -390713 -466478 -399193 -328918 -303385 -266500 -178275 -68564 1028
38167 1028 -22521 -152262 -326616 -432040 -398197 -258207 -105796 -21500 -35970 -110721 -151915
38156 -151915 -110330 -72453 -162548 -335344 -386363 -236380 -85198 -155593 -366668 -432739 -273659
38145b73659J27886j47930l14493j46645J79081L45502K74591J23042L518j06700
38135F4193j94276j45737N7564K27770J90273K3026o7550l7133n140k0040k0022
38124G2928j0714o5204j25134l4273J62974J98165k3423k29120j55367P9628J85147
38113E5607J12000K1445k8321j03352j78745j58432p5864m7181n2630J4479J10407
38102c30587Q9334k2818n1201J7971Q778j14195j50285q29J33760M7752j54202
38091e26522k00693p523K45123L27642J75530n3741j11367P7052K88321K64148
38081D77970N9894n3956j1299j1640j29292j65568j6989J00019o823j82612j86894
38070a27190p2899l3054l2893Q9168K58016K25528j9745j99715j38396L4992J22947
$$ plain form
38145 -273659 -145773 -293703 -608196 -754841 -575760 -230258 44333 167375 170893 64193
38135 64193 -130083 -275820 -218256 9514 199787 222813 155263 118130 112990 92950 72928
38124 72928 62214 -2990 -128124 -162397 577 198742 175319 -53801 -209168 -129540 55607
38113 55607 167607 189052 160731 57379 -121366 -279798 -355662 -402843 -455473 -440994 -330587
38102 -330587 -241253 -264071 -315272 -297301 -288523 -402718 -553003 -553832 -420072 -372320 -526522
38091 -526522 -727215 -734738 -489615 -161973 13557 -40184 -151551 -74499 213822 477970
38081 477970 537864 483908 472609 460969 331677 166109 149120 249139 242316 59704 -127190
38070 -127190 -200089 -233143 -266036 -176868 81148 306676 286931 87216 -51180 -16188 106759
38059A06759R2322J5088m4932l3643M9870P9304o6387k68845k57305J0541K46209
38048g1019K09558J7452o2219J7106Q4917M4646k2925l3858k3882n5019r8800
38037E957p8097J3661R1731Q2981J6890j3995K6375P9615Q2145L9433j5157p3989
38025B57550j20053j04194k8543R520n2738j26544r3965L585L1605j8814l2979
38014b75570J8396M1529J0787K5646J24687K02323J81116J19984P5468N009j02773
38003D26602j55836j24466j20518j80622j42689Q0172K67529J79447m3782o5195
37993A20642J21125J77698k6275j88743m2715K29009K68157M1420j78070k21035
37983C01213j70155j33437q9535R470J36175K30937K43872J25007j14891l23006
$$ plain form
38059 106759 199081 214169 169237 135594 185464 264768 198381 -70464 -327769 -317228 -71019
38048 -71019 138539 155991 93772 110878 195795 240441 217516 183658 159776 104757 5957
38037 5957 -72140 -58479 33252 116233 133123 119128 145503 225118 307263 346696 331539 257550
38025 257550 137497 33303 4760 14280 -38458 -165002 -258967 -255382 -223777 -242591 -275570
38014 -275570 -257174 -215645 -204858 -179212 -54525 147798 328914 448898 524366 529375 426602
38003 426602 270766 146300 25782 -154840 -297529 -217357 50172 229619 185837 120642
37993 120642 241767 419465 393190 204447 161732 390741 658898 700318 522248 301213
37983 301213 131058 -2379 -91914 -82444 53731 284668 528540 653547 538656 215650
37973B15650l14249j09096N2508M297j34206j29973M7350J96739J58482P843o2373
37962f7028J3684J12658R1052m0101j36849r1365N9446J86613J87664N0087j47518
37951B18343k72473k33371q5418P674k7842p0426K1980J83488K11619N8423q9434
37940g7437o5611O2270J13587M0317m7450n3462R49L3252l447p7102j01429k8980
37928b04543O3911M4605q7954j63692o4059R1479R5970n1819j41877m3510J31902
37917c29587K03155J41349M3873k9595r0768j28600r1729J5058R8431Q9472L7761
37906d1180L0792N5308K8888l4773j3049J15203J67590l915k52114k85786o0798
37895b93834J63944J82339O4118l4744q6732j10501n6964P3777J51541J07245
$$ plain form
37973 215650 -98599 -207695 -155187 -150890 -285096 -415069 -367719 -170980 -12498 -4655 -67028
37962 -67028 -53344 59314 150366 110265 -26584 -117949 -58503 128110 315774 365861 218343
37951 218343 -54130 -287501 -372919 -365245 -393087 -463513 -441533 -258045 -46426 11997 -77437
37940 -77437 -143048 -80778 32809 73126 25676 -27786 -26837 6415 2968 -74134 -175563 -204543
37928 -204543 -140632 -96027 -183981 -347673 -411732 -320253 -224283 -276102 -417979 -461489 -329587
37917 -329587 -126432 14917 58790 29195 -61573 -190173 -281902 -266844 -168413 -78941 -41180
37906 -41180 -10388 44920 73808 39035 25986 141189 308779 304864 52750 -233036 -293834
37895 -293834 -129890 52449 116567 81823 -4909 -115410 -172374 -98597 52944 160189
37885A60189O2591J08202J16783j6366j18053J523J72638Q9928j70377k40132
37875A66926n4902M9731r0443k13403j06745M9249M9908L3538J81216L33556K51083
37864F49714M2798k4995J4734n9417k02989j64243L9172J00754p5381k19074j33924
37853c2851L1447Q6906Q8659J48809J90994R7790o0589j30657r4742l8289m770
37842B82707j0606r0715k00084j88800j8111J18368N9264n0453L4937K52345K82893
37831D71745K8113k20710j93607j7754q559k06851l31901j77304J27312L02968
37821b26548K40791N2284j09931j74891j42224n9905r041k2133k0389P7320J96898
37810a97769J88979P6898N8352J91624K58140P7260j92656k61435j12576J9807
$$ plain form
37885 160189 222780 330982 447765 431399 313346 314869 487507 577435 407058 166926
37875 166926 112024 161755 71312 -142091 -248836 -199587 -149679 -116141 65075 398631 649714
37864 649714 692512 667517 682251 622834 419845 255602 294774 395528 320147 101073 -32851
37853 -32851 -1404 85502 174161 322970 513964 611754 551165 420508 325766 287477 282707
37842 282707 272101 181386 -18698 -207498 -225609 -107241 -47977 -98430 -63493 188852 471745
37831 471745 499858 279148 85541 67787 59228 -147623 -479524 -656828 -529516 -226548
37821 -226548 14243 66527 -43404 -218295 -360519 -420424 -429465 -451598 -471987 -394667 -197769
37810 -197769 -8790 68108 126460 318084 576224 653484 460828 199393 86817 106624
37800A06624K1553K978L7231M2696j8039m6288n684j5371j33711k25138j69371
37789d02520m5031L0336Q8150J79691K10479J02868M424R9358K78610K48195l6135
37778G58425k79242k43501l3534J03335R6834N6479O4544R1941P9061J8587k7642
37767F85287K9624K03120L54212L02081N6231j25029K0804M74049R28064J064657
37757C993100Q34421M93955L73457N98966J064678J650913K304828K790402K559940
37748A6664660J230361p76130k393974k895287k508235j930262j510753j174292
37740D706088q81033p18935o10231l58892m1181K9260j78037k96192j27539L6915
37730A560223r5367l39319l58977k06236j55214j94199j04489O8814P0483p2732
$$ plain form
37800 106624 128177 131155 168386 211082 193043 146755 141071 125700 -8011 -233149 -402520
37789 -402520 -447551 -417215 -329065 -149374 61105 163973 168397 267755 546365 794560 758425
37778 758425 479183 235682 202148 305483 402317 458796 523340 615281 694342 712929 685287
37767 685287 714911 918031 1272243 1574324 1630555 1505526 1526330 2000379 2928443 3993100
37757 3993100 4827521 5321476 5694933 6293899 7358577 9009490 11314318 14104720 16664660
37748 16664660 17895021 17118891 14724917 11829630 9321395 7391133 5880380 4706088
37740 4706088 3825055 3106120 2495889 2136997 2095816 2125076 1947039 1650847 1523308 1560223
37730 1560223 1464856 1125537 766560 560324 405110 210911 106422 175236 245719 172987
37720A72987o1988J30377J72758n3476k23599j04212P8831O4451j2170O4071J49539
37709C77569J1913j85449j03628J85445K64214J708k68931k54802n4215Q4592
37699E8416Q4121J2651n1091l7883O4336J34368M4700j25697j82724j11117o1146
37688a71066m9898N4343K11743J78936q3257k53563r1417J89630K15579l2507
37678A68523k28234j50642P5236J81264O9422j03617j20976K0348R0709l8944
37668c6911j59425k1954K20137J90101j01012k16272K6447K51625J33080q8436
37658A97380l7885J67876J56665n7958j37782M36J27865J70908K74291L87498
37648A249294K52437j02073k86497j30357N4115j0271j48714r8602K9681j2871
$$ plain form
37720 172987 110999 241376 414134 360658 137059 32847 111678 176129 163959 228030 377569
37709 377569 389482 204033 100405 285850 550064 551772 282841 28039 -26176 58416
37699 58416 142537 155188 104097 66214 130550 264918 309618 183921 1197 -109920 -171066
37688 -171066 -220964 -166621 45122 224058 140801 -112762 -204179 -14549 201030 168523
37678 168523 -59711 -210353 -135117 46147 115569 11952 -109024 -88676 2033 -36911
37668 -36911 -196336 -218290 1847 191948 90936 -125336 -98889 152736 285816 197380
37658 197380 159495 327371 484036 426078 288296 288732 416597 587505 861796 1249294
37648 1249294 1501731 1399658 1113161 982804 1036919 1026648 877934 779332 809013 796142
37638G96142j56712j55465l2744j3137q1915L887K46712L19588O9780j97325j46232
37627F52579R6513J39616r9176k99338k17511l321O7388j6705n0428M9472J45737
37616D64826J08229k3971j44500k13961k33853j89498r0483K964N2186P7132Q4143
37605a06786L8979m3773p9948m4334k1229n6492o5614K1989J33477J72269J63415
37594A11953J61563J19237j1697j38996j43353n7239J3415N5954Q2737Q097k00286
37583A385l42743k06898R0434K36746J63532P8812P7603L3327q0099q2924P8258
37572D7433J83106P7864q5755j18385o8233m4352J3762J68290K71497J70104j7129
37561E98202p4756l4287q2749k01634j77747K7003J76704R8347q1523j32789j8806
$$ plain form
37638 796142 639430 483965 451221 438084 356169 360056 606768 926356 996136 798811 652579
37627 652579 749092 888708 789532 490194 272683 269362 336750 320045 269617 319089 464826
37616 464826 573055 549084 404584 190623 -43230 -232728 -323211 -320247 -268061 -190929 -106786
37605 -106786 -67807 -111580 -191528 -235862 -257091 -313583 -379197 -357208 -223731 -51462 111953
37594 111953 273516 392753 381056 242060 98707 41468 54883 110837 193574 201671 1385
37583 1385 -341358 -548256 -457822 -221076 -57544 21268 98871 132198 52099 -30825 47433
37572 47433 230539 308403 222648 104263 36030 -8322 5440 173730 445227 615331 598202
37561 598202 523446 489159 406410 204776 27029 54032 230736 329083 247560 114771 95965
37550I5965J01072Q8009l7241j38114j01442N0142J70697J31631m7374k14652
37540I8693k24887o7633J15223J53555K9897r1769p3787J5396L3302O514O4248
37529E8752J61526J03639j13769k34190j10651Q0497J29586P8599N1896J7535
37519B23420p5692j17103k6996M3356l5620q9791P6705K65322J32813k15649l13191
37508a32426m4964J58393q953k56030j59083J89182L29690R7507j89345j89840
37498b05869N8707K60878K26539K3712j57765k06657j50905p3442k4868j7962
37488b67632l7899k4374Q1973K24865K54398J35417K1603J8033R453j12223k00501
37477A03113p9893J00298N6046j45907j64041L9464J11367p9683j72471Q9773
$$ plain form
37550 95965 197037 285046 247805 109691 8249 58391 229088 360719 313345 98693
37540 98693 -126194 -193827 -78604 74951 104848 13079 -60708 -45312 -12010 -5496 58752
37529 58752 220278 323917 210148 -24042 -134693 -54196 75390 153989 205885 223420
37519 223420 147728 30625 3629 46985 11365 -78426 -1721 263601 396414 180765 -132426
37508 -132426 -177390 -18997 -27950 -283980 -443063 -253881 75809 173316 -16029 -205869
37498 -205869 -147162 113716 340255 363967 206202 -455 -151360 -224802 -249670 -267632
37488 -267632 -305531 -329905 -247932 -23067 231331 366748 388351 406384 415837 303614 103113
37477 103113 23220 123518 179564 33657 -130384 -90920 20447 -59236 -231707 -141934
37467a41934L73538K42120j47587k80513o3307J00691j2040j52406p9200O5559
37457i5079N5104n0716p0767k7209n2501j06966m0620J27308K22103J91490J56533
37446C08680J60658P9284j29054k63148j34318J24392J97580J0188j79185j45580
37436B9497J9770R4765M4102r639l5424j08610j95994j40363P7217K37175J58090
37425A70586n1735j51532q9881k1126m4127q2934m5066L6055Q1220R7738J41987
37414D1185J89132J37996l3812j93713j94777o0061M6374K5911n8500j03303p9991
37403b83559R190J66702L02620K34809n9504l00193k21074L6564R9319q7594j84905
37392b87625l147J94015J10597j24614j82534k9177R8618J02520R7713J13452
$$ plain form
37467 -141934 231604 473724 326137 45624 -17683 83008 70968 -81438 -160638 -95079
37457 -95079 -39975 -90691 -161458 -188667 -241168 -348134 -388754 -261446 -39343 152147 308680
37446 308680 469338 548622 419568 156420 22102 146494 344074 354262 175077 29497
37436 29497 49267 144032 188134 178495 143071 34461 -161533 -301896 -224679 12496 170586
37425 170586 118851 -32681 -122562 -143688 -187815 -270749 -315815 -279760 -198540 -100802 41185
37414 41185 230317 368313 334501 140788 -53989 -114050 -67676 -41765 -100265 -203568 -283559
37403 -283559 -274369 -107667 194953 429762 370258 70065 -151009 -114445 -15126 -102720 -287625
37392 -287625 -290772 -96757 13840 -110774 -293308 -322485 -223867 -121347 -23634 89818
37382H9818K6145j60173k33437q3611J07958J20973o891p2131K040J00914J04088
37371d307K6387k9079P10P0695P9237n826r2560p6657J2515M3733l7615j31000
37359a43767j03007N6765K22282K52014J25220l0165p3782k5572l3342j37624
37349A09022j79674l4476J73799K32202J33165L7234J072n6023j37577j41284
37339A37460o4381k5661m3690r600O6640K7601j19441j27425Q9598K38482P0447
37328B40030j94260j72629R5921K20477N8339j15657p7066M3866M6655k3296j6737
37317A05643N4431P6641L2948j7842o8261j29922j49656q3201J0150N5579P7212
37306c6278J13836R7440m2582k05213k07863m4056R6338Q8685K4078M5324J36923
$$ plain form
37382 89818 115963 -44210 -277647 -361258 -253300 -132327 -139218 -211349 -209309 -108395 -4307
37371 -4307 22080 -6999 -6289 64406 143643 137817 45257 -31400 -18885 24848 -12767 -143767
37359 -143767 -246774 -190009 32273 284287 409507 379342 305560 279988 246646 109022
37349 109022 -70652 -105128 68671 300873 434038 471272 472344 416321 278744 137460
37339 137460 73079 47418 3728 -5872 60768 88369 -31072 -158497 -68899 169583 240030
37328 240030 45770 -126859 -30938 189539 247878 132221 55155 99021 145676 122380 105643
37317 105643 160074 236715 269663 251821 183560 53638 -96018 -179219 -169069 -113490 -36278
37306 -36278 77558 174998 132416 -72797 -280660 -324716 -228378 -139693 -115615 -70291 66632
37295F6632J59390M2939j22100j82087q0203Q1064J45230P7304l678L219M1885
37284B29595J2724l6853K5131J76733K38433J63464J60401L88041O45212N59733
37274B562614O9545m58889o39446m62928k13193r8476r1530q9533p8961q6398
37264D12805p0072K4201J26525Q9565q6451j89194n9924J52310J58522o2483k09420
37253B86384p8353J40282J35955p7251k04705j16614q610o0527j54230q3033J04708
37242a15994J75953P2717r418O6663J76223J44774K3695m021Q1737J26809P9571
37231H18709P2757J53190J33022j14252l60734k85195K9541J56575p0528l09730
37221B23355k15456P2169J82785O3177l6562j6679k9906j35948j76496p2842K5934
$$ plain form
37295 66632 226022 268961 146861 -35226 -115429 -34365 110865 188169 184491 187710 229595
37284 229595 242319 205466 230597 407330 645763 809227 969628 1357669 2002881 2562614
37274 2562614 2632159 2173270 1533824 1070896 857703 759227 667697 578164 499203 412805
37264 412805 342733 366934 493459 583024 496573 307379 247455 399765 558287 495804 286384
37253 286384 208031 348313 484268 407017 202312 85698 77088 16561 -137669 -220702 -115994
37242 -115994 59959 132676 123258 189921 366144 510918 534613 530592 612329 739138 818709
37231 818709 891466 1044656 1177678 1063426 702692 417497 447038 603613 533085 223355
37221 223355 7899 80068 262853 326030 289468 272789 242883 106935 -69561 -142403 -116469
37210a16469R908j1706O1403J23196O3092j3727L3756J18905N9516j11418j77538
37199C8918m7670J42606K24065J52181l220j09065n1961J16923J84250M2986j34441
37188E55572j45892o7844r5495j76551r8658R7141J31559m0003j23429J6926J07547
37177A60873o4486k48589j20406J64532K02120r765q8114Q2637J59982o9960l09563
37166a40739k02985J11636K18614L6282j14266j3177J78588K03597N5208p1630
37156B61128n3043M8568R3476K5871o2786l4328J07021J80091O0053j19576j37752
37145C68723j4747K2911q9910j56815o1979L1782j9953p6912K6410J45879N0955
37134B26344j44884j28881Q1292J34472p8774k31674q8832J25532J20296j018
$$ plain form
37210 -116469 -106561 -118267 -56864 66332 129424 115697 149453 268358 327874 216456 38918
37199 38918 -8752 133854 357919 510100 506880 397815 345854 462777 647027 690013 555572
37188 555572 409680 341836 246341 69790 -28868 68273 199832 159829 36400 53326 160873
37177 160873 96387 -152202 -272608 -108076 94044 84279 -3835 78802 238784 168824 -140739
37166 -140739 -343724 -232088 -13474 22808 -91458 -104635 73953 277550 332758 261128
37156 261128 208085 256653 350129 376000 313214 278886 385907 565998 626051 506475 368723
37145 368723 353976 376887 286977 130162 68183 99965 80012 3100 29510 175389 226344
37134 226344 81460 -47421 33871 168343 89569 -142105 -230937 -105405 14891 13873
37124A3873K3297J38474R0855j05054j83647q1898l1402j47059k24308o6080K10315
37113c62634L37396K29750L1509q0135n0971L6526O1522J1584P655J13911J91032
37102E27145Q0502j18048j50650J4418J30885M1834j11934j44558r0870q3485
37092I5239j17984r8433j8686M5076O1817N5100L6444J2341N234R485p080k2372
37080E6181J9207P3628K8154q0789o5334R3325J32045r8651l16297j61451K38591
37069h1391L86832J00550k34515j99910J17992L07390J89237j9560n7816N5772
37059E64581J10849J2846j06748q8151L9121J13963P9477M5780J02724J98878
37049A073320K72364L77294N70888P84561R51864J165993J502920J723724J401385
$$ plain form
37124 13873 37170 175644 266499 161445 -22202 -104100 -135502 -282561 -506869 -572949 -362634
37113 -362634 -25238 204512 236021 155886 104915 141441 202963 214547 222202 336113 527145
37102 527145 607647 489599 338949 353367 484252 526086 414152 269594 178724 95239
37092 95239 -22745 -121178 -139864 -94788 -32971 22129 58573 70914 76148 85633 78553 56181
37080 56181 75388 149016 177170 96381 31047 124372 256417 157766 -158531 -319982 -81391
37069 -81391 305441 405991 171476 -28434 89558 396948 586185 566625 508809 564581
37059 564581 675430 688276 581528 493377 532498 646461 725938 771718 874442 1073320
37049 1073320 1345684 1722978 2293866 3078427 4030291 5196284 6699204 8422928 9824313
37040I824313M35585p20634j464387j587121j341867j070882q90275p10043m47865
37031B026824j69273k7920q5154k19617k53760j56182o2025q7633j86677k21470
37021E57113j35091j0901K8449m7015j53499j96218j65357j04220j8860J03401
37011a42198J97580J61397K9606k1191P3881J38149R942j83684j94151k3463Q5721
37000A31589J6662q8623r9111p6172r4310p9800L0123J21686O8128m6487m7205
36989a63520M9884O2616o0616j49486o6661Q7319J14531j9160j62186j80167q7936
36978e75382K3669J09064J68721J79967J05567k3581j00266n4247O0883J31309
36968B5704J08750L7287k2460n3694p4508r7603r8688k7133J19555K36963K01297
$$ plain form
37040 9824313 10259898 9539264 8074877 6487756 5145889 4075007 3184732 2474689 2026824
37031 2026824 1857551 1829631 1744477 1524860 1271100 1114918 1052893 965260 778583 557113
37021 557113 422022 411121 439570 392555 239056 42838 -122519 -226739 -245599 -142198
37011 -142198 55382 216779 246385 225194 299075 437224 447166 263482 69331 45868 131589
37000 131589 148251 59628 -39483 -115655 -209965 -289765 -259642 -137956 -69828 -116315 -163520
36989 -163520 -113636 -51020 -111636 -261122 -327783 -240464 -125933 -145093 -307279 -487446 -575382
36978 -575382 -551713 -442649 -273928 -93961 11606 -11975 -112241 -166488 -105605 25704
36968 25704 134454 171741 149281 95587 21079 -76524 -175212 -202345 -82790 154173 355470
36957C55470M1291o1731j520J08473R7368l2943j39162j33924m3563P1732J37272
36946C98763O6247j15269k02641m4109J99414K24709Q317j64716j26443l5658
36936B08614o4648j17731m2084O8723K0084j36009j49122M6473K20638J77225
36926B32163J8402l3967L2131K7156j18158k06577n4767J84496J76016j11266
36916A45629k93324p9252K94928L63091M5335k96828l69378k22065j4836J77474
36906b49226K51713P9874k23006l05287m0599K53287K59148R0077L0698P0002
36896B16681N455j41374j60168l4022L9525p443m3875k1733m5986j27278j26091
36885d46309l435J05330J28592J48022J84851J25014m6388j48392o6553O4404
$$ plain form
36957 355470 396761 335030 333510 441983 539351 506408 367246 233322 189759 261491 398763
36946 398763 465010 349741 147100 102991 302405 527114 535431 370715 244272 208614
36936 208614 143966 26235 -15849 52874 72958 -63051 -212173 -165700 54938 232163
36926 232163 250565 216598 248729 275885 157727 -48850 -103617 80879 256895 145629
36916 145629 -147695 -226947 67981 431072 476407 179579 -189799 -411864 -426700 -249226
36906 -249226 2487 82361 -140645 -445932 -486531 -233244 25904 115981 146679 216681
36896 216681 222136 80762 -79406 -113428 -73903 -81346 -125221 -146954 -192940 -320218 -446309
36885 -446309 -449744 -344414 -215822 -67800 117051 242065 195677 47285 -19268 45136
36875D5136O9830j9036n3463J7612J28060J86105J09814j05344k86397k05263
36865a12946J03966L11977K00229n9881j81732j53728j51573j90543j25535M2557
36855c17209J17271Q752j13754n7990J35346K61577J97247P491j41143j28120
$$ plain form
36875 45136 114966 95930 42467 60079 188139 374244 484058 378714 92317 -112946
36865 -112946 -8980 302997 503226 443345 261613 107885 -43688 -234231 -359766 -317209
36855 -317209 -199938 -191186 -304940 -362930 -227584 33993 231240 238731 97588 -30532
$$ [...]
##END NTUPLES=NMR SPECTRUM
##END=
