##TITLE=31Pdec_PR90R_KSO
 DMSO-d6, 24 sc
 5.6.2019
##JCAMPDX= 6.0         $$ Bruker NMR JCAMP-DX V2.0
##DATA TYPE= NMR SPECTRUM
##DATA CLASS= NTUPLES
##ORIGIN= UXNMR, Bruker Analytische Messtechnik GmbH
##OWNER= root
$$ XWIN-NMR		Version 3.5
$$ Wed Jun  5 16:00:05 2019 Russian Standard Time (UT+4h)  she@DPX200
##.OBSERVE FREQUENCY= 81.013821
##.OBSERVE NUCLEUS= ^31P
##.ACQUISITION MODE= SIMULTANEOUS
##.ACQUISITION SCHEME= undefined
##.AVERAGES= 24
##.DIGITISER RES= 17
##SPECTROMETER/DATA SYSTEM= spect
##.PULSE SEQUENCE= zgpg30
##.SOLVENT NAME= DMSO
##.SHIFT REFERENCE= (INTERNAL, DMSO, 0, 182.463)
##AUDIT TRAIL= $$ (NUMBER, WHEN, WHO, WHERE, WHAT)
$$ ##TITLE= Audit trail, XWIN-NMR		Version 3.5
$$ ##JCAMPDX= 5.01
$$ ##ORIGIN= Bruker BioSpin GmbH
$$ ##OWNER= she
$$ F:/spectra/data/she/nmr/P31/1/pdata/1/auditp.txt
$$ ##AUDIT TRAIL=  $$ (NUMBER, WHEN, WHO, WHERE, WHAT)
(   1,<2019-06-05 15:59:13.23 +0400>,<she>,<DPX200>,
      <created by zg, POWCHK disabled, PULCHK disabled
       configuration hash MD5:
       00 E9 B6 7A A2 85 ED C7 34 08 36 98 17 FE 4E 26
       data hash MD5: 32K
       E1 68 3F 5D E4 CF 83 9C F2 FE 36 84 BF 64 E0 7B>)
(   2,<2019-06-05 15:59:15.62 +0400>,<she>,<DPX200>,
      <Start of raw data processing
       efp BC_mod = 2 LB = 1 FT_mod = 6 PKNL = 1 PHC0 = -2183.141 PHC1 = 37.39912 SI = 64K 
       data hash MD5: 64K
       D3 34 A5 41 9E 98 6C F2 3E D6 7E 31 DC 91 41 38>)
(   3,<2019-06-05 15:59:29.50 +0400>,<she>,<DPX200>,
      <pk PHC0 = 3.365492 PHC1 = 0 
       data hash MD5: 64K
       30 23 22 4C 96 12 80 A1 57 81 17 61 99 FB 09 D7>)
(   4,<2019-06-05 15:59:32.57 +0400>,<she>,<DPX200>,
      <abs ABSG = 5 
       data hash MD5: 64K
       D6 29 0C 06 91 76 01 76 66 5D 47 67 38 71 74 39>)
$$ ##END=
$$ 
$$ hash MD5
$$ 7C D7 5C 44 33 8C 42 DB 44 DE 5F 28 82 62 D9 B4
##$RELAX= 
##$RELAX= 
##$RELAX= 
##$RELAX= 
##$RELAX= 
##$RELAX= 
##$RELAX= 
##$RELAX= 
$$ Bruker specific parameters
$$ --------------------------
##$DU= <F:/spectra>
##$EXPNO= 1
##$NAME= <P31>
##$PROCNO= 1
##$TYPE= <nmr>
##$USER= <she>
##$AMP= (0..31)
100 100 100 100 100 100 100 100 100 100 100 100 100 100 100 100 100 100 
100 100 100 100 100 100 100 100 100 100 100 100 100 100 
##$AQSEQ= 0
##$AQ_mod= 1
##$AUNM= <au_zg>
##$AUTOPOS= <>
##$BF1= 81.014009
##$BF2= 200.13
##$BF3= 200.13
##$BF4= 200.13
##$BF5= 200.13
##$BF6= 200.13
##$BF7= 200.13
##$BF8= 200.13
##$BYTORDA= 1
##$CFDGTYP= 0
##$CFRGTYP= 5
##$CHEMSTR= <none>
##$CNST= (0..31)
1 1 145 1 1 1 1 1 1 1 1 1 1 1 1 1 1 1 1 1 1 1 1 1 1 1 1 1 1 1 1 1 
##$CPDPRG= <waltz16>
##$CPDPRG1= <>
##$CPDPRG2= <waltz16>
##$CPDPRG3= <>
##$CPDPRG4= <mlev>
##$CPDPRG5= <mlev>
##$CPDPRG6= <mlev>
##$CPDPRG7= <mlev>
##$CPDPRG8= <mlev>
##$CPDPRGB= <>
##$CPDPRGT= <>
##$D= (0..31)
0 1 0 0 0 0 0 0 0 0 0 0.03 2e-05 3e-06 0 0 0 0 0 0 0 0 0 0 0 0 0 0 0 0 
0 0 
##$DATE= 1559735952
##$DBL= (0..7)
120 120 120 11 120 120 24 19 
##$DBP= (0..7)
150 150 150 150 150 150 150 150 
##$DBP07= 0
##$DBPNAM0= <>
##$DBPNAM1= <>
##$DBPNAM2= <>
$$ [...]
##$SUBNAM3= <"">
##$SUBNAM4= <"">
##$SUBNAM5= <"">
##$SUBNAM6= <"">
##$SUBNAM7= <"">
##$SUBNAM8= <"">
##$SUBNAM9= <"">
##$SW= 369.568048894756
##$SWIBOX= (0..15)
0 1 3 0 0 0 0 0 0 0 0 0 0 0 0 0 
##$SW_h= 29940.119760479
##$TD= 32768
##$TD0= 1
##$TE= 0
##$TE2= 300
##$TE3= 300
##$TEG= 300
##$TL= (0..7)
0 120 53 12 22 120 120 120 
##$TP= (0..7)
150 150 150 150 150 150 150 150 
##$TP07= 0
##$TPNAME0= <>
##$TPNAME1= <>
##$TPNAME2= <>
##$TPNAME3= <>
##$TPNAME4= <>
##$TPNAME5= <>
##$TPNAME6= <>
##$TPNAME7= <>
##$TPOAL= (0..7)
0.5 0.5 0.5 0.5 0.5 0.5 0.5 0.5 
##$TPOFFS= (0..7)
0 0 0 0 0 0 0 0 
##$TUNHIN= 0
##$TUNHOUT= 0
##$TUNXOUT= 0
##$USERA1= <user>
##$USERA2= <user>
##$USERA3= <user>
##$USERA4= <user>
##$USERA5= <user>
##$V9= 5
##$VALIST= <valist>
##$VCLIST= <CCCCCCCCCCCCCCC>
##$VD= 0
##$VDLIST= <DDDDDDDDDDDDDDD>
##$VPLIST= <PPPPPPPPPPPPPPP>
##$VTLIST= <TTTTTTTTTTTTTTT>
##$WBST= 1024
##$WBSW= 4
##$XGAIN= (0..3)
0 0 0 0 
##$XL= 0
##$YL= 0
##$YMAX_a= 23092
##$YMIN_a= -27753
##$ZGOPTNS= <>
##$ZL1= 120
##$ZL2= 120
##$ZL3= 120
##$ZL4= 120
##$ABSF1= 182.463
##$ABSF2= -187.1042
##$ABSG= 5
##$ABSL= 3
##$ALPHA= 0
##$AQORDER= 0
##$ASSFAC= 0
##$ASSFACI= 0
##$ASSFACX= 0
##$ASSWID= 0
##$AUNMP= <proc_1d>
##$AZFE= 0.1
##$AZFW= 0.5
##$BCFW= 0
##$BC_mod= 2
##$BYTORDP= 0
##$COROFFS= 0
##$CY= -3
##$DATMOD= 1
##$DC= 0
##$DFILT= <>
##$DTYPP= 0
##$F1P= 0
##$F2P= 0
##$FCOR= 1
##$FTSIZE= 65536
##$FT_mod= 6
##$GAMMA= 0
##$GB= 0
##$INTBC= 1
##$INTSCL= 5.30512e-09
##$ISEN= 30
##$LB= 1
##$LEV0= 0
##$LPBIN= 0
##$MAXI= 10000
##$MC2= 0
##$MEAN= 0
##$ME_mod= 0
##$MI= 50
##$NCOEF= 0
##$NC_proc= -4
##$NLEV= 6
##$NOISF1= 182.463
##$NOISF2= 159.3651
##$NSP= 0
##$NTH_PI= 0
##$NZP= 0
##$OFFSET= 182.463
##$PC= 4
##$PHC0= -2179.776
##$PHC1= 37.39912
##$PH_mod= 1
##$PKNL= yes
##$PPARMOD= 0
##$PSCAL= 0
##$PSIGN= 0
##$REVERSE= no
##$SF= 81.0140089999434
##$SI= 65536
##$SIGF1= 159.3651
##$SIGF2= -187.1042
##$SINO= 113.3802
##$SIOLD= 16384
##$SREGLST= <1H.CDCl3>
##$SSB= 0
##$STSI= 65536
##$STSR= 0
##$SW_p= 29940.119760479
##$SYMM= 0
##$S_DEV= 0
##$TDeff= 32768
##$TDoff= 0
##$TI= <>
##$TILT= no
##$TM1= 0
##$TM2= 0
##$TOPLEV= 0
##$USERP1= <user>
##$USERP2= <user>
##$USERP3= <user>
##$USERP4= <user>
##$USERP5= <user>
##$WDW= 1
##$XDIM= 65536
##$YMAX_p= 426346645
##$YMIN_p= -3558581
$$ End of Bruker specific parameters
$$ ---------------------------------
##NTUPLES= NMR SPECTRUM
##VAR_NAME=  FREQUENCY,     SPECTRUM/REAL,   SPECTRUM/IMAG
##SYMBOL=    X,             R,               I
##VAR_TYPE=  INDEPENDENT,   DEPENDENT,       DEPENDENT
##VAR_FORM=  AFFN,          ASDF,            ASDF
##VAR_DIM=   65536,         65536,           65536
##UNITS=     HZ,            ARBITRARY UNITS, ARBITRARY UNITS
##FACTOR=    0.456856943014862, 1,           1
##FIRST=     14782.0589164792, 0,            0
##LAST=      -15158.0608439998, 0,           0
##MIN=       -15158.0608439998, -3558581,    0
##MAX=       14782.0589164792, 426346645,    0
$$ Real data points
##PAGE= N=1
##DATA TABLE= (X++(R..R)), XYDATA
$$ [...]
41252C51985m83238k25870R560n1948k23594k21620L686L56311O52241N96375
$$ 351985 -131253 -357123 -347563 -399511 -623105 -844725 -841039 -484728 167513 763888
41242G63888J26209k42444N0463O76516O55882k52189j041156p60743K00475O87845
$$ 763888 890097 647653 698116 1374632 2030514 1778325 737169 -23574 176901 864746
41232H64746K80091l77851n65038k44451J59519L01989J47191p8334j04458P6107
$$ 864746 1144837 766986 201948 -42503 117016 419005 566196 487862 383404 459511
41222D59511J80006L3884j51993r7901J24672K28482J36328J6722j9717k8759
$$ 459511 639517 673401 521408 423507 548179 776661 912989 929711 909994 881235
41212H81235r2596k40992m37442n30701l64142l5948J70361K32493M43533Q16759
$$ 881235 788639 547647 110205 -420496 -784638 -820586 -650225 -417732 25801 842560
41202H42560Q40682K07024n71854p73500m34915j59440j52510q9944J27328J79918
$$ 842560 1683242 1890266 1318412 544912 109997 -49443 -201953 -291897 -164569 15349
41192A5349j2476q6449R1285J21934k31612n40226l19431K04553M04734J41404
$$ 15349 2873 -83576 7709 129643 -101969 -642195 -961626 -757073 -352339 -210935
41182b10935j03865N1070L96453M53268P7238l96375n56973l62841j13738j5081
$$ -210935 -314800 -263730 132723 585991 663229 266854 -290119 -652960 -766698 -781779
41172g81779N8446K62164M36727L16322j5216j77820q233K48054K95141R7821
$$ -781779 -723333 -461169 -24442 291880 276664 98844 90611 338665 633806 731627
41162G31627k05491m63621n28184l32727l3668J14080P7620O5770J98748L54394
$$ 731627 526136 62515 -465669 -798396 -832064 -717984 -640364 -574594 -375846 -21452
41152b1452L84194K91812J49266L451r8776j32054j36832j28425m6543O5185M535
$$ -21452 362742 654554 803820 807271 708495 576441 439609 311184 264641 329826 334361
41141C34361k36025k88149O7545M19346K52395k03422k50829K00252M97477K68408
$$ 334361 98336 -189813 -122268 297078 549473 346051 95222 295474 792951 1061359
41131A061359r2765j68443j09807j75501k48056j80937j34812j92649j04316K05738
$$ 1061359 968594 800151 690344 514843 266787 85850 -48962 -241611 -345927 -140189
41121a40189L54384J49119K9477L38050O14632K68687l93444n55091j33876J07066
$$ -140189 214195 363314 392791 730841 1345473 1614160 1220716 665625 531749 638815
41111F38815k76486p82960o97268l960O61399P32642K33401l13654m53512k74764
$$ 638815 362329 -420631 -1117899 -1121859 -460460 272182 505583 191929 -261583 -536347
41101e36347j84266k37448o9265L88583O29342L46432o628P0026K89721J00402
$$ -536347 -720613 -958061 -1027326 -638743 -9401 337031 330403 400429 690150 790552
41091G90552l10065l03328R5607K04559j83756m76232k64326P8288Q5773j02922
$$ 790552 480487 177159 272766 477325 293569 -182663 -446989 -368701 -282928 -385850
41081c85850j21681o122k2847j47519j05557J76739M33404L58826n3012m43399
$$ -385850 -507531 -513653 -536500 -684019 -789576 -612837 -179433 179393 126381 -317018
41071c17018l96183Q5488N00175M20585K8402j62879J400K11881K02695L1948
$$ -317018 -713201 -627713 -127538 293047 321449 158570 159970 371851 574546 606494
41061F06494j20464j40818O984K03382J85313j02597l04027j06697K57639L27936
$$ 606494 486030 345212 352196 555578 740891 638294 334267 227570 485209 813145
41051H13145O6918j90875k68859k00954M2678L93680M60863K4319m55750m42306
$$ 813145 880063 689188 420329 219375 262053 655733 1116596 1140915 685165 242859
41041B42859j95197k99445n56235k85970L59990M75250r3293m26221m4267L43994
$$ 242859 47662 -251783 -808018 -1093988 -733998 -258748 -352041 -778262 -822529 -478535
41031d78535J18413k33901o1488L37366L23526k1472k11500k04851k28721k18049
$$ -478535 -360122 -594023 -655511 -318145 5381 -16091 -227591 -432442 -661163 -879212
41021h79212p3336k4572j42802M664N87615R49706N25803j91321l73691p3758
$$ -879212 -952548 -977120 -1119922 -1115258 -527643 422063 947866 756545 382854 309096
41011C09096J02000Q7333K17304L54954J16997k67617k63190o620m7522k70044
$$ 309096 411096 498429 715733 1070687 1187684 920067 656877 650257 602735 332691
41001C32691p3664M30119M43460j97546p11762n89495k25025p4045j6571J16360
$$ 332691 259027 689146 1132606 935060 223298 -366197 -591222 -665267 -681838 -565478
40991e65478J36142j6267k3073K24120L63151J82871m3149r9733j42315k19486
$$ -565478 -429336 -445603 -468676 -244556 118595 301466 258317 158584 16269 -203217
40981b03217p9487K60055L42024p44l06926k23837l9211j03203k40116j48682
$$ -203217 -282704 -22649 319375 318631 11705 -212132 -251343 -354546 -594662 -743344
40971g43344P3621K14028L28373M54393L59616k5947l16804k07670N9761J30735
$$ -743344 -669723 -455695 -127322 327071 686687 660740 343936 136266 196027 326762
40961C26762O1372M4569R255j11910j05221J17470K17999k6775k67598j41339
$$ 326762 388134 432703 441958 330048 224827 342297 560296 533521 265923 124584
40951A24584Q8227j8377l09606l02716L2132L07299L49178K74688J19266j05143
$$ 124584 212811 194434 -115172 -417888 -385756 -78457 270721 545409 664675 559532
40941E59532j71280K8228J13918k46618o41652m11059K85246O19932L21838M605
$$ 559532 388252 416480 530398 283780 -357872 -768931 -483685 136247 458085 462690
40931D62690J22071L02702M8840m61015o81214m52041q2885Q5167o0074l79612
$$ 462690 584761 887463 936303 475288 -205926 -657967 -740852 -655685 -715759 -1095371
40921a095371n35069k70763K12056M05085J59154q4423P2785M10294M35762R5085
$$ -1095371 -1630440 -1901203 -1689147 -1284062 -1124908 -1209331 -1136546 -726252 -290490 -195405
40911a95405k05778j89697J1359J64982K36956K88367K82584J46596o9028k23766
$$ -195405 -401183 -590880 -579521 -414539 -177583 110784 393368 539964 470936 247170
40901B47170k48458j73525k3236J89250L42774K42187j16493m29326l91863o4188
$$ 247170 -1288 -174813 -198049 -8799 333975 576162 459669 30343 -361520 -425708
40891d25708K20554K51364Q2620j31431k31286p1034K77848M18103P6849l81935
$$ -425708 -205154 46210 128830 -2601 -233887 -304921 -27073 391030 467879 85944
40881H5944l42904J35453L20444j09837n61345m27739M7334K75104K16301J92999
$$ 85944 -256960 -121507 198937 89100 -472245 -899984 -852650 -577546 -361245 -168246
40871a68246J70808j05699m67358m72687j26581J49122K20474L36941N28307M95999
$$ -168246 2562 -103137 -570495 -1043182 -1169763 -1020641 -800167 -463226 65081 561080
40861E61080J83621q3876j42161j74706k52890j89751J2602O8584o9714q7318
$$ 561080 744701 660825 518664 343958 91068 -98683 -86081 -17497 -87211 -174529
40851a74529J05499J64704o2507k14161l7702J49395K7019j41106K1472L03762
$$ -174529 -69030 95674 33167 -180994 -218696 -69301 -42282 -183388 -161916 141846
40841A41846K38218j02098k16527K1119K26382J60989J4378m1388j10013k38784
$$ 141846 380064 277966 61439 82558 308940 469929 484307 442919 332906 94122
40831I4122k39720n2160O2012n9757j57569L6699K91084J75381k35953m03434
$$ 94122 -145598 -197758 -135746 -195503 -353072 -316373 -25289 150092 -85861 -489295
40821d89295j09021K27517K08211M3417J36421L71182K90260j32486m10874k81806
$$ -489295 -598316 -370799 -162588 -119171 17250 388432 678692 546206 135332 -146474
40811a46474l6787K9137L5633J35145J41327j04378l37147k49361j0228J4025
$$ -146474 -183261 -154124 -118491 16654 157981 53603 -283544 -532905 -543133 -529108
40801e29108j47277j88653p5196j9600k5724R1406K89395L32101K09627J32030
$$ -529108 -676385 -865038 -940234 -959834 -985558 -894152 -604757 -272656 -63029 69001
40791F9001J42210J11740N7694P8718P2786o6988j19147J08307K52355j43191
$$ 69001 211211 322951 380645 459363 532149 465161 346014 454321 706676 563485
40781E63485p41112p29690n8545M32840K85732K4690J85686M94432M50819J01482
$$ 563485 -177627 -907317 -965862 -533022 -247290 -222600 -36914 457518 908337 1009819
40771A009819k37794m90745o13410m04482L9415K11306j1448l4446M66127Q33321
$$ 1009819 772025 281280 -332130 -736612 -697197 -485891 -497339 -531785 -65658 767663
40761G67663L95545l84261n44316m7440K84344O0530k71611k55464N0534L77645
$$ 767663 1163208 778947 234631 187191 471535 532065 260454 4990 55524 433169
40751D33169M87816J61604m91623q16873l25558M65551N80853o2752n68522l79734
$$ 433169 920985 1082589 590966 -225907 -551465 -85914 494939 432187 -136335 -516069
40741e16069N3181J21432j07592k28450j37409J7308J41556J68368L7398j03515
$$ -516069 -462888 -341456 -449048 -677498 -814907 -797599 -656043 -487675 -450277 -553792
40731e53792K629K69709K77406r4068m09683k79816J18567L60817L26802J86723
$$ -553792 -551163 -281454 -4048 -98116 -507799 -787615 -669048 -308231 18571 205294
40721B05294P1514L886o104N222n2562j70411k09104j17051l8616j09806k50624
$$ 205294 276808 280694 274590 279812 227250 56839 -152265 -269316 -307932 -417738 -668362
40710f68362k32522Q4382N50978P43776L48062l74171p45047m81584m5798O8335
$$ -668362 -900884 -816502 -265524 478252 826314 452143 -292904 -774488 -820286 -751951
40700g51951M374R1183J55901q6687l12202m1256M07696L11917k00278k73189
$$ -751951 -747577 -656394 -500493 -587180 -899382 -940638 -532942 -221025 -421303 -694492
40690f94492K21201M05061j26523n80839k56396L46175M00859K7743q7084J69284
$$ -694492 -473291 -68230 -194753 -775592 -1031988 -685813 -284954 -257211 -344295 -175011
40680a75011L31313J55636j95640m93413m85756K8313P15875P78264M1177n49432
$$ -175011 156302 311938 116298 -377115 -862871 -834558 -118683 659581 700758 151326
40670A51326j91155N30656M95705k64563p03391l70720J15565K07068Q6358K5326
$$ 151326 -39829 490827 986532 721969 18578 -352142 -236577 -29509 56849 82175
40660H2175q3330k67741k31199J05769L47983K12027o0102j25707j329J19664
$$ 82175 -1155 -268896 -500095 -394326 -46343 165684 105582 -20125 -21454 98210
40650I8210J71352J45724J1277j48094j63540l4033Q8666J64524K34290J89904
$$ 98210 269562 415286 426563 278469 114929 80896 169562 334086 568376 758280
40640G58280n9670k65607j23874J64486J21895k21658l32242k2947K83553K72127
$$ 758280 698610 433003 309129 473615 595510 373852 41610 18663 302216 574343
40630E74343J15979m6619l80794p98004p56470p0153N89678N16037q6661m72914
$$ 574343 690322 643703 262909 -535095 -1291565 -1361718 -772040 -256003 -342664 -815578
40620h15578l61925p2501J08546J88018K21296K24827K55551K76886R4217k93105
$$ -815578 -1177503 -1250004 -1141458 -953440 -732144 -507317 -251766 25120 119337 -173768
40610a73768m96298k39398J62262K22783j0126j13577P125P1841K120J7632J34273
$$ -173768 -670066 -909464 -747202 -524419 -534545 -648122 -640997 -569156 -567036 -549404 -415131
40599d15131P9908j68629k39866K7298K44500M7405k95864k32321K58893N82184
$$ -415131 -335223 -503852 -743718 -716420 -471920 -424515 -720379 -952700 -693807 -111623
40589a11623L03319k76083m93295j32894L62520M95710K96084J30425J05504j8545
$$ -111623 191696 -84387 -577682 -710576 -348056 147654 443738 574163 679667 661122
40579F61122l21452m86509k46656J92372M12686L04427R9292N534K6776O5305
$$ 661122 339670 -146839 -393495 -201123 211563 515990 615282 620816 647592 712897
40569G12897K7828j03937j93728o9958J76491K29288K9412o5744J46203L00542
$$ 712897 740725 636788 443060 373102 549593 778881 808293 742549 888752 1189294
40559A189294J5162m13645l80835R7943L85148J47340k51211l71865k32033o0757
$$ 1189294 1204456 790811 409976 507919 893067 1040407 789196 417331 185298 124541
40549A24541M5483M4320r5668j95667j919L23094K69130k45513o08050l31535
$$ 124541 170024 214344 118676 -76991 -78910 244184 513314 267801 -340249 -671784
40539f71784K54816M99116K66475j03700l62675m41629k49392J48969L65904J71965
$$ -671784 -416968 82148 348623 244923 -117752 -559381 -808773 -659804 -293900 -121935
40529a21935o1668R9138L85173K07796l26008m96519r2507K83182K02116p956
$$ -121935 -183603 -84465 300708 508504 182496 -314023 -406530 -123348 78768 70812
40519G0812J4837L2769k23522m04471o7989N00702O24368K06097j97918j91667
$$ 70812 85649 118418 -105104 -509575 -577564 -76862 547506 753603 555685 364018
40509C64018P0381K69874K60421K5031l12026m41745j98129J13791R4709j22143
$$ 364018 434399 704273 964694 989725 677699 235954 37825 151616 246325 124182
40499A24182q6339J73050J44835k75535n05644j52467L68418M65781J83726m7679
$$ 124182 37843 210893 355728 80193 -425451 -577918 -209500 256281 440007 392328
40489C92328r7834q7738L6246L25884M32690m420o39327p05148r9006M00949K08603
$$ 392328 294494 206756 243002 568886 1001576 997156 357829 -347319 -446325 -45376 163227
40478A63227l04062m48129j94056l8009j43821j54081J53891M83445M55521J29889
$$ 163227 -140835 -588964 -783020 -821029 -964850 -1118931 -965040 -481595 -26074 103815
40468A03815j35457j77684j43267j69840j86846q2533J03310K55275L35139L45488
$$ 103815 -31642 -209326 -352593 -522433 -709279 -791812 -688502 -433227 -98088 247400
40458B47400K40070J7300j68743j68198o8695p5186j73320j41601P2122K37979
$$ 247400 487470 504770 336027 167829 99134 23948 -149372 -290973 -218851 19128
40448A9128J98834R9520J25505K18563K04191K7664k61596n67919o85385m29792
$$ 19128 217962 317482 442987 661550 865741 893405 631809 63890 -621495 -1051287
40438a051287K6168K46647J36919R4914L14575L81310k0256m25611k21112L49793
$$ -1051287 -1025119 -778472 -641553 -546639 -232064 149246 128990 -296621 -517733 -167940
40428a67940N15140J42230j71733j30046p7564k23536k92657j59311j07531j84019
$$ -167940 347200 489430 317697 187651 110087 -113449 -406106 -565417 -672948 -856967
40418h56967j708M63360N95499J24215k98422r0494L12993K15281j68890j33521
$$ -856967 -858675 -395315 200184 324399 25977 -64517 248476 463757 294867 161346
40408A61346K83178L87928N494l09309k43888j13625j48231j15960J01746J77036
$$ 161346 444524 832452 837946 528637 284749 171124 22893 -93067 8679 185715
40398A85715r9180l86530k73212J35210M05354L42275J30157K9104P5232M1280
$$ 185715 86535 -299995 -573207 -437997 -32643 309632 439789 468893 544125 585405
40388E85405k77566o74228o29632k3326N18308L78799j66286l42094N251L06123
$$ 585405 307839 -366389 -996021 -1019347 -501039 -122240 -288526 -630620 -625369 -319246
40378c19246K41890J25522J95169K12227J7124j15273P597J36110M3740j21796
$$ -319246 -77356 48166 243335 455562 472686 357413 365010 501120 544860 423064
40368D23064k27638l86950n19792k67079K94438M86436O2574k48475J26070N75415
$$ 423064 195426 -191524 -711316 -978395 -683957 -197521 -134947 -383422 -257352 318063
40358C18063K68321l85253l17218M24004O76270j6o43339m14279J93291K59788
$$ 318063 586384 201131 -116087 307917 984187 984171 340832 -73447 119844 379632
40348C79632j80667l83646p4381L04706L39539R5700j34733j82851r9467p0815
$$ 379632 198965 -184681 -259062 45644 385183 480883 346150 163299 63832 -6983
40338f983j80020k31742k3877K32297J50840j42977j08399K71425L06825k74748
$$ -6983 -187003 -418745 -442622 -210325 -59485 -202462 -310861 -39436 267389 -7359
40328g359p16811l58063K55732K24854k19631j33891M80742O33881L2404m06804
$$ -7359 -724170 -1082233 -826501 -601647 -821278 -955169 -474427 159454 191858 -214946
40318b14946j16078J99142j26839m89812n6734P09822P08291m2652m78061j78221
$$ -214946 -331024 -131882 -258721 -748533 -805267 -95445 612846 570194 92133 -86088
40308h6088J55244N995k46332k19760j78203l32066l08750J23322M88650L70794
$$ -86088 69156 75151 -171181 -390941 -569144 -901210 -1209960 -1086638 -597988 -227194
40298b27194J46245K84570M50338Q7190n07816n71268j08146J61237K2256J8407
$$ -227194 -80949 203621 653959 741149 233333 -337935 -446081 -284844 -262588 -244181
40288b44181L64127M95907N0297m57052m09890J4144K43646J80629J29371J57662
$$ -244181 119946 615853 666150 209098 -200792 -186648 56998 237627 366998 524660
40278E24660P5877r7217j36876l4488j7579j49105k38567j77499q3755o4067o1254
$$ 524660 600537 503320 366444 331956 314377 165272 -73295 -250794 -334549 -398616 -459870
40267d59870l677O2813O1081l750n9057l5851P3744J92486K26163J76313J10204
$$ -459870 -463547 -400734 -339653 -343403 -402460 -438311 -364567 -172081 54082 230395 340599
40256C40599J1923j90926m04743l70536k6499K92583K13982k01014n18892m16592
$$ 340599 352522 161596 -243147 -613683 -640182 -347599 -133617 -334631 -853523 -1270115
40246a270115L6669N14714O96434M39627j23582o21917o91508k82908K62264M75693
$$ -1270115 -1233446 -718732 -22298 417329 293747 -328170 -1019678 -1302586 -1040322 -564629
40236e64629J89203k51249k98149J65134O29410N70844J03733k58148l39342l69614
$$ -564629 -375426 -626675 -924824 -759690 -130280 440564 544297 286149 -53193 -422807
40226d22807l77785q7377M49969O90785L75917j9324k777J92091N0675l76656
$$ -422807 -800592 -887969 -438000 252785 628702 609378 606601 798692 849367 472711
40216D72711n96310m15515p0898K15996L54429K27856j12915k65681L1533L88864
$$ 472711 -123599 -539114 -610012 -394016 -39587 188269 75354 -190327 -158794 230070
40206B30070K62946j92158l53358q7081J60685J68289J36575P4694k54094o42609
$$ 230070 493016 300858 -52500 -139581 21104 189393 325968 400662 146568 -496041
40196d96041m76549K61396P54620M94676k0360j74670j44891l28450m67741j16400
$$ -496041 -972590 -711194 43426 538102 517742 343072 198181 -130269 -598010 -714410
40186g14410M17522M22713j00809m52814l15730r8787j17612j13054J64024M38245
$$ -714410 -296888 125825 25016 -427798 -743528 -842315 -959927 -1072981 -908957 -470712
40176d70712L43438J6932j11274O4336K43460J91448K9109J829J18405J51298
$$ -470712 -127274 -110342 -221616 -157280 86180 277628 306737 308566 426971 578269
40166E78269j4678j75012q4082J36119J17405j81905l30849m6452L14940K22136
$$ 578269 563591 388579 304497 440616 558021 376116 45267 -1185 313755 535891
40156E35891k33732m16055k5686M72914M63748m5877m87277m41742o2131K22708
$$ 535891 302159 -113896 -139582 333332 797080 751203 263926 -177816 -239947 -17239
40146a7239K41259J81370K19527K52833J15705r0264j18576J6052K6469k02721
$$ -17239 224020 405390 624917 877750 993455 903191 784615 800667 827136 624415
40136F24415m21457l76775j35426R4793K40468K90601J74058o7042j67173M0169
$$ 624415 202958 -173817 -309243 -214450 26018 316619 490677 423635 256462 296631
40126B96631L15171K82930o4344l67558l57859j15735R7923J12011l0260j21302
$$ 296631 611802 894732 830388 462830 104971 -10764 87159 199170 168910 47608
40116D7608k8975O9654j31731n65518p16717k58408M51992P69990N02262J24l30821
$$ 47608 18633 88287 -43444 -608962 -1325679 -1584087 -1132095 -362105 140157 140281 -190540
40105a90540l44622j12619J45017J72980l0176j48283j318J20540j06560m45106
$$ -190540 -535162 -647781 -502764 -329784 -359960 -508243 -509561 -389021 -495581 -940687
40095i40687l61296J75382N92558M75734O7447j21708N3657K72881J60460k75387
$$ -940687 -1301983 -1126601 -534043 -58309 9138 -112570 -58913 213968 374428 99041
40085I9041o02294m41530J6857K23492N8094O184L22665N06906P5139n61093o17806
$$ 99041 -503253 -944783 -927926 -704434 -646340 -640156 -317491 189415 264554 -296539 -914345
40074i14345o9600M13998M84828L69748K22762l4643k52559j73607k9257k54956
$$ -914345 -983945 -569947 -85119 284629 507391 472748 220189 46582 17325 -237631
40064b37631n88241l23979M07385N97077q1707o53484l13481L77515M71137M1349
$$ -237631 -825872 -1149851 -742466 -145389 -227096 -880580 -1194061 -816546 -345409 -304060
40054c04060j99372r9112j4990J6358K07126L93264K57598j7653j5584J78326
$$ -304060 -503432 -602544 -617534 -601176 -394050 -786 256812 239159 223575 401901
40044D01901J57178o5931j39618l7399j2880m3784O9210K12408J74398J44846
$$ 401901 559079 493148 353530 316131 303251 259467 328677 541085 715483 860329
40034H60329L47721M28898j7936n41181l60791L06530M59632j14189n35996l06357
$$ 860329 1208050 1636948 1619012 1077831 717040 1023570 1483202 1369013 833017 526660
40024E26660m334j16012j94113J99573N89599L71656j73429m10087l49703l71111
$$ 526660 522326 406314 212201 411774 1001373 1373029 1199600 789513 439810 68699
40014F8699m05246j83398N8243q0078l61059k29478K26139L94288J43294n4690
$$ 68699 -336547 -519945 -461702 -541780 -902839 -1132317 -906178 -511890 -368596 -423286
40004d23286j0261o3843l07905k93823J82657O10460M83414M3412j35890K937
$$ -423286 -433547 -497390 -805295 -1099118 -916461 -306001 177413 220825 84935 87872
39994H7872L2491k27082m41337k61301K05058N40358M96717K10385k6047r3906
$$ 87872 120363 -106719 -548056 -809357 -604299 -63941 432776 643161 617114 523208
39984E23208p1069J4229K57305O23349Q16006O01489J48503j78790k85099l53537
$$ 523208 452139 466368 723673 1347022 2163028 2764517 2913020 2734230 2449131 2095594
39974B095594m52169m37826k76711j51441j42707p8804J37167K89234J57887j06120
$$ 2095594 1643425 1205599 928888 777447 634740 555936 693103 982337 1140224 1034104
39964A034104j79623n2010l4533k67761m76900l50515Q731K15796J25871o863
$$ 1034104 854481 802471 767938 500177 23277 -327238 -318507 -102711 23160 16297
39954A6297M5289J24316m3805l59526m33132j56355J29602J50370P3027J45132
$$ 16297 61586 185902 142097 -217429 -650561 -806916 -677314 -526944 -453917 -308785
39944c08785K34906O7618k51999l43948j21570J20172J88226J90956K03568J25791
$$ -308785 -73879 -6261 -258260 -602208 -723778 -603606 -415380 -224424 -20856 104935
39934A04935K871R7729M18738N29828J43668l80088m97641k28046k0008r844J01533
$$ 104935 107806 205535 624273 1154101 1297769 917681 420040 191994 171986 162142 263675
39923B63675M16179N61835K35022l19488o11736m73373j12436K22178M06747L83761
$$ 263675 679854 1241689 1476711 1157223 545487 72114 -40322 181856 588603 972364
39913I72364J63204j24532l04951k91508j12232J11597J81869l1873l77025m98507
$$ 972364 1135568 1011036 706085 414577 302345 413942 595811 563938 186913 -311594
39903c11594k48941J31695L59270M24594M00398J89027k21852m60997j76413L34356
$$ -311594 -560535 -428840 -69570 355024 755422 944449 722597 261600 85187 419543
39893D19543L84262j45104n80884l84192J32229L08946J6534l41438m57730l52497
$$ 419543 803805 658701 77817 -306375 -174146 134800 151334 -190104 -647834 -1000331
39883a000331j13967J94925M06502L61255J60962M1492P132j31143l55037l84733
$$ -1000331 -1114298 -919373 -512871 -151616 9346 50838 57970 -73173 -428210 -812943
39873h12943j02173K34719L21942J60322l5572j21679j05690n6231k5131k12R1341
$$ -812943 -915116 -680397 -358455 -198133 -233705 -355384 -461074 -517305 -542436 -542648 -451307
39862d51307K63560L76576K73122l779k44549l02150j78692N0674K47996K25112
$$ -451307 -187747 188829 461951 458172 213623 -88527 -267219 -216545 31451 256563
39852B56563m8908l05467k65297k5108R3366L6281M7249J94479K26118J4509j78476
$$ 256563 207655 -97812 -363109 -388217 -294851 -258570 -211321 -16842 209276 223785 45309
39841D5309q0182J79973K53843L8249k16997k05920J02666L83008K43961k78374
$$ 45309 -34873 145100 398943 437192 220195 14275 116941 499949 743910 465536
39831D65536o35367m05475J10130K80925L4365j24515L0338J44408j3857j33881
$$ 465536 -169831 -575306 -465176 -184251 -149886 -274401 -244063 -99655 -113512 -247393
39821b47393M4999K36935J11840j25086j06708P8145J04470j7762n4434j7018
$$ -247393 -202394 34541 146381 21295 -85413 -7268 97202 79440 25006 7988
39811G988o8238j22476K2992K72030L32336J38027j44350l78822m31052j13434
$$ 7988 -60250 -182726 -159734 112296 444632 582659 438309 59487 -371565 -484999
39801d84999M69013P61676L86927k73827n63117m01214j89727r2601L6018J78081
$$ -484999 -15986 745690 1132617 858790 295673 -105541 -295268 -387869 -351851 -173770
39791a73770J80951J42436K25785K44148j87j70781J21197M86168K34425m20845
$$ -173770 7181 149617 375402 619550 619363 448582 569779 1055947 1290372 869527
39781H69527n78457r7047J86331j19457l68835j05765J47165p3366k68348J12575
$$ 869527 291070 194023 380354 260897 -107938 -213703 -66538 -139904 -408252 -295677
39771b95677O09692M81915o0371k53298k0994P0714j35020k28937m0776J38310
$$ -295677 314015 795930 735559 482261 461267 531981 396961 168024 127248 265558
39761B65558J37001R9466R4198L9140q128N7865Q3603j12068l20640k39519m8026
$$ 265558 402559 502025 596223 635363 627235 685100 768703 656635 335995 96476 48450
39750D8450j40786l82334k38231L34961P27502N30230M5362k24145j78153l3925
$$ 48450 -92336 -474670 -712901 -377940 349562 879792 925154 701009 522856 488931
39740D88931K9372k8033j30097j23657K4374R8179p3589k85660k10485J04197
$$ 488931 518303 490270 360173 236516 260890 359069 285480 -180 -210665 -106468
39730a06468L17579K92105J69575M7936n4365j6304K09294L45809J38668j74793
$$ -106468 211111 503216 672791 720727 666362 650058 859352 1205161 1343829 1169036
39720A169036k03863n9929j20824k86077j44572J79934J29867k71254l31410J61041
$$ 1169036 965173 905244 784420 498343 353771 533705 663572 392318 60908 221949
39710B21949N24144K89196o0281K7577K49741O3556l29959l56612m4219J15976
$$ 221949 746093 1035289 975008 1002585 1252326 1315882 985923 629311 585092 701068
39700G01068M8901J12092L31258L05264p0579l55142j86067K55227N55077N50822
$$ 701068 749969 862061 1193319 1498583 1428004 1072862 886795 1142022 1697099 2247921
39690B247921L71231J90097M1515j88233n55489q17922o03769K9957M60198J99614
$$ 2247921 2619152 2809249 2850764 2662531 2107042 1289120 685351 715308 1175506 1375120
39680A375120m43360p25847l86143J11875K08129j38469m68368l13683K77655
$$ 1375120 931760 205913 -180230 -68355 139774 1305 -467063 -780746 -503091
39671e03091O71694L17103m58648p08194j15303N02608L49173j87962j83819L66472
$$ -503091 168603 485706 27058 -681136 -796439 -293831 55342 -132620 -316439 50033
39661E0033N79977Q6738m72364n06811k53685j68136j93306p4135J06455J72741
$$ 50033 630010 716748 244384 -262427 -516112 -684248 -877554 -951689 -845234 -672493
39651f72493K49463M50633N00047J44206l07401l58642p7612L8579j33615j98556
$$ -672493 -423030 27603 527650 671856 364455 5813 -71799 -33220 -166835 -365391
39641c65391O7586L67511L72998J67171q152j28599k66692l35543k24085m3619
$$ -365391 -297805 69706 442704 609875 601723 473124 206432 -129111 -353196 -396815
39631c96815O716o8677j13814p9357j4911J16749L58229N18675L11524j99642
$$ -396815 -390099 -458776 -572590 -651947 -666858 -550109 -191880 326795 638319 438677
39621D38677n53299m16432M3492M31318N51104M09709M2882m04716o10015l90389
$$ 438677 -114622 -531054 -487562 -56244 494860 904569 947451 542735 -67280 -457669
39611d57669P243K15655K38554L18668M26217K93984n0118k31648j02926M8184
$$ -457669 -450426 -234771 3783 322451 748668 1042652 992534 760886 657960 706144
39601G06144M445p7546o6619j39079l70699m30327o4589M07006N04973K83182
$$ 706144 710589 633043 566424 427345 56646 -373681 -438270 -31264 473709 756891
39591G56891J66369K35677J49405k33668n75070n08188r5451K68255K58927q7121
$$ 756891 923260 1158937 1308342 1074674 499604 -8584 -104035 164220 423147 336026
39581C36026l81261k49612K04125M58399K38739j09894j46528L6453N5076j26510
$$ 336026 -45235 -294847 -90722 367677 606416 496522 349994 386447 441523 315013
39571C15013k37030k21246k33530j90317J45244O10033O85646K16298l53793n96637
$$ 315013 77983 -143263 -376793 -567110 -421866 188167 873813 1090111 736318 139681
39561A39681n54242m35385k63517l4497J12466J08136Q8232J54229K39368L16794
$$ 139681 -414561 -849946 -1113463 -1147960 -1035494 -927358 -839126 -684897 -445529 -128735
39551a28735M49430N22091K63838k87704o65703n38099j32373J05469L9829j47104
$$ -128735 320695 842786 1106624 818920 153217 -384882 -517255 -411786 -371957 -519061
39541e19061k45169j44022J11770K65855Q5214k57938l37066q7194J10057P7678
$$ -519061 -764230 -908252 -796482 -530627 -445413 -703351 -1040417 -1127611 -1017554 -939876
39531i39876J07728L40800L89522k3825m85362m33842K9684L71731M08245L44152
$$ -939876 -832148 -491348 -101826 -125651 -611013 -1044855 -1015171 -643440 -235195 108957
39521A08957K39141j1951k67611k40605M822J15561P610o3880N037L0983o3079
$$ 108957 348098 336147 68536 -172069 -167247 -51686 -44076 -107956 -102919 -71936 -135015
39510a35015j16723o1938k2034j0229J21891L46719M03579J96377m0459r5180
$$ -135015 -251738 -313676 -335710 -345939 -224048 122671 526250 722627 682168 586988
39500E86988m7627p0748j79264k76765k76382j18828J55711L38060K50172J7841
$$ 586988 539361 468613 289349 12584 -263798 -382626 -226915 111145 361317 379158
39490C79158p0850K7613Q5745j8803j63033k28474k21875j22014J09783L16507
$$ 379158 308308 335921 421666 402863 239830 11356 -210519 -332533 -222750 93757
39480I3757K31099j35155m37726m17857j60544J10026K54990K06905l646j57245
$$ 93757 324856 189701 -248025 -665882 -826426 -716400 -461410 -254505 -258151 -415396
39470d15396m4114K04505K58826Q8452j0535O3731M8227k09923m70490m69091
$$ -415396 -459510 -255005 3821 92273 81738 145469 193696 -16227 -486717 -955808
39460i55808k54378J2565K84260M78121M21097J48266l0631M7218J90027K13152
$$ -955808 -1210186 -1197621 -913361 -435240 -14143 134123 103492 150710 340737 553889
39450E53889J69433O8539k08962n01150l59409K10867N03538O9634n32852n17977
$$ 553889 723322 791861 582899 81749 -277660 -66793 436745 506379 -26473 -544450
39440e44450j3149K47871Q1353n3318L6057O8506k049J43025M60634M22523j06100
$$ -544450 -557599 -309728 -228375 -281693 -245636 -177130 -179179 -36154 424480 847003 740903
39429G40903n09309l08436J36505K38959M9623K0067K17439K83651L4714l17608
$$ 740903 231594 -76842 59663 298622 348245 368312 585751 869402 904116 586508
39419E86508m90149l79281n0737K84297L61028J36951j08401j21276L703L2756
$$ 586508 96359 -282922 -333659 -49362 311666 448617 340216 218940 222643 255399
39409B55399k8472o830R9851J20665M850j10552j14921k7794R2070J84087J58851
$$ 255399 226927 220097 319948 440613 445463 334911 219990 192196 284266 468353 627204
39398F27204j4272k04962k33659q0776R6218J23398n8080l37112m64070k69993
$$ 627204 612932 407970 174311 93535 189753 313151 255071 -82041 -546111 -816104
39388h16104Q3032K44919J53734J32496L61711N40842L50248k183q0340R2988
$$ -816104 -733072 -488153 -334419 -201923 159788 700630 1050878 1048695 968355 1061343
39378A061343Q8004k35093n17894m57855j93380j3489J0981k4343k7706P4201
$$ 1061343 1149347 914254 396360 -61495 -254875 -268364 -257383 -281726 -309432 -235231
39368b35231K63899L17865L3837l70113m14678l0735K84546J68031j07240r1677
$$ -235231 28668 346533 380370 10257 -404421 -435156 -150610 17421 -89819 -181496
39358a81496K04679M64861N73067N77438L68672j35969n96193n30974k5381K91394
$$ -181496 23183 488044 1061111 1638549 2007221 1871252 1275059 744085 718704 1010098
39348A010098Q7733k53747k54203j4002M0976j44978k01985O5150L71147L70241
$$ 1010098 1097831 844084 589881 575879 616855 471877 269892 335042 706189 1076430
39338A076430J44406M3412J36565J09901k20032n57556n17471j83869L7767L6308
$$ 1076430 1220836 1264248 1400813 1510714 1290682 733126 215655 31786 69553 105861
39328A05861P1409K23711K25720k159j07704J08499K86585Q4060k20979k08012
$$ 105861 177270 400981 626701 624542 516838 625337 911922 995982 775003 566991
39318E66991o8120k48612n67903m35014J00791L23267N200k05683J27141N00689
$$ 566991 498871 250259 -317644 -752658 -651867 -328600 -323400 -529083 -401942 98747
39308I8747L26608j10928j86184M1707N1574j72653j50538J99227L78913J24304
$$ 98747 425355 314427 128243 169950 221524 48871 -101667 97560 476473 600777
39298F00777j95049j93681k2638l2448k12411k68785r5607Q5902K5538k49160
$$ 600777 405728 212047 189409 156961 -55450 -324235 -419842 -333940 -308402 -557562
39288e57562m39469k87624J02145L39298K23997K1627R6620L85246M72906J67009
$$ -557562 -997031 -1284655 -1182510 -843212 -619215 -597588 -500968 -115722 357184 524193
39278E24193k39373l19017J9107M34680M55379o5118p03742q20458k92135K86821
$$ 524193 284820 -34197 -15090 419590 874969 809851 106109 -714349 -1006484 -719663
39268g19663L40566L0748p4607J49027L10323J98440N1161O1510P7963m1086j63401
$$ -719663 -379097 -348349 -422956 -273929 36394 234834 285995 347505 425468 384382 220981
39257B20981j71321j74591k20837j14721K12048M29424K20640k29399m68262l66300
$$ 220981 49660 -124931 -345768 -460489 -248441 180983 401623 172224 -296038 -662338
39247f62338j73769p4004J7471K10043M43051N76843N08565J88106k97529o28173
$$ -662338 -836107 -910111 -892640 -682597 -239546 337297 845862 1033968 736439 108266
39237A08266m59394J30187N54217L11980l56330o55856j83285N45659P48222L63760
$$ 108266 -351128 -220941 333276 645256 288926 -366930 -550215 -4556 743666 1107426
39227A107426K976j3866k6889k90016m31002q6270L67895L11111j55571l83069
$$ 1107426 1110402 1096536 1069647 779631 348629 262359 630254 941365 785794 402725
39217D02725j90930l9858j75766k73053q8290J39256J91008K46018M55563N87524
$$ 402725 211795 171937 -3829 -276882 -365172 -225916 -34908 211110 666673 1254197
39207A254197M06965L9129l11381o21011p78157m98461J52038N63447L15965k28344
$$ 1254197 1661162 1700291 1388910 767899 -10258 -508719 -356681 206766 522731 294387
39197B94387m53858k82969l9650J41297K96319K94593K0446k77561k68323l0445
$$ 294387 -159471 -442440 -482090 -340793 -44474 250119 270565 -6996 -275319 -305764
39187c05764J16416R1175o748j96823m36530l97254Q0259N27245L94697j07237
$$ -305764 -189348 -98173 -104921 -301744 -738274 -1135528 -1055269 -528024 -133327 -240564
39177b40564k92063M080L02845K89858J32352J1712o3402K6053L76509O33183
$$ -240564 -532627 -528547 -225702 64156 196508 208220 144818 170871 547380 1180563
39167A180563L36511k59835m18476o9230N0783l59723o21478k19606K91374J87792
$$ 1180563 1517074 1257239 838763 769533 820316 460593 -160885 -380491 -89117 98675
39157I8675k38771j99959K90169M98358J89393p7774P2305K94229J93836m6658
$$ 98675 -140096 -340055 -49886 448472 637865 560091 632396 926625 1120461 1073803
39147A073803n9408J06067J63146J14231J87227L58591L47474J21682L4706K83474
$$ 1073803 1014395 1120462 1283608 1397839 1585066 1943657 2291131 2412813 2447519 2730993
39137B730993N51096N03574L99562P44979J456323J964785K209502K772995L635837
$$ 2730993 3282089 3785663 4185225 4930204 6386527 8351312 10560814 13333809 16969646
39128A6969646L559114J545118j493301l481015l513200k564438j864268j551123
$$ 16969646 20528760 22073878 20580577 17099562 13586362 11021924 9157656 7606533
39120G606533j229735r13923p86045o48692k77546P4346Q2089p0071k0612J55494
$$ 7606533 6376798 5462875 4676830 4028138 3750592 3824938 3907027 3836956 3816344 3971838
39110C971838J60546L3210j829q080j61484l00309j59168R8661Q4699j87593l62503
$$ 3971838 4132384 4165594 4163765 4155685 3994201 3693892 3534724 3633385 3718084 3530491 3167988
39099C167988l42671l46363m17760l66380j95116j29183j85280j40211K7365Q2159
$$ 3167988 2825317 2478954 2061194 1694814 1499698 1370515 1185235 1045024 1072389 1154548
39089A154548k1468n4157M2961M4980j02253j36003K8887O8184k11040m45356
$$ 1154548 1133080 1078923 1121884 1166864 1064611 928608 957495 1025679 814639 369283
39079C69283k02360L23308N08618J38886l21324l68978q3662Q5736j4149q0668
$$ 369283 166923 490231 998849 1137735 816411 447433 363771 449507 435358 354690
39069C54690J15378L31166K11617j29156k35423Q578K13672J06761p3076k5625
$$ 354690 470068 801234 1012851 883695 648272 656850 870522 977283 904207 878582
39059H78582J15039O2629j22249j96192j88305k81143l84502k63857j6513K0963
$$ 878582 993621 1056250 934001 737809 549504 268361 -116141 -379998 -396511 -375548
39049c75548j65595k16736M2206L68471N01320M51313L08741R3808r6834j01263
$$ -375548 -541143 -757879 -715673 -347202 154118 605431 914172 1007980 911146 809883
39039H09883K6005J8749j90140l23986j69656J03974J90858K6602k16733l63386
$$ 809883 835888 854637 664497 340511 170855 274829 465687 492289 275556 -87830
39029h7830l44495j97218l7000O0677J61855L37515M65526L61619Q8084r6382
$$ -87830 -432325 -629543 -666543 -605866 -444011 -106496 359030 720649 808733 712351
39019G12351j11395j45929l21751m76903l72600J5899M55816O23516L75554m0511
$$ 712351 600956 455027 133276 -343627 -716227 -700328 -244512 379004 754558 714047
39009G14047j83109K4014J45259j18665m25535l24192n997L0198j44905l7399
$$ 714047 530938 554952 700211 581546 156011 -168181 -174178 -143980 -288885 -326284
38999c26284L29775M04672J06425P113K69409K45750m06377r72347o84784J08102
$$ -326284 3491 408163 514588 521701 791110 1036860 630483 -341864 -1026648 -918546
38989i18546M96948L07338R5905J34741J58471K0451p5726k2769L9749N3808J03771
$$ -918546 -421598 -114260 -18355 116386 274857 295308 219582 196813 236562 290370 394141
38978C94141J62345J44147J43483K54761K76040l967l55622l91055j74633p6421
$$ 394141 556486 700633 844116 1098877 1374917 1370950 1015328 624273 449640 373219
38968C73219j39379j19034m5366j47462k78148p6576K85706K47347j50502k05482
$$ 373219 233840 114806 69440 -78022 -356170 -432746 -147040 100307 -50195 -255677
38958b55677K61412M87782p716n58380l68756K27877L49087l2770j78109J31046
$$ -255677 5735 493517 485801 -72579 -441335 -213458 135629 102859 -75250 55796
38948E5796L20620Q3698j41519J3139K63857K52348J31895J71809K31046O9122
$$ 55796 376416 460114 318595 331734 595591 847939 979834 1151643 1382689 1451811
38938A451811j60553j81402j03724k06882l92327l25917l2339J22503L1333l0077
$$ 1451811 1291258 1109856 1006132 799250 406923 81006 48667 171170 202503 172426
38928A72426N6598L7701k14170l82017j53966K87444N10907L85707J27883n7145
$$ 172426 229024 266725 52555 -329462 -483428 -195984 314923 700630 828513 771368
38918G71368j28217j03488k6631J8373J1475K5183L7819r9310l45052l59970J4317
$$ 771368 643151 539663 513032 531405 542880 568063 605882 506572 161520 -198450 -184133
38907a84133L89336L02107j08351l01530j04969J55291K35549K08901J14237j22002
$$ -184133 205203 507310 398959 97429 -7540 147751 383300 592201 706438 584436
38897E84436l30440j83756K00514K59017j71192n09031k68723K22871L78188K22220
$$ 584436 253996 70240 270754 529771 358579 -150452 -419175 -196304 181884 404104
38887D04104J95459L58995L57145O0249k54188l53104k94672k18199j85151k09508
$$ 404104 599563 958558 1315703 1375952 1121764 768660 473988 255789 70638 -138870
38877a38870k16959o5895J81202K03232q2231k22936J55398O61392N86217p5104
$$ -138870 -355829 -421724 -240522 -37290 -119521 -342457 -187059 474333 1060550 985446
38867I85446o09954n78994k58633l0050J05470K25726K19960Q7584Q6027K94652
$$ 985446 375492 -203502 -462135 -492185 -386715 -160989 58971 146555 232582 527234
38857E27234L80125Q9375l17403m21984j96778Q3351K69507L85832L95921K11300
$$ 527234 907359 996734 679331 257347 60569 143920 413427 799259 1195180 1406480
38847A406480j12940l79236m19233j96063J51634L16691O3436m34689o80806m00862
$$ 1406480 1293540 914304 495071 299008 450642 767333 830769 396080 -284726 -685588
38837f85588J51566N22589N05821J91699j90652l65469j88489J27659J99812M983
$$ -685588 -534022 -11433 494388 686087 495435 129966 -58523 69136 268948 273931
38827B73931o3105J82900L96185K42103p1592j54947l2468K8283M9471K38221
$$ 273931 210826 393726 789911 1032014 960422 805475 773007 801290 850761 1088982
38817A088982M94718N11613L12062K20053K85977K05179j07909l09936j71248
$$ 1088982 1583700 2095313 2407375 2627428 2913405 3118584 3010675 2700739 2529491
38808B529491M0302m3676l73230n95881n18788k54341j9207N5133j9299j25939
$$ 2529491 2569793 2526117 2152887 1557006 1038218 783877 764670 819803 800504 674565
38798F74565j84571k40875l17063k61636K8788L03517J97027k10115m28988k40583
$$ 674565 489994 249119 -67944 -329580 -300792 2725 199752 -10363 -439351 -679934
38788f79934N3898J98874L43401N61132M90310p2057n89735m22527J60619K92173
$$ -679934 -626036 -427162 -83761 477371 967681 895624 305889 -116638 43981 336154
38778C36154k01194n36286j71943M12994N05552J61607p6551n7208l4688m8717
$$ 336154 134960 -401326 -573269 -160275 345277 506884 430333 373125 338437 289720
38768B89720J09033L77891M25795K02267J9244L735o9647k65238k71725M8765
$$ 289720 398753 776644 1202439 1404706 1423950 1427685 1358038 1092800 821075 869840
38758H69840L04816J24109k38432k49345J21633L93302K97563J10409J75931M12886
$$ 869840 1174656 1298765 1060333 810988 932621 1325923 1623486 1733895 1909826 2322712
38748B322712M73729K32717n8333p2126K22396N17106N05375K38993M6237Q0023
$$ 2322712 2796441 3029158 2970825 2898699 3121095 3638201 4143576 4382569 4428806 4508829
38738D508829J20766n9806l22032l64430j89430r1256k12116l87839m64908m91529
$$ 4508829 4629595 4569789 4247757 3883327 3693897 3602641 3390525 3002686 2537778 2046249
38728B046249m94326l37337K905K35491J00303j96994k01332J43531L76223J62395
$$ 2046249 1551923 1214586 1217491 1452982 1553285 1356291 1154959 1298490 1674713 1837108
38718A837108k31647l55082k38865k63888m49092l57492J53187N60315L91474
$$ 1837108 1605461 1250379 1011514 747626 298534 -58958 94229 654544 1046018
38709A046018o6778k40268j62166k91212n70988l99689L36389Q89870O49111l3411
$$ 1046018 979240 738972 576806 285594 -285394 -685083 -348694 541176 1190287 1156876
38699A156876m19630l58626k26919k34576k69603k18537l8439K97780O00110M79645
$$ 1156876 737246 378620 151701 -82875 -352478 -571015 -609454 -311674 288436 768081
38689G68081p1082m43397j99862K41558K37381j04272k20359p7869q9113k11046
$$ 768081 696999 253602 53740 295298 532679 428407 208048 130179 41066 -169980
38679a69980Q853M81812N39241J4620m29366l19391J934Q1930J4725J5816m3463
$$ -169980 -161127 320685 859926 874546 445180 125789 127723 209653 224378 240194 196731
38668A96731k45115k98632l9121K18660K25286K15926L67870L45521j06313n72279
$$ 196731 -48384 -347016 -386137 -167477 57809 273735 641605 987126 880813 308534
38658C08534n42287k02092n5276p7381J08483M33672M37372N4107k50500j70801
$$ 308534 -233753 -435845 -491121 -568502 -460019 -26347 411025 465132 214632 43831
38648D3831Q8197K13380J51897R052j23586j77373j40981q8726n9287p126L5447
$$ 43831 132028 345408 497305 506357 382771 205398 64417 -24309 -83596 -90722 -55275
38637e5275m1310j50949m5633K09807J91578j92212m04640o3274M04065L88324
$$ -55275 -96585 -247534 -293167 -83360 108218 -83994 -488634 -551908 -147843 240481
38627B40481K1209j09576J11985L00304K70833J62377o477l04568n03896l07563
$$ 240481 261690 152114 264099 564403 835236 997613 991136 686568 182672 -124891
38617a24891R7890K59712J48873Q6096R0242p8938l00233j90680J68968K91163
$$ -124891 -27001 232711 381584 467680 557922 478984 178751 -11929 157039 448202
38607D48202J20203J14725L72814L98364k9610m41237m48343l12328l59171l79744
$$ 448202 568405 683130 1055944 1454308 1424698 983461 535118 222790 -136381 -516125
38597e16125o7729L66600M77061J97076j75233l66271k52086J23717M39113L19440
$$ -516125 -583854 -217254 259807 456883 281650 -84621 -336707 -212990 226123 545563
38587E45563j14167k79063N6861L99420K64415j13648k08218j0944M6644k02572
$$ 545563 431396 152333 209194 608614 873029 759381 551163 540219 586863 384291
38577C84291m60917m07457m2703L59496M62157J43073k89710l35923Q8535M93426
$$ 384291 -76626 -484083 -526786 -167290 294867 437940 148230 -187693 -99158 394268
38567C94268M41826J03504m1925J52971M09556M26134J53521k30812m66760m22794
$$ 394268 836094 939598 897673 1050644 1460200 1886334 2039855 1809043 1342283 919489
38557I19489k40425j40251r5003N9525K10857N1411l56267n35384k84846K6103
$$ 919489 679064 538813 443810 503335 714192 765603 409336 -126048 -410894 -384791
38547c84791P9905O6600K04234K66324K5586k16649o4112K82827L06838k5771
$$ -384791 -304886 -238286 -34052 232272 257858 41209 -22903 259924 566762 540991
38537E40991k67522k03476o5923n2045q1443q3880j37749k27194j73336Q1772
$$ 540991 273469 69993 4070 -47975 -129418 -213298 -351047 -578241 -751577 -669805
38527f69805L49506M36052L37610J53691l1889j41848j08681N9568K66237L78116
$$ -669805 -320299 115753 453363 607054 575165 433317 324636 384204 650441 1028557
38517A028557K94362N1605j36631q8151Q8535J29003J4347k2033O9254L8430k22541
$$ 1028557 1322919 1374524 1237893 1149742 1238277 1367280 1381627 1359594 1428848 1467278 1244737
38506A244737m63292m72759l55750k17280M7184L79174L84435q2723n20905m27769
$$ 1244737 781445 308686 -47064 -264344 -217160 162014 546449 463726 -57179 -484948
38496d84948m8278L7467j68029j73600J10217K21519n0947k99679j39863K27314
$$ -484948 -533226 -495759 -663788 -837388 -727171 -505652 -556599 -856278 -996141 -768827
38486g68827L65136K12889O5942J08274K04667J21184j76411m53482m23019n9732
$$ -768827 -403691 -190802 -124860 -16586 188081 309265 132854 -320628 -743647 -803379
38476h03379L30148M09837J54846j50799k18914k1330K04446K04800R940q0650
$$ -803379 -473231 -63394 91452 -59347 -278261 -299591 -95145 109655 119595 38945
38466C8945Q6625K52521J12277j86202k46160l5047J20309J12064J37410J83588
$$ 38945 125570 378091 490368 304166 58006 22959 143268 255332 392742 576330
38456E76330j1831l60275l69763P6329M47108L49618M5811j06115j53541j63782
$$ 576330 564499 204224 -165539 -89210 357898 707516 753327 647212 493671 329889
38446C29889M0688L55748K56753l16571o01761j37684M17855L03691j59660k39536
$$ 329889 370577 726325 983078 666507 64746 -72938 344917 648608 488948 249412
38436B49412m6998j36702l31542m7791N05514N69627J26902j30910n1574j58325
$$ 249412 202414 65712 -265830 -313621 191893 761520 888422 757512 705938 547613
38426E47613n16809n47771j19319J88385J25268J19383L28337K87373j51660m13090
$$ 547613 30804 -516967 -636286 -447901 -322633 -203250 125087 412460 260800 -152290
38416a52290j46234K01186J86747L3488N0121O1029j17163k18730j9875K08106
$$ -152290 -298524 -97338 89409 122897 173018 234047 116884 -101846 -121721 86385
38406H6385J61384j3170n7113j5627j0635N755K7227p2697j96407n5978K90477
$$ 86385 247769 234599 177486 161859 151224 156979 184206 111509 -84898 -140876 149601
38395A49601M17367J92351m8614j08102j54585k28552j26820Q9517J00939m1466
$$ 149601 566968 759319 710705 602603 448018 219466 92646 182163 283102 241636
38385B41636K9847K28700Q7491k80556k00649L59352N88539J84858j18559J31152
$$ 241636 271483 500183 587674 307118 106469 465821 1054360 1239218 1120659 1251811
38375A251811L02129j44913o35618m45997J21685L62099K66222J85122N8948j90879
$$ 1251811 1553940 1409027 773409 327412 449097 811196 1077418 1262540 1321488 1130609
38365A130609j28656M80624R99195Q15210L59454L53368N95106M38178j8916k25505
$$ 1130609 1001953 1482577 2481772 3296982 3656436 4009804 4604910 5043088 5024172 4798667
38355D798667k48756n20127q31917o30018j01973L3401k92473m60770k34226J2539
$$ 4798667 4549911 4029784 3197867 2567849 2465876 2499277 2206804 1746034 1511808 1524347
38345A524347Q0905J40146J68209j7342k06419l1054K83000J51067l85251o31069
$$ 1524347 1605252 1745398 1913607 1896265 1689846 1658792 1941792 2092859 1707608 1076539
38335A076539k44289L70213P13308O75439L67191j7125j92922p9653J1824j34761
$$ 1076539 832250 1202463 1915771 2591210 2958401 2941276 2748354 2668701 2680525 2545764
38325B545764k39929m5268J58462O2891l4853K11202M60235K43945j63537k31498
$$ 2545764 2305835 2260567 2419029 2481920 2447067 2658269 3118504 3362449 3198912 2967414
38315B967414j07814k10739l12265J2889M01908K07222l08199l40376J20612L86617
$$ 2967414 2859600 2648861 2336596 2349485 2751393 2958615 2650416 2310040 2430652 2817269
38305B817269L05165L21214M60058L24931P368k1525J90759K57102L04478O37508
$$ 2817269 3122434 3443648 3903706 4228637 4236005 4214480 4405239 4662341 4966819 5604327
38295E604327Q58647M42276j40864o3569M57534O61955O90586J109004J492885
$$ 5604327 6462974 6905250 6764386 6700817 7158351 7820306 8510892 9619896 11112781
38286A1112781J129806O53709J146596K066121K117979J748907K394889L563260
$$ 11112781 12242587 12896296 14042892 16109013 18226992 19975899 22370788 25934048
38278B5934048L395166K109098J934253L366566M611301N200420O775307R568401
$$ 25934048 29329214 31438312 33372565 36739131 41350432 46550852 53326159 62894560
38270F2894560J1825789J3757941J8010230K5005130L2685522M2314182N7206756
$$ 62894560 74720349 88478290 106488520 131493650 164179172 206493354 263700110
38263B63700110P0938271O4730624K6977640k7150647o5971731p2462758n7511415
$$ 263700110 334638381 399369005 426346645 399195998 333224267 260761509 203250094
38256B03250094m1443307l2051103k5244836j8355221j3591632j1591896r735332
$$ 203250094 161806787 129755684 104510848 86155627 72563995 60972099 51236767
38249E1236767p020165n252327m955536m288755k614320j638297k206653k865966
$$ 51236767 44216602 38964275 34008739 29719984 27105664 25467367 23260714 20394748
38241B0394748k503151j979133k157646k336140j692872p19715k37308j99969
$$ 20394748 17891597 15912464 13754818 11418678 9725806 9006091 8768783 8568814
38233H568814k68971n22026r10433r40794n07884k31091m47859o47943l87984
$$ 8568814 8299843 7777817 6867384 5926590 5418706 5187615 4739756 4091813 3703829
38224C703829j8626k503j91914k91377m16395o63255o72472j89762L58786M02453
$$ 3703829 3685203 3682700 3490786 3199409 2783014 2119759 1447287 1257525 1616311 2018764
38214B018764L4805k00040r6657Q0317Q9986n5467k62193m35309m39879k18822
$$ 2018764 2053569 1853529 1756872 1837189 1927175 1871708 1609515 1174206 734327 515505
38204E15505R0470L06398L82588L28584J16386j73509k89180j15457Q4140j0697
$$ 515505 605975 912373 1294961 1623545 1739931 1566422 1277242 1161785 1245925 1235228
38194A235228k89404l30498j7666K55342J22190k43708l76560j55993P5833M5642
$$ 1235228 945824 615326 597660 853002 975192 731484 354924 198931 274764 320406
38184C20406p4607K1343K75360L31721N9248k41602k27323O5791L04271K61756
$$ 320406 245799 267142 542502 874223 933471 691869 464546 530337 834608 1096364
38174A096364J9859j86906k09425n6933J74398L71984M33553L28041J84422K21730
$$ 1096364 1116223 929317 719892 662959 837357 1209341 1642894 1970935 2155357 2377087
38164B377087M61552N81497K57368l59185p48174o59755l82766k68496k77681
$$ 2377087 2838639 3420136 3677504 3318319 2570145 1910390 1527624 1259128 981447
38155I81447j97434m0089L8531J1589q1830k62908m23251k70700K07592M99918
$$ 981447 784013 743924 782455 794044 712214 449306 26055 -244645 -37053 462865
38145D62865K09130k95875l60382L724K02563l386k46368k39412j31640q5618
$$ 462865 671995 376120 15738 19462 222025 218639 -27729 -267141 -398781 -484399
38135d84399l0714L8527j589o2373Q7773L27432K74551k4604p6270K27312L69355
$$ -484399 -515113 -476586 -478175 -540548 -452775 -125343 149208 124604 48334 275646 645001
38124F45001O0503k78828k34399k5253k04l5735Q3538J51784n7758k69243j32307
$$ 645001 705504 426676 192277 167024 166820 131085 214623 366407 308649 39406 -92901
38113i2901J49966J76663M8497J24675L06104J94606j45986k22858P6165K80500
$$ -92901 57065 233728 282225 406900 713004 907610 761624 538766 614931 895431
38103H95431O3144l07504m23208k75419j27988j03954j12919o1815L0654J11323
$$ 895431 958575 651071 227863 -47556 -175544 -279498 -392417 -454232 -423578 -312255
38093c12255K04024L85818O07731O15374K24577l38876o12644m54313j67240j1803
$$ -312255 -108231 277587 885318 1500692 1725269 1386393 773749 319436 152196 140393
38083A40393Q9276K32930K74888J10199q0024j05412m2425k4007j4618P161o8327
$$ 140393 229669 462599 737487 847686 767662 662250 619825 595818 581200 588361 520034
38072E20034k16740k20485p3365n9301k01297j06379L18132N27527J84937j84481
$$ 520034 303294 82809 9444 -49857 -251154 -357533 -39401 488126 673063 488582
38062D88582j192L76317K30306k93774m23642n2347J29794j69118m04944j81837
$$ 488582 487390 863707 1094013 800239 376597 324250 454044 284926 -120018 -301855
38052c01855J04840k0283l64002m46131j94061J26633L42912L99793K30850q1074
$$ -301855 -197015 -217298 -581300 -1027431 -1221492 -1094859 -751947 -352154 -121304 -202378
38042b02378k21465m521L28041L95659J56103r2633j09416M7903J56760J08680
$$ -202378 -423843 -428364 -100323 295336 451439 358806 249390 297293 454053 562733
38032E62733J0441j1133m1054k42709m90823m29885l0917K46559J03324j29678
$$ 562733 573174 562041 520987 278278 -212545 -642430 -673347 -426788 -323464 -453142
38022d53142l3514K16255J93813k0609j5495J91039K07694K2821L3026K74307
$$ -453142 -486656 -270401 -76588 -97197 -112692 78347 286041 308862 341888 616195
38012F16195K85863j02597m53518m15035j93913q7410m0880N1375O2902m6193
$$ 616195 902058 799461 345943 -69092 -263005 -350415 -391295 -339920 -277018 -323211
38002c23211l6488J85180L26691J87811q56j4770j9215j72267k40179l3666J32373
$$ -323211 -359699 -174519 152172 339983 339127 324357 305142 132875 -107304 -140970 -8597
37991h597o5408k79794P1876Q00531J025735L84643l94726m28274K02969O70362
$$ -8597 -74005 -353799 -281923 518608 1544343 1928986 1534260 1105986 1308955 1979317
37981A979317N38382K13607J99482L40865J35948m34671q40790p57995m55457
$$ 1979317 2517699 2731306 2930788 3271653 3407601 2972930 2132140 1374145 918688
37972I18688k96595k62484k07268j95871k51000j18582K96247N69224L13501j73333
$$ 918688 622093 359609 152341 -43530 -294530 -413112 -116865 452359 765860 592527
37962E92527l46293k41702k64851l83008k49730J3474l7301k84143j63420K79014
$$ 592527 246234 4532 -260319 -643327 -893057 -879583 -916884 -1201027 -1364447 -1085433
37952a085433L62386j9588j29456L23438N93959J54843l55963j76029L39777L69028
$$ -1085433 -723047 -742635 -872091 -548653 45306 200149 -155814 -331843 7934 376962
37942C76962n6774k80192j62811r6444j23649O9094L88673L83325N4036j04335
$$ 376962 320188 39996 -122815 -219259 -342908 -273814 114859 498184 552220 447885
37932D47885P2376K01054N0622j36435j57793j57601k46479k68694j41281n2230
$$ 447885 520261 721315 771937 635502 477709 320108 73629 -195065 -336346 -388576
37922c88576j28924k08403j13823P2666J61596J11658L1103L9998J69178L07837
$$ -388576 -517500 -725903 -839726 -767060 -605464 -493806 -462703 -422705 -253527 54310
37912E4310K82590P4033j35339k16078k34175k25176o3300K45897L98031K01038
$$ 54310 336900 410933 275594 59516 -174659 -399835 -463135 -217238 180793 381831
37902C81831o1682n288K89385M17369K23766q8044l07353l67804k56057n4730
$$ 381831 320149 314861 604246 1021615 1245381 1157337 849984 482180 226123 171393
37892A71393L5754l1074j6989K05032L49799J33525k40173l72862k38118p7812
$$ 171393 207147 176073 159084 364116 713915 847440 607267 234405 -3713 -81525
37882h1525M4096J71169J68968l0490j21235J36314L82304J29832m07764n78769
$$ -81525 -37429 133740 302708 272218 150983 287297 669601 799433 391669 -187100
37872a87100k60125P8336J91220K53498K63948j2725m16531m17411M3306L75255
$$ -187100 -447225 -368889 -177669 75829 339777 327052 -89479 -506890 -463584 -88329
37862h8329K13117j28700k87202l31135l50296j58954K55470N04979L68264J33775
$$ -88329 124788 -3912 -291114 -622249 -972545 -1131499 -876029 -371050 -2786 130989
37852A30989P2029K9675j35491j95732n24J61930N1651p6639O8970K79051J98884
$$ 130989 203018 232693 97202 -98530 -99054 62876 114527 37888 106858 385909 584793
37841E84793q8316k65748k99363l28100k79222j9799K90004L84391K85951J82874
$$ 584793 496477 230729 -68634 -396734 -675956 -695755 -405751 -21360 264591 447465
37831D47465P9740j06706k66640k31702o2342O1210R2340N4960o6058j67642l2005
$$ 447465 527205 420499 153859 -77843 -140185 -78975 13365 68325 2267 -165375 -197380
37820a97380K77199L41320J458l00785j64345J38687J26751j07046j14674J27034
$$ -197380 79819 421139 422597 121812 -42533 96154 222905 115859 1185 128219
37810A28219K35914J01886j8526l1812r5369j84549r0596J13210J00751j36771
$$ 128219 364133 466019 447493 415681 320312 135763 45167 158377 259128 122357
37800A22357k26091l0775J23275P262j47311o9337J16706J30316m6605k23168
$$ 122357 -103734 -134509 -11234 -3972 -151283 -220620 -103914 26402 -20203 -243371
37790b43371k82182k21280o7714R6594J56887J19259J12435J70377J72197O3422
$$ -243371 -525553 -746833 -814547 -717953 -561066 -441807 -329372 -158995 13202 76624
37780G6624l7585l6315o239n2878j66034k65023k71310j26201J16050K36347R6399
$$ 76624 39039 2724 -3515 -56393 -222427 -487450 -758760 -884961 -768911 -532564 -436165
37769d36165q9563j901K58614K40826j59241m51984k40416J84851K87845Q1748
$$ -436165 -525728 -527629 -269015 -28189 -187430 -639414 -879830 -694979 -407134 -325386
37759c25386L9195K99908M41404J43364l07462m16244j45803J00546O2285r1705
$$ -325386 -286191 13717 455121 598485 291023 -125221 -271024 -170478 -108193 -199898
37749a99898q7945O7712J63806J18178O8253J39636K68924L13275K39404J15785
$$ -199898 -287843 -220131 -56325 61853 130106 269742 538666 851941 1091345 1207130
37739A207130k3127j86588l08717k55817k7462J48262N5738k03669l07469j44087
$$ 1207130 1184003 997415 688698 432881 405419 553681 609419 405750 98281 -45806
37729d5806K9396k4027j52131n7943K00699K66798L4123j92621j75205n0406o978
$$ -45806 -16410 -40437 -192568 -250511 -49812 216986 251109 58488 -116717 -167123 -174101
37718a74101J4219P5055K8481j52339j65340J22310K97547Q544l59492k35125
$$ -174101 -159882 -84827 -56346 -208685 -374025 -251715 45832 54376 -305116 -540241
37708e40241J54599J16336l04346l46508J43003L70015p4868m64901j10903M95307
$$ -540241 -385642 -269306 -573652 -920160 -777157 -407142 -482010 -946911 -1057814 -562507
37698e62507M87114q351j82142J37573L68239K19887K8185L1091L4512q2420j15132
$$ -562507 -75393 -83744 -265886 -128313 239926 459813 487998 519089 553601 471181 356049
37687C56049N1551K19080J93346p548k92425n25220m68353o0448L30454L25689
$$ 356049 407600 626680 820026 812478 520053 -5167 -473520 -533968 -203514 122175
37677A22175R5145M7884J09738j07652m84506m23973J89988P12950O40093K26255
$$ 122175 217320 265204 374942 267290 -217216 -641189 -451201 261749 901842 1128097
37667A128097n6210j71924l16480m71479m97904l76869j19502K72322N86236M91487
$$ 1128097 1071887 899963 583483 112004 -385900 -762769 -882271 -609949 -23713 467774
37657D67774L8145k95978k46245p0926l4151j7489R8980J22049n1091j31900P0874
$$ 467774 505919 209941 -36304 -107230 -141381 -158870 -59890 62159 11068 -120832 -49958
37646d9958K40927N7277k34577k17421K6113J27534O8125P7987R8575q6611k95052
$$ -49958 190969 248246 13669 -203752 -177639 -50105 18020 96007 194582 107971 -187081
37635a87081j09950L85090N86671K07400l24223m63139j79554J73733L12059J66432
$$ -187081 -297031 88059 674730 882130 557907 94768 -84786 88947 401006 567438
37625E67438j55105l82572k75362N0824J84348n0167l14102j89773K60456N81427
$$ 567438 412333 29761 -245601 -194777 -10429 -60596 -374698 -564471 -304015 277412
37615B77412M91052J49886j26390k30738k58514k66413j96425l7290Q5081O6953
$$ 277412 768464 918350 791960 561222 302708 36295 -160130 -197420 -112339 -45386
37605d5386k1826p3261j47533l52012n43280m01549J16854O21862P23872M55410
$$ -45386 -67212 -140473 -288006 -640018 -1183298 -1584847 -1467993 -846131 -122259 333151
37595C33151J16671j22742k67438k83744j10440J41437K29154P4812j22616j35023
$$ 333151 449822 327080 59642 -224102 -334542 -193105 36049 110861 -11755 -146778
37585a46778K5906J53755J17091M253l6057l4882j45180l23152k79435R0507M32334
$$ -146778 -120872 32883 149974 154227 118170 83288 -61892 -385044 -664479 -573972 -141638
37574a41638L70014N7214p9841k7161j14081k94123j31494L32366L94534k16997
$$ -141638 228376 285590 205749 178588 64507 -229616 -361110 -28744 365790 148793
37564A48793p03135k84311N51296P01045Q4664k89001R8236N51812L36244k24487
$$ 148793 -554342 -838653 -287357 413688 498352 209351 307587 859399 1195643 971156
37554I71156l83938j55825j43428m44911m79872K7775N27323M11301j09292l31570
$$ 971156 587218 431393 287965 -156946 -636818 -609043 -81720 329581 220289 -111281
37544a11281o0001K08200J10120o1005Q7263L53444K47185k02484m51700k47715
$$ -111281 -171282 36918 147038 86033 173296 526740 773925 571441 119741 -127974
37534a27974N8623J20474N2778O4435N2413j19320k64276j53253Q8132J92551
$$ -127974 -69351 51123 103901 168336 220749 101429 -162847 -316100 -227968 -35417
37524c5417J55337J20492Q2743J9265P9146K86841L06158q6271n29420n52001
$$ -35417 119920 240412 323155 342420 421566 708407 1014565 928294 398874 -153127
37514a53127k97566k28557k97385p7988L55620M35259P9823q2094K59363N39185
$$ -153127 -450693 -679250 -976635 -1054623 -699003 -263744 -183921 -266015 -6652 532533
37504E32533K20669l21796l79466L0780K86658J20577j31700j90648k06214l54121
$$ 532533 753202 431406 51940 82720 369378 489955 358255 167607 -38607 -392728
37494c92728m56231k37505K24446N23715L83838k5319k86207k14380l3418k0729
$$ -392728 -848959 -1086464 -862018 -338303 45535 20216 -265991 -480371 -513789 -534518
37484e34518j22512q9931J04037K31550J73771O7605N8634J33923K38343L38144
$$ -534518 -657030 -746961 -642924 -411374 -237603 -169998 -111364 22559 260902 599046
37474E99046L37358J59233o6122j45139j57244l32249n60515m28507J10081N09655
$$ 599046 936404 1095637 1029515 884376 727132 394883 -165632 -594139 -484058 25597
37464B5597L49443o8288j80733L7272J39734p0160l01600k63541n7674K4353r0729
$$ 25597 375040 306752 126019 163291 303025 232865 -68735 -332276 -389950 -365597 -456326
37453d56326j72698K6380M33950O44878L46774k52708n97626m31732p4330N4275
$$ -456326 -629024 -602644 -168694 476184 822958 570250 -27376 -459108 -533438 -479163
37443d79163l3155k3419J84732L48805K40366n2202k39361j78912l7199n3114
$$ -479163 -512318 -535737 -351005 -2200 238166 185964 -53397 -232309 -269508 -322622
37433c22622j77434j21087J67254L32323J51268l4194J68400M73730K78381l25277
$$ -322622 -500056 -621143 -453889 -121566 29702 -4492 163908 637638 916019 590742
37423E90742n72227j75980K32531J02765k42760k44303K1248J40218J05140J69879
$$ 590742 18515 -157465 75066 177831 -64929 -309232 -287984 -147766 -42626 127253
37413A27253K65442J46735p1897p1355J04760J17209j24481l94993n25688m80336
$$ 127253 392695 539430 467533 396178 500938 618147 493666 98673 -427015 -907351
37403i07351k10538K00265M31532L31000J96820K73024K77870p7952m48297l54183
$$ -907351 -1117889 -917624 -486092 -155092 41728 314752 592622 514670 66373 -287810
37393b87810l2518n0682l03707k26445J35215J94610m4341P0142N94727P14003
$$ -287810 -320328 -371010 -674717 -901162 -765947 -571337 -615678 -545536 49191 763194
37383G63194P8844n35646m42753n6256m1396k20758j03228J25453J3605k16334
$$ 763194 842038 306392 -136361 -192617 -234013 -454771 -557999 -432546 -418941 -635275
37373f35275n1156K90587J49555l93385n44331n6174L80149K15631j99534k62251
$$ -635275 -686431 -395844 -246289 -639674 -1184005 -1240179 -860030 -644399 -843933 -1106184
37363a106184L2741K58686J87439q0092l35033l42228M7701O09854P94988L51731
$$ -1106184 -1073443 -814757 -627318 -707410 -1042443 -1384671 -1336970 -727116 67872 419603
37353D19603k64720m00094j9431K93605J51783j50826j33168J44451J81655j78443
$$ 419603 154883 -245211 -264642 28963 180746 29920 -103248 41203 222858 44415
37343D4415m61582k52836J50338J57693k24245m17222j70591J05903O4672n3433
$$ 44415 -417167 -670003 -519665 -361972 -586217 -1003439 -1174030 -1068127 -1003455 -1056888
37333a056888O8995K46209J59181l9697J3287K61819L53598K28747R5946l9522
$$ -1056888 -987893 -741684 -582503 -622200 -608913 -347094 6504 235251 331197 291675
37323B91675l04430n11610l47850J5124P9934j59361j69185K13120M52479J88887
$$ 291675 -12755 -524365 -872215 -857091 -777157 -936518 -1105703 -892583 -440104 -251217
37313b51217j45436j6086L62325L87476q697l29781k69852k4952J21757J34463
$$ -251217 -396653 -412739 -50414 337062 328365 -1416 -271268 -296220 -174463 -40000
37303d0000J00925O2870L7859L2563J1540k4210L2151K49247M88958N12268K32090
$$ -40000 60925 123795 161654 194217 205757 181547 213698 462945 951903 1464171 1696261
37292A696261k01252n03579m39664o2666K14554L3961l73863m11572P542K50343
$$ 1696261 1495009 991430 551766 489100 703654 737615 363752 -47820 -40278 210065
37282B10065q1585m70010k60429K69477L19826j57688l94800m2916L21510J75052
$$ 210065 128480 -341530 -601959 -332482 -12656 -170344 -565144 -608060 -286550 -111498
37272a11498j75327k10778l5087o4366k62825k39594R2963M33196N47028M24072
$$ -111498 -286825 -497603 -532690 -597056 -859881 -1099475 -1006512 -573316 -26288 397784
37262C97784R4748l31191n37297k94466J49813L10932P9008k05066k51474r6959
$$ 397784 492532 161341 -375956 -670422 -520609 -209677 -130669 -335735 -587209 -684168
37252f84168R8235K25473K03416N9021J1831J94405L47239J41498k41055k84442
$$ -684168 -585933 -360460 -157044 -98023 -86192 108213 455452 596950 355895 71453
37242G1453P1678K92897M3302l38400l89480j48818N2131Q0260j7036k07882l43599
$$ 71453 143131 436028 479330 140930 -248550 -397368 -345237 -264977 -282013 -489895 -833494
37231h33494j39776L66339O47125L67241p2468j42822k7049k31319n75667l67432
$$ -833494 -973270 -606931 40194 407435 334967 192145 165096 -66223 -641890 -1009322
37221a009322L93326Q01300L24543m03616n17567q6544K03899J22089m755l4581
$$ -1009322 -615996 185304 509847 106231 -411336 -497880 -293981 -171892 -176647 -211228
37211b11228j84636m57126m74609n4573M68754O87460N75083L32616O9896j51714
$$ -211228 -395864 -852990 -1327599 -1382172 -913418 -225958 349125 681741 751637 599923
37201E99923j99646m5360R0670L175j92010k34280j13777m8636j06666j15080
$$ 599923 400277 354917 445587 448762 256752 22472 -91305 -139941 -246607 -361687
37191c61687R819R1375k4325j98732j80605N3535K96447L78170K92889J16382
$$ -361687 -351868 -260493 -284818 -483550 -664155 -610620 -314173 63997 356886 473268
37181D73268m8330p9844L9796J19051n4294l90076n30170k75114J57608L79739
$$ 473268 424938 345094 384890 503941 449647 59571 -470599 -745713 -588105 -208366
37171b08366K35366r5937k94356j59582K01563M15879K24243j50626k25744R1652
$$ -208366 27000 -68937 -363293 -522875 -321312 94567 318810 168184 -57560 34092
37161C4092L48205J90329j28311j55968Q6411K09876Q3351n5850p5814j25514
$$ 34092 382297 572626 444315 288347 374758 584634 667985 612135 536321 410807
37151D10807k72894l23281j35812J40437K80858K40053R8025o8116j85683k20241
$$ 410807 137913 -185368 -321180 -180743 100115 340168 438193 370077 184394 -35847
37141c5847k37256k66703j50694K20007N63049M57935j7329k95229q7662K40605
$$ -35847 -273103 -539806 -690500 -470493 92556 550491 533162 237933 150271 390876
37131C90876K47580j8786k65272l89304l69680q4190L79575N45080J38856l67090
$$ 390876 638456 619670 354398 -34906 -404586 -488776 -109201 435879 574735 207645
37121B07645l07095K22666M87171J53483l19756m15725j98675k2869J7277P2018
$$ 207645 -99450 123216 610387 763870 444114 28389 -170286 -193155 -175878 -103860
37111a03860J92098K52971J47137q1325k59146k24395j6576J21521N3071l1999
$$ -103860 88238 341209 488346 407021 147875 -76520 -93096 28425 81496 49497
37101D9497J01731L28331L08591K268k76488l26831k62608j88290j4950K55001
$$ 49497 151228 479559 788150 790418 513930 187099 -75509 -263799 -278749 -23748
37091b3748L61763J27032k36569l56329j20363K58139M73685L49948q999k30479
$$ -23748 338015 465047 228478 -127851 -248214 9925 483610 833558 824559 594080
37081E94080m8338K70658J64389m23858q20031m73296K48473N12975J16747l22378
$$ 594080 545742 816400 980789 556931 -263100 -736396 -487923 25052 141799 -180579
37071a80579k61964J10728K83771J45360Q484N8113R8131q4833l30250k86242
$$ -180579 -442543 -331815 -48044 97316 105800 163913 262044 177211 -153039 -439281
37061d39281O4717L01881J09472k58041k95310N0181L05984J57217j17945q6729
$$ -439281 -374564 -72683 36789 -221252 -516562 -466381 -160397 -3180 -121125 -207854
37051b07854K07348L34966Q9654k77951m30432l16844j13383M2265J42321J96083
$$ -207854 -506 334460 424114 146163 -284269 -601113 -714496 -672231 -529910 -333827
37041c33827J40201p3554l17745l33085l6695L00758L60196J98343J28055J99860
$$ -333827 -193626 -267180 -584925 -918010 -954705 -653947 -293751 -95408 32647 232507
37031B32507J33976j53966l37797k01111j6158q3495k00129o399L58675M39579
$$ 232507 366483 212517 -125280 -326391 -342549 -426044 -626173 -632572 -273897 165682
37021A65682J92230J8293Q3363J15911k8707j07982J6547P9500j33383m04780
$$ 165682 357912 376205 459568 575479 546772 438790 455337 534837 401454 -3326
37011c326m46191l09084j39122J47047N67338P49134L61376k98327o07645m19545
$$ -3326 -449517 -758601 -897723 -750676 -183338 565796 927172 628845 21200 -398345
37001c98345j26573r40N3124R0736k0742k23797k10896P0023K64435J81167J00685
$$ -398345 -524918 -525858 -472734 -381998 -402740 -626537 -837433 -767410 -502975 -321808 -221123
36990b21123K36833L08753M4947k45762j14345K61073L17739L834j63694M5317
$$ -221123 15710 324463 369410 123648 9303 270376 588115 591949 428255 473572
36980D73572K53068J63274K3265J13101K32817P7443k17703l20560k50220k55519
$$ 473572 726640 889914 913179 1026280 1259097 1336540 1118837 798277 548057 292538
36970B92538l03032j26171K64767N27511M73585K67830Q5333j17053l84684n87595
$$ 292538 -10494 -136665 128102 655613 1129198 1397028 1482361 1365308 980624 393029
36960C93029n94718m36795j96825Q2891L00979L03738J16969K014J29282L13200
$$ 393029 -201689 -638484 -835309 -752418 -451439 -147701 -30732 -28718 100564 413764
36950D13764K23041j98882o35648o90179k55697L48198O20867L74042l1012q7641
$$ 413764 636805 437923 -197725 -887904 -1143601 -795403 -174536 199506 168494 80853
36940H0853K33196M78145L43895K7418j66426k55934l79958m17122j56575K65818
$$ 80853 314049 792194 1136089 1163507 997081 741147 361189 -55933 -212508 53310
36930E3310M55952K82713R589j30866k01662k97302k86643k8536L13163M07072
$$ 53310 509262 791975 801564 670698 469036 171734 -114909 -143445 169718 576790
36920E76790J77502q7992q6961J53416L33999K35788l0140j26594J46065N82243
$$ 576790 754292 666300 579339 732755 1066754 1302542 1272402 1145808 1291873 1874116
36910A874116P17004L06531l61659p35883n87412k13452j1069j5995j8990J0671
$$ 1874116 2591120 2897651 2535992 1800109 1212697 999245 988176 972181 953191 963862
36900I63862r0262k90388k90279L2943L74361L88417J24731j24199k19932j94658
$$ 963862 873600 583212 292933 325876 700237 1088654 1213385 1089186 869254 674596
36890F74596n7505J37057J77785m5379k95015k99368j67998j49410j46397O6307
$$ 674596 617091 754148 931933 886554 591539 292171 124173 -25237 -171634 -105327
36880a05327K69592K8900m97986o06155n2547N54585O04197J92641k61331n62634
$$ -105327 164265 193165 -304821 -910976 -963523 -408938 195259 387900 126569 -436065
36870d36065n95108k05943L55284M37119q0895m00363N4538O48302M63863k16621
$$ -436065 -1031173 -1237116 -881832 -444713 -525608 -925971 -871433 -223131 240732 24111
36860B4111l24023L05161O84089K16754m61865n09875K692M18237L92996O3493
$$ 24111 -299912 5249 689338 906092 444227 -65648 -62956 355281 748277 811770
36850H11770l00151m53199k65267R1075K60427J49511K787j8790l253R878R6809
$$ 811770 511619 58420 -206847 -115772 144655 294166 296953 278163 274910 284788 381597
36839C81597J58390K15k17199r7595L02044M35641J04210k27901j98062m9889
$$ 381597 539987 540202 323003 225408 527452 963093 1067303 839402 641340 591451
36829E91451m7165K7481L40648N06314J62489l62562n16448l24410j90598j95762
$$ 591451 544286 571767 912415 1418729 1581218 1218656 702208 377798 187200 -8562
36819h562j35351j1458L6582P7915J88741J56981j23552k61073P4376M96728M39055
$$ -8562 -143913 -155371 -118789 -40874 147867 304848 181296 -79777 -5401 491327 930382
36808I30382N9405j00015r4609l71801p48949n68192R8882L94723L4775k34163
$$ 930382 989787 889772 795163 423362 -325587 -893779 -794897 -400174 -365399 -599562
36798e99562J02886N11984L76056k0354j12466l127q4955k42484j67124n2855
$$ -599562 -496676 15308 391364 371010 258544 255417 170462 -72022 -239146 -292001
36788b92001k22521l81829l5913N55899O52430J88310j34277L0270K17973K3168
$$ -292001 -514522 -896351 -932264 -376365 276065 464375 330098 360368 578341 601509
36778F01509k78161l08366k16894l00731m22626k74636N8260K49998K72479L50212
$$ 601509 323348 14982 -201912 -502643 -925269 -1199905 -1141645 -891647 -619168 -268956
36768b68956M68829L60857N580k43605j53709P5995J68950J70516K45542K87942
$$ -268956 199873 560730 566310 322705 168996 244991 413941 584457 829999 1117941
36758A117941P7711k61991l58286j76308j00241k66867k60722J79651N57290K80788
$$ 1117941 1195652 933661 575375 399067 298826 31959 -228763 -49112 508178 788966
36748G88966l21432l71205K11249N30592R9424m09432k75653J19548j405m63402
$$ 788966 467534 96329 307578 838170 937594 528162 252509 372057 370652 -92750
36738i2750m16781K35314O33620K79926k71689l21548M5174L05771K61308N3563
$$ -92750 -509531 -274217 359403 639329 367640 46092 91266 397037 658345 711908
36728G11908j89028l47417k58413J4240J34963q814r4817O2220J15460k31249
$$ 711908 522880 175463 -82950 -68710 66253 57439 -37378 24842 140302 -90947
36718i0947o02657m37943J40836N01130M05608J93909J18086N2774q7452j48936
$$ -90947 -693604 -1131547 -990711 -489581 -83973 109936 228022 280796 193344 44408
36708D4408p0947K045L2725J18780J53075q5117m08146l14388K00308M65791R1281
$$ 44408 -26539 -24494 8231 127011 280086 194969 -213177 -527565 -327257 138534 229815
36697B29815m08058l72096M9514K43054J10087P9245K97879M43837L46454K23147
$$ 229815 -178243 -550339 -500825 -257771 -147684 -68439 229440 673277 1019731 1242878
36687A242878J88701L9353k75897m09828j34579K18116J74813k09083m34542k49680
$$ 1242878 1431579 1470932 1195035 785207 650628 868744 1043557 834474 399932 150252
36677A50252N4649J02584n3536o9857J31835K14158m6224l13179j07822M10691
$$ 150252 204901 307485 253949 184092 315927 530085 483861 170682 62860 473551
36667D73551N44281O6708l63239j57655K74163J34788m99798p52237k53452L46268
$$ 473551 1017832 1084540 721301 563646 837809 972597 472799 -279438 -532890 -186622
36657a86622L73034P371j75271m6755J13688J64288J84354K06515J93226J43331
$$ -186622 186412 193783 18512 -28243 85445 249733 434087 640602 833828 977159
36647I77159J7145k42276m55799k95565J49106K78733j92601o89644n18667J39085
$$ 977159 994304 752028 296229 664 149770 428503 235902 -453742 -972409 -833324
36637h33324N21026L63967Q9823N849m3884j68106j60594O3672K29447J25621
$$ -833324 -312298 51669 141492 147341 103457 -64649 -225243 -161571 67876 193497
36627A93497r0821k11204k64604k94293j62029J83967M92177M99272K65936L4920
$$ 193497 102676 -108528 -373132 -667425 -829454 -645487 -153310 345962 611898 646818
36617F46818q5295j31927j35607j14750j08057j03605m5894L3712M5412K8668
$$ 646818 561523 429596 293989 179239 71182 -32423 -78317 -44605 807 29475
36607B9475J06031K14513J44613p6360j41272N1786J79609j4655k85826k48721
$$ 29475 135506 350019 494632 418272 277000 328786 508395 493740 207914 -40807
36597d0807J8044Q7005j66694l67669j62288K94756N22196L00567o4997j41587
$$ -40807 -22763 64242 -102452 -470121 -632409 -337653 184543 485110 420113 278526
36587B78526N2164Q1389k23863m36331j69603K45477K28589q7558m9479L58509
$$ 278526 330690 412079 188216 -248115 -417718 -172241 56348 -31210 -80689 277820
36577B77820L66089k97155p92894m02600L44074N17007J98963J42867L96944L18583
$$ 277820 643909 346754 -446140 -848740 -504666 12341 211304 354171 751115 1069698
36567A069698j56744l33913J4892K41164l6874k97009j02472R7407j86727n19434
$$ 1069698 912954 579041 593933 835097 798223 501214 398742 496149 309422 -210012
36557b10012k35767L61320L92871k17688o32723l79213N1155P7365j54039j66099
$$ -210012 -445779 -84459 308412 90724 -541999 -921212 -870057 -792692 -946731 -1112830
36547a112830J04207L45705L72473K41270M3147j37676j68595j2220J42540R0825
$$ -1112830 -1008623 -662918 -290445 -49175 -6028 -143704 -312299 -324519 -181979 -91154
36537i1154r2211j39164M7648K78014L28134J86123O676q6109r2255q0579j02096
$$ -91154 -183365 -322529 -274881 3133 331267 517390 524066 437957 345702 265123 163027
36526A63027j53301j77037q4291J66282M46766M74712R8980m10037n46089j64879
$$ 163027 9726 -167311 -251602 -85320 361446 836158 935138 525101 -20988 -185867
36516a85867K75415K71291p1556k27759j5833K01503J26741n9046p5456J6338
$$ -185867 89548 360839 289283 61524 45691 247194 373935 314889 239433 255771
36506B55771K8377M889K5024r0631m40457o10534j39077O43712Q57358K75889
$$ 255771 284148 289037 314061 223430 -217027 -827561 -966638 -322926 534432 810321
36496H10321l10438k17764K04887K18605j82345l80930j28343J83728J86553m7363
$$ 810321 499883 282119 487006 705611 523266 142336 13993 197721 384274 336911
36486C36911k72023l27073j11981K97840N09329K15197k52790k59274J89909L91242
$$ 336911 64888 -262185 -374166 -76326 433003 648200 395410 136136 326045 717287
36476G17287m508m67572m29114j05403l6374k38627l43936k61335j50113L1270
$$ 717287 712779 245207 -183907 -289310 -325684 -564311 -908247 -1169582 -1319695 -1288425
36466a288425L71963N60539K09180l98010m88462J47526Q06444P74593J72536
$$ -1288425 -916462 -355923 -146743 -544753 -1033215 -885689 -79245 695348 867884
36457H67884l32815l43073j6441K44185J88655p7023j96494J6942K96960K62519
$$ 867884 535069 191996 175555 419740 608395 531372 334878 351820 648780 911299
36447I11299l0273j88646j01651n6869j87362k44341p9698P0943K6058j2190J32222
$$ 911299 881026 692380 590729 533860 346498 102157 22459 93402 119460 107270 239492
36436B39492K21542n350l35295l78008j59873j6351l9301m2123J7443l824p9809
$$ 239492 461034 455684 120389 -257619 -417492 -433843 -473144 -515267 -497824 -501648 -581457
36425e81457j4981J74604K47114J62309J65003L24601L30176m9129n50025p09750
$$ -581457 -596438 -421834 -174720 -12411 152592 477193 807369 758240 208215 -501535
36415e01535m40464q7405L3697k2401K6911L07116O03178N79452J78934k69250
$$ -501535 -941999 -1029404 -995707 -1018108 -991197 -684081 -80903 498549 677483 408233
36405D08233m07642k42647o5285m5387p4035k117J40371K15205J43310m2546k17131
$$ 408233 591 -242056 -307341 -352728 -426763 -428880 -288509 -73304 70006 27460 -189671
36394a89671k20923m819K78546M42655N11301O38590P88756P12691L26507q8693
$$ -189671 -410594 -415413 -136867 305788 817089 1455679 2244435 2957126 3283633 3194940
36384C194940k22879j38681j53501l82548n84132m88167j53764Q6597J8648j93201
$$ 3194940 2972061 2833380 2679879 2297331 1713199 1225032 1071268 1157865 1176513 983312
36374I83312k11369K0909J74876r876l08453k75231J28560M54897L64513J8042
$$ 983312 771943 792852 967728 957852 649399 374168 502728 957625 1322138 1340180
36364A340180k55159l96160m94702m64712j82814J49648J51401j81718l70113
$$ 1340180 1085021 688861 194159 -270553 -453367 -303719 -152318 -334036 -704149
36355g04149n5442M86446O44135K17412l24302l93860P183K90860L5932m34220
$$ -704149 -759591 -273145 370990 588402 264100 -129760 -122577 168283 204215 -230005
36345b30005m51530Q9332N67539M78117O6520j43741j15582j50448k08120L8737
$$ -230005 -681535 -592203 -24664 453453 519973 376232 260650 110202 -97918 -59181
36335e9181M96900O13552K13949j73111j23397M0168j62237n25572m56141R1716
$$ -59181 437719 1051271 1265220 1092109 968712 1008880 846643 321071 -135070 -43354
36325d3354N27857M41965L8914k83729l94908l73723l15662l07244l62324l28864
$$ -43354 484503 926468 965382 681653 286745 -86978 -402640 -709884 -1072208 -1401072
36315a401072p6575K21926K64327Q4572M3299K94240N55409N07277J62016k45104
$$ -1401072 -1477647 -1255721 -991394 -906822 -863523 -569283 -13874 493403 655419 410315
36305D10315m85281m06781n5168K31777J64213k9640J31005N71148O19578l322
$$ 410315 -74966 -481747 -536915 -305138 -140925 -170565 -39560 531588 1151166 1147844
36295A147844o67441o74004j82870J57804J54219J05852J46624J25019M5440R5675
$$ 1147844 480403 -193601 -376471 -218667 -64448 41404 188028 313047 358487 454162
36285D54162K29631J75068r5210k78155j85966L0614J44630Q4767r2893k42339
$$ 454162 683793 858861 763651 485496 299530 330144 474774 559541 466648 224309
36275B24309j96129q746Q601k51258m11632j46973K35424K19337j02494j91448
$$ 224309 28180 19434 28035 -223223 -634855 -781828 -546404 -327067 -429561 -621009
36265f21009O8502K73529K39559K06410K54412J49996j08753k00897q1597o9198
$$ -621009 -552507 -278978 -39419 166991 421403 571399 462646 261749 180152 110954
36255A10954j86917p5183K42855K36320j82002l31240J56303O44599M64506o7478
$$ 110954 -75963 -151146 91709 328029 146027 -185213 -28910 615689 1080195 1012717
36245A012717k78533k22352l50154n45158l54807P9364J91201k5328k2398L06957
$$ 1012717 734184 511832 161678 -383480 -738287 -658923 -467722 -493050 -515448 -208491
36235b08491M13544J2092m37723m01916N2737M60241M83687J17754l41283m70712
$$ -208491 205053 217145 -220578 -622494 -569757 -109516 374171 491925 150642 -320070
36225c20070j32936K97182L67911J18583p8075q3350l3262K9592J40081J59576
$$ -320070 -453006 -155824 212087 330670 252595 169245 135983 165575 305656 465232
36215D65232k3877j88113j21239p8198l52917o03659k85415L65524N44526Q2343
$$ 465232 441355 253242 132003 53805 -299112 -902771 -1188186 -822662 -278136 -195793
36205a95793l35439k46699N8744K49749M05441N00016K21630l21048m43062J03798
$$ -195793 -531232 -777931 -719187 -469438 -63997 436019 657649 336601 -106461 -2663
36195b663O12570M18529j74731m96196m72895l99932k48267J24941M47067L75968
$$ -2663 609907 1028436 853705 357509 -115386 -515318 -763585 -638644 -191577 184391
36185A84391J07912M4983J16572K1832j13132L2293K78128J62237k34896l45961
$$ 184391 292303 337286 453858 475690 362558 394851 672979 835216 600320 254359
36175B54359l854L32263L03154N5349j76101l78869n07452l73887l792K50349
$$ 254359 250505 582768 885922 941271 765170 386301 -121151 -495038 -498830 -248481
36165b48481J60265p1422j17712P0098K93566L68392K59241Q1234N469O2367Q2526
$$ -248481 -88216 -159638 -277350 -207252 86314 454706 713947 795181 800650 863017 945543
36154I45543m1892j47617m5572J45861J67572K4098o5338n5159j06107k48812
$$ 945543 903651 756034 710462 856323 1023895 1047993 982655 927496 821389 572577
36144E72577l10413j98235j1449J36810J91778Q9398j44308k78669j30822J15598
$$ 572577 262164 63929 52480 189290 381068 470466 326158 47489 -83333 32265
36134C2265J31549o5814j64780p0432K435l3224q98J40708J49973o0371j68846
$$ 32265 163814 98000 -66780 -137212 -134777 -168001 -168899 -28191 121782 61411 -107435
36123a07435J11865N59425O82315L31037j47705l30465j43614J24110J50800r5060
$$ -107435 4430 563855 1246170 1577207 1429502 1099037 955423 1079533 1230333 1135273
36113A135273l52129l75075j77140O6626K37584K97398K19169M3461r1128j15201
$$ 1135273 783144 408069 230929 297555 535139 832537 1051706 1095167 1004039 888838
36103H88838j24393j76681j44254O0901K83706L62115L92101N10396N98464M95737
$$ 888838 764445 587764 443510 504411 788117 1150232 1542333 2052729 2651193 3146930
36093C146930L26016K81111K66511J43359J28799M93453J031220J376679J707225
$$ 3146930 3472946 3754057 4020568 4163927 4292726 4786179 5817399 7194078 8901303
36084H901303K428755L146744K756897Q89258j370664k649335k722601k351273
$$ 8901303 11330058 14476802 17233699 18122957 16752293 14102958 11380357 9029084
36076I029084k086636j811991j310445p36565m01821l71462m29772l79627k79613
$$ 9029084 6942448 5130457 3820012 3083447 2681626 2310164 1880392 1500765 1221152
36067A221152k98128l48427j12634M01657O30532J66862n23929o29906j14808
$$ 1221152 923024 574597 461963 863620 1494152 1661014 1137085 507179 392371
36058C92371K92219K02445k0302n4667j01143k96376l28099l1764K05634P5388
$$ 392371 684590 887035 866733 812066 710923 414547 86448 54684 260318 335706
36048C35706j26637n3049Q9121l3430k68783k86437j22748L3519K12211L76539
$$ 335706 209069 156020 245141 211711 -57072 -343509 -466257 -432738 -220527 156012
36038A56012K17372k66898m73932p0840L43840J57694j90479M8352N61046M30706
$$ 156012 373384 106486 -367446 -438286 -94446 63248 -127231 -78879 482167 912873
36028I12873k55635m60159R7407M87257J33290k95671j10668K51278P1091l82277
$$ 912873 657238 197079 294486 781743 915033 619362 508694 759972 831063 448786
36018D48786l12834K78800N96739K48446k81644m15512j89517n173k5925n5105
$$ 448786 135952 414752 1011491 1259937 978293 562781 373264 368091 342166 287061
36008B87061J02217L26188L08226r431k66421j30469K02684K43801r8190m07426
$$ 287061 389278 715466 1023692 1014261 747840 617371 820055 1063856 965666 558240
35998E58240l77354j66445l5978N125L7149M4048O6501K25491M17370L20906q2830
$$ 558240 180886 14441 -21537 -16412 20737 64785 131286 356777 774147 1095053 1012223
35987A012223l51400k12740q431j54576m63083m36871m3200K78367L02654K55154
$$ 1012223 660823 448083 439652 285076 -178007 -614878 -658078 -379711 -77057 178097
35977A78097L18270L07899J9990l64410m56952j65526J60494J38455j71737l22095
$$ 178097 496367 804266 824256 459846 2894 -162632 -2138 136317 -35420 -357515
35967c57515m8194L57489M09917O4767k64783k84343j11975K7576P6535K6406
$$ -357515 -405709 -48220 361697 426464 161681 -122662 -234637 -207061 -130526 -104120
35957a04120j43920k77290j10645K90101M91700K92546K5616K2042J33160J10302
$$ -104120 -248040 -525330 -635975 -345874 145826 438372 463988 486030 619190 729492
35947G29492R8261L06543M76304K12379l02678m73353j44179K12578K13355J3285
$$ 729492 827753 1134296 1610600 1822979 1520301 1046948 902769 1115347 1328702 1341987
35937A341987p6918k6435M1310J04903J81407K13225J75212J52424K18586L63438
$$ 1341987 1265069 1238634 1279944 1384847 1566254 1779479 1954691 2107115 2325701 2689139
35927B689139N75979Q51765J114399J327122J705043K566175L814747M689719
$$ 2689139 3265118 4116883 5231282 6558404 8263447 10829622 14644369 19334088
35919A9334088M205925J974248j273026l963568m784605l793677k332749j620659
$$ 19334088 23540013 25514261 24241235 20277667 15493062 11699385 9366636 7745977
35911G745977j595404j412658p97501l24929m13464o99412o48682k90182Q7Q9709
$$ 7745977 6150573 4737915 3940414 3615485 3202021 2502609 1853927 1563745 1563832 1653541
35901A653541R5731L3551j73906m33492n06003k70835J65430N45207N80656J80655
$$ 1653541 1749272 1782823 1608917 1175425 669422 398587 564017 1109224 1689880 1870535
35891A870535l39151m86107j70153J62448J23489j43369k86772k75672l04670
$$ 1870535 1531384 1045277 875124 1037572 1161061 1017692 730920 455248 150578
35882A50578l75463l16202j12722Q2121J96213K37672J47837o8342j67583N8063
$$ 150578 -224885 -541087 -653809 -571688 -375475 -137803 10034 -58308 -225891 -167828
35872a67828L92702M11381O8989k45525k59211j02659N278N1333R4314Q8305k3462
$$ -167828 224874 636255 705244 459719 200508 97849 103127 154460 248774 337079 313617
35861C13617j96554l41736l66624j81652J46804L07019Q3782k42338j85427K33748
$$ 313617 117063 -224673 -591297 -772949 -626145 -319126 -235344 -477682 -663109 -429361
35851d29361M68591K44971n0105J2379L02759M47455L82263K30410n0685m62886
$$ -429361 39230 284201 234096 246475 549234 996689 1378952 1609362 1558677 1095791
35841A095791o58357l43245J49291K11547j57931l51751q0974K26176J39627j25261
$$ 1095791 437434 94189 243480 455027 297096 -54655 -135629 90547 230174 104913
35831A04913q8975K84060O05416O11277L80384Q9531j83149m07476n25365m72459
$$ 104913 15938 299998 905414 1516691 1897075 1986606 1803457 1395981 870616 398157
35821C98157k37661P9733K89581K84606J83475J67999K01158J00012j19816k34978
$$ 398157 160496 240229 529810 814416 997891 1165890 1367048 1467060 1347244 1112266
35811A112266j99382k35199m08664m28803j00279K87218L19104K1955k33397k56848
$$ 1112266 912884 677685 269021 -159782 -260061 27157 346261 368216 134819 -122029
35801a22029j56634l2344J18632K19429J47205l1963j18422q5431q7286j46909
$$ -122029 -278663 -311007 -192375 27054 174259 142296 23874 -61557 -148843 -295752
35791b95752r5053J19066K88866K13239p0215l68684m93442l22748R2300M46422
$$ -295752 -390805 -271739 17127 230366 160151 -208533 -701975 -1024723 -932423 -486001
35781d86001M15396M2803k90200l30828j85272k9569J51365L90582N29183L99601
$$ -486001 -70605 -27802 -318002 -648830 -834102 -863671 -712306 -321724 207459 607060
35771F07060J02228r8168j01640m9001r1625k01651k31070j13868K4540J4434
$$ 607060 709288 611120 509480 460479 368854 167203 -63867 -177735 -153195 -138761
35761a38761q3865R911L79523O55167M29750j45274m95427l51058o297J88773
$$ -138761 -222626 -212715 166808 821975 1251725 1106451 611024 259966 253669 442442
35751D42442K15183J45429p2737l49795l40453O3186M11548K60269j64748l00381
$$ 442442 657625 803054 730317 380522 40069 103255 514803 775072 610324 309943
35741C09943j00876n5908l46744m96381q5592N40351O31653l780o94088o50093
$$ 309943 209067 153159 -193585 -689966 -775558 -235207 396446 392666 -301422 -951515
35731i51515J11971P58185N89720j46462n99047l83515K9596Q5900q8797j8513
$$ -951515 -839544 -81359 508361 361899 -237148 -620663 -591067 -505167 -593964 -612477
35721f12477L01199L78984j3420m73983m80497m333N12564O31244K81774k20535
$$ -612477 -311278 67706 54286 -419697 -900194 -904527 -391963 239281 521055 300520
35711C00520m63450l17908l6216Q1196L3116J7052R0225J22131L1048j21838k47630
$$ 300520 -162930 -480838 -517054 -435858 -402742 -385690 -295465 -173334 -142286 -264124 -511754
35700e11754k79086j54366Q1961K26320J50347J8667O5407K22117K10045l2952
$$ -511754 -790840 -945206 -863245 -636925 -486578 -467911 -402504 -180387 29658 -3294
35690c294k64379k72834q6069J46130K78496K15956L1962k9070J16864J83887
$$ -3294 -267673 -540507 -626576 -480446 -201950 14006 45968 16898 133762 317649
35680C17649p3992l90603l25587K1770J28952j15711k35892M4448L62722L18007
$$ 317649 243657 -146946 -472533 -450763 -321811 -437522 -673414 -628966 -266244 51763
35670E1763N5168o5382o073P5589J72830K94634K52323n6361l59747l54232j54670
$$ 51763 106931 41549 35476 111065 283895 578529 830852 774491 414744 60512 -94158
35659i4158p4100j29029j15403l3539o1481j81447j88046m4519P5349Q5781N3137
$$ -94158 -168258 -297287 -412690 -446229 -507710 -689157 -877203 -921722 -846373 -760592 -707455
35648g07455j5860j69035k92494j81286J25890L25064K34771J5314p4744J0226
$$ -707455 -723315 -892350 -1184844 -1366130 -1240240 -915176 -680405 -665091 -739835 -729609
35638g29609J15130J09751L2665L3475J75235L10901K50200N4882o390J32251
$$ -729609 -614479 -504728 -472063 -438588 -263353 47548 297748 352630 346240 478491
35628D78491J86561n5061l63118l58082l7184K41108K30286L1987j05326m9002
$$ 478491 665052 609991 246873 -111209 -148393 92715 323001 354988 249662 200660
35618B00660J28428K14484Q5717p5411J8865K66078J91787l31678p44410n42693
$$ 200660 329088 543572 629289 553878 572743 838821 1030608 698930 -45480 -588173
35608e88173n0489M7150k74416m10229r6427K73628L74622L89907N12564N25646
$$ -588173 -638662 -591512 -865928 -1276157 -1372584 -1098956 -724334 -334427 178137 703783
35598G03783K11271j94628l13870j55933k4907n7118j22679r3698P592R4895J25314
$$ 703783 915054 720426 406556 250623 225716 168598 45919 -47779 -40187 54708 180022
35587A80022J36705J97071K61504J52838j60048l70015j90199J59144J73792k18206
$$ 180022 316727 513798 775302 928140 768092 398077 207878 367022 540814 322608
35577C22608n50868n00164k58735r5812K9678J92378K40541J10715N2038K05166
$$ 322608 -228260 -728424 -987159 -1082971 -1053293 -860915 -620374 -509659 -457621 -252455
35567b52455K79336K4080k74507k14257M3180K8003k33767k33938J75833M92293
$$ -252455 26881 50961 -223546 -437803 -394623 -366620 -600387 -834325 -658492 -166199
35557a66199L03453r0013r6129L55296P26821N49345l3827m60541l95061o8977
$$ -166199 137254 47241 -48888 306408 1033229 1582574 1548747 1088206 693145 624168
35547F24168O4530r2990k43529k03321j63435l03752m26958k52958R8038K36555
$$ 624168 688698 595708 352179 148858 -14577 -318329 -745287 -998245 -900207 -663652
35537f63652M8866j76724j56478Q8297L29708L42250N5109l16287l71892J1090
$$ -663652 -614786 -791510 -947988 -859691 -529983 -187733 -132624 -448911 -820803 -809713
35527h09713M10237L36938r1774l08862j01130J53096J31368K2107J04397K31039
$$ -809713 -399476 -62538 -154312 -463174 -564304 -411208 -279840 -257733 -153336 77703
35517G7703Q1929k60547l52796K1859N64486P91969N10892l6824l81054j91019
$$ 77703 159632 -100915 -453711 -431852 132634 924603 1435495 1398671 1017617 826598
35507H26598M36672J023249J104199O15308j00593o23283p84593p39674p42677
$$ 826598 1263270 2286519 3390718 4006026 3905433 3282150 2497557 1757883 1015206
35498A015206q16330o86230j60106M69667O31398J64797m12769n06136j42417
$$ 1015206 198876 -487354 -647460 -177793 453605 618402 205633 -300503 -442920
35489d42920J59095J04824p8695o8371J29165K87952K77581J07650j72829m25516
$$ -442920 -283825 -179001 -257696 -326067 -196902 91050 368631 476281 303452 -122064
35479a22064m03338l2548L42003K81010j41977l50450j8712M56226M76048K6528
$$ -122064 -525402 -557950 -215947 65063 -76914 -427364 -446076 10150 486198 512726
35469E12726l71979l74338j15143J51654L32088L64438J94441j766O3856K90931
$$ 512726 140747 -233591 -348734 -197080 135008 499446 693887 692121 755977 1046908
35459A046908K03675k98646o33940l61920Q1411J5128m13165m64201m544K86364
$$ 1046908 1250583 951937 317997 -43923 37488 52616 -360549 -824750 -829294 -542930
35449e42930K4688k83958r4760L23317L67282K4062k21356j66147n3540m9339
$$ -542930 -518242 -802200 -896960 -573643 -206361 -182299 -403655 -569802 -623342 -672681
35439f72681k9949Q1799J54166J06255L9958J8637m8751j95068k58954r6633J82195
$$ -672681 -702630 -620831 -466665 -360410 -320452 -301815 -350566 -545634 -804588 -901221 -719026
35428g19026L13748J84661k7044k9357K49280N16089M00978p2299m37897l24866
$$ -719026 -405278 -220617 -247661 -277018 -27738 488351 889329 817030 379133 54267
35418E4267Q3249K95151J24930j49730k01675r550K10788K36772k0701m14608
$$ 54267 137516 432667 557597 407867 206192 196642 407430 644202 623501 208893
35408B08893n67315k03202M28921O84704K48732m30759o46382k69218J71056K19608
$$ 208893 -358422 -561624 -132703 552001 800733 369974 -276408 -545626 -374570 -154962
35398a54962J8636k2650J66766L05032K42427J43335J28042L5349k49241m53032
$$ -154962 -136326 -158976 7790 312822 555249 698584 826626 861975 612734 159702
35388A59702k36245K27987L70878n498m30854m15968r0589Q3839o116r6923n5957
$$ 159702 -76543 151444 522322 516824 85970 -329998 -420587 -336748 -342864 -439787 -495744
35377d95744j0220J879J00624K30501J51577j03281j53164J30398L24433Q5626
$$ -495744 -505964 -504085 -403461 -172960 -21383 -124664 -277828 -147430 177003 262629
35367B62629k50128j55603K25217K70103j21210l41286m5485K79810Q2799l83518
$$ 262629 12501 -143102 82115 352218 231008 -110278 -155763 124047 206846 -176672
35357a76672m69143j15590J50641J01922P1879K57355L40688P0034k50865k24337
$$ -176672 -645815 -761405 -610764 -508842 -436963 -179608 161080 231114 -19751 -244088
35347b44088K3623J00028j5039l4078O3747l90k63729l86885j65250J79076L52541
$$ -244088 -220465 -120437 -135476 -169554 -105807 -106197 -369926 -756811 -922061 -742985 -390444
35336c90444L36373K34471O1082j42240k29540j84421k00857l27889k81591J10072
$$ -390444 -54071 180400 241482 99242 -130298 -314719 -515576 -843465 -1125056 -1014984
35326a014984M89512L66463j64506m88470k69910J63116L38759K31343J21829
$$ -1014984 -525472 -159009 -323515 -811985 -1081895 -918779 -580020 -348677 -226848
35317b26848R3487k3544k50092l08437j9459L40027L28616n0576l17992j87404
$$ -226848 -133361 -156905 -406997 -715434 -734893 -394866 -66250 -116826 -434818 -622222
35307f22222L5140l1545k06997n9207L08552L51612n754j78134J37369M39486
$$ -622222 -587082 -618627 -825624 -884831 -576279 -224667 -230421 -408555 -271186 168300
35297A68300K54432p2311o895K05655l0124n32562n17191J24992N91359L97325
$$ 168300 422732 350421 343526 549181 519057 -13505 -530696 -405704 185655 582980
35287E82980L7732N5834J68106j28691o01898n92556j5597N39544O05846K72370
$$ 582980 620712 676546 844652 715961 114063 -478493 -494090 45454 651300 923670
35277I23670j21761l35613k88274q8488L674j30079k79227k14532m8596l1603
$$ 923670 801909 466296 178022 89534 93208 -36871 -316098 -530630 -579226 -610829
35267f10829j31754j25207R123J10528J64590K70706L43900K04445o1523j83857
$$ -610829 -742583 -867790 -858667 -748139 -583549 -312843 31057 235502 173979 -9878
$$ [...]
##END NTUPLES=NMR SPECTRUM
##END=
