##TITLE=31Pdec_PR68_HCl
 D2O
  24 sc
 2.11.2023
##JCAMPDX= 6.0         $$ Bruker NMR JCAMP-DX V2.0
##DATA TYPE= NMR SPECTRUM
##DATA CLASS= NTUPLES
##ORIGIN= UXNMR, Bruker Analytische Messtechnik GmbH
##OWNER= root
$$ XWIN-NMR		Version 3.5
$$ Thu Nov  2 17:51:42 2023 Russian Standard Time (UT+4h)  she@DPX200
##.OBSERVE FREQUENCY= 81.013821
##.OBSERVE NUCLEUS= ^31P
##.ACQUISITION MODE= SIMULTANEOUS
##.ACQUISITION SCHEME= undefined
##.AVERAGES= 24
##.DIGITISER RES= 16
##SPECTROMETER/DATA SYSTEM= spect
##.PULSE SEQUENCE= zgpg30
##.SOLVENT NAME= CD2Cl2
##.SHIFT REFERENCE= (INTERNAL, CD2Cl2, 0, 248.564)
##AUDIT TRAIL= $$ (NUMBER, WHEN, WHO, WHERE, WHAT)
$$ ##TITLE= Audit trail, XWIN-NMR		Version 3.5
$$ ##JCAMPDX= 5.01
$$ ##ORIGIN= Bruker BioSpin GmbH
$$ ##OWNER= she
$$ F:/spectra/data/she/nmr/P31/1/pdata/1/auditp.txt
$$ ##AUDIT TRAIL=  $$ (NUMBER, WHEN, WHO, WHERE, WHAT)
(   1,<2023-11-02 17:50:29.09 +0400>,<she>,<DPX200>,
      <created by zg, POWCHK disabled, PULCHK disabled
       configuration hash MD5:
       00 E9 B6 7A A2 85 ED C7 34 08 36 98 17 FE 4E 26
       data hash MD5: 32K
       A1 D9 C5 FA 39 DE 80 DD 2C 3D F1 65 32 97 9B 63>)
(   2,<2023-11-02 17:50:34.78 +0400>,<she>,<DPX200>,
      <Start of raw data processing
       efp BC_mod = 2 LB = 5 FT_mod = 6 PKNL = 1 PHC0 = -10862.71 PHC1 = 676.2902 SI = 64K 
       data hash MD5: 64K
       0F 61 94 14 FB 87 72 5E C4 85 21 38 2C 09 62 70>)
(   3,<2023-11-02 17:50:55.35 +0400>,<she>,<DPX200>,
      <pk PHC0 = 0.8361941 PHC1 = 0 
       data hash MD5: 64K
       2C CD 7D 97 36 F8 8B 9D 1E D9 D2 2C 5B DE CB 56>)
(   4,<2023-11-02 17:51:03.81 +0400>,<she>,<DPX200>,
      <absd ABSG = 5 
       data hash MD5: 64K
       5E 98 D1 DF DF 90 9F 3F 94 59 35 C9 BC 70 A3 AD>)
(   5,<2023-11-02 17:51:06.87 +0400>,<she>,<DPX200>,
      <abs ABSG = 5 
       data hash MD5: 64K
       39 2B BF 3D 1D 1A FD 93 F7 CD B7 35 8A 99 65 8F>)
$$ ##END=
$$ 
$$ hash MD5
$$ 6E C3 A5 54 52 42 EA C5 64 CD 80 11 CE FD A4 08
##$RELAX= 
##$RELAX= 
##$RELAX= 
##$RELAX= 
##$RELAX= 
##$RELAX= 
##$RELAX= 
##$RELAX= 
##$RELAX= 
$$ Bruker specific parameters
$$ --------------------------
##$DU= <F:/spectra>
##$EXPNO= 1
##$NAME= <P31>
##$PROCNO= 1
##$TYPE= <nmr>
##$USER= <she>
##$AMP= (0..31)
100 100 100 100 100 100 100 100 100 100 100 100 100 100 100 100 100 100 
100 100 100 100 100 100 100 100 100 100 100 100 100 100 
##$AQSEQ= 0
##$AQ_mod= 1
##$AUNM= <au_zg>
##$AUTOPOS= <>
##$BF1= 81.014009
##$BF2= 200.13
##$BF3= 200.13
##$BF4= 200.13
##$BF5= 200.13
##$BF6= 200.13
##$BF7= 200.13
##$BF8= 200.13
##$BYTORDA= 1
##$CFDGTYP= 0
##$CFRGTYP= 5
##$CHEMSTR= <none>
##$CNST= (0..31)
1 1 145 1 1 1 1 1 1 1 1 1 1 1 1 1 1 1 1 1 1 1 1 1 1 1 1 1 1 1 1 1 
##$CPDPRG= <waltz16>
##$CPDPRG1= <>
##$CPDPRG2= <waltz16>
##$CPDPRG3= <>
##$CPDPRG4= <mlev>
##$CPDPRG5= <mlev>
##$CPDPRG6= <mlev>
##$CPDPRG7= <mlev>
##$CPDPRG8= <mlev>
##$CPDPRGB= <>
##$CPDPRGT= <>
##$D= (0..31)
0 1 0 0 0 0 0 0 0 0 0 0.03 2e-05 3e-06 0 0 0 0 0 0 0 0 0 0 0 0 0 0 0 0 
0 0 
$$ [...]
##$SUBNAM3= <"">
##$SUBNAM4= <"">
##$SUBNAM5= <"">
##$SUBNAM6= <"">
##$SUBNAM7= <"">
##$SUBNAM8= <"">
##$SUBNAM9= <"">
##$SW= 501.771253377433
##$SWIBOX= (0..15)
0 1 3 0 0 0 0 0 0 0 0 0 0 0 0 0 
##$SW_h= 40650.406504065
##$TD= 32768
##$TD0= 1
##$TE= 0
##$TE2= 300
##$TE3= 300
##$TEG= 300
##$TL= (0..7)
0 120 53 12 22 120 120 120 
##$TP= (0..7)
150 150 150 150 150 150 150 150 
##$TP07= 0
##$TPNAME0= <>
##$TPNAME1= <>
##$TPNAME2= <>
##$TPNAME3= <>
##$TPNAME4= <>
##$TPNAME5= <>
##$TPNAME6= <>
##$TPNAME7= <>
##$TPOAL= (0..7)
0.5 0.5 0.5 0.5 0.5 0.5 0.5 0.5 
##$TPOFFS= (0..7)
0 0 0 0 0 0 0 0 
##$TUNHIN= 0
##$TUNHOUT= 0
##$TUNXOUT= 0
##$USERA1= <user>
##$USERA2= <user>
##$USERA3= <user>
##$USERA4= <user>
##$USERA5= <user>
##$V9= 5
##$VALIST= <valist>
##$VCLIST= <CCCCCCCCCCCCCCC>
##$VD= 0
##$VDLIST= <DDDDDDDDDDDDDDD>
##$VPLIST= <PPPPPPPPPPPPPPP>
##$VTLIST= <TTTTTTTTTTTTTTT>
##$WBST= 1024
##$WBSW= 4
##$XGAIN= (0..3)
0 0 0 0 
##$XL= 0
##$YL= 0
##$YMAX_a= 153
##$YMIN_a= -537
##$ZGOPTNS= <>
##$ZL1= 120
##$ZL2= 120
##$ZL3= 120
##$ZL4= 120
##$ABSF1= 248.5645
##$ABSF2= -253.2056
##$ABSG= 5
##$ABSL= 3
##$ALPHA= 0
##$AQORDER= 0
##$ASSFAC= 0
##$ASSFACI= 0
##$ASSFACX= 0
##$ASSWID= 0
##$AUNMP= <proc_1d>
##$AZFE= 0.1
##$AZFW= 0.5
##$BCFW= 0
##$BC_mod= 2
##$BYTORDP= 0
##$COROFFS= 0
##$CY= -3
##$DATMOD= 1
##$DC= 0
##$DFILT= <>
##$DTYPP= 0
##$F1P= 0
##$F2P= 0
##$FCOR= 1
##$FTSIZE= 65536
##$FT_mod= 6
##$GAMMA= 0
##$GB= 0
##$INTBC= 1
##$INTSCL= 6.047779e-11
##$ISEN= 30
##$LB= 5
##$LEV0= 0
##$LPBIN= 0
##$MAXI= 10000
##$MC2= 0
##$MEAN= 0
##$ME_mod= 0
##$MI= 50
##$NCOEF= 0
##$NC_proc= -14
##$NLEV= 6
##$NOISF1= 182.463
##$NOISF2= 159.3651
##$NSP= 0
##$NTH_PI= 0
##$NZP= 0
##$OFFSET= 248.5645
##$PC= 4
##$PHC0= -10861.87
##$PHC1= 676.2902
##$PH_mod= 1
##$PKNL= yes
##$PPARMOD= 0
##$PSCAL= 0
##$PSIGN= 0
##$REVERSE= no
##$SF= 81.0140089999694
##$SI= 65536
##$SIGF1= 159.3651
##$SIGF2= -187.1042
##$SINO= 113.3802
##$SIOLD= 16384
##$SREGLST= <1H.CDCl3>
##$SSB= 0
##$STSI= 65536
##$STSR= 0
##$SW_p= 40650.406504065
##$SYMM= 0
##$S_DEV= 0
##$TDeff= 32768
##$TDoff= 0
##$TI= <>
##$TILT= no
##$TM1= 0
##$TM2= 0
##$TOPLEV= 0
##$USERP1= <user>
##$USERP2= <user>
##$USERP3= <user>
##$USERP4= <user>
##$USERP5= <user>
##$WDW= 1
##$XDIM= 65536
##$YMAX_p= 366218679
##$YMIN_p= -171638458
$$ End of Bruker specific parameters
$$ ---------------------------------
##NTUPLES= NMR SPECTRUM
##VAR_NAME=  FREQUENCY,     SPECTRUM/REAL,   SPECTRUM/IMAG
##SYMBOL=    X,             R,               I
##VAR_TYPE=  INDEPENDENT,   DEPENDENT,       DEPENDENT
##VAR_FORM=  AFFN,          ASDF,            ASDF
##VAR_DIM=   65536,         65536,           65536
##UNITS=     HZ,            ARBITRARY UNITS, ARBITRARY UNITS
##FACTOR=    0.620285442955139, 1,           1
##FIRST=     20137.2065510682, 0,            0
##LAST=      -20513.1999529968, 0,           0
##MIN=       -20513.1999529968, -171638458,  0
##MAX=       20137.2065510682, 366218679,    0
$$ Real data points
##PAGE= N=1
##DATA TABLE= (X++(R..R)), XYDATA
$$ [...]
39166e898499l10759O10374J268879J505806J333402R76358O74080L89660j40090
39157D09211r94349j820652k085020j530101l77786Q36622J618183J813617J628666
39148e01609J320456R07189K73666m94648j076771j255350j130119r36960q11213
39139c705359p95565q88931r34403o05582K72565J407255K214561K371903K124153
39130A460597J986260K142825K183738J534182K05928j019196j361235r32921
39122F200178n82475q41384j388816j705861j854938k219526k704676k698870
39114g796368j859860n66556N12913J040416J126450J114883J392970K175632
39106b859520L250471M023723L976573L056612J591939m6425j596860k843306
$$ plain form
39166 -5898499 -6209258 -5598884 -4330005 -2824199 -1490797 -514439 159641 549301 409211
39157 409211 -585138 -2405790 -4490810 -6020911 -6398697 -5562075 -3943892 -2130275 -501609
39148 -501609 818847 1726036 1999702 1505054 428283 -827067 -1957186 -2894146 -3705359
39139 -3705359 -4500924 -5389855 -6324258 -6929840 -6657275 -5250020 -3035459 -663556 1460597
39130 1460597 3446857 5589682 7773420 9307602 9513530 8494334 7133099 6200178
39122 6200178 5617703 4776319 3387503 1681642 -173296 -2392822 -5097498 -7796368
39114 -7796368 -9656228 -10222784 -9709871 -8669455 -7543005 -6428122 -5035152 -2859520
39106 -2859520 390951 4414674 8391247 11447859 13039798 12993373 11396513 8553207
39098H553207l574986l655387l126160k259632j439841q55141l32600L40368R27697
39089e422475Q44347j15127j361660k037907j839072j132891m19997M0004J26798
39080a1317980k55903j010969j707847j803235j064727K02343J341993J840708
39072a3775617J720179J401475J143280P53934j4280r58001j578439j673054j462504
39063a4443027j112514m68496N83852J749206K498021K436201J396910n26235
39055g886082k762245m338898m614338l909441l093014k578674k084086j352232
39047c2619010o07149q2534M68953J396852K513602L247216L344629L047964K594230
39038a6695247J941325J112776M72752L88778P54482J059155Q99919L21393l01112
$$ plain form
39098 8553207 4978221 1322834 -1803326 -4062958 -5502799 -6357940 -6690540 -6350172 -5422475
39089 -5422475 -4578128 -4693255 -6054915 -8092822 -9931894 -11064785 -11484782 -11444778 -11317980
39080 -11317980 -11573883 -12584852 -14292699 -16095934 -17160661 -16958318 -15616325 -13775617
39072 -13775617 -12055438 -10653963 -9510683 -8756749 -8771029 -9729030 -11307469 -12980523 -14443027
39063 -14443027 -15555541 -16024037 -15440185 -13690979 -11192958 -8756757 -7359847 -7886082
39055 -7886082 -10648327 -14987225 -19601563 -23511004 -26604018 -29182692 -31266778 -32619010
39047 -32619010 -33226159 -33308693 -32839740 -31442888 -28929286 -25682070 -22337441 -19289477 -16695247
39038 -16695247 -14753922 -13641146 -13168394 -12779616 -12025134 -10965979 -10066060 -9744667 -10045779
39029a0045779o34769o83433p28706r00820q55125j14977J188866K212858K288359
39020h273526J738895J510461K064700K921515L244185K563005R47886j109856
39012E607265k809057l375329k622317j116836L36735J256391J507667J127122
39004h8359M02527j25609j45164J2058k39255r78840j731350k130939k239342
38995g264273k135409j599782m42198J122249K658004L879706M637896M746136
38987E602329M120881L025011J933478J158530P28532N44455M81701M04680K57197
38978A8256794R3615j18371o16476j537934k542626k990562k541416j436799k33818
38969F332407N34002M93391m06734j694671k545910k381324j310861l55P86951
$$ plain form
39029 -10045779 -10680548 -11363981 -12092687 -12993507 -13848632 -13963609 -12774743 -10561885 -8273526
39020 -8273526 -6534631 -5024170 -2959470 -37955 3206230 5769235 6717121 5607265
39012 5607265 2798208 -577121 -3199438 -4316274 -3979539 -2723148 -1215481 -88359
39004 -88359 314168 188559 43395 55453 -183802 -1162642 -2893992 -5024931 -7264273
38995 -7264273 -9399682 -10999464 -11441662 -10319413 -7661409 -3781703 856193 5602329
38987 5602329 9723210 12748221 14681699 15840229 16568761 17113216 17594917 17999597 18256794
38978 18256794 18350409 18232038 17615562 16077628 13535002 10544440 8003024 6566225 6332407
38969 6332407 6866409 7359800 6953066 5258395 2712485 331161 -979700 -980055 -193104
38960a93104N80872n56730k025693l081588l368252k983271k077007p17828P46094
38951a3676507J602041J396297M17548p62788j993444l356594m470273m606417
38943b5450137l634186k340647j538363j197212p45220N2281Q61863J274721J196314
38934c1520586P83437K53851k05184m62406l68806L43948J852393L742143M972729
38925b0608481M734577L307257J749268P59482J91183l03407o17768m25862K61586
38916a0952165J109274J845262K328900K360004J768709P03541m37556j403449
38908b677480k201666k786382k881699k241097r38931O74824K159570L067907
38900g824954L096921K396089J616622J398950J786960K291960K503189K434746
$$ plain form
38960 -193104 387768 -168962 -2194655 -5276243 -8644495 -11627766 -13704773 -14422601 -13676507
38951 -13676507 -12074466 -10678169 -10260621 -11023409 -13016853 -16373447 -20843720 -25450137
38943 -25450137 -29084323 -31424970 -32963333 -34160545 -34905765 -34853484 -33991621 -32716900 -31520586
38934 -31520586 -30737149 -30483298 -30688482 -31150888 -31519694 -31175746 -29323353 -25581210 -20608481
38925 -20608481 -15873904 -12566647 -10817379 -10057897 -9866714 -10170121 -10787889 -11213751 -10952165
38916 -10952165 -9842891 -7997629 -5668729 -3308725 -1540016 -836475 -1274031 -2677480
38908 -2677480 -4879146 -7665528 -10547227 -12788324 -13727255 -13052431 -10892861 -7824954
38900 -7824954 -4728033 -2331944 -715322 683628 2470588 4762548 7265737 9700483
38892I700483K249328J887299J158524J13460q53463j307242j149193p26976n75257
38883A0496963r23082j374131j209895j81623J081750J674323J402304R27355
38875A1893964Q76124J088378R31162J39800r27513j768861k186078k254959k093588
38866E698429j741286j153398l23345M74457O76074m4746j219567j850029j347561
38857h30972j0641J459279K585281L144985L006071K299178J501775R65247N25511
38848A4645714n6421m75383k11075O01570J190333J104749O20253K4239r24920
38839A6519059k445868m078296n077505n231883m829212l975115k462854l51951
38831a1933625J737323L053781L240419K432478J101795j48378q93551j127509
$$ plain form
38892 9700483 11949811 13837110 14995634 15109094 14255631 12948389 11799196 11072220 10496963
38883 10496963 9573881 8199750 6989855 6808232 7889982 9564305 10966609 11893964
38875 11893964 12770088 13858466 14789628 14929428 14001915 12233054 10046976 7792017 5698429
38866 5698429 3957143 2803745 2480400 2954857 3630931 3586185 2366618 516589 -830972
38857 -830972 -841613 617666 3202947 6347932 9354003 11653181 13154956 14120203 14645714
38848 14645714 14589293 14113910 13902835 14504405 15694738 16799487 17419740 17443979 16519059
38839 16519059 14073191 9994895 4917390 -314493 -5143705 -9118820 -11581674 -11933625
38831 -11933625 -10196302 -7142521 -3902102 -1469624 -367829 -516207 -1409758 -2537267
38823b537267j101678r67017p64722o91411j005093j541149j617531o63364J164515
38814i724717L106661M396063M633620L818184K303845O86844n23182j227669
38806G469649j677281k097434k476478k718809k835402k827701k439158j275368
38798a0877982O21223K405859K953760J905891L5932j550595k382794k616976
38790i505682k381466j629615o06683Q4402J46046K230K84257J092050J973110
38781a0541351K437733K263264J479894L89011m37933m71871L31507J440861K099387
38772a009498J817081P37995l63675o71850j42466L89064J10830q76172j753887
38763a762578j878630j190277O5068J531357K639024K801243J995157R08253K69650
$$ plain form
38823 -2537267 -3638945 -4605962 -5370684 -6062095 -7067188 -8608337 -10225868 -10889232 -9724717
38814 -9724717 -6618056 -2221993 2411627 6229811 8533656 9220500 8697318 7469649
38806 7469649 5792368 3694934 1218456 -1500353 -4335755 -7163456 -9602614 -10877982
38798 -10877982 -10256759 -7850900 -4897140 -2991249 -2955317 -4505912 -6888706 -9505682
38790 -9505682 -11887148 -13516763 -14123446 -14039044 -13892998 -13890768 -13606511 -12514461 -10541351
38781 -10541351 -8103618 -5840354 -4360460 -3971449 -4409382 -4881253 -4549746 -3108885 -1009498
38772 -1009498 807583 1545578 1181903 510053 367587 756651 867481 -8691 -1762578
38763 -1762578 -3641208 -4831485 -4766417 -3235060 -596036 2205207 4200364 5108617 5378267
38754E378267J67434J73777l4503m08610p95176j231704j899733k842810l753539
38745e246597m061608l333437j669204L13446J924966K835700L124864L030287
38737c081583K707345K171349J405268M97447l54213r70807j247603j073932l81905
38728c28634N75104J156237Q29390k66619j458917k215796k461918k266878j581788
38719h019819m40872Q24319J777046K176460K016704J455112Q05011L94868K82493
38710A271322K63017K50023M02401P13880P73923K51677n71304j101997j165254
38701A087688j082055j072390r67042n89101r9185J94934J74239n5045k87146
38692b695103k94405L0442M85538O66355M05974K4823L3080O23954J478872J978339
$$ plain form
38754 5378267 5545701 5719478 5684975 5276365 4481189 3249485 1349752 -1493058 -5246597
38745 -5246597 -9308205 -12641642 -14310846 -13997400 -12072434 -9236734 -6111870 -3081583
38737 -3081583 -374238 1797111 3202379 3699826 3345613 2374806 1127203 53271 -328634
38728 -328634 246470 1402707 2232097 1965478 506561 -1709235 -4171153 -6438031 -8019819
38719 -8019819 -8460691 -7636372 -5859326 -3682866 -1666162 -211050 593961 988829 1271322
38710 1271322 1534339 1784362 2186763 2900643 3674566 3926243 3354939 2252942 1087688
38701 1087688 5633 -1066757 -2033799 -2622900 -2722085 -2527151 -2352912 -2407957 -2695103
38692 -2695103 -2989508 -2959066 -2473528 -1807173 -1401199 -1376376 -1343296 -719342 759530 2737869
38682B737869J634141N51955m25655k77730J214504L075860L916993L149330J387646
38673A6964913k46593j082526j267460j438325k096566l152771l993224m065790
38665c78342l444837k750403k489213k564729k455951j747632m19915J216441
38657a5034581K675604L459433L328728K535289J669383J152936R07192N67561
38649A261545l6940o91796j034460q96369m24073P2312L98814O52877J098396
38640D00306J832862K645371L277431L727708M127403M342959L938715K674052
38632B6966807R28569n36107j278208j596949k209838l454360m792529n215425
38624H811960m251101k481741r01488J29648J011450K038609K847017K923141
$$ plain form
38682 2737869 4372010 4923965 4498310 4220580 5435084 8510944 12427937 15577267 16964913
38673 16964913 16718320 15635794 14368334 12930009 10833443 7680672 3687448 -378342
38665 -378342 -3823179 -6573582 -9062795 -11627524 -14083475 -15831107 -16251022 -15034581
38657 -15034581 -12358977 -8899544 -5570816 -3035527 -1366144 -213208 693984 1261545
38649 1261545 1224605 532809 -501651 -1398020 -1822093 -1749781 -1350967 -698090 400306
38640 400306 2233168 4878539 8155970 11883678 16011081 20354040 24292755 26966807
38632 26966807 27895376 27359269 26081061 24484112 22274274 18819914 14027385 8811960
38624 8811960 4560859 2079118 1177630 1307278 2318728 4357337 7204354 10127495
38616A0127495K318439J532837R17781N55277N48360R56230J439683J434415Q50092
38607B0680609K57488J49313K53786j60856j431617l155914m579351n114644m592982
38598B305832l324810j991955j248562j226625j451717j326540o83331J79861
38590h767847R41927J596888K306317L042541L527131L483789K788727J399670
38582A0319143n72575k569738l649345l221683j687407l3720J212231K313699
38574B110605L564126M602617M770469L913135K496972J033597k84137j373880
38566B0833504k024951k064336j640585j158095q91044p29245l88063R8251J94836
38557A2230272o29700k171530l467809l693372l005065k332954k392953l076221
$$ plain form
38616 10127495 12445934 13978771 14896552 15451829 16000189 16956419 18396102 19830517 20680609
38607 20680609 20938097 21087410 21341196 21180340 19748723 16592809 12013458 6898814 2305832
38598 2305832 -1018978 -3010933 -4259495 -5486120 -6937837 -8264377 -8947708 -8767847
38590 -8767847 -7825920 -6229032 -3922715 -880174 2646957 6130746 8919473 10319143
38582 10319143 9746568 7176830 3527485 305802 -1381605 -1415325 -203094 2110605
38574 2110605 5674731 10277348 15047817 18960952 21457924 22491521 22207384 20833504
38566 20833504 18808553 16744217 15103632 13945537 13054493 12325248 11937185 12035436 12230272
38557 12230272 11600572 9429042 5961233 2267861 -737204 -3070158 -5463111 -8539332
38549h539332l756004l949685l614711k996791k339863j679481q41870L01643
38541b7416094J552041K448733K668546K278195J580739Q86879N33827R04974
38533a4562160K117033L682848M744893M782382L998310K973767K093855J391424
38525A1222352P66854J52044m69672r89049j108628n57649N31220J563933J897917
38516A3009322J306949R6035j087411j555900r58321M14173J750806K312409J923129
38507A7211191Q65907n42686k094244l522620m497424m876793m799351m427685
38499f683705l725290k610086j267469j77637K29842l8146m93462n43493L7748
38490a5271698J006264J978707K741176L182378L125760K489959J585599R82979
$$ plain form
38549 -8539332 -12295336 -16245021 -19859732 -22856523 -25196386 -26875867 -27717737 -27416094
38541 -27416094 -25864053 -23415320 -20746774 -18468579 -16887840 -16000961 -15467134 -14562160
38533 -14562160 -12445127 -8762279 -4017386 764996 4763306 7737073 9830928 11222352
38525 11222352 11989206 12141250 11671578 10682529 9573901 9016252 9547472 11111405 13009322
38516 13009322 14316271 14412306 13324895 11768995 10810674 11224847 12975653 15288062 17211191
38507 17211191 18077098 17534412 15440168 11917548 7420124 2543331 -2256020 -6683705
38499 -6683705 -10408995 -13019081 -14286550 -14464187 -14234345 -14272491 -14765953 -15309446 -15271698
38490 -15271698 -14265434 -12286727 -9545551 -6363173 -3237413 -747454 838145 1821124
38482A821124R54249J157381R65415P1665j234168k325232k791516k797631k811985
38473f990698k904512k522662j237455M60404J575948J851859K091641L001550
38465d673925M134834M401087L397216J806189N47377j02967n31652j238075k373476
38456E366608l672842m738069n356381n448780m761034k977928m01483J790434
38448b0199475K449927J624719M84450Q0779M99514J241015K001334K817829L667722
38439e332186M218239M004359K806210Q97548j073352k518568l219375l196310
38431c413435k475765j202091J66818J103502J443310J342445R19422L02037o7518
38422a881275K68561J049582J402122R73299M74897O57712J139345Q76647l35033
$$ plain form
38482 1821124 2775373 3932754 4898169 4969834 3735666 1410434 -1381082 -4178713 -6990698
38473 -6990698 -9895210 -12417872 -13655327 -13194923 -11618975 -9767116 -7675475 -4673925
38465 -4673925 -539091 3861996 7259212 9065401 9612778 9509811 8978159 7740084 5366608
38456 5366608 1693766 -3044303 -8400684 -13849464 -18610498 -21588426 -21989909 -20199475
38448 -20199475 -17749548 -16124829 -15640379 -15559600 -15060086 -13819071 -11817737 -8999908 -5332186
38439 -5332186 -1113947 2890412 5696622 6594170 5520818 3002250 -217125 -3413435
38431 -3413435 -5889200 -7091291 -6924473 -5820971 -4377661 -3035216 -2115794 -1813757 -1881275
38422 -1881275 -1612714 -563132 838990 1812289 2287186 2944898 4084243 4960890 4625857
38413D625857j474843j536468o77336J33728L28976K86354P19441J745171K678960
38404F829840K772965K068974J323366J030436Q03933K0931j096408j506330n63913
38395A1683794J133542K329215K291431J162854o45790k915880n320800p043134
38387B675232p186662n699718l628609k209246j777920j750783j534302j081033
38379b2193041n10633L41604J620162K932401L605463L483949L128187L121495
38371d470413L437376L603739L262797K412087J274391J30710q12204j578332
38363G260151k418773l490693m509975m838174m014079k241784l75237O19709
38355a4008855L26340q51730k031594k501966k114570j159591l877J099143J956319
$$ plain form
38413 4625857 3151014 1614546 937210 1070938 1399914 1686268 2405709 4150880 6829840
38404 6829840 9602805 11671779 12995145 14025581 14829514 14850445 13754037 12247707 11683794
38395 11683794 12817336 15146551 17437982 18600836 17955046 15039166 9718366 2675232
38387 2675232 -4511430 -10211148 -13839757 -16049003 -17826923 -19577706 -21112008 -22193041
38379 -22193041 -22703674 -22362070 -20741908 -17809507 -14204044 -10720095 -7591908 -4470413
38371 -4470413 -1033037 2570702 5833499 8245586 9519977 9650687 8838483 7260151
38363 7260151 4841378 1350685 -3159290 -7997464 -12011543 -14253327 -14628564 -14008855
38355 -14008855 -13682515 -14534245 -16565839 -19067805 -21182375 -22341966 -22345843 -21246700 -19290381
38346a9290381K366267K198600J542419P44879K66620M42303J291764K467995
38338g969534L373803L462568K618471J306032K43974j69476j21170j12865n16559
38329B115244j358336k329899k908760k652535j590354k76574O90626J161473
38321g149115J344066J346486J027635K83869o97222j483953j611586q64797M34415
38312g370202J501079J739663J349090J043970J175870J417367J346040R80433
38304C183310N78817K37104m0613q3917L38442J228953K336842L302382L710523
38295A4791843L232253J953669M07338r48544k112241l168656l792480l545927
38287F817255k573295j557543r72557p71432q26917j188235j722250j967207j705491
$$ plain form
38346 -19290381 -16924114 -14725514 -13183095 -12438216 -12171596 -11729293 -10437529 -7969534
38338 -7969534 -4595731 -1133163 1485308 2791340 3035314 2865838 2744668 2631803 2115244
38329 2115244 756908 -1572991 -4481751 -7134286 -8724640 -9001214 -8310588 -7149115
38321 -7149115 -5805049 -4458563 -3430928 -3147059 -3844281 -5328234 -6939820 -7804617 -7370202
38312 -7370202 -5869123 -4129460 -2780370 -1736400 -560530 856837 2202877 3183310
38304 3183310 3762127 3999231 3958618 3874701 4213143 5442096 7778938 11081320 14791843
38295 14791843 18024096 19977765 20385103 19436559 17324318 14155662 10363182 6817255
38287 6817255 4243960 2686417 1713860 942428 115511 -1072724 -2794974 -4762181 -6467672
38278f467672j387626j586962k180541k439075j869912o46865P60074K012592
38270a3805987K876712L128887K774946K220609J946416J999615J988866J624470
38262D754534J104487Q62566J041582J354779J406256R92325J36184r25431j716941
38253I010341j748520j000007o4122M03770L09699L9349q4997K0597M46280J277738
38243H610128K262915K866270K844778K504224K216002J952524J505986Q87691
38235B5650518K24092n10016j302570j809160j654281j005438m99621n67397j120322
38226A7405805j918859k894455l969793m851058n222103m998118m224825k865817
38218a3539223r05984J335844L138533L742893K909764J218720k57043p61971
$$ plain form
38278 -6467672 -7855298 -9442260 -11622801 -14061876 -15931788 -16578653 -15818579 -13805987
38270 -13805987 -10929275 -7800388 -5025442 -2804833 -858417 1141198 3130064 4754534
38262 4754534 5859021 6721587 7763169 9117948 10524204 11516529 11652713 10727282 9010341
38253 9010341 7261821 6261814 6197692 6601462 6911161 6950510 6865513 6886110 7332390 8610128
38243 8610128 10873043 13739313 16584091 19088315 21304317 23256841 24762827 25650518
38235 25650518 25874610 25364594 24062024 22252864 20598583 19593145 19093524 18526127 17405805
38226 17405805 15486946 12592491 8622698 3771640 -1450463 -6448581 -10673406 -13539223
38218 -13539223 -14445207 -13109363 -9970830 -6227937 -3318173 -2099453 -2356496 -3118467
38210c118467m17250O9487J89236K2101k8032L67630J300873K575904L754459
38201D715941M482678M822942N008925M840963L718479J510616r07305k329852
38193B5863387k327186j472003o39098l29416n13494p92843p36446l14878L279
38184A8741302k37717r54485j698701k203507k459804k395150j923622j331025
38176E537291j148067j453153j648245j166958j66712O84780Q80580L28316p83901
38167A063931k004697k623630k074682m77875J371395K606194K813307K073561
38159B747504P67739n56278j333645j257364m80863N07144J265114J671607J820110
38150E151068J700157J126837Q1492j007591j558658j419708r40597m23502K09500
$$ plain form
38210 -3118467 -3535717 -3466230 -3276994 -3254893 -3282925 -2915295 -1614422 961482 4715941
38201 4715941 9198619 14021561 19030486 23871449 27589928 29100544 28193239 25863387
38193 25863387 23536201 22064198 21425100 21095684 20582190 19789347 19052901 18738023 18741302
38184 18741302 18503585 17549100 15850399 13646892 11187088 8791938 6868316 5537291
38176 5537291 4389224 2936071 1287826 120868 -45844 638936 1519516 1847832 1063931
38167 1063931 -940766 -3564396 -5639078 -6116953 -4745558 -2139364 673943 2747504
38159 2747504 3515243 2958965 1625320 367956 -112907 394237 1659351 3330958 5151068
38150 5151068 6851225 7978062 8059554 7051963 5493305 4073597 3133000 2709498 2918998
38141B918998J022153J619299J471753O15298l41726r76507j491450k204587k850376
38132b17145k740181j639852k30213M79423J31060p07477j199591r97699l11590
38123g433265N33064J328817J846239J817238J253481O12190M35505Q59491J563127
38114B815887K094984K157097J743922J206336J052933J427526J822867J546253
38106A5867805M53036r86213k267015l173972l536683l113862j971915o90418
38098E80763J31160M52383O40674Q62078Q92566M84828l44255j411263k508419
38089b19485l352961l572494k914974j482069K84823J864471K951471L552028
38081b889190L779124L567736K719698J296313k06373j265614j812315k078447
$$ plain form
38141 2918998 3941151 5560450 7032203 7647501 7305775 6329268 4837818 2633231 -217145
38132 -217145 -2957326 -4597178 -4827391 -4347968 -4216908 -4924385 -6123976 -7121675 -7433265
38123 -7433265 -6900201 -5571384 -3725145 -1907907 -654426 -42236 393269 1252760 2815887
38114 2815887 4910871 7067968 8811890 10018226 11071159 12498685 14321552 15867805
38106 15867805 16320841 15334628 13067613 9893641 6356958 3243096 1271181 580763
38098 580763 711923 1164306 1804980 2667058 3559624 4044452 3700197 2288934 -219485
38089 -219485 -3572446 -7144940 -10059914 -11541983 -11257160 -9392689 -6441218 -2889190
38081 -2889190 889934 4457670 7177368 8473681 8267308 7001694 5189379 3110932
38073C110932k052158j428300j81219J131122J859394J891140J592488J267733
38065G191132R09347M05808k44902r24223j397165j338538n98745M77653J209718
38056E690085J199536O58121J436o76886j477627k176988k250065j558135p04997
38047a295520m06151o24839o46236r215R31346J468188J312521P41731K13090
38038A684915R3210O06598J671916K738421L068983K324973P63045j106162k796106
38029I049793l800830l727449k762943j723028j271467j232708r94615m24654
38021f887901M2874J58563J81324L35603M16791J93562j75038m59499p92062j341219
38011h327002j713133j177455M16938K272273L318145L084544J884288L85439
$$ plain form
38073 3110932 1058774 -369526 -550745 580377 2439771 4330911 5923399 7191132
38065 7191132 8100479 8506287 8261385 7337162 5939997 4601459 4002714 4480367 5690085
38056 5690085 6889621 7547742 7549178 6872292 5394665 3217677 967612 -590523 -1295520
38047 -1295520 -1701671 -2326510 -2972746 -2981961 -2050615 -582427 730094 1471825 1684915
38038 1684915 1778125 2384723 4056639 6795060 9864043 12189016 12952061 11845899 9049793
38029 9049793 5248963 1521514 -1241429 -2964457 -4235924 -5468632 -6463247 -6887901
38021 -6887901 -6845027 -6686464 -6505140 -6169537 -5752746 -5559184 -5734222 -6193721 -6985783 -8327002
38011 -8327002 -10040135 -11217590 -10800652 -8528379 -5210234 -2125690 -241402 144037
38003A44037q73888j728147k305517k669033k545948j588894L9360J553231K190815
37994g783984J885359J184462O41240M79189P57120J521629K595816L354400L010978
37985G646209J328625r67556k634212k893915k013255r28779l88836m90798q80758
37976b223275j173078j194548j060824j116161j635731k463562l057433l012490
37968a6937102k454268j809231j292890p75576p4896Q19873J825831K897188L997449
37959a3803622N017843N770692O016834N504702M102587K000509k25525j837645
37951A2546375k347459j838385r38777l86104m66220q26633q82658m19820K37171
37942D677490O24748O14343M51582L98773M28558K83210k17969r91010j822099
$$ plain form
38003 144037 -729851 -2457998 -4763515 -7432548 -9978496 -11567390 -11528030 -9974799 -7783984
37994 -7783984 -5898625 -4714163 -4072923 -3593734 -2836614 -1314985 1280831 4635231 7646209
37985 7646209 8974834 8007278 5373066 2479151 465896 -462883 -851719 -1342517 -2223275
37976 -2223275 -3396353 -4590901 -5651725 -6767886 -8403617 -10867179 -13924612 -16937102
37968 -16937102 -19391370 -21200601 -22493491 -23269067 -23343963 -22524090 -20698259 -17801071 -13803622
37959 -13803622 -8785779 -3015087 3001747 8506449 12609036 14609545 14384020 12546375
37951 12546375 10198916 8360531 7421754 7035650 6569430 5742797 4860139 4440319 4677490
37942 4677490 5302238 5916581 6368163 6766936 7195494 7478704 7260735 6269725 4447626
37933D447626k632193l502425m388768m898607m499956l019852q93590J128495
37925a8259270K516114L213948L471606L563327L691812L989492M405497M600633
37917A1193159M176305L139655K005426J272126Q99784N13543M1109j76316J0505
37908B3075296J44359m09221j750356l356029m599108n155460m971884m092047
37900a114450k608677p07327J253072K674061K891311J680991l55642k093082
37892A620257k686085k069925p63085O03316J533592J737996J241660M17533k56417
37883A378842n43234n23067l45101J0436O69753J587083K387883K539331J697936
37874H859862p9991k370887m524153n855111n967326n044224l709210k464175
$$ plain form
37933 4447626 1815433 -1686992 -6075760 -10974367 -15474323 -18494175 -19387765 -18259270
37925 -18259270 -15743156 -12529208 -9057602 -5494275 -1802463 2187029 6592526 11193159
37917 11193159 15369464 18509119 20514545 21786671 22686455 23199998 23241107 23064791 23075296
37908 23075296 23219655 22810434 21060078 17704049 13104941 7949481 2977597 -1114450
37900 -1114450 -3723127 -4430454 -3177382 -503321 2387990 4068981 3713339 1620257
37892 1620257 -1065828 -3135753 -3898838 -3295522 -1761930 -23934 1217726 1635259 1378842
37883 1378842 835608 312541 -32560 -22124 647629 2234712 4622595 7161926 8859862
37874 8859862 8779871 6408984 1884831 -3970280 -9937606 -14981830 -18691040 -21155215
37866b1155215j355711k79359O10018J065696J198375J404819J845021K315776
37858a4350580K678979L039171L357522L282583K659733J920261J610364J733383
37850E931416J926484K102829K427425K704321K349503J156928l47887j567247
37842A6683772k446297l093972l184274k317996q59116J96244L14644q1184m05747
37833D806074p27638j407032k247826k550486j968030q86134Q0761O01133N94090
37824c705088J43432l22589j56771P87307J731429J674308N07177q61381j468279
37815a670455j067658O1061J635270L393509M798080N094127L821297J255195
37807A7320426j643315l742962m384194l701529k357937r49144L00878J308682
$$ plain form
37866 -21155215 -22510926 -22790285 -22180267 -21114571 -19916196 -18511377 -16666356 -14350580
37858 -14350580 -11671601 -8632430 -5274908 -1992325 667408 2587669 4198033 5931416
37850 5931416 7857900 9960729 12388154 15092475 17441978 18598906 18251019 16683772
37842 16683772 14237475 11143503 7959229 5641233 4782117 4978361 5293005 5211821 4806074
37833 4806074 4078436 2671404 423578 -2126908 -4094938 -4981072 -4900311 -4299178 -3705088
37824 -3705088 -3561656 -3884245 -4041016 -3253709 -1522280 152028 659205 -202176 -1670455
37815 -1670455 -2738113 -2677052 -1041782 2351727 7149807 12243934 16065231 17320426
37807 17320426 15677111 11934149 7549955 3848426 1490489 541345 842223 2150905
37799B150905J829424J597615P30227k12861o76603n76394k86484k19202m51068
37790C885559o97858n62563J82090J424116K717395L518165L577055L148214K717667
37781A9909840K480143K165584J398506Q8066j584064l349660m862116n714832
37773A0531467n737457n200632m457403l441707j853693J51099J860659K773374
37765e374293L146388L520605L937698L946266L255289K060749P62900l43277
37757A4912325j070308j331894j311643j488081k262208l480222m382835m163893
37749d578759k735131r66780k4303l52313j375132k227919k587558k636063k450004
37740a9933962j827626p31519M79674J475223K391472L583672N006145O080957
$$ plain form
37799 2150905 3980329 5577944 6308171 6095310 5418707 4842313 4555829 4336627 3885559
37790 3885559 3187701 2625138 2807228 4231344 6948739 10466904 14043959 17192173 19909840
37781 19909840 22389983 24555567 25954073 26042139 24458075 21108415 16246299 10531467
37773 10531467 4794010 -406622 -4864025 -8305732 -10159425 -10008326 -8147667 -5374293
37765 -5374293 -2227905 1292700 5230398 9176664 12431953 14492702 15255602 14912325
37757 14912325 13842017 12510123 11198480 9710399 7448191 3967969 -414866 -4578759
37749 -4578759 -7313890 -8280670 -8304973 -8657286 -10032418 -12260337 -14847895 -17483958 -19933962
37740 -19933962 -21761588 -22493107 -22013433 -20538210 -18146738 -14563066 -9556921 -3475964
37732c475964O246910N508495M366192L288284K348768J356708K39209p37233
37724A9141369j078740m19522J085594K643819L257633K490134P80852j135893
37716B6765246l013780n012372o892938p778434p002357m929570k629520r19663
37708a1413388j1822J61989j97749o04527n31640l7485K10359k13203q79727j010183
37698a4527376l83904N27685J162113J276844Q71678J10785n94861p64190l34277
37689a2655503J70673J40849n05973j303039j708684j461273n90560O47020J793077
37680a5473413K374455K240821J661826J025292N47762L51971O17087J380474
37672e273725K262060K706947K587571K322307K278997K289246J927513J069685
$$ plain form
37732 -3475964 2770946 8279441 12645633 15933917 18282685 19639393 19878602 19141369
37724 19141369 18062629 17643107 18728701 21372520 24630153 27120287 27901139 26765246
37716 26765246 23751466 18739094 11846156 4067722 -2934635 -7864205 -10493725 -11413388
37708 -11413388 -11425210 -11263221 -11460970 -12065497 -12597137 -12634622 -12424263 -12637466 -13517193 -14527376
37698 -14527376 -14911280 -14383595 -13221482 -11944638 -11072960 -10962175 -11557036 -12321226 -12655503
37689 -12655503 -12484830 -12343981 -12849954 -14152993 -15861677 -17322950 -17913510 -17266490 -15473413
37680 -15473413 -13098958 -10858137 -9196311 -8171019 -7623257 -7271286 -6654199 -5273725
37672 -5273725 -3011665 -304718 2282853 4605160 6884157 9173403 11100916 12170601
37664A2170601o4745j287861k583573l919047n154994o128919o630185o354650
37656a9953373n162335l390884j639119j97821J028510K015231K465741K394214
37648b2439836K444805L154259M068630M097532K778152P79948r27365j987813
37640h031688k544667k643884k220824j535067j122981j178021j266856q40794
37632b1384782J33743J201516J928014K188786K030061J497143P12755L699k38699
37623a1927764P7141N52058O06948R7505m46228l65667L35700R46654Q68993K75415
37613h979245j99842k18232N7234L50444N33799N44093L57119P7550k02384o08990
37603h288454j210663j537851q81368O76202J934068J692717K9268j847995k842292
$$ plain form
37664 12170601 12105856 10817995 8234422 4315375 -839619 -6968538 -13598723 -19953373
37656 -19953373 -25115708 -28506592 -30145711 -30343532 -29315022 -27299791 -24834050 -22439836
37648 -22439836 -19995031 -16840772 -12772142 -8674610 -5896458 -5116510 -6043875 -8031688
37640 -8031688 -10576355 -13220239 -15441063 -16976130 -18099111 -19277132 -20543988 -21384782
37632 -21384782 -21251039 -20049523 -18121509 -15932723 -13902662 -12405519 -11692764 -11689065 -11927764
37623 -11927764 -11850623 -11298565 -10691617 -10594112 -11040340 -11406007 -11070307 -10123653 -9254660 -8979245
37613 -8979245 -9179087 -9397319 -9340085 -8989641 -8455842 -7911749 -7554630 -7477080 -7679464 -8288454
37603 -8288454 -9499117 -11036968 -11918336 -11242134 -9308066 -7615349 -7586081 -9434076 -12276368
37594a2276368k758135k047919j224355n69721j38997M4943k43691j274742k767879
37585b3256864l745120l425687k157924j000104m22433N3720Q67725J658596J791413
37576b9636678J236218N70421L56290P95656J754932K808211L414215L354857
37568a5345878K923603K481611J966558J072617k04415j447261k171090k126092
37560a2850347j404860n04369j45738o85637j688377k319832k160883j423433
37552b3183476m45109O73901J865102K861619L379675L348642K802713J726488
37544f970445K41353j132112j660277r81728N03957J853019K224719J440228L2490
37535d448796j226140j889620j992049j727914j110827l4774J376591K629735
$$ plain form
37594 -12276368 -15034503 -17082422 -18306777 -18876498 -19015495 -18970552 -19214243 -20488985 -23256864
37585 -23256864 -27001984 -30427671 -32585595 -33585699 -34008132 -33954412 -33086687 -31428091 -29636678
37576 -29636678 -28400460 -27830039 -27473749 -26678093 -24923161 -22114950 -18700735 -15345878
37568 -15345878 -12422275 -9940664 -7974106 -6901489 -7105904 -8553165 -10724255 -12850347
37560 -12850347 -14255207 -14759576 -14905314 -15590951 -17279328 -19599160 -21760043 -23183476
37552 -23183476 -23628585 -22954684 -21089582 -18227963 -14848288 -11499646 -8696933 -6970445
37544 -6970445 -6729092 -7861204 -9521481 -10503209 -9999252 -8146233 -5921514 -4481286 -4448796
37535 -4448796 -5674936 -7564556 -9556605 -11284519 -12395346 -12430120 -11053529 -8423794
37527h423794L182460K893596K060851R90728l25817j940216l399864l759834
37519h721890k388442K29474K624696L386135K185640o2074j958875k654991k348100
37510i708427j885818j887972k253668k476291k282511j831087j364216q74977
37502b4564967j99559O83054J571965K237889K581230K561713K082269J105763
37494a1940643p6607q47759p15466K33371J436792K408516L059139L479116L619288
37485F55747L330159K599121J585774M72166n83637j385022j759158j731052j527931
37476A656167j335955j094489n89259K52154J187723J805146J845308J375952
37468E102747O67713r572m11866k82928M63482J469731K041692J695154N58344
$$ plain form
37527 -8423794 -5241334 -2347738 -286887 703841 378024 -1562192 -4962056 -8721890
37519 -8721890 -11110332 -10880858 -8256162 -4870027 -2684387 -2746461 -4705336 -7360327 -9708427
37510 -9708427 -11594245 -13482217 -15735885 -18212176 -20494687 -22325774 -23689990 -24564967
37502 -24564967 -24764526 -24081472 -22509507 -20271618 -17690388 -15128675 -13046406 -11940643
37494 -11940643 -12017250 -12865009 -13580475 -13347104 -11910312 -9501796 -6442657 -2963541 655747
37485 655747 3985906 6585027 8170801 8642967 8059330 6674308 4915150 3184098 1656167
37476 1656167 320212 -774277 -1363536 -1111382 76341 1881487 3726795 5102747
37468 5102747 5770460 5760888 5349022 5066094 5529576 6999307 9040999 10736153 11294497
37459A1294497q05646j854533k285358k013480j202151l03640J48022q6649p91693
37450B099369j496674j812030j654611j278280j081212j266951j643207j793910
37442i927506j469970q03732j68560J56198K49624N36233J428385K859535M183391
37433b956402M641844L979965K596927J147976O7503n76662r24685j117788j200180
37424E658498j126084q14864k27927N42446J243851J593895J493354J051703L55224
37415I770096o65414j992954l249607l885595l633961k613942j066667P27708
37407f610336K309596L228654L524915L680298L881598L655662K533449Q19726
37399A7023562o34599j234416q92715K72177J978907L557282M187459L572231
$$ plain form
37459 11294497 10488851 8634318 6348960 4335480 3133329 2829689 2977711 2891062 2099369
37450 2099369 602695 -1209335 -2863946 -4142226 -5223438 -6490389 -8133596 -9927506
37442 -9927506 -11397476 -12201208 -12369768 -12213570 -11963946 -11427713 -9999328 -7139793 -2956402
37433 -2956402 1685442 5665407 8262334 9410310 9477813 8901151 7976466 6858678 5658498
37424 5658498 4532414 3717550 3489623 4032069 5275920 6869815 8363169 9414872 9770096
37415 9770096 9104682 7111728 3862121 -23474 -3657435 -6271377 -7338044 -6610336
37407 -6610336 -4300740 -1072086 2452829 6133127 10014725 13670387 16203836 17023562
37399 17023562 16388963 15154547 14261832 14534009 16512916 20070198 24257657 27829888
37391B7829888K159338O50999m82918j051278j103652j000057j215096j837424
37383B3949800k406049k395428j746865q19324L0312O49041R43352P26391j57074
37374A8774156j499499k610644k785379k045901j221193j043494j309914j223252
37366E034880m19837P20014J686797K276124K378273J896823J140153Q41356J379318
37357A6933901K222370K506440J997567J143108L06670o35281j880194l191022
37349A9403559l995854l942221l260673k532933k103632j844850j609782j696868
37341a583254k463226l518988l851044l002806j702934r56385q58152p61275l30967
37332a9029031J88087O84875J499542K789571M012465M368555L579919K052070
$$ plain form
37391 27829888 29989226 30640225 30157307 29106029 28002377 27002320 25787224 23949800
37383 23949800 21543751 19148323 17401458 16582134 16612446 17261487 18204839 18931230 18774156
37374 18774156 17274657 14664013 11878634 9832733 8611540 7568046 6258132 5034880
37366 5034880 4615043 5335057 7021854 9297978 11676251 13573074 14713227 15554583 16933901
37357 16933901 19156271 21662711 23660278 24803386 25110056 24474775 22594581 19403559
37349 19403559 15407705 11465484 8204811 5671878 3568246 1723396 113614 -1583254
37341 -1583254 -4046480 -7565468 -11416512 -14419318 -16122252 -17078637 -17936789 -18698064 -19029031
37332 -19029031 -18840944 -18156069 -16656527 -13866956 -9854491 -5485936 -1906017 146053
37324A46053M52449o91328j145360r70803l87212M18942J285293J885516J793298
37315B786848R44665p0600m52804k2225N38110M20074l63401r43953n93470M08374
37305B651618J122133J075390O87997M96881L90302m0026p11240j168442j397653
37296C106960j892372k732319l154775k458553r95011K13086O66856P31756Q44236
37287e670136R03707O37892J87776M433L11853R22460J520409J930862K130751
37278B880007K150468J980715J494848N03854r99591k675028m019027m704255
37270c388009m673533m019666k982449k009508j515972j476526j486349j351059
37262b2903071j355612j720756k040310j657253n45849N77548J120103J263960
$$ plain form
37324 146053 598502 -92826 -1238186 -2208989 -2596201 -2177259 -891966 993550 2786848
37315 2786848 3731513 3660913 3208109 3185884 3723994 4144068 3780667 2836714 2243244 2651618
37305 2651618 3773751 4849141 5537138 6034019 6424321 6384295 5673055 4504613 3106960
37296 3106960 1214588 -1517731 -4672506 -7131059 -8126070 -7912984 -7246128 -6514372 -5670136
37287 -5670136 -4766429 -4128537 -3940761 -3936328 -3624475 -2702015 -1181606 749256 2880007
37278 2880007 5030475 7011190 8506038 9009892 8010301 5335273 1316246 -3388009
37270 -3388009 -8061542 -12081208 -15063657 -17073165 -18589137 -20065663 -21552012 -22903071
37262 -22903071 -24258683 -25979439 -28019749 -29677002 -30222851 -29645303 -28525200 -27261240
37254b7261240J564845K141697K536824K298973J471013M79949k96176p80326
37246a7844441j107308j410915j751025k160350k562323k569568j610660M24033
37238c0592557K713984M046425L966135L157575K544899K256989J710149N16316
37230i680085j021432k271442k823891k619478j793230n87541O63925J652900
37222a8480274K281613K706288L126615L484490L427214K699237J594859Q67353
37214A707395J042240J854449K472252K274332J335256J70263q66726j828809
37206H160652k849124l721455l982662l432098k383765j270659j66123J056626
37198h588608K189141K678479K276507J457998J011965J307549K018618K429545
$$ plain form
37254 -27261240 -25696395 -23554698 -21017874 -18718901 -17247888 -16767939 -17064115 -17844441
37246 -17844441 -18951749 -20362664 -22113689 -24274039 -26836362 -29405930 -31016590 -30592557
37238 -30592557 -27878573 -23832148 -19866013 -16708438 -14163539 -11906550 -10196401 -9680085
37230 -9680085 -10701517 -12972959 -15796850 -18416328 -20209558 -20797099 -20133174 -18480274
37222 -18480274 -16198661 -13492373 -10365758 -6881268 -3454054 -754817 840042 1707395
37214 1707395 2749635 4604084 7076336 9350668 10685924 10856187 9989461 8160652
37206 8160652 5311528 1590073 -2392589 -5824687 -8208452 -9479111 -9645234 -8588608
37198 -8588608 -6399467 -3720988 -1444481 13517 1025482 2333031 4351649 6781194
37190F781194J975349O93904p32736j535632j554712j260794j098832j081056
37182B186685j084039j167977j362992j444928j231859q64490m55797L18827J835192
37173c271378L773752N157555N213995L982175K106846L16105q94688j374892
37165A5009470j276206q28181j79447M64963P35355L90766l70984j160064j863020
37156A0922652k570931l136423l204658k731540k118868j726867j532409j366173
37148g465217j213711j137665j091010r16466m16975N35902J744153K590822K535761
37139d834406J731196Q16757Q2083p40182j716901k222877j557804J94564K197972
37130f049598L540557L674565K523414N90053j162161j957897j827034j410474
$$ plain form
37190 6781194 8756543 9450447 8717711 7182079 5627367 4366573 3267741 2186685
37182 2186685 1102646 -65331 -1428323 -2873251 -4105110 -4969600 -5425397 -5106570 -3271378
37173 -3271378 502374 5659929 10873924 14856099 16962945 17279050 16384362 15009470
37165 15009470 13733264 12905083 12725636 13190599 13925954 14316720 13945736 12785672 10922652
37156 10922652 8351721 5215298 2010640 -720900 -2839768 -4566635 -6099044 -7465217
37148 -7465217 -8678928 -9816593 -10907603 -11824069 -12241044 -11705142 -9960989 -7370167 -4834406
37139 -4834406 -3103210 -2286453 -2204370 -2944552 -4661453 -6884330 -8442134 -8247570 -6049598
37130 -6049598 -2509041 1165524 3688938 4278991 3116830 1158933 -668101 -2078575
37122b078575j207458j213748j227885j229207j366695j711994k092004k132924
37114a4260490j513016k58806J204927K306043K596213J887932L95480j195881
37106h837598k107431k168713j994054k218338k651570k449170j118268Q50708
37098b2694434K404074K849816K326137J464166P21188J19264m30883q15158r29743
37089a4985573j005742j319893j594847j123731L55822K261331L790704M566507
37081i055422M473360L377657J496977k86844j084165q96857m30739j25402J49205
37072b382230M98801O71833M52658k4175m76882o40138j64180J179779K957909
37063B073375M116952L906247K592250J087459J06912j53153J37635N49450N64621
$$ plain form
37122 -2078575 -3286033 -4499781 -5727666 -6956873 -8323568 -10035562 -12127566 -14260490
37114 -14260490 -15773506 -16032312 -14827385 -12521342 -9925129 -8037197 -7641717 -8837598
37106 -8837598 -10945029 -13113742 -15107796 -17326134 -19977704 -22426874 -23545142 -22694434
37098 -22694434 -20290360 -17440544 -15114407 -13650241 -12929053 -12809789 -13240672 -14055830 -14985573
37089 -14985573 -15991315 -17311208 -18906055 -20029786 -19673964 -17412633 -13621929 -9055422
37081 -9055422 -4582062 -1204405 292572 5728 -1078437 -1975294 -2406033 -2531435 -2382230
37072 -2382230 -1883429 -1211596 -758938 -783113 -1259995 -1900133 -2064313 -884534 2073375
37063 2073375 6190327 10096574 12688824 13776283 13883195 13730042 13867677 14417127 14981748
37054A4981748N9710m59980m73744k58035o74658k026965l476124l857096k893787
37045I21069j349612r4214O47883J091968J320589J259310J123702J489445K684561
37036I094701M231377N093831M508794K554899L4832k050165l016205k812950
37028A7639114k027051j486674j649725k244408k516796j945750q15007k7733
37020D925970k13980j036453j560574j326166p99254o65075r96016j396946j700551
37011d769045k051192k356933k151519j183243J63072J225109J648880J494437
37003g980434J004211M85044K52974M23091P57887Q67582N54260j03185q98484
36994d637054j582379j860394j509263n77445O00870J637497K301111K504279
$$ plain form
37054 14981748 15041458 14581478 14107734 13849699 13175041 11148076 7671952 3814856 921069
37045 921069 -428543 -522757 125126 1217094 2537683 3796993 4920695 6410140 9094701
37036 9094701 13326078 18419909 22928703 25483602 25518434 23468269 20452064 17639114
37028 17639114 15612063 14125389 12475664 10231256 7714460 5768710 4953703 4925970
37020 4925970 4711990 3675537 2114963 788797 -10457 -675532 -1671548 -3068494 -4769045
37011 -4769045 -6820237 -9177170 -11328689 -12511932 -12348860 -11123751 -9474871 -7980434
37003 -7980434 -6976223 -6491179 -6238205 -5815114 -5057227 -4189645 -3635385 -3738570 -4637054
36994 -4637054 -6219433 -8079827 -9589090 -10166535 -9565665 -7928168 -5627057 -3122778
36986c122778K209232J501700P58170N23368R94125J667358J753505J011073n0763
36977G244990q83744j492991k059364k283494j635111k54289Q79564R00299p3861
36968C41999j179199j699841j562584j126961o91980j81598P28285K096039L379321
36959A03481L843844L343402K438385J646709Q54583l41324j929589l366752m054725
36950B538014l764385k707759j380915k70337M35355Q36043J038882J057261J007353
36941a210488J119790J409331J602019J595315J719784K252934K896037L090697
36933A4475419K727871K207608J896570J860686K029171K213958J986656R75854
36925C0373793n88653j948449k550012k444906j918334j101621j37323O17928
$$ plain form
36986 -3122778 -913546 588154 1346324 1869692 2863817 4531175 6284680 7295753 7244990
36977 7244990 6361246 4868255 2808891 525397 -1109714 -1364003 -484439 415860 341999
36968 341999 -837200 -2537041 -4099625 -5226586 -5918566 -6100164 -5371879 -3275840 103481
36959 103481 3947325 7290727 9729112 11375821 12230404 11889080 9959491 6592739 2538014
36950 2538014 -1226371 -3934130 -5315045 -5585382 -5150027 -4313984 -3275102 -2217841 -1210488
36941 -1210488 -90698 1318633 2920652 4515967 6235751 8488685 11384722 14475419
36933 14475419 17203290 19410898 21307468 23168154 25197325 27411283 29397939 30373793
36925 30373793 29785140 27836691 25286679 22841773 20923439 19821818 19684495 20302423
36917B0302423Q75054P29110M38189J7435o90570j611244k353083k555503k182515
36908A2969296j463648o56380J03960P66722J204608J163033N22310l69518q39161
36899A3401222n30684K03023P01634O79045L13691k25413r94744j902672k399844
36890I245258j869953l58072J293849K179128K149816J820393J798356K077211
36882A8335986K256786K182823K121241K302425K548704K514871K161088J786432
36874C6210356J636919J687949J853560K200762K785746L384525L619165L386385
36866E6765367K963089K570624K009489R60348m12610j436355j588313r76930
36858F0854709o2253Q75708J769783K419543K439997J648633L79634o38765p06240
$$ plain form
36917 20302423 21177477 21906587 22344776 22362211 21671641 20060397 17707314 15151811 12969296
36908 12969296 11505648 10849268 10953228 11719950 12924558 14087591 14609901 14240383 13401222
36899 13401222 12870538 13073561 13775195 14454240 14767931 14542518 13547774 11645102 9245258
36890 9245258 7375305 7017233 8311082 10490210 12640026 14460419 16258775 18335986
36882 18335986 20592772 22775595 24896836 27199261 29747965 32262836 34423924 36210356
36874 36210356 37847275 39535224 41388784 43589546 46375292 49759817 53378982 56765367
36866 56765367 59728456 62299080 64308569 65268917 64856307 63419952 61831639 60854709
36858 60854709 60792456 61668164 63437947 65857490 68297487 69946120 70325754 69686989 68980749
36849F8980749M15415K295544M086872N169760N598731N852837O226487O602685
36841A05229080O716143O410661N709814M922023M647255N313125O599826P654542
36833A53202469Q046057Q210656Q741258R540303J0009951R871047R388155Q849208
36825B25859104Q219220P381345O409794N458681M590266L874268L513011L659113
36817B68964802M102006M273698L678784K342484P83361m96134j423179k183299
36809B80042523k776605l020379k992352l119739l648436m326666m911107n756417
36801B49490822p487415j0115206j2804350j4545963j4844956j3824694j2009184
36794A63859054j0056739q399303p013248n705782m590312l976188l784021l477103
$$ plain form
36849 68980749 69396164 71691708 75778580 80948340 86547071 92399908 98626395 105229080
36841 105229080 111945223 118355884 124065698 128987721 133634976 138948101 145547927 153202469
36833 153202469 161248526 169459182 178200440 187740743 197750694 207621741 217009896 225859104
36825 225859104 234078324 241459669 247869463 253328144 257918410 261792678 265305689 268964802
36817 268964802 273066808 277340506 281019290 283361774 284145135 283649001 282225822 280042523
36809 280042523 277265918 274245539 271253187 268133448 264485012 260158346 255247239 249490822
36801 249490822 242003407 231888201 219083851 204537888 189692932 175868238 163859054
36794 163859054 153802315 145403012 138389764 132683982 128093670 124117482 120333461 116856358
36786A16856358k733970j841636j216656q78743o80398p24399j122659j528432
36778A06129465j399097p41637k04635l10804q54339j166593p91842J71763J212902
36769A02045183J787731J714104J317830J128465J356785J683607J536817N30753
36761A13101275j248221l186318m403031m341257l240791j903896r12594k05980
36753I3659187N21413J245654J672484J755444J859045K337190L149337M026228
36745A10225982M877350N818734O803226P464402P511648P173442O996733P174800
36737A64046317P328419P113240O827708P109420Q073690R067137R375949Q957008
36729B27898888Q334887P961966P872149P846312P673283P235182O539473N785163
$$ plain form
36786 116856358 114122388 112280752 111064096 110185353 109504955 108780556 107657897 106129465
36778 106129465 104730368 103988731 103784096 103473292 102618953 101452360 100660518 100832281 102045183
36769 102045183 103832914 105547018 106864848 107993313 109350098 111033705 112570522 113101275
36761 113101275 111853054 108666736 104263705 99922448 96681657 94777761 93865167 93659187
36753 93659187 94180600 95426254 97098738 98854182 100713227 103050417 106199754 110225982
36745 110225982 115103332 120922066 127725292 135189694 142701342 149874784 156871517 164046317
36737 164046317 171374736 178487976 185315684 192425104 200498794 209565931 218941880 227898888
36729 227898888 236233775 244195741 252067890 259914202 267587485 274822667 281362140 287147303
36721B87147303N310400N334202N700949N919422N517974M398445K838476J159236
36713C23326407n35149k244316l801519m879414n278976n082300m481289l589057
36705B93434387k503482j438952o51133k52666j85919l43871o33456r46373j165632
36696B85312903j227816j151156j015866r27315r21638q37307l54655P08523K159331
36687B81745004L618537M960420O410209Q103272R656064J0357301R829815Q415442
36679C43096064O852684N622433M645163L541965K081799L78571j244793k543305
36671C62430581l563784m589272n782915o874987p362579p122872o679090o678208
36663C13776874p197140p767076q013088q016600q058408q290931q739773r359331
$$ plain form
36721 287147303 292457703 297791905 303492854 309412276 314930250 319328695 322167171 323326407
36713 323326407 322791258 320546942 316745423 311866009 306587033 301504733 297023444 293434387
36705 293434387 290930905 289491953 288840820 288588154 288402235 288058364 287424908 286478535 285312903
36696 285312903 284085087 282933931 281918065 280990750 280069112 279231805 278877150 279585673 281745004
36687 281745004 285363541 290323961 296734170 304837442 314493506 324850807 334680622 343096064
36679 343096064 349948748 355571181 360216344 363758309 365840108 366218679 364973886 362430581
36671 362430581 358866797 354277525 348494610 341619623 334257044 327134172 320455082 313776874
36663 313776874 306579734 298812658 290799570 282782970 274724562 266433631 257693858 248334527
36655B48334527r940427j0177516r991909r615711r218650q669058p858329p029564
36647A75833363o480500o089090n491515m706040m256339m603529n651121o812639
36639A31742590p364399o783472n068632k838618q95071M01166J157216J399854
36631A11750634Q77314m38368k003122l171926l833817m278939m569261m395043
36623H9937472l561183k315663j101856j92061L35280M43194J35746m56524j124377
36614H2100028j702379k077302k137299j859410j465326j320724j528194j686716
36606F8322678j241648j07944J193691K049749K224629J763182P08064q06823
36598G4105578k322223l257718l396299k973486k317992j642560j147986r84784
$$ plain form
36655 248334527 238394100 228216584 218224675 208608964 199390314 190721256 182862927 175833363
36647 175833363 169352863 163263773 157772258 153066218 148809879 144206350 138555229 131742590
36639 131742590 124378191 117594719 112526087 109687469 108792398 109193564 110350780 111750634
36631 111750634 112627948 112189580 110186458 107014532 103180715 98901776 94332515 89937472
36623 89937472 86376289 84060626 82958770 82766709 83101989 83545183 83680929 83224405 82100028
36614 82100028 80397649 78320347 76183048 74323638 72858312 71537588 70009394 68322678
36606 68322678 67081030 66973086 68166777 70216526 72441155 74204337 74912401 74105578
36598 74105578 71783355 68525637 65129338 62155852 59837860 58195300 57047314 56062530
36590E6062530r99040p83158j17953Q19770J730852K406111K627370K259300J633436
36581F5639218J440666J909879K412810K277059J717910J477197J717382J854860
36573H0446981J510106J082974J184915J858554K565736K723666K149736J235596
36565I4758264P99965J501643L196183M991716O018102O013855N209063L972840
36557A26461631K706706J796600J450148J695166K558404L966671N417016O179376
36549A52231718O125162O048286O794388Q240916R457202R721606R067331P995412
36541B15682021P070249O758898P242561Q237097R188346R661815R381593Q048225
36533B81270805N546978K398920l82843k097596k835718l097521l220837l306202
$$ plain form
36590 56062530 55063490 54280332 54162379 54982149 56713001 59119112 61746482 64005782 65639218
36581 65639218 67079884 68989763 71402573 73679632 75397542 76874739 78592121 80446981
36573 80446981 81957087 83040061 84224976 86083530 88649266 91372932 93522668 94758264
36565 94758264 95558229 97059872 100256055 105247771 111265873 117279728 122488791 126461631
36557 126461631 129168337 130964937 132415085 134110251 136668655 140635326 146052342 152231718
36549 152231718 158356880 164405166 171199554 179440470 188897672 198619278 207686609 215682021
36541 215682021 222752270 229511168 236753729 244990826 254179172 263840987 273222580 281270805
36533 281270805 286817783 289216703 288833860 286736264 283900546 280803025 277582188 274275986
36525B74275986l386464l411761l270184l074097l250730m045085n011241n300715
36517B43525709m500217l006161j579441p44846o72496j409497k993336n307684
36509B23312031p899230j0002338j0848203j0116254q224856o204900n149778
36502A64866472n517105o755409p681559p480899o429478n492481n197134n149580
36494A15162827m743413l982708l297331k829941k389300k009057k000894k331094
36486I1579089k432707j929425j224444j062816j725301k898542m068727m707826
36478G1529301m339671k940355j237089j63589K9456k32312p03036j632929l055644
36469E7254132m274760m469732l559141k147564q72426j50619k89081j280572
$$ plain form
36525 274275986 270889522 267477761 264207577 261133480 257882750 253837665 248826424 243525709
36517 243525709 239025492 236019331 234439890 233695044 233022548 231613051 228619715 223312031
36509 223312031 215412801 205410463 194562260 184446006 176221150 170016250 164866472
36502 164866472 159349367 152593958 144912399 137431500 131002022 125509541 120312407 115162827
36494 115162827 110419414 106436706 103139375 100309434 97920134 95911077 93910183 91579089
36486 91579089 89146382 87216957 85992513 84929697 83204396 80305854 76237127 71529301
36478 71529301 67189630 64249275 63012186 62848597 62878053 62645741 61942705 60309776 57254132
36469 57254132 52979372 48509640 44950499 42802935 41930509 41779890 41490809 40210237
36461D0210237k476490k923140k203537p51447O61398J476880J439252N96961
36453C6030114n54958j232379r78336q4619O84495O73337l52505k148429m028217
36444B8008503n179680n237839m509049l503437k388502j067525L99551J761672
36436H283694K898039L877911M671798N041082M792974L991007K856865J586138
36428C7999508L00472r25326k026604k871209l230572k917550j949713n36175
36420B3842831R99189K194294K556863K021293J273139J259226K195906L251135
36412C9593876L372974K321792P78438m20588r81937j175234j370772j647232
36404D0471317j806329j671950j251856n69100M82517J876354L092090L314899
$$ plain form
36461 40210237 37733747 34810607 32607070 31855623 32517021 33993901 35433153 36030114
36453 36030114 35475156 34242777 33264441 33179822 33864317 34537654 34185149 32036720 28008503
36444 28008503 22828823 17590984 13081935 9578498 7189996 6122471 6522022 8283694
36436 8283694 11181733 15059644 19731442 24772524 29565498 33556505 36413370 37999508
36428 37999508 38299980 37374654 35348050 32476841 29246269 26328719 24379006 23842831
36420 23842831 24842020 27036314 29593177 31614470 32887609 34146835 36342741 39593876
36412 39593876 42966850 45288642 46067080 45646492 44664555 43489321 42118549 40471317
36404 40471317 38664988 36993038 35741182 35172082 35654599 37530953 40623043 43937942
36396D3937942K146659R072k208672l773347m410606m301980l959781l879788
36388B3559499m060114l951980l080699j650716l85441J44783j04668p87880j396827
36379H285957j411868n66797Q63862K172018K764463K636346K311322K316154
36371A9371457K635220K631651J623669l33785k323557l369194l315362k798635
36363A4121464k477577k528944k817623l184347l405725l132388k168290q12299
36355f405729K48125M76048p6164q58480j333382j367980j112435o12495K27018
36346a0815474J252192J928627J866898J345736J030033J214630J591229J708930
36338A122801J378688O43204l11274j123601j432936j234550q70501n97231l92733
$$ plain form
36396 43937942 46084601 46093673 43885001 40111654 35701048 31399068 27439287 23559499
36388 23559499 19499385 15547405 12466706 10815990 10430549 10575332 10470664 9682784 8285957
36379 8285957 6874089 6307292 7171154 9343172 12107635 14743981 17055303 19371457
36371 19371457 22006677 24638328 26261997 25928212 23604655 20235461 16920099 14121464
36363 14121464 11643887 9114943 6297320 3112973 -292752 -3425140 -5593430 -6405729
36355 -6405729 -6157604 -5681556 -5757720 -6616200 -7949582 -9317562 -10429997 -11042492 -10815474
36346 -10815474 -9563282 -7634655 -5767757 -4422021 -3391988 -2177358 -586129 1122801
36338 1122801 2501489 3144693 2833419 1709818 276882 -957668 -1828169 -2425400 -2818133
36329b818133k42604k91513n44820p07063n38526j57751J88640M02990L77986
36320d330794j28699j113622k029525k254196j768396j061659m83270k2686L79216
36311a2813631P13076J091856J680543K371502K829274K900472K701616K300994
36303C775702J645677Q25523L3127q01852j905696l021552l320563k280431l60136
36294e410201J512275K858457L710691M012735L468958K002480j16j971903l451230
36285F732146m077173l607414k108117j1174K100293L708922M417939M002602
36277A1158024K544069M87226j485874k708105k831991k057921j030029l52974
36269C722425j51761j07037J59014P79303J571300K117905K025590J284541L21832
$$ plain form
36329 -2818133 -3060737 -3352250 -3897070 -4604133 -5142659 -5300410 -5111770 -4708780 -4330794
36320 -4330794 -4459493 -5573115 -7602640 -9856836 -11625232 -12686891 -13170161 -13192847 -12813631
36311 -12813631 -12100555 -11008699 -9328156 -6956654 -4127380 -1226908 1474708 3775702
36303 3775702 5421379 6246902 6280029 5478177 3572481 550929 -2769634 -5050065 -5410201
36294 -5410201 -3897926 -1039469 2671222 6683957 10152915 12155395 12155279 10183376 6732146
36285 6732146 2654973 -952441 -3060558 -3071732 -971439 2737483 7155422 11158024
36277 11158024 13702093 14189319 12703445 9995340 7163349 5105428 4075399 3722425
36269 3722425 3570664 3463627 3622641 4401944 5973244 8091149 10116739 11401280 11723112
36260A1723112m30643r12892j244653j378757j271722j245661j700477k416920
36252A121387k613539j904561q29748j65892k8368J2775J87663L33309L41744
36243c545230L69029N34549P09532O85681L50407l18655j190926j878677j964779
36234f249069j451047p78508k99812O8345N60389J159129J650492J883516J769802
36225a686763J211612L18466m07681m24712K89321J248169K010298K475771K672526
36216G707007K617878K501356K627753K906233K679774J454032l09198j506594
36208B0678241j538363q59307l37234l40038n84636o42580l45583K31670R44918
36199A7207088J615255J946999J583445M59639q58938j473115j082790m80071
$$ plain form
36260 11723112 11292469 10379577 9134924 7756167 6484445 5238784 3538307 1121387
36252 1121387 -1492152 -3396713 -4226461 -4392353 -4420721 -4407946 -4220283 -3886974 -3545230
36243 -3545230 -3176201 -2641652 -1932120 -1246439 -896032 -1214687 -2405613 -4284290 -6249069
36234 -6249069 -7700116 -8478624 -8778436 -8710091 -8149702 -6990573 -5340081 -3456565 -1686763
36225 -1686763 -475151 -156685 -564366 -989078 -699757 548412 2558710 5034481 7707007
36216 7707007 10324885 12826241 15453994 18360227 21040001 22494033 22184835 20678241
36208 20678241 19139878 18280571 17943337 17603299 17018663 16376083 16030500 16262170 17207088
36199 17207088 18822343 20769342 22352787 22812426 21953488 20480373 19397583 18917512
36191A8917512p10821j752312k488853k148875j263323q16859q56863n52372M95995
36182H823229J632326J960316J320103K62140n68311p78958l18570L96567O11934
36173A3340776j23094j433194k481640k848767k806534k703394k380243j415126
36165b851216J78142J738315K490374K175743J125390j43750j280589k165279
36157A267130k865304l559416m281588m639494m035846k406532n56024N80706
36149b0496368R57728J370551K393834L733529M714535N002143M608294L555212
36141E839458J952733K62829r05587j284224j012679k96875P19598J774691K505958
36132I555902K773690K779135K739577K538341J775115J56780k097013m163761
$$ plain form
36191 18917512 18206691 16454379 13965526 11816651 10553328 9736469 8879606 8327234 8823229
36182 8823229 10455555 12415871 13735974 13998114 13429803 12650845 12332275 12728842 13340776
36173 13340776 13217682 11784488 9302848 6454081 3647547 944153 -1436090 -2851216
36165 -2851216 -2673074 -934759 1555615 3731358 4856748 4712998 3432409 1267130
36157 1267130 -1598174 -5157590 -9439178 -14078672 -18114518 -20521050 -21077074 -20496368
36149 -20496368 -19538640 -18168089 -15774255 -12040726 -7326191 -2324048 2284246 5839458
36141 5839458 7792191 8055020 7149433 5865209 4852530 4555655 5275253 7049944 9555902
36132 9555902 12329592 15108727 17848304 20386645 22161760 22318540 20221527 16057766
36124A6057766n063604m410317k724875r05408N10245J426081J792206J551943
36116H234037R44018M12029R2894k47248o43594p06686k15778M27821P12817P43601
36106I753911J051809J810982K616791K979714K673177J633084p2143k061025
36098B0386300l734989m691976m856662m210214k758572r14037M69429P95218
36090D84497L18031k16523l88095k83441p164N49107J327915J832802J536336
36081E153465N05080n66436r64329n39722K35874O50022K13938j007198k334530
36072A346164k844040k086017n90051M79631L69760n54827j253503j125431n42399
36063f800713k93568p16096j466321j960377j853096j171516j82574Q37718J792616
$$ plain form
36124 16057766 10994162 6583845 3858970 2953562 3463807 4889888 6682094 8234037
36116 8234037 9178055 9590084 9682978 9435730 8792136 8085450 7869672 8297493 9010310 9753911
36106 9753911 10805720 12616702 15233493 18213207 20886384 22519468 22447325 20386300
36098 20386300 16651311 11959335 7102673 2892459 133887 -780150 -310721 484497
36090 484497 802528 586005 197910 -85531 -92695 456412 1784327 3617129 5153465
36081 5153465 5658545 5092109 4127780 3588058 3823932 4473954 4687892 3680694 1346164
36072 1346164 -1497876 -3583893 -4173944 -3694313 -3324553 -3879380 -5132883 -6258314 -6800713
36063 -6800713 -7094281 -7810377 -9276698 -11237075 -13090171 -14261687 -14444261 -13606543 -11813927
36054a1813927K713945L469474L629445K825598J267912k56640r96045q06387
36046C3375j24673N23257R57423J382731K048993K833015L177263K551111J000516
36037A4383011q37810k256848k901882k733114j861091n95822N21986J012533
36029D730963Q09431K18652m29804r73505j334495j451931j363403j249163j319300
36020b362555j646926k063532k188546j682098o12856M83780J081970J204002
36012g786761J363471J988626L013543L967680M279681L566218J948459J83819
36004A2524736p96677o92578m4978M67701P38812J060205J468226J604381J193953
35995A7523781L81406m58026j036942j230753j017287m67796K42728Q51407J041276
$$ plain form
36054 -11813927 -9099982 -5630508 -2001063 824535 2092447 1835807 839762 33375
36046 33375 -91298 431959 1389382 2772113 4821106 7654121 10831384 13382495 14383011
36037 14383011 13545201 11288353 8386471 5653357 3792266 3196444 3718430 4730963
36029 4730963 5540394 5759046 5329242 4355737 3021242 1569311 205908 -1043255 -2362555
36020 -2362555 -4009481 -6073013 -8261559 -9943657 -10556513 -10072733 -8990763 -7786761
36012 -7786761 -6423290 -4434664 -1421121 2546559 6826240 10392458 12340917 12524736
36004 12524736 11728059 11035481 10990503 11458204 12197016 13257221 14725447 16329828 17523781
35995 17523781 17905187 17447161 16410219 15179466 14162179 13694383 13937111 14788518 15829794
35986A5829794N86989l68680j232931j365473o28603N59424J701799K599270L247401
35977B0928990L573084L424172K776470J879972J167291R02618Q18181K57883
35969C5728661j047815k430898k891008k314498j670227j765078k197710j945808
35961A9465619p08910Q68481K213180L454074M864440O174361O820745O643157
35953D9795147N990953N280497M767580M653847M992558N356707M916314L147579
35945H8901182M42993k116794l589612l746412k990122j934139j066475o08858
35937G3291763n38488p66853j331387k328049l606380m676367n095585m905905
35929E0042749m507673m100893l454903k318315q85296L09578R02968J011370
$$ plain form
35986 15829794 16416783 16048103 14815172 13449699 12821096 13380520 15082319 17681589 20928990
35977 20928990 24502074 27926246 30702716 32582688 33749979 34652597 35470778 35728661
35969 35728661 34680846 32249948 29358940 27044442 25374215 23609137 21411427 19465619
35961 19465619 18756709 19625190 21838370 25292444 30156884 36331245 43151990 49795147
35953 49795147 55786100 61066597 65834177 70488024 75480582 80837289 85753603 88901182
35945 88901182 89344175 87227381 83637769 79891357 76901235 74967096 73900621 73291763
35937 73291763 72753275 71986422 70655035 68326986 64720606 60044239 54948654 50042749
35929 50042749 45535076 41434183 37979280 35660965 34775669 35085247 35988215 36999585
35921C6999585J098136J610103K612576L600959L739526K522344K78014k076011
35913E0385232l782276m642391m755815m181323l027301j662120n39522J73294
35905B7967778N83654O71410J26071j258370l114894m576116m827810l581709
35897A1990014j163998J617293L681645M091220K651837J96874j926199k859036
35889A8279650k784579k510439k599622k957006l140188k876620k225859j377447
35881b192110m66749L61158Q25910O54004m5045o59200n52698K73536J140396
35872f60798J387342R87462L85525j00214m96846q68960j053307q01659q6950
35863a308405P93561J388484J405058R48305M28221J49979O1063M360O8218M13873
$$ plain form
35921 36999585 38097721 39707824 42320400 45921359 49660885 52183229 52461243 50385232
35913 50385232 46602956 41960565 37204750 33023427 29996126 28334006 27794484 27967778
35905 27967778 28551432 29222842 29348913 28090543 24975649 20399533 15571723 11990014
35897 11990014 10826016 12443309 16124954 20216174 22868011 23064885 21138686 18279650
35889 18279650 15495071 12984632 10385010 7428004 4287816 1411196 -814663 -2192110
35881 -2192110 -2658859 -2297701 -1471791 -817787 -862832 -1522032 -2074730 -1801194 -660798
35872 -660798 726544 1714006 2099531 1999317 1502471 633511 -419796 -1221455 -1308405
35863 -1308405 -514844 873640 2278698 3227003 3655224 3805203 3866266 3870626 3938844 4352717
35853D352717Q17909P57031O6525p88396j283328j423285j532366j674579j575949
35844b283721r85864J71740J880717L905757N618581O345189N998804N078942
35836B5730145L947464K439118L92540j738250l143710l401036k680185j350633
35828B0195453K34596J573364K080738J599672O74097R1292K10680Q28627J515475
35819B9003994J869333J587501O34361o15730j665718k406738l101403l766366
35811B1539234l899818l112055j801991p94446l44443R5777J027377K191972K936119
35802A7837726L043765K923457L066161L543626M005986M008141L357769K256377
35794D4043008J081344J2630r75955j714889j752841r73472p1657N4888o05520
$$ plain form
35853 4352717 5170626 5927657 5994182 5205786 3922458 2499173 966807 -707772 -2283721
35844 -2283721 -3269585 -3097845 -1217128 2688629 8307210 14652399 20651203 25730145
35836 25730145 29677609 32116727 32509267 30771017 27627307 24226271 21546086 20195453
35828 20195453 20430049 22003413 24084151 25683823 26357920 26449212 26659892 27488519 29003994
35819 29003994 30873327 32460828 33095189 32479459 30813741 28407003 25305600 21539234
35811 21539234 17639416 14527361 12725370 11930924 11586481 11682258 12709635 14901607 17837726
35802 17837726 20881491 23804948 26871109 30414735 34420721 38428862 41786631 44043008
35794 44043008 45124352 45136982 44161027 42446138 40693297 39719825 39648168 39703056 39097536
35785C9097536j120938p68252J24871O87924N23313r5788q03121j489219k085278
35776C4071048k361268k123413j496357r03888p95915j369213k424780l434006
35768A9162208l834016l390972k341824j182343k85809L00830P00920R03714P36700
35759A0769408J89461m08588p51915j026563j721747k914559m013662m358930
35751d237095l855523k851278j628790k90120J013145K046640K641562K653569
35743d507890J895812M37140j086606j836030j525556n58236N78842J658930K395369
35734b548225K326713J418215M38631K46768Q38049J538539K051765K772575L927711
35725A3010741M874605M604609K767439j7726k681547m302962m410826l145770
$$ plain form
35785 39097536 37976598 37208346 37333217 38021141 38544454 38448666 37645545 36156326 34071048
35776 34071048 31709780 29586367 28090010 27186122 26390207 25020994 22596214 19162208
35768 19162208 15328192 11937220 9595396 8413053 8127244 8428074 9128994 10032708 10769408
35759 10769408 10958869 10550281 9798366 8771803 7050056 4135497 121835 -4237095
35751 -4237095 -8092618 -10943896 -12572686 -12862806 -11849661 -9803021 -7161459 -4507890
35743 -4507890 -2612078 -2174938 -3261544 -5097574 -6623130 -7181366 -6602524 -4943594 -2548225
35734 -2548225 -221512 1196703 1635334 1882102 2720151 4258690 6310455 9083030 13010741
35725 13010741 17885346 22489955 25257394 25239668 22558121 18255159 13844333 10698563
35717A0698563j259675K78379Q86955O22058j17163r91473j811394k398178k520480
35708C387592j989074p95768Q00258K313555L257840L435520L015576K319690
35700A5745189J589012R80922O68504P83351J244512J730182J849523J345734
35692B5936929K39899j087085k015189k111397j517827p71893j70133N07718J493172
35683B0504194K429271K573495J605293p921j511060k500327k939796k795578
35675A7357571k010273q66220o5824j90025j096806k008713k242733j794624j207522
35666E874831r75017j128618j303885j083751l28863O57730J248709R21927k87479
35657C595584j754936k707632k699031j752605k51503J249782K305038K841411
$$ plain form
35717 10698563 9438888 9717267 10604222 11226280 11109117 10117644 8306250 5908072 3387592
35708 3387592 1398518 602750 1403008 3716563 6974403 10409923 13425499 15745189
35700 15745189 17334201 18315123 18983627 19766978 21011490 22741672 24591195 25936929
35692 25936929 26176828 25089743 23074554 20963157 19445330 18673437 18503304 19011022 20504194
35683 20504194 22933465 25506960 27112253 27104332 25593272 23092945 20153149 17357571
35675 17357571 15347298 14481078 14415254 14225229 13128423 11119710 8876977 7082353 5874831
35666 5874831 4899814 3771196 2467311 1383560 1054697 1712427 2961136 3883063 3595584
35657 3595584 1840648 -866984 -3566015 -5318620 -5570123 -4320341 -2015303 826108
35649H26108L058103K972600K278274Q92450n40089j115484o92151p6683k3707
35640G579421l49223k87524M93063J556899K288658K478184K274940J842140J236546
35631A9113104N27470j21378n20256n96026m89379m89452p93622j296848j653863
35622A3679750j577775j080758m52837m3753l2337l17893n87280n22503k6250
35613I038364O66574J073709P77446j60905j070082j153229k76458Q10514J217696
35604A0923629Q46155L98764M71715Q83576J042365P64097M11802K17319j99831
35595A5759591j352792l013740m146922l885675k443674q99277j75750m06978
35587e65217j176729k023094k619304k787483k605102k359710k173185j771097
$$ plain form
35649 826108 3884211 6856811 9135085 10027535 9487446 8371962 7679811 7603128 7579421
35640 7579421 7230198 6942674 7435737 8992636 11281294 13759478 16034418 17876558 19113104
35631 19113104 19640574 19519196 18998940 18402914 17913535 17424083 16630461 15333613 13679750
35622 13679750 12101975 11021217 10568380 10524627 10492290 10174397 9587117 9064614 9038364
35613 9038364 9704938 10778647 11556093 11395188 10325106 9171877 8895419 9705933 10923629
35604 10923629 11769784 12168548 12640263 13523839 14566204 15330301 15742103 15959422 15759591
35595 15759591 14406799 11393059 7246137 3360462 916788 17511 -158239 -565217
35587 -565217 -1741946 -3765040 -6384344 -9171827 -11776929 -14136639 -16309824 -18080921
35579a8080921q48963M05293J405861J790101J743413J699192J917497K376803
35571g591724K843813K945790K362852J115084l94581j684270k477621k706852
35563e587509k422777j794055j056254l49587L11456Q67580J171860J206014J161623
35554f491649J146754R59607L73534m24473r14319p94554l09527M640j86071p44641
35544g380699j159187r16248P1850J344255K249658K448639K053755J378285O86682
35535G76990J30049k91021p56431j440670k180892k455154j855938n75592O77685
35526g970974J267424J109511O16315K60145K32257M70911Q76812J340765J543585
35517b53249R48104p32077l004558m725967m921017l491745j154624J161448K788343
$$ plain form
35579 -18080921 -18929884 -18524591 -17118730 -15328629 -13585216 -11886024 -9968527 -7591724
35571 -7591724 -4747911 -1802121 560731 1675815 1281234 -403036 -2880657 -5587509
35563 -5587509 -8010286 -9804341 -10860595 -11210182 -10898726 -10031146 -8859286 -7653272 -6491649
35554 -6491649 -5344895 -4385288 -4011754 -4436227 -5350546 -6145100 -6454627 -6449987 -6636058 -7380699
35544 -7380699 -8539886 -9456134 -9384284 -8040029 -5790371 -3341732 -1287977 90308 776990
35535 776990 907039 616018 -140413 -1581083 -3761975 -6217129 -8073067 -8648659 -7970974
35526 -7970974 -6703550 -5594039 -4977724 -4717579 -4485322 -4014411 -3137599 -1796834 -253249
35517 -253249 694855 -37222 -3041780 -7767747 -12688764 -16180509 -17335133 -16173685 -13385342
35508a3385342L433341L175392K441617J779667J446006J217403O92516k35200
35500E65400j271232k035889k336160k086266j146532N22779K520277L997157
35492a270466M159273K827537N46193j777010l362889l910166l657929l094980
35484i540437k502290j770713o85640P10155K126719L280802L978474M051390
35476c51540L472620K536639J651116Q61983j56638j472204k482827k423136j228678
35467D07335K99438J145818P46262q39044l031946m906609n557455m614536k451029
35458a8801766J37767K387717L737235L860355K846787J312621L4220o81961j146434
35449f313459j701009k123213j826125o42597Q06073J651554J585493J004497
$$ plain form
35508 -13385342 -9952001 -6776609 -4334992 -2555325 -1109319 108084 800600 565400
35500 565400 -705832 -2741721 -5077881 -7164147 -8310679 -7787900 -5267623 -1270466
35492 -1270466 2888807 5716344 6262537 4485527 1122638 -2787528 -6445457 -9540437
35484 -9540437 -12042727 -13813440 -14499080 -13788925 -11662206 -8381404 -4402930 -351540
35476 -351540 3121080 5657719 7308835 8170818 8014180 6541976 4059149 1636013 407335
35467 407335 706773 1852591 2598853 1759809 -1272137 -6178746 -11736201 -16350737 -18801766
35458 -18801766 -18663999 -16276282 -12539047 -8678692 -5831905 -4519284 -4485064 -5167025 -6313459
35449 -6313459 -8014468 -10137681 -11963806 -12606403 -11800330 -10148776 -8563283 -7558786
35441g558786M42177N7091k90277o38003p45709k85060Q47417K355612L636428
35432b179110M130286L698542K691859J654541R75964P31339O52887K23628r20143
35423A1659793k444973l347425k855182j316269M3575K82309n06418j517866j966643
35414a969099j454767p0605J525870K349844J865526N82950l28741r1703J059619
35405C468894K168816K285951J051089j087040l123874m173006m040318l135416
35397f584904j940423p80899k0996l9610p67792j498291j480753o84425J99105
35388a3598988M63339l6352r06412j589102j725524j365819r06075p13868p79431
35379b1158232q26791p57237q10869j209198j774873k041280j688729p86152L19584
$$ plain form
35441 -7558786 -7116609 -7059518 -7349795 -7987798 -8733507 -9018567 -8171150 -5815538 -2179110
35432 -2179110 1951176 5649718 8341577 9996118 10972082 11703421 12356308 12579936 11659793
35423 11659793 9214820 5867395 3012213 1695944 1739519 2021828 1515410 -2456 -1969099
35414 -1969099 -3423866 -3494471 -1968601 381243 2246769 2829719 2500978 2409275 3468894
35405 3468894 5637710 7923661 8974750 7887710 4763836 590830 -3449488 -6584904
35397 -6584904 -8525327 -9306226 -9327222 -9366832 -10134624 -11632915 -13113668 -13798093 -13598988
35388 -13598988 -13135649 -13172001 -14078413 -15667515 -17393039 -18758858 -19664933 -20378801 -21158232
35379 -21158232 -21985023 -22742260 -23553129 -24762327 -26537200 -28578480 -30267209 -31053361 -30733777
35370c0733777J220697J624180J551824J464040J991969L305569M763994N409457
35362i402047M902886L848218L115883K982884L036232K725278J777245K37983
35354A3224562j489662k627765k508915j367453l63646m79899j547266k657515
35346A82441l315668l694661l829745l233645j641305L16719J680398K217976
35338a1317490K469267K810650K967196K573885J790638J053231M68464j64554
35330B651287q07002j034258n53174L84236J256558J804316K098612K201466K025435
35321A0027476J551241R57623M33854J3720l18018n30045p08979j161712k103153
35312H162007l275304m102064m254391l893042l342412k741117k097182j478276
$$ plain form
35370 -30733777 -29513080 -27888900 -26337076 -24873036 -22881067 -19575498 -14811504 -9402047
35362 -9402047 -4499161 -650943 2464940 5447824 8484056 11209334 12986579 13224562
35354 13224562 11734900 9107135 6598220 5230767 4867121 4387222 2839956 182441
35346 182441 -3133227 -6827888 -10657633 -13891278 -15532583 -15215864 -13535466 -11317490
35338 -11317490 -8848223 -6037573 -3070377 -496492 1294146 2347377 2815841 2651287
35330 2651287 1844285 810027 256853 641089 1897647 3701963 5800575 8002041 10027476
35321 10027476 11578717 12536340 12970194 12983914 12665896 12135851 11426872 10265160 8162007
35312 8162007 4886703 784639 -3469752 -7362794 -10705206 -13446323 -15543505 -17021781
35304a7021781r64152n00014N3126P59982J593361K509715L431623M192202M598850
35295a347088M547291M027877L079820J826715N18069n71713j315872j789535
35287H975564k174095k606996l040774l199482k757211j654509k26740R98931
35279e685312J587782J334417L45393q81330j630026j459252n39713N61390J345161
35270e021490J575862J247052O22175K02312L48142R17951J488992J884495K193236
35261E458727K293289J770171N08616r16140j710825j628098j114631q23247j097500
35252B740362j772767k306028k205089j481679o09650J4094L55902L83184k38543
35243e120214j687858l360942m150153l446319j617193N10648K312004L424280
$$ plain form
35304 -17021781 -17985933 -18485947 -18432821 -17672839 -16079478 -13569763 -10138140 -5945938 -1347088
35295 -1347088 3200203 7228080 10307900 12134615 12652684 12080971 10765099 8975564
35287 8975564 6801469 4194473 1153699 -2045783 -4802994 -6457503 -6684243 -5685312
35279 -5685312 -4097530 -2763113 -2417720 -3299050 -4929076 -6388328 -6928041 -6366651 -5021490
35270 -5021490 -3445628 -2198576 -1576401 -1374089 -1025947 -107996 1380996 3265491 5458727
35261 5458727 7752016 9522187 10030803 9114663 7403838 5775740 4661109 3837862 2740362
35252 2740362 967595 -1338433 -3543522 -5025201 -5634851 -5620757 -5264855 -4881671 -5120214
35243 -5120214 -6808072 -10169014 -14319167 -17765486 -19382679 -18872031 -16560027 -13135747
35235a3135747L552520K589062Q69447r29684k214195k776264k766462k462548
35227a7273871k039908j522112r63651o10833p14724j151653j403945j029306
35219b6710003n4901J139702K158187K704867K593660J911499J102623O38565
35211a4515801N98029P69480J141628J984983L298359M408462M412988L043919
35203E142047R68526p60248j466382j147733k70641N61508Q32062K70694j000636
35194C129197k457460l433782l537894k878892j892776r59399j96777M36408R60007
35185a0831368J347473J606368J789187J931943K053830K218792K503099K838217
35177E457541K949001K563637J711488P37157k6752n40524r52569j291477j415788
$$ plain form
35235 -13135747 -9583227 -6994165 -6124718 -7054402 -9268597 -12044861 -14811323 -17273871
35227 -17273871 -19313779 -20835891 -21799542 -22410375 -23125099 -24276752 -25680697 -26710003
35219 -26710003 -26764904 -25625202 -23467015 -20762148 -18168488 -16256989 -15154366 -14515801
35211 -14515801 -13917772 -13148292 -12006664 -10021681 -6723322 -2314860 2098128 5142047
35203 5142047 6110573 5350325 3883943 2736210 2465569 3027077 3859139 4129833 3129197
35194 3129197 671737 -2762045 -6299939 -9178831 -11071607 -12031006 -12227783 -11791375 -10831368
35185 -10831368 -9483895 -7877527 -6088340 -4156397 -2102567 116225 2619324 5457541
35177 5457541 8406542 10970179 12681667 13418824 13392072 12851548 11898979 10607502 9191714
35168I191714j297655j201118j431692j945360k336631k235092j624948p66133
35160c646915O2133O48692Q04842M41131k65189r29796j310161j525996j788270
35151g509529j921293j346728L09961K663647M769064N873358N845686M892955
35143A3577121L139140P20313j841974l717965m375440l999703l256394k758087
35135b512989k774837l207499l630407l505387k630615j381517l30404L40264
35127a9633391Q48939J302483J505755J386966J306445J696946K555511L498496
35119e531850M164037M314113L690342K164201J15982j609869k310265j930536
35111C066155r72007l6071N40946P87390Q97275Q31085J92677j219529k747534
$$ plain form
35168 9191714 7894059 6692941 5261249 3315889 979258 -1255834 -2880782 -3646915
35160 -3646915 -3584782 -2936090 -2131248 -1690117 -1955306 -2885102 -4195263 -5721259 -7509529
35151 -7509529 -9430822 -10777550 -10467589 -7803942 -3034878 2838480 8684166 13577121
35143 13577121 16716261 17436574 15594600 11876635 7501195 3501492 245098 -2512989
35135 -2512989 -5287826 -8495325 -12125732 -15631119 -18261734 -19643251 -19973655 -19633391
35127 -19633391 -18784452 -17481969 -15976214 -14589248 -13282803 -11585857 -9030346 -5531850
35119 -5531850 -1367813 2946300 6636642 8800843 8916825 7306956 4996691 3066155
35111 3066155 2094148 2058077 2599023 3386413 4283688 5114773 5307450 4087921 1340387
35102A340387l192524k072320k87519Q00155P93576M47426N92037J303285K115744
35093A840247K559777K285740J081613p86417k356608k509226r24569J543816
35085B734373L491973L970104L004117J352473j28007r63358j155407j031261
35077A1275007j039589j489730k269653k845402k719936j932565j004347m14271
35069b440486k60568l65549m66249l15762O9428J62336o99445k418217l902572
35060a0637084m090684l027879j566374k04838J213811K673959L542447L315692
35052h780950K385000J596430J256557J006866N74993J70688L3511l5337m29494
35043b221736j174116j822317j907663j411513p92835n90440r49534j477325j563312
$$ plain form
35102 1340387 -1852137 -3924457 -4211976 -3411821 -2618245 -2170819 -1578782 -275497 1840247
35093 1840247 4400024 6685764 7767377 6980960 4624352 2115126 1190557 2734373
35085 2734373 6226346 10196450 13200567 14553040 14425033 13461675 12306268 11275007
35077 11275007 10235418 8745688 6476035 3630633 910697 -1021868 -2026215 -2440486
35069 -2440486 -2701054 -3066603 -3532852 -3848614 -3779186 -3616850 -4316295 -6734512 -10637084
35060 -10637084 -14727768 -17755647 -19322021 -19526859 -18313048 -15639089 -12096642 -8780950
35052 -8780950 -6395950 -4799520 -3542963 -2536097 -1961104 -1790416 -1756905 -1792242 -2221736
35043 -2221736 -3395852 -5218169 -7125832 -8537345 -9330180 -9920620 -10870154 -12347479 -13910791
35034a3910791q78375L85379J685589K506493K661324K346003J901822J470230
35026a832326R06605Q2744q04232j344181j298410p66128m2507N12856N35069
35017d050510j10436j033598j485273j001947K07516J578230K680321L266118
35009E0421L123854K249705J078953K03034j72883k56896k02142O1006M97688
35000F632740Q50903J016369J224112J627828J987745K041892J963803K093203
34992A9438595K333738K194290J423083K92207p54116j424449j524198r44589
34984B1034561Q8374R67031J105067L18379j193677k984358m374118m666693l703267
34975F591299k129993q71891l42391k56971o3118O35981J899773L354080M309297
$$ plain form
35034 -13910791 -14789166 -14403787 -12718198 -10211705 -7550381 -5204378 -3302556 -1832326
35026 -1832326 -925721 -842977 -1647209 -2991390 -4289800 -5055928 -5098435 -4585579 -4050510
35017 -4050510 -4160946 -5194544 -6679817 -7681764 -7474248 -5896018 -3215697 50421
35009 50421 3174275 5423980 6502933 6705967 6533084 6276188 6074046 6135052 6632740
35000 6632740 7483643 8500012 9724124 11351952 13339697 15381589 17345392 19438595
34992 19438595 21772333 23966623 25389706 25681913 24927797 23503348 21979150 21034561
34984 21034561 21122935 22089966 23195033 23513412 22319735 19335377 14961259 10294566 6591299
34975 6591299 4461306 3589415 3247024 2990053 2926935 3562916 5462689 8816769 13126066
34966A3126066M279715L431853K309162J161173j26132j423744k148511j944356
34958A8665226j272083r36715j145228j380891j177877o69809k76578j25411L3013
34949A1713647M76135J229707K034434K451062K089345R29465n61470j769527
34941A8592798k454035k869654l358482l918099m219569l945701l013424j560989
34933f747155R7562J505589K258637K302929J966624J609826J314723R82301N99545
34924E890581K60684K0158r0046L3645M19242Q18497R37066Q95013J117937J608753
34914A1911530J672682P25921p84452j655730j136338L95329J910597K569179
34906A5608718K091712P54869p04523j441133j119572j90418N81718P91488N18965
$$ plain form
34966 13126066 17405781 20837634 23146796 24307969 24181837 22758093 20609582 18665226
34958 18665226 17393143 16456428 15311200 13930309 12752432 12082623 11806045 11680634 11713647
34949 11713647 12189782 13419489 15453923 17904985 19994330 20923795 20362325 18592798
34941 18592798 16138763 13269109 9910627 5992528 1772959 -2172742 -5186166 -6747155
34933 -6747155 -6649593 -5144004 -2885367 -582438 1384186 2994012 4308735 5291036 5890581
34924 5890581 6151265 6171423 6081377 6115022 6534264 7352761 8289827 9184840 10302777 11911530
34914 11911530 13584212 14310133 13525681 11869951 10733613 11128942 13039539 15608718
34906 15608718 17700430 18455299 17750776 16309643 15190071 14999653 15581371 16372859 16891824
34897A6891824K4531l91435l61865L01476J243274J758393J538023J032169Q97379
34888B2933769J252573J684199J829441J645237J138299K05158j050843k049692
34880B7588141k090764j043429M32780J408239J390075N54050n71011j525369
34872B6142712k065338k077554j556295p41973j52304k51718r92745j787111k056260
34863A4461414j790477j483885j557484j965942k367332k524466k449565k256982
34855a934719k017737j753609j457575j067539m92799K38728Q63132J022837O36404
34846e962877R6948n4764K63514N21653J88634n59297r32025l42281J034985K519853
34836c225657L493652L608651K740995J088733p35847k021280k475178k327939
$$ plain form
34897 16891824 16916355 16524920 16163055 16464531 17707805 19466198 21004221 22036390 22933769
34888 22933769 24186342 25870541 27699982 29345219 30483518 30688676 29637833 27588141
34880 27588141 25497377 24453948 24886728 26294967 27685042 28239092 27668081 26142712
34872 26142712 24077374 21999820 20443525 19701552 19549248 19297530 18304785 16517674 14461414
34863 14461414 12670937 11187052 9629568 7663626 5296294 2771828 322263 -1934719
34855 -1934719 -3952456 -5706065 -7163640 -8231179 -8723978 -8485250 -7622118 -6599281 -5962877
34846 -5962877 -5865929 -5920693 -5657179 -5135526 -4946892 -5506189 -6438214 -6780495 -5745510 -3225657
34836 -3225657 267995 3876646 6617641 7706374 6970527 4949247 2474069 146130
34828A46130j952081j551121j198669r31398p03452m21234j15356Q0128J98726
34819f448327M83154R91498J341437J098899L63496k49156k08434M84790J380708
34810g61935J900803J620843N37069q10946j652100j560719o59445P36306K400702
34801A750578L944530M559768L505212R95458j664546l091131k958795k071708
34793D969366j439540j452632j875308k331231k607365k618738k323242j736769
34785a1415459r36347j6255Q91243J568432J828741J739022J594898J571044J508158
34776a666523J191553P45392N32435O65249Q37898P24577L72316Q6241P4539L53702
34766C917379Q72547J502289J923587J745884Q51851m38534j587142k195036k199941
$$ plain form
34828 146130 -1805951 -3357072 -4555741 -5487139 -6190591 -6611825 -6727181 -6647053 -6448327
34819 -6448327 -5965173 -4973675 -3632238 -2533339 -2169843 -2418999 -2627433 -2142643 -761935
34810 -761935 1138868 2759711 3296780 2485834 833734 -726985 -1386430 -650124 1750578
34801 1750578 5695108 10254876 13760088 14755546 13091000 9999869 7041074 4969366
34793 4969366 3529826 2077194 201886 -2129345 -4736710 -7355448 -9678690 -11415459
34785 -11415459 -12351806 -12368061 -11476818 -9908386 -8079645 -6340623 -4745725 -3174681 -1666523
34776 -1666523 -474970 270422 802857 1468106 2306004 3030581 3402897 3489138 3563677 3917379
34766 3917379 4789926 6292215 8215802 9961686 10813537 10375003 8787861 6592825 4392884
34757D392884j850478j497950j295775j065009n41604K35495R02535J161094J049841
34748A491033P81986M91074K53899J85614K97055L46327N8901n18888j066839
34739B320162j370263j469019j468604j458429j631012k160532k815663k982294
34731a3035654k331526j286886n62185l70629l77661l10553k06927k3093N79254
34722a7925860J793455L231329M189354M275742L604751K464521J019457o28432
34714B024317k235845l384449l681126l039704j793463m84293M92652J024182
34706a1077729J148435R80200P83525Q53526J133046J126789M70227m79951q94302
34697e956234l37706Q16175J853161K366116K363782J992236J370587O11816j79644
$$ plain form
34757 4392884 2542406 1044456 -251319 -1316328 -1857932 -1622437 -719902 441192 1491033
34748 1491033 2273019 2764093 3017992 3203606 3500661 3846988 3905889 3387001 2320162
34739 2320162 949899 -519120 -1987724 -3446153 -5077165 -7237697 -10053360 -13035654
34731 -13035654 -15367180 -16654066 -17216251 -17586880 -17964541 -18275094 -18482021 -18505114 -17925860
34722 -17925860 -16132405 -12901076 -8711722 -4435980 -831229 1633292 2652749 2024317
34714 2024317 -211528 -3595977 -7277103 -10316807 -12110270 -12594563 -12101911 -11077729
34706 -11077729 -9929294 -8949094 -8165569 -7312043 -6178997 -5052208 -4581981 -5061932 -5956234
34697 -5956234 -6293940 -5477765 -3624604 -1258488 1105294 3097530 4468117 5079933 4900289
34688D900289r36265j573554j925364j776512r47699N77266K410364L629404L236470
34679G594399J098009j637071l360339l323049k025000m14265R57133J953234
34671H43051K480532K451597J953848J129003n7291j631774l198129m001515l535369
34662c566047j935708K59190K512462M355243N324022N139841L956166K310714
34654A8355883Q54455J22755L10766J014940J329567N54408j094042k636196l224324
34645A5588212k761900j712126n85825K95760P79479Q23481M26490l74603j289808
34636A1189160j643445q52888P83963K102553K172708J210651J60902l84783m94193
34627A4244628l37773J14606P61951J218258J275855J276119J738286K689149
$$ plain form
34688 4900289 3964024 2390470 465106 -1311406 -2259105 -1681839 728525 4357929 7594399
34679 7594399 8692408 7055337 3694998 371949 -1653051 -2067316 -1110183 843051
34671 843051 3323583 5775180 7729028 8858031 8800740 7168966 3970837 -30678 -3566047
34662 -3566047 -5501755 -5242565 -2730103 1625140 6949162 12089003 16045169 18355883
34654 18355883 19210338 19333093 19643859 20658799 21988366 22542774 21448732 18812536 15588212
34645 15588212 12826312 11114186 10528361 10824121 11603600 12427081 12853571 12478968 11189160
34636 11189160 9545715 8692827 9476790 11579343 13752051 14962702 15123604 14738821 14244628
34627 14244628 13906855 14021461 14783412 16001670 17277525 18553644 20291930 22981079
34619B2981079L512415L429192K114756J2654j852025k517113j741979r7760J537311
34610B7378530K511309K606902K084033J588713J650618K007350J677548M7026
34602D1552029k248062l883525m266326m036434m093622m502867m601212l908443
34594A0011538k552838q79991R34093K702110L925719L985660K633947J80380
34586B0940618k709051n202245o426282n872381l936277j814920n38970j39045
34578e698553P8105O01155J348627K080507K711130L110158K981510K205975J117653
34569A0536267K21563k71921n20315q01606j319735k106934k954826l525605l641203
34560d384315l370802k771826j727346j97091J497711K812150L365834L162443
$$ plain form
34619 22981079 26493494 29922686 32037442 32050096 30198071 27680958 25938979 25841219 27378530
34610 27378530 29889839 32496741 34580774 36169487 37820105 39827455 41505003 41552029
34602 41552029 39303967 35420442 31154116 27117682 23024060 18521193 13919981 10011538
34594 10011538 7458700 6578709 7512802 10214912 14140631 18126291 20760238 20940618
34586 20940618 18231567 13029322 6603040 730659 -3205618 -5020538 -5559508 -5698553
34578 -5698553 -5620448 -5019293 -3670666 -1590159 1120971 4231129 7212639 9418614 10536267
34569 10536267 10757830 10485909 9965594 9163988 7844253 5737319 2782493 -743112 -4384315
34560 -4384315 -7755117 -10526943 -12254289 -12451380 -10953669 -8141519 -4775685 -1613242
34552a613242K569340K115752K064014K042519J340454k44737k061128l272775
34544B940197l610343l236718k230269o49007J108332K524734L502823M250414
34536D600163M688533M466537L603287K612336J829575J028977j07029j495192
34528B1227187k819157l845303m355973m102955l125510j898500r02090j86110
34520h411M79894J218630J952464K468959K436877J643649M15812m81214n82163
34511I544497p4129P59298J953816L312989L954929L172143J557185M75091L54146
34502B5009965K30329p99786k379233l567107m140345m584777n066271n088647
34494c85872m240088k822292j567630r82999j082445j534644j896166j824105
$$ plain form
34552 -1613242 956098 3071850 5135864 7178383 8518837 8274100 6212972 2940197
34544 2940197 -670146 -3906864 -6137133 -6786140 -5677808 -3153074 349749 4600163
34536 4600163 9288696 13755233 17358520 19970856 21800431 22829408 22722379 21227187
34528 21227187 18408030 14562727 10206754 6103799 2978289 1079789 177699 -8411
34520 -8411 471483 1690113 3642577 6111536 8548413 10192062 10607874 10126660 9544497
34511 9544497 9470368 10229666 12183482 15496471 19451400 22623543 24180728 24655819 25009965
34502 25009965 25240294 24440508 22061275 18494168 14353823 9769046 4702775 -385872
34494 -385872 -4625960 -7448252 -9015882 -9998881 -11081326 -12615970 -14512136 -16336241
34486a6336241j260601m52044K62456O98138Q75889R00360Q74558R48395J354484
34477a2134606K245342L410881M210542L921169K278459k30447k569464l748633
34469b616757l449501k203833q84107O7907Q32997J614365K101079J802243P98382
34460a937225j80710m64827K3072R37404J860549K370641K143424J289404L58484
34451F400216k94698r40961j884298k594479k013150P8437K423245L397322K602564
34442G174198J062896m8852n13485q56576j421926j974769k121169j781809j112778
34433a594270j57014J164013K699702L924658M300270L736906K609694J378481
34425A8062440L15727m47136q45719r97357j259365j954983l003181l945008m393749
$$ plain form
34486 -16336241 -17596842 -18048886 -17786430 -17088292 -16212403 -15312043 -14437485 -13489090 -12134606
34477 -12134606 -9889264 -6478383 -2267841 1653328 3931787 3701340 1131876 -2616757
34469 -2616757 -6066258 -8270091 -9154198 -9086291 -8253294 -6638929 -4537850 -2735607 -1937225
34460 -1937225 -2117935 -2582762 -2559690 -1622286 238263 2608904 4752328 6041732 6400216
34451 6400216 6105518 5164557 3280259 685780 -1327370 -1248933 1174312 4571634 7174198
34442 7174198 8237094 8188242 7674757 6818181 5396255 3421486 1300317 -481492 -1594270
34433 -1594270 -1751284 -587271 2112431 6037089 10337359 14074265 16683959 18062440
34425 18062440 18378167 17931031 17085312 16087955 14828590 12873607 9870426 5925418 1531669
34416A531669m368153m108168l642829k685328j005983J143760L045269M008158
34408f081605L920482L329007K906023K781548K478077J605061N30809J42760
34400A1612162Q78288K178082L044230L022437K461689J885954J352516M92377
34392B6927735r84885k932563m801936n919164n812077m457789k312176o6937
34384c59792J707129K778230L223424L241235K977585K486022J819260J125343
34376A8998436O19185M43729N58198P49544P42123L32414n03911j570528k497152
34367A7872038k866433k404787j198338K14385J079842R65190J63273m84095k57945
34358A3083130Q81173K335485L377739L608126L047333J973326P43694l30125
$$ plain form
34416 1531669 -2836484 -6944652 -10587481 -13272809 -14278792 -13135032 -10089763 -6081605
34408 -6081605 -2161123 1167884 4073907 6855455 9333532 10938593 11469402 11612162
34400 11612162 12490450 14668532 17712762 20735199 23196888 25082842 26435358 26927735
34392 26927735 25942850 23010287 18208351 12289187 6477110 2019321 -292855 -359792
34384 -359792 1347337 4125567 7348991 10590226 13567811 16053833 17873093 18998436
34376 18998436 19617621 20061350 20619548 21369092 22111215 22443629 21939718 20369190 17872038
34367 17872038 15005605 12600818 11402480 11616865 12696707 13661897 13825170 13341075 13083130
34358 13083130 13964303 16299788 19677527 23285653 26332986 28306312 29050006 28719881
34350B8719881j106690j665741k141930k450145k283440j500282m22556M31717
34342A7580814Q63929J012938Q72743J54402j155841k378498k651769j804748
34334A2493970m45082P67371J615265K086574K024590J233497k46684k132286
34326A7397215m026490n440897n873315n104358l417306j428248K87088J414688
34318f191623J936964K075077K084172J979399J545372P03513k53916r20225j159470
34309A799263j123186j017632j005593j203662j569487j862786j891432j713923
34301i588438j442262j009152m06148j7709l09054j132524j701578j413559m79596
34292a7500020L61430N49682R2000m46177k33006J169611L160737M380389L970409
$$ plain form
34350 28719881 27613191 25947450 23805520 21355375 19071935 17571653 17149097 17580814
34342 17580814 18444743 19457681 20330424 20484826 19328985 16950487 14298718 12493970
34334 12493970 12048888 12816259 14431524 16518098 18542688 19776185 19529501 17397215
34326 17397215 13370725 7929828 2056513 -3047845 -6465151 -7893399 -7606311 -6191623
34318 -6191623 -4254659 -2179582 -95410 1883989 3429361 4132874 3878958 2958733 1799263
34309 1799263 676077 -341555 -1347148 -2550810 -4120297 -5983083 -7874515 -9588438
34301 -9588438 -11030700 -12039852 -12446000 -12463709 -12772763 -13905287 -15606865 -17020424 -17500020
34292 -17500020 -17138590 -16588908 -16496908 -16943085 -17176091 -16006480 -12845743 -8465354 -4494945
34283d494945K440314J063070O07514R24809J508228J974544K072639J729520
34275G825693J213273R08322Q46297P81157P51303J095564J725879J870258R36616
34266A7954362o75242k037068k743106l069626l279292l322669l234540l271001
34258c678182l428160l213042k198472o16156Q27268J610599J752929J663015
34250g280201J743779J967704J734588L84332j947015m165215n145525m719116
34242a7426669l592358k518743j833415j575171j568475j352181m71423R56283
34234b9382152K235860K831525K882750K816248K704596K323891J726705J382466
34226a0478111J630240K195323K421411J938943R94837J22227m11842p57559j156631
$$ plain form
34283 -4494945 -2054631 -991561 -384047 540762 2048990 4023534 6096173 7825693
34275 7825693 9038966 9947288 10793585 11574742 12326045 13421609 15147488 17017746 17954362
34266 17954362 17279120 15242052 12498946 9429320 6150028 2827359 -407181 -3678182
34258 -3678182 -7106342 -10319384 -12517856 -13134012 -12306744 -10696145 -8943216 -7280201
34250 -7280201 -5536422 -3568718 -1834130 -1449798 -3396813 -7562028 -12707553 -17426669
34242 -17426669 -21019027 -23537770 -25371185 -26946356 -28514831 -29867012 -30338435 -29382152
34234 -29382152 -27146292 -24314767 -21432017 -18615769 -15911173 -13587282 -11860577 -10478111
34226 -10478111 -8847871 -6652548 -4231137 -2292194 -1297357 -1175130 -1586972 -2344531 -3501162
34217c501162j628088k013440k165206j976511j394742o20203j66860m22466j162746
34208a5051424j795689k094305k324166k555846k310099j220692K86092J446452
34200b5619677K143927K935730M062489M897567M607292L087955J039023o85252
34192c530946j573556j496114o24829N61482J373488J261191K33250j036164j644048
34183f476246j196910j84483M57695K03110o77165j515907j861458j644656r51177
$$ plain form
34217 -3501162 -5129250 -7142690 -9307896 -11284407 -12679149 -13299352 -13466212 -13888678 -15051424
34208 -15051424 -16847113 -18941418 -21265584 -23821430 -26131529 -27352221 -27066129 -25619677
34200 -25619677 -23475750 -20540020 -16477531 -11579964 -6972672 -3884717 -2845694 -3530946
34192 -3530946 -5104502 -6600616 -7225445 -6663963 -5290475 -4029284 -3796034 -4832198 -6476246
34183 -6476246 -7673156 -7857639 -7399944 -7196834 -7873999 -9389906 -11251364 -12896020 -13847197
$$ [...]
##END NTUPLES=NMR SPECTRUM
##END=
