##TITLE=31Pdec_PR198_rm30
 , 24 sc
 9.3.2022
##JCAMPDX= 6.0         $$ Bruker NMR JCAMP-DX V2.0
##DATA TYPE= NMR SPECTRUM
##DATA CLASS= NTUPLES
##ORIGIN= UXNMR, Bruker Analytische Messtechnik GmbH
##OWNER= root
$$ XWIN-NMR		Version 3.5
$$ Wed Mar  9 12:59:28 2022 Russian Standard Time (UT+4h)  she@DPX200
##.OBSERVE FREQUENCY= 81.013821
##.OBSERVE NUCLEUS= ^31P
##.ACQUISITION MODE= SIMULTANEOUS
##.ACQUISITION SCHEME= undefined
##.AVERAGES= 177
##.DIGITISER RES= 16
##SPECTROMETER/DATA SYSTEM= spect
##.PULSE SEQUENCE= zgpg30
##.SOLVENT NAME= CDCl3
##.SHIFT REFERENCE= (INTERNAL, CDCl3, 0, 248.564)
##AUDIT TRAIL= $$ (NUMBER, WHEN, WHO, WHERE, WHAT)
$$ ##TITLE= Audit trail, XWIN-NMR		Version 3.5
$$ ##JCAMPDX= 5.01
$$ ##ORIGIN= Bruker BioSpin GmbH
$$ ##OWNER= she
$$ F:/spectra/data/she/nmr/P31/1/pdata/1/auditp.txt
$$ ##AUDIT TRAIL=  $$ (NUMBER, WHEN, WHO, WHERE, WHAT)
(   1,<2022-03-09 12:57:37.73 +0400>,<she>,<DPX200>,
      <continue with go, POWCHK disabled, PULCHK disabled
       configuration hash MD5:
       00 E9 B6 7A A2 85 ED C7 34 08 36 98 17 FE 4E 26
       data hash MD5: 32K
       FC E4 2B 21 E8 67 F8 AC B6 75 5A EC 4C EC 2D C0>)
(   2,<2022-03-09 12:57:56.57 +0400>,<she>,<DPX200>,
      <Start of raw data processing
       efp BC_mod = 2 LB = 1 FT_mod = 6 PKNL = 1 PHC0 = -9189.383 PHC1 = 100.0745 SI = 64K 
       data hash MD5: 64K
       4E F6 BF C0 C9 67 39 94 59 B3 49 62 F6 CF 76 D7>)
(   3,<2022-03-09 12:58:15.95 +0400>,<she>,<DPX200>,
      <pk PHC0 = 5.967164 PHC1 = -23.00001 
       data hash MD5: 64K
       E9 C7 46 7F 24 25 81 26 97 31 F2 39 93 B1 25 68>)
$$ ##END=
$$ 
$$ hash MD5
$$ EB 53 F1 4A 04 A7 DC A3 16 7C 27 5A AA 15 9B E4
##$RELAX= 
##$RELAX= 
##$RELAX= 
##$RELAX= 
##$RELAX= 
##$RELAX= 
##$RELAX= 
##$RELAX= 
$$ Bruker specific parameters
$$ --------------------------
##$DU= <F:/spectra>
##$EXPNO= 1
##$NAME= <P31>
##$PROCNO= 1
##$TYPE= <nmr>
##$USER= <she>
##$AMP= (0..31)
100 100 100 100 100 100 100 100 100 100 100 100 100 100 100 100 100 100 
100 100 100 100 100 100 100 100 100 100 100 100 100 100 
##$AQSEQ= 0
##$AQ_mod= 1
##$AUNM= <au_zg>
##$AUTOPOS= <>
##$BF1= 81.014009
##$BF2= 200.13
##$BF3= 200.13
##$BF4= 200.13
##$BF5= 200.13
##$BF6= 200.13
##$BF7= 200.13
##$BF8= 200.13
##$BYTORDA= 1
##$CFDGTYP= 0
##$CFRGTYP= 5
##$CHEMSTR= <none>
##$CNST= (0..31)
1 1 145 1 1 1 1 1 1 1 1 1 1 1 1 1 1 1 1 1 1 1 1 1 1 1 1 1 1 1 1 1 
##$CPDPRG= <waltz16>
##$CPDPRG1= <>
##$CPDPRG2= <waltz16>
##$CPDPRG3= <>
##$CPDPRG4= <mlev>
##$CPDPRG5= <mlev>
##$CPDPRG6= <mlev>
##$CPDPRG7= <mlev>
##$CPDPRG8= <mlev>
##$CPDPRGB= <>
##$CPDPRGT= <>
##$D= (0..31)
0 1 0 0 0 0 0 0 0 0 0 0.03 2e-05 3e-06 0 0 0 0 0 0 0 0 0 0 0 0 0 0 0 0 
0 0 
##$DATE= 1646816045
##$DBL= (0..7)
120 120 120 11 120 120 24 19 
##$DBP= (0..7)
150 150 150 150 150 150 150 150 
##$DBP07= 0
##$DBPNAM0= <>
##$DBPNAM1= <>
##$DBPNAM2= <>
##$DBPNAM3= <>
##$DBPNAM4= <>
##$DBPNAM5= <>
##$DBPNAM6= <>
##$DBPNAM7= <>
##$DBPOAL= (0..7)
0.5 0.5 0.5 0.5 0.5 0.5 0.5 0.5 
##$DBPOFFS= (0..7)
$$ [...]
##$SUBNAM2= <"">
##$SUBNAM3= <"">
##$SUBNAM4= <"">
##$SUBNAM5= <"">
##$SUBNAM6= <"">
##$SUBNAM7= <"">
##$SUBNAM8= <"">
##$SUBNAM9= <"">
##$SW= 501.771253377433
##$SWIBOX= (0..15)
0 1 3 0 0 0 0 0 0 0 0 0 0 0 0 0 
##$SW_h= 40650.406504065
##$TD= 32768
##$TD0= 1
##$TE= 0
##$TE2= 300
##$TE3= 300
##$TEG= 300
##$TL= (0..7)
0 120 53 12 22 120 120 120 
##$TP= (0..7)
150 150 150 150 150 150 150 150 
##$TP07= 0
##$TPNAME0= <>
##$TPNAME1= <>
##$TPNAME2= <>
##$TPNAME3= <>
##$TPNAME4= <>
##$TPNAME5= <>
##$TPNAME6= <>
##$TPNAME7= <>
##$TPOAL= (0..7)
0.5 0.5 0.5 0.5 0.5 0.5 0.5 0.5 
##$TPOFFS= (0..7)
0 0 0 0 0 0 0 0 
##$TUNHIN= 0
##$TUNHOUT= 0
##$TUNXOUT= 0
##$USERA1= <user>
##$USERA2= <user>
##$USERA3= <user>
##$USERA4= <user>
##$USERA5= <user>
##$V9= 5
##$VALIST= <valist>
##$VCLIST= <CCCCCCCCCCCCCCC>
##$VD= 0
##$VDLIST= <DDDDDDDDDDDDDDD>
##$VPLIST= <PPPPPPPPPPPPPPP>
##$VTLIST= <TTTTTTTTTTTTTTT>
##$WBST= 1024
##$WBSW= 4
##$XGAIN= (0..3)
0 0 0 0 
##$XL= 0
##$YL= 0
##$YMAX_a= 59916
##$YMIN_a= -101496
##$ZGOPTNS= <>
##$ZL1= 120
##$ZL2= 120
##$ZL3= 120
##$ZL4= 120
##$ABSF1= 0
##$ABSF2= 0
##$ABSG= 0
##$ABSL= 0
##$ALPHA= 0
##$AQORDER= 0
##$ASSFAC= 0
##$ASSFACI= 0
##$ASSFACX= 0
##$ASSWID= 0
##$AUNMP= <proc_1d>
##$AZFE= 0.1
##$AZFW= 0.5
##$BCFW= 0
##$BC_mod= 2
##$BYTORDP= 0
##$COROFFS= 0
##$CY= -3
##$DATMOD= 1
##$DC= 0
##$DFILT= <>
##$DTYPP= 0
##$F1P= 0
##$F2P= 0
##$FCOR= 1
##$FTSIZE= 65536
##$FT_mod= 6
##$GAMMA= 0
##$GB= 0
##$INTBC= 1
##$INTSCL= 5.30512e-09
##$ISEN= 30
##$LB= 1
##$LEV0= 0
##$LPBIN= 0
##$MAXI= 10000
##$MC2= 0
##$MEAN= 0
##$ME_mod= 0
##$MI= 50
##$NCOEF= 0
##$NC_proc= -5
##$NLEV= 6
##$NOISF1= 182.463
##$NOISF2= 159.3651
##$NSP= 0
##$NTH_PI= 0
##$NZP= 0
##$OFFSET= 248.5645
##$PC= 4
##$PHC0= -9183.416
##$PHC1= 77.07449
##$PH_mod= 1
##$PKNL= yes
##$PPARMOD= 0
##$PSCAL= 0
##$PSIGN= 0
##$REVERSE= no
##$SF= 81.014009
##$SI= 65536
##$SIGF1= 159.3651
##$SIGF2= -187.1042
##$SINO= 113.3802
##$SIOLD= 16384
##$SREGLST= <1H.CDCl3>
##$SSB= 0
##$STSI= 65536
##$STSR= 0
##$SW_p= 40650.406504065
##$SYMM= 0
##$S_DEV= 0
##$TDeff= 32768
##$TDoff= 0
##$TI= <>
##$TILT= no
##$TM1= 0
##$TM2= 0
##$TOPLEV= 0
##$USERP1= <user>
##$USERP2= <user>
##$USERP3= <user>
##$USERP4= <user>
##$USERP5= <user>
##$WDW= 1
##$XDIM= 65536
##$YMAX_p= 293785923
##$YMIN_p= -27182280
$$ End of Bruker specific parameters
$$ ---------------------------------
##NTUPLES= NMR SPECTRUM
##VAR_NAME=  FREQUENCY,     SPECTRUM/REAL,   SPECTRUM/IMAG
##SYMBOL=    X,             R,               I
##VAR_TYPE=  INDEPENDENT,   DEPENDENT,       DEPENDENT
##VAR_FORM=  AFFN,          ASDF,            ASDF
##VAR_DIM=   65536,         65536,           65536
##UNITS=     HZ,            ARBITRARY UNITS, ARBITRARY UNITS
##FACTOR=    0.620285442955139, 1,           1
##FIRST=     20137.2065510759, 0,            0
##LAST=      -20513.1999529892, 0,           0
##MIN=       -20513.1999529892, -27182280,   0
##MAX=       20137.2065510759, 293785923,    0
$$ Real data points
##PAGE= N=1
##DATA TABLE= (X++(R..R)), XYDATA
$$ [...]
44253b979540J911543J053226l68521m78372k54193n81270l39905P72897R34423
44244c29712m77359j297450j02106J399636J233198n648p90147r36259p62127
44235b067974j2439J018980J155884K69497k77861m818r7429r39860j105892L8131
44225b023781R35648M06239m49210l79987p1378m59537p27622J71515J377892
44216a220221J360409K89735m89037n59637m72320k94207L84411J243514J270348
44207A512995J12413j305982j684449o89204N99274P80920j20550n88320J89371
44198a193532R87560N03216l93336j17511P33540K61765j260545j443354L06839
44189a615358J511833L05125j770549k068086l80851J240935J206562k15812j534794
$$ plain form
44253 -2979540 -1067997 -14771 -383292 -861664 -1115857 -1697127 -2037032 -1264135 -329712
44244 -329712 -807071 -2104521 -2206627 -806991 426207 420559 -369588 -1305847 -2067974
44235 -2067974 -2080413 -1061433 94451 363948 86087 81269 -16160 -956020 -2061912 -2023781
44225 -2023781 -1088133 -681894 -1131104 -1511091 -1582469 -2042006 -2769628 -2598113 -1220221
44216 -1220221 140188 429923 -59114 -618751 -1091071 -1385278 -1000867 242647 1512995
44207 1512995 1625408 319426 -1365023 -2054227 -1454953 -674033 -794583 -1382903 -1193532
44198 -1193532 -205972 297244 -96092 -213603 519937 781702 -478843 -1922197 -1615358
44189 -1615358 -103525 201600 -1568949 -3637035 -4017886 -2776951 -1570389 -1786201 -3320995
44180c320995j364352K90652J807615J712678N52453l7034K17634K24191l00085
44171b17243n44587m65389q42195j286160m26697J462630K325116J487505O22642
44162B115622O54308J88675j587212k818446j731154L57426Q88793l20887j293284
44153c546159q87452J71390P84413N98355j10065p30318p37820k77313J12738
44144d622231M24864R86806J424185J070100L62335K92087M84671k83669j545053
44135a405905j372600L63713J360404L74330r39214p96561K31210P08375L66256
44126a109992m36546j364913j379367M17463K430991J774498j163096k473070
44118c304032n15337J497676Q16109n58931J03864J306098K33855j949014j957612
$$ plain form
44180 -3320995 -4685347 -4394695 -2587080 -874402 -321949 -358983 -141349 82842 -217243
44171 -217243 -761830 -1227219 -2069414 -3355574 -3782271 -2319641 5475 1492980 2115622
44162 2115622 2769930 2958605 1371393 -1447053 -3178207 -2820781 -1931988 -2252875 -3546159
44153 -3546159 -4433611 -4262221 -3477808 -2879453 -2989518 -3719836 -4457656 -4734969 -4622231
44144 -4622231 -4197367 -3210561 -1786376 -716276 -353941 -61854 422817 139148 -1405905
44135 -1405905 -2778505 -2414792 -1054388 -680058 -1619272 -2415833 -2184623 -1476248 -1109992
44126 -1109992 -1546538 -2911451 -4290818 -3873355 -1442364 332134 -830962 -3304032
44118 -3304032 -3819369 -2321693 -1505584 -2064515 -1960651 -654553 -420698 -2369712 -4327324
44109d327324J81360J651783J578205J320712J015251k85113j646376j202531
44101a714033L11171N51617k65297J40120J632609J542598o36061k145329j369506
44092a952111l0332M8618n42444o38400l60203p9730L98482Q56410P02763L26329
44082a270618N37267P40461j45969j243509q05716N17391N34177m96957j84042
44073a817515J468490J655871l02210j542069n65340K38268j036235k420137j545189
44064e866066M69348J309971J181621J487692J844245J119743j40986p50647r22178
44055b67257j181165p82268O96748J747619J055641k65474o07888l99620n69032
44046e72696l19649J042481J826356M06616j539682j394828L8129l9235j511948
$$ plain form
44109 -4327324 -4145964 -2494181 -915976 404736 1419987 1134874 -511502 -1714033
44101 -1714033 -1402862 -851245 -1116542 -976422 656187 2198785 1562724 -582605 -1952111
44092 -1952111 -1982443 -1933825 -2476269 -3114669 -3474872 -3554602 -3156120 -2299710 -1596947 -1270618
44082 -1270618 -733351 7110 -138859 -1382368 -2188084 -1670693 -1136516 -1633473 -1817515
44073 -1817515 -349025 1306846 1004636 -537433 -1102773 -864505 -1900740 -4320877 -5866066
44064 -5866066 -5396718 -4086747 -2905126 -1417434 426811 1546554 1405568 654921 -267257
44055 -267257 -1448422 -2230690 -1533942 213677 1269318 1003844 395956 -3664 -572696
44046 -572696 -892345 150136 1976492 2383108 843426 -551402 -513273 -552508 -2064456
44037b064456j601355K22942J353628N00969m77251j25736M16247Q0137j00033
44028a794908P46471J395207O54333m95399o82690m25224p67792j046015q2194
44019b498211J330486J298118j76167j043895k01118J027098R15536l68028j264161
44010i80342r16422K5830M83687J95993k66821l90683k47691j30960m0557J62574
44000b105392L10320O5672n17449r46458q45180k68380N14804J202446J420944
43991a168673R20048l2479p32313o91030q7988M52525M16006j66316o34900k37606
43981a962726R12397J610358Q31326q26495j640999q88958K32527K73467n05646
43972a964749o63139K28530R77948O06667j90259j52801O00224P65500j50918
$$ plain form
44037 -2064456 -3665811 -3442869 -2089241 -1588272 -2065523 -2191259 -1775012 -1694875 -1794908
44028 -1794908 -1048437 346770 1001103 505704 -176986 -602210 -1370002 -2416017 -2498211
44019 -2498211 -1167725 130393 -45774 -1089669 -1290787 -263689 651847 283819 -980342
44010 -980342 -1896764 -1870934 -1387247 -1191254 -1458075 -1848758 -2096449 -2227409 -2267966 -2105392
44000 -2105392 -1795072 -1729400 -2246849 -3193307 -4038487 -4306867 -3792063 -2589617 -1168673
43991 -1168673 -248625 -281104 -1013417 -1704447 -1792435 -1339910 -923904 -1090220 -1725120 -1962726
43981 -1962726 -1050329 560029 1391355 564860 -1076139 -1965097 -1732570 -1459103 -1964749
43972 -1964749 -2627888 -2399358 -1421410 -814743 -1005002 -1157803 -557579 207921 57003
43963E7003j075099q71395K21888J102337J098219K89630q42313j529729j067855
43954b617314K69399J147967P18849k19737l83707J71363L87266P043j60091K44751
43944d34211N08754L7052p12245q72626k31474N55571N23679o53301j945410j735789
43934d960000J01936J651542J404051L67724L62959J093270Q40803m56200j097938
43925f91853n29226m484p3256K10489R95935R90300O620k62670P74725J249723
43915B666303j1898j290784q34733K26390N4476p24526n52125j6052n79211j428376
43905b490536n78370J530716K407101J226036l87432j129493j162793o62910L49626
43896h98055Q08879l25546j814615j444445L95701J123469J42018l45422O75806
$$ plain form
43963 57003 -1018096 -1889491 -1667603 -565266 532953 822583 -19730 -1549459 -2617314
43954 -2617314 -2347915 -1199948 -481099 -700836 -1084543 -913180 -525914 -518871 -678962 -434211
43944 -434211 74543 111595 -600650 -1473276 -1704750 -1149179 -625500 -1278801 -3224211 -4960000
43934 -4960000 -4858064 -3206522 -1802471 -1434747 -1071788 21482 862285 406085 -691853
43925 -691853 -1221079 -1225563 -1298819 -1088330 -92395 897905 904525 641855 1416580 2666303
43915 2666303 2654405 1363621 528888 755278 809754 85228 -466897 -482949 -1062160 -2490536
43905 -2490536 -3068906 -1538190 868911 2094947 1707515 578022 -584771 -1247681 -898055
43896 -898055 -89176 -414722 -2229337 -3673782 -3278081 -2154612 -2012594 -2358016 -1682210
43887a682210J300875K12821r12180k77107J071107J114231p8866j027193j127959
43878a406481o32696L19657J162014P74307o68417j206205O1519J274892O73621
43869C52211n58919m27088M87082K86335q15984j075393l91317j03059j68248
43860b414380N47811J438356O95871j158257j455931K43001J107286m05132j924254
43851c325629r49049J287644K010566R93722N824l69417p90868r78695l9585J387418
43841g68069J577394L00672q97964j000706m46735J74607P24377Q22690J45250
43832F31516n76183l64599L00149K16425l28852n9467O91221K43119j304865j793685
43822b345221n51564M54274J29395J08871J396485J937215O571k344026k184271
$$ plain form
43887 -1682210 -381335 -168514 -1080694 -1357801 -286694 827537 748671 -278522 -1406481
43878 -1406481 -2039177 -1719520 -557506 216801 -451616 -1657821 -1596302 -321410 352211
43869 352211 -206708 -633796 -146714 139621 -676363 -1751756 -2143073 -2246132 -2414380
43860 -2414380 -1866569 -428213 267658 -890599 -2346530 -2103529 -996243 -1401375 -3325629
43851 -3325629 -4274678 -2987034 -976468 17254 23078 -346339 -1137207 -2115902 -2155487 -768069
43841 -768069 809325 1109997 212033 -788673 -1235408 -1060801 -336424 486266 631516
43832 631516 55333 -309266 -9117 207308 -121544 -181011 510210 753329 -551536 -2345221
43822 -2345221 -2896785 -2442511 -2313116 -2204245 -807760 1129455 1136026 -1208000 -3392271
43813c392271k02225Q57677P11700R90009J355283J29899j712652j373940P40637
43804a895883J045622j259762k433543j33430K704413K381274l12926k116722
43796b020957k005514j032697L85331K039033K459871Q47587q14596l46391J098883
43787F10550Q67365r13514j830394j145610k45589L20503J173216J746834P53675
43778A337036q80346o53351J417762K277005K95468k360937k942363j441265M27721
43769b523270J545469J505804K23579j347195j578029k76512Q90664Q14256K83586
43760d61648K07898J69197l35044p79463p28853o48735p30349l56627M65345P26884
43750b471395K90565L77838J233495J265492j91626j248750l09904J230474J158159
$$ plain form
43813 -3392271 -3594496 -2736819 -2025119 -1035110 320173 450072 -1262580 -2636520 -1895883
43804 -1895883 -850261 -2110023 -4543566 -4676996 -1972583 408691 95765 -2020957
43796 -2020957 -4026471 -5059168 -4673837 -2634804 -174933 672654 -141942 -488333 610550
43787 610550 1477915 564401 -1265993 -2411603 -2657192 -2336689 -1163473 583361 1337036
43778 1337036 456690 -196661 1221101 3498106 3793574 1432637 -1509726 -2950991 -2523270
43769 -2523270 -977801 528003 751582 -595613 -2173642 -2450154 -1559490 -745234 -461648
43760 -461648 -253750 -84553 -419597 -1199060 -1927913 -2576648 -3306997 -3663624 -3198279 -2471395
43750 -2471395 -2180830 -1802992 -569497 695995 504369 -744381 -1054285 176189 1334348
43741A334348j30871n67622K27736O97487q0838j401490k153841j679803k539
43732c757433J640989J463046m15247j434459p1702J647269J157290o04255q33181
43723a207683N42686J015631j64711j003125l39985N50770N87884M22043M87139
43714H90649K822j007036j001255N04243J705395J208036O5026l04035l73067
43705A690778j014889j432778n72279O67410O90662k09682m99124K7909K89819
43696c62174J07979L68098J054541R81860k07116j276640j058740K29585J569002
43687A406395K038011J095576q76640k242873j611065J32439O44861o80783j859218
43678a953297j290974Q443L09372j15342J78199J176331J496244P77979J86943
$$ plain form
43741 1334348 1203477 635855 863591 1561078 1480240 78750 -2075091 -3754894 -3757433
43732 -3757433 -2116444 -653398 -1068645 -2503104 -2574806 -927537 229753 -374502 -1207683
43723 -1207683 -664997 350634 185923 -817202 -1157187 -606417 -18533 403510 890649
43714 890649 893471 -113565 -1114820 -610577 1094818 2302854 2367880 2063845 1690778
43705 1690778 675889 -756889 -1329168 -661758 28904 -180778 -679902 -651993 -362174
43696 -362174 -254195 113903 1168444 2150304 1943188 666548 -392192 -162607 1406395
43687 1406395 3444406 4539982 3663342 1420469 -190596 -58157 586704 -94079 -1953297
43678 -1953297 -3244271 -3235828 -2926456 -3041798 -2863599 -1687268 -191024 586955 773898
43669G73898M16657P72753N93464J86180j21736n79629j098804r76695k01625
43660b35537J78896k50256m98685k3578P8703r08625j514183j73414J933865K362490
43650I49676J045525M5198K1507l56262j349720j391346j49604M28854n76216
43641a332388j290861k59576R69894N59218m58648j91881P30903N61851j89453
43632i00941K20887J344289J255595J15102j73573L92155n1964j416124j378455
43623e93029L42113R54318p66813k131311q69565J115129R56315n45162n42522
43614b080527J157889K168211J506633N36915J01910n72619j746246k201772j175051
43605b304657L55700J033906O48537j69423p72445o74101J56349Q68010M73487
$$ plain form
43669 773898 1190555 1963308 2556772 2742952 2621216 2041587 942783 -33912 -235537
43660 -235537 -56641 -306897 -805582 -829160 -750457 -1659082 -3173265 -3346679 -1412814 949676
43650 949676 1995201 2040399 2061906 1705644 355924 -1035422 -1185026 -756172 -1332388
43641 -1332388 -2623249 -2882825 -1912931 -1353713 -1812361 -2004242 -1273339 -711488 -900941
43632 -900941 -680054 664235 1919830 2034932 1861359 2253514 2201550 785426 -593029
43623 -593029 -250916 703402 -63411 -2194722 -3064287 -1949158 -992843 -1538005 -2080527
43614 -2080527 -922638 1245573 2752206 3289121 3391031 2818412 1072166 -1129606 -2304657
43605 -2304657 -1948957 -915051 -266514 -435937 -1208382 -1882483 -1726134 -858124 -384637
43596c84637o97029j146688j66723J148637J312681K88101n96852k84775Q50511
43587C23226J450352O71503q21474j565455r93268M4624N91732P13128Q44462
43578A258830P63794Q4848o79311n60224M37083J197440Q94300r7748q45231r73684
43568A480097r13765j134802j301443n79844R15431J632366N42392r39103o40337
43559i39008R31900J074781p53057j728726j71283J474738M86396j656109j715448
43550b995816J21896J064262N78033N44055J075234L49515j178622p11246J750471
43541E97782K432679k60795k786585j920250L92320P32710l00475N922J354632
43532B47940J248617l62755j121225l81768J85181q0784j04086K53182k09529
$$ plain form
43596 -384637 -1081666 -2228354 -2395077 -1246440 66241 354342 -242510 -527285 323226
43587 323226 1773578 2445081 1623607 58152 -935116 -890492 -298760 414368 1258830
43578 1258830 2022624 2107472 1428161 867937 1305020 2502460 3396760 3299012 2453781 1480097
43568 1480097 566332 -568470 -1869913 -2449757 -1534326 98040 640432 -298671 -939008
43559 -939008 -7108 1067673 314616 -1414110 -1585393 -110655 375741 -1280368 -2995816
43550 -2995816 -2873920 -1809658 -1231625 -687570 387664 737179 -441443 -1152689 597782
43541 597782 3030461 2769666 -16919 -1937169 -1544849 -812139 -1112614 -1106692 247940
43532 247940 1496557 1133802 12577 -369191 -184010 -264794 -368880 -115698 -325227
43523c25227j384329j517278j13335J151161J019721J15414o29381r95538n76839
43514c255631J009090K511876J820430q91094k761171j865957M68261J769713
43506a194483J228372k88467j434083j009463R73085K425408J260266j295545
43498F65090j798625L45075J676544j11717k571801k232380M14319K246392K072646
43489G05543J126951K61528o01336r72040k89904N39067L00615l64655j02911
43480F02858N12177j09764j533869j798788p41456r5615k34426K66484J368010
43471a764389R75047j233031k302464k27535K670520K898816O61831r05939l82647
43462C90209N62057J96533j017176j559659p84342P10735J703366J183002n93791
$$ plain form
43523 -325227 -1709556 -3226834 -3340169 -2189008 -1169287 -1053873 -1683254 -2678792 -3255631
43514 -3255631 -2246541 265335 2085765 1194671 -1566500 -3432457 -2964196 -1194483
43506 -1194483 33889 -254578 -1688661 -2698124 -1725039 700369 1960635 665090
43498 665090 -1133535 -788460 888084 776367 -1795434 -4027814 -3613495 -1367103 705543
43489 705543 1832494 2094022 1492686 520646 230742 769809 1070424 705769 602858
43480 602858 1115035 1005271 -528598 -2327386 -3068842 -3164457 -3398883 -3132399 -1764389
43471 -1764389 -789342 -2022373 -4324837 -4552372 -1881852 1016964 1678795 772856 390209
43462 390209 952266 1148799 131623 -1428036 -2212378 -1501643 201723 1384725 790934
43453G90934j857266j042637J131558K211947R24145j265136j956492n80127J228848
43444d14226J680170O52458n09611n71865M09755J305428J110943q1823j244885
43435B336344j503151j007749o26574p97241r70867m18193O67764J338045J099092
43426A17470M26537k9544j86972k23054q4336K45448L90563j043p04007j141284
43416a190222r68407k35387O76913J102171O03433k82319m46912K77525P56506
43407B93301K10491o11182o48866q7905K53713L32794N42001N87814j9631p72225
43397H0305p31874k3026M24239L46518J88082j1172n03540q83993n55773R9919
43387a570315L09917L16655P86268J243650P58832j87254l79505n8353l28849
$$ plain form
43453 790934 -1066332 -2108969 -977411 1234536 2158681 893545 -1062947 -1643074 -414226
43444 -414226 1265944 1918402 1408791 836926 1246681 2552109 3663052 3581229 2336344
43435 2336344 833193 -174556 -801130 -1598371 -2569238 -2987431 -2319667 -981622 117470
43426 117470 544007 514463 327491 104437 20101 265549 656112 655069 -48938 -1190222
43416 -1190222 -2158629 -2394016 -1717103 -614932 -11499 -293818 -740730 -463205 293301
43407 293301 503792 -107390 -756256 -844161 -590448 -257654 284347 872161 852530 80305
43397 80305 -651569 -674595 -250356 96162 284244 273072 -230468 -1114461 -1670234 -1570315
43387 -1570315 -1260398 -943743 -157475 1086175 1845007 1657753 1278248 1219895 891046
43378H91046p09432J88532J595862J170919q94596j560227K03731J503558J94764
43369B584157j671256j461923k19562l25404j178827o15285R28816J194577J12669
43360f52038l72817L6572j36252p95512j82775J542414J904442J35372j369850
43351A09556q36826K92417R9904p24568m25906Q17644J365054O05326o07214j339674
43341f44287j174447n9349J348138J772162P48437n41698p36066o4489K32913
43332H81314k04882n48107j95761L66071K89131n26555j261746j049551J8374
43323b231712R23929R24294L93781R1886O6743l5152q3108J08622o3635j038691
43313i43043j594275j05629K521560L189510P22834k172065k388931m00953Q87026
$$ plain form
43378 891046 181614 370146 1966008 3136927 2242331 682104 885835 2389393 2584157
43369 2584157 912901 -549022 -768584 -1093988 -2272815 -2888100 -1959284 -764707 -652038
43360 -652038 -1024855 -988283 -1124535 -1920047 -2102822 -560408 1344034 1479406 109556
43351 109556 -727270 -434853 -334949 -1059517 -1485423 -667779 697275 1302601 695387 -644287
43341 -644287 -1818734 -1878083 -529945 1242217 1990654 1448956 712890 648401 881314
43332 881314 676432 128325 -67436 298635 587766 61211 -1200535 -2250086 -2231712
43323 -2231712 -1307783 -383489 10292 102178 168921 133769 50661 159283 95648 -943043
43313 -943043 -2537318 -2642947 -121387 3068123 3790957 1618892 -770039 -1170992 -283966
43304b83966K28269q85805p97294L97139J543366J724548O93256r70642j991548
43295c42677j520915k13289N10342K01315l44719l99762j2569N41159J107035
43286d74080J375990J082986N45728K26252j59355j084542j833563j071062Q67940
43277e23706J773709N03036j228644j238511N3912N47598k92569r91532o67539
43268b064246j55797j78481j16773O19712J359242J249487N74506J05734m4316
43259A349068j43264k04917l26689p87955j169484n09187Q44211R44197r05107
43250i09127k440722j373994J148832K161733J085781n3730o7874K75911L79218
43241B06028N12269L55760o40594j376766k67132J594306J470922m81975j186584
$$ plain form
43304 -283966 -55697 -941502 -1738796 -1341657 201709 1926257 2619513 1648871 -342677
43295 -342677 -1863592 -2076881 -1566539 -1365224 -1709943 -2109705 -2122274 -1581115 -474080
43286 -474080 901910 1984896 2530624 2756876 2597521 1512979 -320584 -1391646 -523706
43277 -523706 1250003 1753039 524395 -714116 -660204 -112606 -405175 -1396707 -2064246
43268 -2064246 -2220043 -2398524 -2515297 -1895585 -536343 713144 1287650 1393384 1349068
43259 1349068 1205804 1000887 674198 -113757 -1283241 -1792428 -948217 -4020 -909127
43250 -909127 -3349849 -4723843 -3575011 -1413278 -327497 -381227 -449101 -173190 206028
43241 206028 718297 1074057 433463 -943303 -1210435 383871 1854793 1372818 186234
43232A86234J14483N29185j092397j676609O52122K737984J455893r45373p32077
43223A229445J035653Q53159q41795q03973Q57228R30241j008454k031412j204086
43214i83994o42309q99212r8825J647521J765564K13073J31554K051243K375112
43205E559727k77322k154946o88138R53250o43644l140695k431343M85101J459056
43196h78954p908p32451M10190J183314K65580r22413r86589k66799N03087R90957
43186d41986P52711j51042m34195O44083J536433N17286j340111j660435m38504
43177a015760L74620L16345O25039J313797R49073m75535j141539l45513N22489
43168A123016M45674O4893k4892k27241o11251m94539M2915o5651j008385j561848
$$ plain form
43232 186234 300717 829902 -262495 -1939104 -1286982 1451002 2906895 1961522 1229445
43223 1229445 2265098 3118257 2276462 1472489 2329717 3259958 2251504 220092 -983994
43214 -983994 -1626303 -2525515 -2624340 -976819 788745 1001818 1133372 3184615 5559727
43205 5559727 5282405 3127459 2439321 3392571 2748927 -391768 -2823111 -2338010 -878954
43196 -878954 -886862 -1619313 -1209123 -25809 239771 -682642 -1669231 -1936030 -1432943 -441986
43186 -441986 310725 159683 -274512 369571 1906004 2423290 1083179 -577256 -1015760
43177 -1015760 -641140 -324795 300244 1614041 2563114 2087579 946040 600527 1123016
43168 1123016 1568690 1633583 1608691 1381450 770199 275660 318575 252924 -755461 -2317309
43158b317309r47702J75341R48804J200143Q75534k2286p71557n76314J00110
43149a335236K20533m8608J25702L33208l73738j152003k48988J712402K068338
43140A301610K45581j237935p95080N1373j44352k14839R92997J928002P73291
43131B900648j234716j546565j36454Q92621O65148R8430k96424q44086j198517
43122f99915n64685O05529J058179Q46577J072995J502770O06195j548074k630700
43113B48871j344176M83671N71430n21460o10039N66020J152309L23421n17026
43104C53021j94540M12421O1142p57750q15101k62112j64625n10319l72984K19785
43094b031062L65662J85168O94430J546526J072827p33927j573639l85614P55641
$$ plain form
43158 -2317309 -3265011 -3089670 -2140866 -940723 -65189 -87475 -859032 -1435346 -1335236
43149 -1335236 -1114703 -1163311 -1037609 -704401 -1078139 -2230142 -2479130 -766728 1301610
43140 1301610 1547191 309256 -485824 -434451 -578803 -793642 199355 2127357 2900648
43131 2900648 1665932 119367 -17087 875534 1540682 1639112 1342688 498602 -699915
43122 -699915 -1264600 -659071 399108 1245685 2318680 3821450 4427645 2879571 248871
43113 248871 -1095305 -611634 -40204 -561664 -1171703 -605683 546626 870047 353021
43104 353021 158481 570902 632044 -125706 -940807 -1202919 -1367544 -1877863 -2250847 -2031062
43094 -2031062 -1665400 -1480232 -785802 760724 1833551 1099624 -474015 -859629 -103988
43085a03988N1766r31840j4787J649320J416899l24546q71365J65643M80993o25719
43075H92376j098122J6840Q55107J26742o98019j60652P71185P94054N15842P47509
43065B762862N78329p93124k013600j495439j9464O34334M60015N76613Q59594
43056A550120L68815n98796r40995p13419p71641r18205k78038Q00457J033296
43047d68406K40677n13035o54766m71027j754Q46739J309352N48188o88609q66098
43037g18739l5238L63668M6599K14233J031903R50289o01095j814130j094593
43028a657103N17564J025028L42399j78820k06460n41886j148135r47897K03278
43019b592032R81821O30510J68209O67675J412391J003772l50992j073897n57462
$$ plain form
43085 -103988 -52222 -984062 -998849 650471 2067370 1742824 871459 1037102 1518095 892376
43075 892376 -205746 -188906 666201 792943 94924 -65728 705457 1499511 2015353 2762862
43065 2762862 3341191 2548067 534467 -960972 -980436 -346102 113913 690526 1550120
43056 1550120 1918935 1320139 379144 -334275 -1105916 -2024121 -2302159 -1501702 -468406
43047 -468406 -227729 -740764 -1395530 -1866557 -1868311 -1021572 287780 835968 147359 -718739
43037 -718739 -753977 -390309 -343710 -129477 902426 1852715 1251620 -562510 -1657103
43028 -1657103 -1139539 -114511 227888 49068 -157392 -699278 -1847413 -2795310 -2592032
43019 -2592032 -1610211 -979701 -811492 -143817 1268574 2272346 1921354 847457 289995
43010B89995J51005K16264J62948N34052O91169Q04p67957n21902L40172N62689
43000A659239N3807j73001J43229K11073k44546n79661n68990p37930j099461
42991a336241r40800j88456L70369N19226Q26819J182768Q01882M6669K78459
42982A560695J270313J001785r03445j918416m49871J345110Q36222r35481j153173
42973F53739J69254O02240m17026r30194q5850N44913j46511j101113j110641
42964a821189n11595l683M90686R43947P28479j50250o25236j31549N43127N80066
42954D2803J70787k88647q35537j180071n41068R85537J959209J340540j07618
42945A545935q74079m44565N61213J257352R87221l00931j672093j888187q80985
$$ plain form
43010 289995 441000 657264 820212 1354264 2045433 2046237 1278280 756378 1096550 1659239
43000 1659239 1713046 1540045 1683274 1894347 1649801 1070140 501150 -236780 -1336241
42991 -1336241 -2277041 -2465497 -2095128 -1575902 -749083 433685 1235567 1282236 1560695
42982 1560695 2831008 3832793 2929348 1010932 561061 1906171 2742393 1806912 653739
42973 653739 822993 1425233 1008207 78013 -7837 537076 390565 -710548 -1821189
42964 -1821189 -2332784 -2336467 -1845781 -901834 -173355 -323605 -948841 -1080390 -537263 42803
42954 42803 213590 -75057 -910594 -2090665 -2631733 -1646196 313013 1653553 1545935
42945 1545935 671856 227291 788504 2045856 3033077 2732146 1060053 -828134 -1709119
42936a709119J52975L91835K40762K45756K17087l2251q3815K79089N38617L75327
42926F16263K71059M96971M13237l64086r31135k80385J056631J615775R31840
42917C826170p9166m91562k82953R8861M00180O48210Q87422Q85318J63860j278379
42907D777961k320813j644366L27183J335942k9169k223805k404693N3368K761421
42898F33029L153581J252171p55195j074949J04903J323124J523514Q01356j49017
42889F812517p60088p04799P7946J007551J018513j76690j300458q79741P26282
42880E821033J673547J070509l3855l97136j42084Q6168M38123J291661K087339
42871A1895305J945449J161883R46227J630251K145159J618451P22591Q40457
$$ plain form
42936 -1709119 -1556144 -1164309 -923547 -677791 -460704 -492955 -576770 -297681 240936 616263
42926 616263 887322 1384293 1797530 1433444 502309 221924 1278555 2894330 3826170
42917 3826170 3747004 3255442 2972489 3071350 3471530 4119740 5007162 5892480 6056340 4777961
42907 4777961 2457148 812782 1139965 2475907 2446738 222933 -2181760 -2128392 633029
42898 633029 3786610 5038781 4283586 3208637 3313540 4636664 6160178 6961534 6812517
42889 6812517 6052429 5347630 5425576 6433127 7451640 7274950 5974492 5094751 5821033
42880 5821033 7494580 8565089 8531234 8134098 7992014 8078182 8516305 9807966 11895305
42871 11895305 13840754 15002637 15948864 17579115 19724274 21342725 22065316 22905773
42863B2905773K221963L555424L440649J951130N02113K78708J062441J659482
42855C7577683J224773j40j061145j245220q50448j024506k419510l999208m002426
42846B4199853k428888j472752k561428m003743l138015k37777J637191P54993
42838A2749434j197089j739483p04027K89917K86222k52402n20574k53220K07473
42829H866251K36263m14700j167118j318709j066262j003752q47001N0527J030972
42820D366471P17202n04508o19573P09986J198821m19013k002331j210860P60453
42811B996648J115380k21849r73996m19094m9750n00905o00246J63198O96545
42802B205931M37908K25305L40813j50974j219073j183467M98642J721416O74411
$$ plain form
42863 22905773 25127736 28683160 32123809 34074939 34577052 34855760 35918201 37577683
42855 37577683 38802456 38802316 37741171 36495951 35645503 34620997 32201487 28202279 24199853
42846 24199853 21770965 20298213 17736785 13733042 10595027 10357250 11994441 12749434
42838 12749434 11552345 9812862 9108835 9398752 9684974 9432572 8911998 8658778 8866251
42829 8866251 9102514 8687814 7520696 6201987 5135725 4131973 3284972 3335499 4366471
42820 4366471 5083673 4579165 3959592 4669578 5868399 5449386 3447055 2236195 2996648
42811 2996648 4112028 3890179 2916183 2497089 2447339 1946434 1346188 1509386 2205931
42802 2205931 2643839 2869144 3209957 3058983 1839910 656443 1155085 2876501 3550912
42793C550912j259460j451769J93150J352086N97697j168866k340550k127223
42785b654023n84845J457039K466477J512683l02372q38461M02657J636972J208508
42776D304635l42166j233208p38656K44585N90000J57834m40465p69546q79350
42767H93663p99076k30979Q33029J498496P94463p72236j446255n30200N07999
42758G48904J65394p66339m63661Q84204J197620j96191j350673n94813J037839
42749F62284J526056P01771j28491m42308o92575q22489l52541K67024J09968
42740H28699m03895J20700J582769K061652O32903j127160j424451o03458l0812
42731A636947J13864M48025P15661J79737p65064r37727j94617M45934M63727
$$ plain form
42793 3550912 2291452 839683 1032833 2384919 2982616 1813750 -526800 -2654023
42785 -2654023 -3238868 -1781829 684648 2197331 1894959 1056498 1459155 3096127 4304635
42776 4304635 3962469 2729261 1990605 2235190 2825190 2983024 2542559 1773013 893663
42767 893663 94587 -136392 696637 2195133 2989596 2217360 771105 240905 748904
42758 748904 914298 147959 -315702 568502 1766122 1569931 219258 -375555 662284
42749 662284 2188340 2890111 2761620 2319312 1626737 804248 451707 718731 828699
42740 828699 424804 545504 2128273 4189925 4822828 3695668 2271217 1667759 1636947
42731 1636947 1750811 2198836 2914497 3094234 2329170 1391443 1196826 1642760 2106487
42722B106487L39651L19580n5234q31997j114444k05745J323647K119238J322381
42713E323564o05429k015512j401861P89021K153390J032655j242761j987135
42705B045932o65825P32184P50172J53346J23668M21671K87567o0072M6249M50017
42695D284909M44892p7618n04893l32748K67111N45262j17517j216501j236318
42686B056579L83656J897234J276228p37407j489886l43432N51306k6436m44154
42677C123688O41136J670690Q22219p07853o46714M94767L40304j275729j994603
42668B467905o58081J173760J784688J277250N18974p9703k38558K08656O31753
42659G086644K74947l12889p0683M35823l22245j864046j766800N35807K393788
$$ plain form
42722 2106487 2446138 2765718 2710484 1878487 764043 558298 1881945 4001183 5323564
42713 5323564 4718135 2702623 1300762 2089783 4243173 5275828 4033067 2045932
42705 2045932 1380107 2112291 2862463 3015809 3139477 3561148 3848715 3788643 3834892 4284909
42695 4284909 4729801 4652183 4147290 3814542 4081653 4626915 4509398 3292897 2056579
42686 2056579 2440235 4337469 5613697 4876290 3386404 3042972 3594278 3567842 3123688
42677 3123688 3764824 5435514 6257733 5549880 4903166 5397933 5738237 4462508 2467905
42668 2467905 1809824 2983584 4768272 6045522 6564496 6484793 6246235 6454891 7086644
42659 7086644 7361591 7048702 6978019 7413842 7091597 5227551 3460751 3996558 6390346
42650F390346J701918r6854n14331K64724L06999o92886j311439j048325q36202
42641D163950j032205r06038l28860k05274p62480r01720J02614J434277J935592
42632C499856J526782P90883J0723o58230p93176l12771L8974l61675r78475q65271
42622A897620j62557J26875k16225k88440L42612P51265P4071r43972q22107N62733
42612A321875J764855J661742O53980k34312o18381o77141m93287j13994R0109
42603C355446k44168q71239j115666o86250o3177J85o56713j246829p80970O28339
42593a681042J615481J239001L35958K67533P15227J75791j358237k028454j027163
42584a745905j8973m40304j097122k35314J356771J554458L91208j15248N82126
$$ plain form
42650 6390346 8092264 7995410 7481079 7745803 8052802 7359916 6048477 5000152 4163950
42641 4163950 3131745 2225707 1896847 1691573 929093 27373 129987 1564264 3499856
42632 3499856 5026638 5817521 5828244 5170014 4376838 4064067 4103041 3741366 2762891 1897620
42622 1897620 1735063 1861938 1645713 1357273 1699885 2451150 2525221 1581249 759142 1321875
42612 1321875 3086730 4748472 5402452 5168140 4549759 3872618 3379331 3265337 3355446
42603 3355446 3111278 2240039 1124373 438123 374946 375131 -281582 -1528411 -2309381 -1681042
42593 -1681042 -65561 1173440 1509398 1776931 2492158 2667949 1309712 -718742 -1745905
42584 -1745905 -1764878 -2205182 -3302304 -3537618 -2180847 -626389 -235181 -350429 231697
42575B31697P67927m54137j533388q73230Q41538J793835J292062k6906j229370
42566H10028j553721p76471K58424L81298j93076l1497J169335J823935Q66046
42557B754301n38316q67009n13267o82876j097995o03877N66925J022130N08940
42548E48956J87250M60502K67563q74892j621592o38280J241439J896522O45209
42539B112677r27893j005828L16283J359848J004637j03195o32780l36450j55199
42530A632100p10199j397319j236646j28918J100358J639514J393929R06101P03987
42521C902907O58641J91870o33155p75886K42563J011864j42458k352283k860248
42512g56185r33807Q88517N91452k91651O03393K357296K089229l56111k018258
$$ plain form
42575 231697 999624 545487 -987901 -1861131 -1019593 774242 2066304 2039398 810028
42566 810028 -743693 -1520164 -1261740 -880442 -1073518 -1105015 64320 1888255 2754301
42557 2754301 2215985 1348976 835709 152833 -945162 -1549039 -982114 40016 548956
42548 548956 736206 1196708 1464271 589379 -1032213 -1670493 -429054 1467468 2112677
42539 2112677 1184784 178956 495239 1855087 2859724 2756529 2123749 1787299 1632100
42530 1632100 921901 -475418 -1712064 -1840982 -740624 898890 2292819 3198920 3902907
42521 3902907 4561548 4753418 4120263 3344377 3586940 4598804 4456346 2104063 -756185
42512 -756185 -1689992 -801475 -210023 -501674 101719 2459015 4548244 4192133 2173875
42503B173875j275864J16437K53050k34235j05137Q9422n45945j068068j66842
42494g63307J264866J317252J87202k19228M23361M17254p91147j439331m22645
42485b5723P08532K47756q70262o82246N57243Q98518q1690p72105k84461L17575
42475A3137Q1084l06951L9262O36092O32245L37295N04804Q02671L41605n84206
42465B497038o23137N92982J609152R27537r30379j843270o02182J502089K099112
42456E228942O29356r91568j000419j08704r9585r07877r11432Q5203L70165o56126
42446A637955j227541j45512J119100R42130K97705Q12633J603510P21882j204460
42437D557402j678995l42990O11818J84775j03950P21496J313635M30238r68951
$$ plain form
42503 2173875 898011 1014448 1267498 1033263 928126 1017548 471603 -596465 -763307
42494 -763307 501559 1818811 2006013 1786785 2210146 2627400 1836253 396922 -25723
42485 -25723 682809 930565 60303 -621943 -64700 833818 752128 -19977 -304438 13137
42475 13137 94221 -212730 -173468 462624 1094869 1432164 1936968 2739639 3081244 2497038
42465 2497038 1873901 2466883 4076035 5003572 4073193 2229923 1627741 3129830 5228942
42456 5228942 5858298 4866730 3866311 3757607 3658022 2750145 1838713 1923916 2294081 1637955
42446 1637955 410414 264902 1384002 2326132 2623837 3436470 5039980 5761862 4557402
42437 4557402 2878407 2535417 3147235 3332010 3228060 3949556 5263191 5693429 4724478
42428D724478j318892m98929P54848J924433K284396J066280r45149j646428n14072
42419E830965M68490l5742n90789L25743J401254N49217j419403j757841J31828
42410D903722J928618J675106q9331j619775j813122n85700J251900K271159J630274
42401I552851J32496p23691n75173j96423j6965K28060N38022N17168K64671L93778
42391A0114794J018627J504292J340569O98332J50870K51771J097456J908179
42383A8084890J605453L50263k45705P61306K105194J946705M13731o81092k44236
42374B4096509J086217K030649J850008P89590M7091O69060J872330J615357k61431
42365C3795380j103165P31462K815983J899253j082290k325272q87431L35519
$$ plain form
42428 4724478 3405586 2906657 3661505 5585938 7870334 8936614 7991465 6345037 5830965
42419 5830965 6299455 6263713 5672924 5998667 7399921 7949138 6529735 4771894 4903722
42410 4903722 6832340 8507446 8418115 6798340 4985218 4399518 5651418 7922577 9552851
42401 9552851 9685347 8961656 8386483 8190060 8173095 8401155 8939177 9456345 9721016 10114794
42391 10114794 11133421 12637713 13978282 14676614 14827484 15079255 16176711 18084890
42383 18084890 19690343 20040606 19794901 20556207 22661401 24608106 25021837 24340745 24096509
42374 24096509 25182726 27213375 29063383 29852973 29900064 30569124 32441454 34056811 33795380
42365 33795380 32692215 33423677 36239660 38138913 37056623 34731351 33843920 34179439
42357C4179439m32447j397442q16300K5419p11601k286665k765454j960883j131838
42348B2702228q76871r04732j018420j061787p02498k13119m70766j371880j546771
42339A4535384n88766l7238q79008j651496p12207R79406J325439K85186n02936
42330A2753764n44092p14268j066575o64326L65579O82000o2686o83719n21021
42321I544656l14486n18643m32538K34584M64619m13717j418824j331421m18723
42312E395507K97213O09813Q60434Q50493K36337m97416o59657n96138j102078
42303E394508j811068j477597N5204J405891J479782O67966j45496o92123r00314
42294C976753m45777M75010Q20901Q9799p23574n35785K01970M36734L26182O43012
$$ plain form
42357 34179439 33746992 32349550 31533250 31558669 30847068 28560403 25794949 23834066 22702228
42348 22702228 21825357 20920625 19902205 18840418 18137920 17924801 17454035 16082155 14535384
42339 14535384 13946618 13909380 13030372 11378876 10666669 11646075 12971514 13256700 12753764
42330 12753764 12209672 11495404 10428829 9764503 10130082 10812082 10749396 10065677 9544656
42321 9544656 9230170 8711527 8278989 8513573 8978192 8564475 7145651 5814230 5395507
42312 5395507 5692720 6302533 7162967 8013460 8249797 7752381 7092724 6496586 5394508
42303 5394508 3583440 2105843 2161047 3566938 5046720 5714686 5569190 4877067 3976753
42294 3976753 3530976 4005986 4826887 4916686 4193112 3657327 3859297 4296031 4622213 5265225
42284E265225R49511K04928j009938r42333L91472Q50704m80987j653986q22731
42275B751865R41892J453569O11979l6706P5512K37691J32392M7427j53417p15672
42265E346532j078877p13392l06402o11039q27419R5289J245867R46211l34901
42256C761869n93167M14604R54718M26688R4314L85414J47557p50401q07172J46294
42246D180718J63718j252342j638885L95413K277075J237096j179785j492652
42238B690356K94297J049903l25705j477990o05571J029082J490973Q34907K38802
42229E219054Q6770P6550J77854M78222P02619N76206K33045j19248m97430q50495
42219F083147r17948o03345j27193L30488Q09692J272076J381847P75897l90247
$$ plain form
42284 5265225 6214736 6419664 5409726 4467393 4858865 5709569 5228582 3574596 2751865
42275 2751865 3693757 5147326 5759305 5722599 5798111 6035802 6168194 6215621 6062204 5346532
42265 5346532 4267655 3554263 3247861 2636822 1809403 1904692 3150559 4096770 3761869
42256 3761869 3168702 3583306 4538024 4964712 5059026 5444440 5591997 4841596 4034424 4180718
42246 4180718 4344436 3092094 1453209 1848622 4125697 5362793 4183008 2690356
42238 2690356 2984653 4034556 3708851 2230861 1625290 2654372 4145345 4980252 5219054
42229 5219054 5305824 5382374 5560228 6038450 6741069 7317275 7550320 7431072 6933642 6083147
42219 6083147 5165199 4561854 4434661 4765149 5574841 6846917 8228764 9004661 8614414
42210H614414j194585o55323Q58836J421167k08490k396880k226030N11685K670729
42201G395523J868453n17553j694937j122275j30140O72403J442124J505004Q6278
42192I504880j747440k087134j000993k79418m22052j03775J100497J739863R39978
42183G644406k13667o78209r67190j522094j333434K83743J911648J775967L92211
42174G293381k62497K85685N93857k07258j097131p93818M18177J162365O87343
42165H080104m66586j254450j149179m31162K60352N44645N12001M30927L67696
42156F894348J33823m35880j164088j504553r80977K25467J264759J410972Q19777
42147F663648K89653K75350L72397o1348q77113j063202j3043J314859J203442
$$ plain form
42210 8614414 7419829 6764506 7623342 9044509 8836019 6439139 4213109 4724794 7395523
42201 7395523 9263976 8746423 7051486 5929211 5799071 6471474 7913598 9418602 9504880
42192 9504880 7757440 5670306 4669313 4389895 3967843 3864068 4964565 6704428 7644406
42183 7644406 7430739 6752530 5785340 4263246 2929812 3213555 5125203 6901170 7293381
42174 7293381 7030884 7316569 7910426 7703168 6606037 5812219 6230396 7392761 8080104
42165 8080104 7613518 6359068 5209889 4778727 5039079 5583724 6095725 6526652 6894348
42156 6894348 7028171 6592291 5428203 3923650 2942673 3168140 4432899 5843871 6663648
42147 6663648 6953301 7228651 7601048 7539700 6662587 5599385 5586342 6901201 8104643
42138H104643n67070k040064j414219N73760J696435J222588M17201J81446p5699
42129H099021p89578j154090n67877K01124K88446Q85j38395m04500q71906o38649
42119D024481O79730J799427J486482M19090n3897J2120j76305m39366k55478
42110G496284j73046q12508j307723n92320N84297Q69895O63726J078161J403398
42101I210164J88050j674970j734119K20908J811607J647149O85076j41783j003122
42092I208960j550574r04954K44897J73036p73419m27009J249623J642622n1692
42083H811490j173299k9855J226750L43782j251610j012575O55148J536568J038663
42074A0145062L9487j066627j881633j197767J014486K424756J467565l7898J60360
$$ plain form
42138 8104643 7537573 5497509 4083290 4657050 6353485 7576073 7993274 8174720 8099021
42129 8099021 7309443 6155353 5587476 5788600 6077046 6077931 5939536 5535036 4663130 4024481
42119 4024481 4704211 6503638 7990120 8409210 8355313 8367433 8191128 7751762 7496284
42110 7496284 7323238 6510730 5203007 4610687 5194984 6064879 6728605 7806766 9210164
42101 9210164 9398214 7723244 5989125 6210033 8021640 9668789 10353865 10212082 9208960
42092 9208960 7658386 6753432 6998329 7171365 6397946 5970937 7220560 8863182 8811490
42083 8811490 7638191 7608336 8835086 9178868 7927258 6914683 7569831 9106399 10145062
42074 10145062 10184549 9117922 7236289 6038522 7053008 9477764 10945329 10907431 11067791
42065A1067791J016952L15323j162809r93817N31042R88593J34523P1722J254481
42056A3223801J714667N47729q50678j400127j422048q37168Q87705K582832K059878
42047A6506591l46867j670536n90328Q34376O85257k12708m74935m25165o03994
42038A3701691k21628J135498K078478J450360K60348l8735K32467J07818o5048
42029A8641249M13265Q17584J03081r79075p65733O71357J479967O70030n71973
42020B0479752n66228P11507J631110Q50688r90863j853915p96493P37445R31654
42011B1134657J92503K82073J333073J726364R98520O46026J419014J987229J334874
42002C1054333M74544M57565N15094k58220r80720m67838O88181J231627J263297
$$ plain form
42065 11067791 12084743 12400066 11237257 10243440 10774482 11763075 11897598 11969320 13223801
42056 13223801 14938468 15486197 14635519 13235392 11813344 10976176 11863881 14446713 16506591
42047 16506591 16159724 14489188 13898860 14733236 15418493 15205785 14730850 14305685 13701691
42038 13701691 13480063 14615561 16694039 18144399 18404747 18366012 18598479 18706297 18641249
42029 18641249 19054514 19872098 19975179 18996104 18230371 18901728 20381695 21051725 20479752
42020 20479752 19913524 20625031 22256141 23106829 22115966 20262051 19465558 20203003 21134657
42011 21134657 21327160 21609233 22942306 24668670 25667190 26313216 27732230 29719459 31054333
42002 31054333 31528877 31986442 32501536 32243316 31262596 30794758 31482939 32714566 33977863
41993C3977863J474077J509542Q83342M92877J342533K580109K642676J647166
41985D6550185Q87541O89778N48484O33583J278140J711298J276373J126663K512541
41976E7214586M144548L811059K079415J521436K446833K569236J281622R46831
41968G6015566K774335M436831L601638J446713O30932J590615K863363L625181
41960I6985174L892153L317163J755697L16202J82970R74427J611151K005782
41952A11040719K466300K348682J058013l15523k99022M39644o7560j772358k307836
41943A12591059n69456J356361J016839j024068k107468j119140K93038J97561
41935A10634726j149768k007268j685397j327178k006997l054346l118916k280045
$$ plain form
41993 33977863 35451940 36961482 37844824 38337701 39680234 42260343 44903019 46550185
41985 46550185 47437726 48127504 48675988 49309571 50587711 52299009 53575382 54702045 57214586
41976 57214586 61359134 65170193 67249608 68771044 71217877 73787113 75068735 76015566
41968 76015566 78789901 83226732 86828370 88275083 88906015 90496630 93359993 96985174
41960 96985174 100877327 104194490 105950187 106266389 106449359 107423786 109034937 111040719
41952 111040719 113507019 115855701 116913714 116598191 116299169 116738813 116671253 114898895 112591059
41943 112591059 112021603 113377964 114394803 113370735 111263267 110144127 110437165 110634726
41935 110634726 109484958 107477690 105792293 104465115 102458118 99403772 96284856 94004811
41927I4004811j808029j975818j670866o11654l08155j701245l190810k645801
41919H0092433n84588M63213m92173j787400j778852r99415r08424j643199k002285
41910G0359310j174353K70702J029747M06491r35731j598748j016495j35803j11740
41901F7093380o86806o36897L31476J063080N13596r28998j983460j804899n71137
41892F2389335P78476J223686N06471n88343j112914j011204q60547q08890m88874
41883F0027196R8302M09653J62949l54270q33316j167778j156477o92176k11084
41874E6282999j95060k93254J98785J044364J234255M75827m91319j081794j278704
41865E5896099r04507J89258J134991P92466k77397l03901P85150R32274o91172
$$ plain form
41927 94004811 92196782 90220964 88550098 87938444 87630289 85929044 82738234 80092433
41919 80092433 79507845 79971058 79478885 77691485 75912633 74913218 74004794 72361595 70359310
41910 70359310 69184957 69455659 70485406 70891897 69956166 68357418 67340923 67205120 67093380
41901 67093380 66406574 65769677 66101153 67164233 67677829 66748831 64765371 62960472 62389335
41892 62389335 63167811 64391497 64897968 64309625 63196711 62185507 61324960 60516070 60027196
41883 60027196 60125498 60535151 60698100 60343830 59510514 58342736 57186259 56494083 56282999
41874 56282999 56087939 55794685 55993470 57037834 58272089 58747916 58256597 57174803 55896099
41865 55896099 54991592 55180850 56315841 57108307 56830910 56527009 57312159 58244433 57553261
41856E7553261j979671j012609R54021J455028K81009j020093j794123k199554
41848E2237269j577703N16011K289523J457730j092671k034947k98453J522247
41840E3019006J159676l15566o52623L63378J295317J295351O38344m1563o0317
41831E6701003R07938K014116J834451M60847j88341J014559K686844K911288
41823F8342705J888737J375657K207012L573126M314195M007373L165289K993445
41815I1867539M341784O329283O860787N175986K849739J415182K24049k054574
41807A17009775m930639o740840p038270o627811n805523m426476l374203l887201
41799G4178812n285482n345490l441852j533898j299504j968341k061584j804711
$$ plain form
41856 57553261 55573590 54560981 55515002 56970030 57251039 56230946 54436823 52237269
41848 52237269 50659566 51175577 53465100 54922830 53830159 51795212 51496759 53019006
41840 53019006 54178682 53863116 53210493 53573871 54869188 56164539 56802883 56761320 56701003
41831 56701003 57608941 59623057 61457508 61918355 61730014 62744573 65431417 68342705
41823 68342705 70231442 71607099 73814111 77387237 81701432 85708805 88874094 91867539
41815 91867539 96209323 102538606 109399393 114575379 117425118 118840300 119064349 117009775
41807 117009775 112079136 105338296 98300026 91672215 85866692 81440216 78066013 74178812
41799 74178812 68893330 63547840 60105988 58572090 57272586 55304245 53242661 51437950
41791E1437950k332909l448345l781644k839228j506176n55063J28251O21927
41783C7724763L69864q86759k246645k455266j376127j00212L87295J83804R889
41774C1610606J95452M30967L18638j47000o06227o84254m05817k78649o23740
41765B9809976p88232K29956J959376K252384j6090k847568l302744j350068L82686
41756B6329676N89133O23097J306412J109441q64366k445557j385623Q79909J244616
41747B7386738l31141j110458j86245L88836n29234j189842k3264J680616J743959
41738B7829965J22530j490094j893350j044616M57591J551821J331134K59968
41730B7124949k53674j7608k88497j158622p31211J635815L253074J574397j621013
$$ plain form
41791 51437950 49105041 45656696 41875052 39035824 37529648 36974585 37102836 37724763
41783 37724763 38094627 37207868 34961223 32505957 31129830 31029618 31416913 31600717 31610606
41774 31610606 31806058 32237025 32555663 32408663 31802436 31118182 30712365 30433716 29809976
41765 29809976 29021744 29251700 31211076 33463460 33447370 30599802 27297058 25946990 26329676
41756 26329676 26918809 27541906 28848318 29957759 29093393 26647836 25262213 26142122 27386738
41747 27386738 27055597 25945139 25758894 26147730 25618496 24428654 24405390 26086006 27829965
41738 27829965 27952495 26462401 24569051 23524435 23982026 25533847 26864981 27124949
41730 27124949 26871275 26853667 26565170 25406548 24675337 26311152 29564226 31138623 29517610
41721B9517610k283386K32280K373870J485694r24593j907172r09266M78372J101635
41712B9165044J008427M89423j85170m06965K24153J068854J061021J73664m87479
41703C2110972j80769N67711Q60956O65090O27472R93810J363789J462230J429545
41694C9900806J160664J78594j265039j748288l53386J705589K394897J603020
41686D3576857J105506J676110J942975Q18922n68917o21928L21680Q10870N90952
41677D9653027M78718N74440L20996L7803O69567J978330K552718J826944P13332
41668E8805875L9526k36336j6237J160364K769631L226084K006601O08150M47438
41659F8811096R35672P47284L4147L6359J046904K067632K305226J962993J587427
$$ plain form
41721 29517610 27234224 27466504 29840374 31326068 30401475 28494303 27585037 28063409 29165044
41712 29165044 30173471 30662894 30477724 30070759 30294912 31363766 32424787 32598451 32110972
41703 32110972 31930203 32497914 33358870 34023960 34651432 35645242 37009031 38471261 39900806
41694 39900806 41061470 41240064 39975025 38226737 37873351 39578940 41973837 43576857
41686 43576857 44682363 46358473 48301448 49120370 48551453 47929525 48251205 49062075 49653027
41677 49653027 50131745 50706185 51027181 51064984 51734551 53712881 56265599 58092543 58805875
41668 58805875 58845401 58609065 58592828 59753192 62522823 65748907 67755508 68363658 68811096
41659 68811096 69746768 70494052 70528199 70564558 71611462 73679094 75984320 77947313 79534740
41650G9534740J435768J479896J459191J069552N74972Q60277K229962L564415
41642I2208773L543282K462611J856302K358836L006527K929474K705425L309061
41634A14380291M378184M564642L599267L016428M132574N846543N698839L420467
41626A49037235K041221M120008P765894Q566447N545880K760629L821152P071577
41618A90730043Q349273O901344N646842O179914O740118N745032M485875M818238
41610B39596679O234166P000485O767293O261970N488052M127598L028929L317584
41602B81822756M256748L862123J808358M6943O3395R59150R66450l01168j979394
41593B91505361l426203m537954n121476n001355m651156m872598n697493o211370
$$ plain form
41650 79534740 80970508 82450404 83909595 84979147 85554119 86414396 88644358 92208773
41642 92208773 95752055 98214666 100070968 102429804 105436331 108365805 111071230 114380291
41634 114380291 118758475 123323117 126922384 129938812 134071386 139917929 145616768 149037235
41626 149037235 151078456 155198464 162964358 171530805 177076685 179837314 183658466 190730043
41618 190730043 199079316 205980660 211627502 217807416 224547534 230292566 234778441 239596679
41610 239596679 245830845 252831330 259598623 265860593 271348645 275476243 278505172 281822756
41602 281822756 286079504 289941627 291749985 291796928 291860323 292819473 293785923 293484755 291505361
41593 291505361 288079158 283541204 278419728 273418373 268767217 263894619 258197126 251985756
41585B51985756n738765m793489m478625n149596o117659o680368o911795p109715
41577B05005744o977840o091712m937042m512926m812624m785449m197539m286471
41569A64404141n671355o787630n871954l765073k964872m095923n140949m462171
41561A25644214k886602k091158k333566k757607k917629k960931k947312k866968
41553A03882441k903782l065812k991018k550207k095167j770767j292103p51758
41545H6461827p76369j430785j913457j850423j827139k050209j765044q50542
41537G3997859n79647j580150k421877j780670p04201q14217j415377p66302N43490
41528F4478908K44824j698910k634797j235788N40840N01869r07727j986283k229581
$$ plain form
41585 251985756 246246991 241453502 236974877 231825281 225707622 219027254 212115459 205005744
41577 205005744 198027904 191936192 186999150 182486224 177673600 172888151 168690612 164404141
41569 164404141 158732786 151945156 146073202 142308129 139343257 135247334 130106385 125644214
41561 125644214 122757612 120666454 118332888 115575281 112657652 109696721 106749409 103882441
41553 103882441 100978659 97912847 94921829 92371622 90276455 88505688 87213585 86461827
41545 86461827 85685458 84254673 82341216 80490793 78663654 76613445 74848401 73997859
41537 73997859 73418212 71838062 69416185 67635515 66931314 66117097 64701720 63935418 64478908
41528 64478908 64723732 63024822 60390025 59154237 59695077 60196946 59289219 57302936 55073355
41519E5073355k059366j552977q04342m36788n82335l61386O08331J276290P69905
41510E1930687j91405o26505q90874j620757k122665j367424J10135P98279K34040
41501D6253511q30386j782756k404094k251782j131562Q9325L07849m10409j167632
41492C6672064j479354j249493k70524J041573J254750k19299j642625j105025
41484C3002067N05324P66986m92206j096550j89271N90584J19724n44936m99043
41475C2162679o38798j590713k086143j129952m6995m20103j388012j097529K07174
41466B3971608P49066J74921k79013k08923l92427p45102j63845J190658J526034
41457B5822977R0152j572398j961137j601647j564660j493743n83737N95618R08086
$$ plain form
41519 55073355 53013989 51461012 50656670 50219882 49637547 49276161 49884492 51160782 51930687
41510 51930687 51739282 51112777 50221903 48601146 46478481 45111057 45221192 46019471 46253511
41501 46253511 45423125 43640369 41236275 38984493 37852931 37942256 38250105 37839696 36672064
41492 36672064 35192710 33943217 33672693 34714266 35969016 35749717 34107092 33002067
41484 33002067 33507391 34274377 33782171 32685621 32496350 33086934 33206658 32661722 32162679
41475 32162679 31523881 29933168 27847025 26717073 26670078 26249975 24861963 23764434 23971608
41466 23971608 24720674 24895595 24616582 24407659 24015232 23270130 23106285 24296943 25822977
41457 25822977 25913129 24340731 22379594 20777947 19213287 17719544 17135807 17731425 18639511
41448A8639511N66449N89270Q06295J40502j248484j860089j136917k30024k1810
41439A6244703K5906L46877K26944n85293p41022O32352J925258J111354r70008
41430A8217071j688067o59485j43143j076333j450924J43329J828454J292137
41422A6463039n22066j023430o1069L14545l67701l42958R73140J606587J28941
41413A7169028j967301k406620j119727L22683J038476J108500N02903o25486
41405A4022456j162461j84276J332398J454140l7422j296262r44013L21435J051374
41396A4557369Q36030J79518m52448p36470l89666K88937L92720l21822p50944
41387A3603224M3061J165687R52554n14461j332910m58315Q56766R29061j44917
$$ plain form
41448 18639511 19205960 19795230 20601525 20742027 19493543 17633454 16496537 16266513 16244703
41439 16244703 16270609 16617486 16844430 16259137 15518115 16150467 18075725 19187079 18217071
41430 18217071 16529004 15869519 15726376 14650043 13199119 13342448 15170902 16463039
41422 16463039 15940973 14917543 14856474 15171019 14803318 14460360 15433500 17040087 17169028
41413 17169028 15201727 12795107 11675380 11998063 13036539 14145039 14647942 14022456
41405 14022456 12859995 12675719 14008117 15462257 15424835 14128573 13184560 13505995 14557369
41396 14557369 15393399 15572917 15120469 14383999 13994333 14283270 14675990 14354168 13603224
41387 13603224 13646285 14811972 15764526 15250065 13917155 13458840 14315606 15244667 15099750
41378A5099750j016443r80008l56972L71189P77519L59567p19675j228766l92312
41369A1913849O46356L11480q49444q87918L71719R99627J82327n03020J8007
41360A2202983M28604m21111j158338k42489J001598L36113j484121j658741J77980
41351I182478J305405N2132j960960k439880j194439N21654J673019J646840L83374
41342I169623r41808q10080M64758R47669m9270j057303r92747n86603l75478
41333E768761N22469K186184K567707M01920k209141k379947m57569P99520K55864
41324G455768o25041m35602N62950J363346J176916k57087j992318k146726l21934
41315D780272J192112M88824p97669L4763K005290J536034j684668l587110j650330
$$ plain form
41378 15099750 14083307 13103299 12746327 13117516 13895035 14254602 13534927 12306161 11913849
41369 11913849 12560205 12871685 12022241 11134323 11506042 12505669 12687996 12184976 12202983
41360 12202983 12631587 12210476 11052138 10809649 11811247 12147360 10663239 9004498 9182478
41351 9182478 10487883 10540015 8579055 6139175 4944736 5466390 7139409 8786249 9169623
41342 9169623 8227815 7417735 7882493 8830162 8780892 7723589 6730842 6144239 5768761
41333 5768761 6291230 8477414 11045121 11447041 9237900 6857953 6400384 7199904 7455768
41324 7455768 6830727 6395125 6958075 8321421 9498337 9241250 7248932 5102206 4780272
41315 4780272 5972384 6461208 5663539 5698302 7703592 9239626 7554958 3967848 2317518
41306B317518J330107J464481p68150j842031l76262J608200J930526N65768j109311
41297E120846j788464r99839N06734J311043R77535N79686Q73918R65398q8139
41288G458718j399066j515405p52975n12101q23882n00853N01260Q75575K43597
41279C574868k77043j42954j47075n45444l38217O73667R95646q0088q36091K53679
41269C130948J699060J031483j203482k025952m45938J213288R44482k80610n72144
41260C491135N1712M02674K87925K52211R9075o07802j158168n25268P23691J022847
41250D040032K05046l89460k63642l79932j007066q71325N89095J820120J345978
41241E088846J8402m55550j29051k16290p02762n30839K20175L73977j29322p7013
$$ plain form
41306 2317518 3647625 5112106 4343956 2501925 2125663 3733863 5664389 6230157 5120846
41297 5120846 3332382 2332543 2839277 4150320 5127855 5707541 6581459 7546857 7458718
41288 7458718 6059652 4544247 3791272 3279171 2455289 1954436 2455696 3331271 3574868
41279 3574868 3297825 3154871 3007796 2462352 2124135 2797802 3793448 3713360 2877269 3130948
41269 3130948 4830008 5861491 4658009 2632057 2186119 3399407 4343889 4063279 3491135
41260 3491135 3542847 3945521 4233446 4485657 4584732 3976930 2818762 2293494 3017185 4040032
41250 4040032 4245078 3855618 3591976 3212044 2204978 1333653 1922748 3742868 5088846
41241 5088846 5107248 4651698 4522647 4306357 3603595 3072756 3292931 3666908 3537586 3460573
41231C460573O44258N78883o39892j172504J75969J701953J186375p05827j495450
41222C734338o40811P4591k13805k27370P87265J372546K35107j348644j330270
41213B442947m4070M82756j32351k33575P53598J105187k88579j723793j058499
41204A303621J002277J935353J002539k02037n65056p03906j093380r61293Q2794
41195A800912R73887Q66814N26242P98264R25898o7518j264410r54455N99007
41186D204641J355806M82719n86130m60580L71949P49214O11561N54107M46089
41177G729376k98447j367023j607910o74440K48120j5843q50525n74338R95815
41168C584785J881629O65120j145961j037591P29717J347003k86739j807548r51871
$$ plain form
41231 3460573 4104831 4683714 4043822 2871318 3047287 4749240 5935615 5229788 3734338
41222 3734338 3093527 3168118 2954313 2726943 3514208 4886754 5121861 3773217 2442947
41213 2442947 2398877 2881633 2749282 2515707 3269305 4374492 4085913 2362120 1303621
41204 1303621 2305898 4241251 5243790 5041753 4476697 3772791 2679411 1718118 1800912
41195 1800912 2774799 3641613 4167855 4966119 5892017 5824499 4560089 3605634 4204641
41186 4204641 5560447 6043166 5457036 4996456 5368405 6117619 6729180 7283287 7729376
41177 7729376 7430929 6063906 4455996 3781556 4029676 4013833 3163308 2588970 3584785
41168 3584785 5466414 6131534 4985573 3947982 4677699 6024702 5737963 3930415 2978544
41159B978544J189005K137167J529298O29401k19313j268156j550821o7962J786014
41150G143177J679581k0426p78454J3002L65475o08743j374905j045041p06034
41141D667632o28367O75496L004900L271982J23872k979893k227846J108558K808139
41132I824473J657434j708n82237o78982n74018M26352J886435K173930R94589
41123A5126268j58343l83754j80674K56097J356301K474092K100844M10020m40982
41114B0559869O39330K102113K089702P85293m05014o60866j4448R43431J076590
41105B7116000k81905j907022j750783J13585J290877M47531q93348q72115J46325
41096B3409145P55778O82492L73003k31012j009775r37036L97881J540074J054869
$$ plain form
41159 2978544 4167549 6304716 7834014 8463415 8244102 6975946 5425125 5357163 7143177
41150 7143177 8822758 8802332 8023878 8036880 8402355 7793612 6418707 5373666 4667632
41141 4667632 4039265 4714761 7719661 10991643 11115515 8135622 5907776 7016334 9824473
41132 9824473 11481907 11480199 10897962 10218980 9644962 10071314 11957749 14131679 15126268
41123 15126268 14967925 14584171 14403497 14659594 16015895 18489987 20590831 21000851 20559869
41114 20559869 21199199 23301312 25391014 26176307 25771293 25110427 25095979 26039410 27116000
41105 27116000 26834095 24927073 23176290 23289875 24580752 25028283 24134935 23262820 23409145
41096 23409145 24164923 24847415 25220418 24989406 23979631 23042595 23440476 24980550 26035419
41087B6035419j73519k01694J054715J882439J380377L59983k20382k11901L30317
41078C0235754J305992J964787J382708j64062j286249j201129n33551k08428
41070C1495822l46707n31180n14957l59012k71396m69095r32594j327041j380452
41061B5363388j125162n80895L01696J032649O36277r69825k270039j773298M9768
41052B0664559J391135J349574N87055K0679p6188K10262N65406L15489q26074
41043B4201897j885758j570526j70480O18930N7454o11453o3346J173708J543068
41034B3293494O08525n20957p08865Q694Q11224J134312R86988M82434l70622
41025B5725227j159108r45739N21302J804476J242580m93817r06237O43039J571370
$$ plain form
41087 26035419 25861900 25660206 26714921 28597360 29977737 30337720 30117338 29905437 30235754
41078 30235754 31541746 33506533 34889241 34725179 33438930 32237801 31704250 31495822
41070 31495822 31149115 30617935 30102978 29743966 29472570 29003475 28070881 26743840 25363388
41061 25363388 24238226 23657331 23959027 24991676 25627953 24658128 22388089 20614791 20664559
41052 20664559 22055694 23405268 23992323 24013002 23936814 24147076 24712482 25027971 24201897
41043 24201897 22316139 20745613 20575133 21194063 21251517 20640064 20576718 21750426 23293494
41034 23293494 23902019 23381062 22672197 22680891 23492115 24626427 25613415 26095849 25725227
41025 25725227 24566119 23620380 24141682 25946158 27188738 26694921 25788684 26431723 28003093
41016B8003093j85691k771370k938350q21862N06440k29609j147030q05089k61328
41007A9349204n81039q77345k66974L47272M6625l73467j15714j37992j321172
40998A6069398k372943j687264j28938K95539l23320k76646N74081O13497n16245
40989A2247159j138965l08300O95991M54978o17117j282216j204547p86156k26894
40980G833933M24167Q80233Q67987M29135j63157m04424K26519J326537J353251
40971A2774181m42321k313697j902783L33222J546092N73314o22567l66603J87852
40962I766690n19112j456623o47725J366546K097795P50767q52874j083626l91950
40953I029888N1653Q5643J79830L49683K66903l7733j73331Q9758N69716Q56910
$$ plain form
41016 28003093 27817402 25046032 22107682 21285820 21792260 21562651 20415621 19610532 19349204
41007 19349204 18768165 17890820 17623846 17971118 18017743 17644276 17528562 17390570 16069398
40998 16069398 13696455 12009191 11880253 12175792 11852472 11575826 12149907 12763404 12247159
40989 12247159 11108194 10799894 11495885 11950863 11333746 10051530 8846983 8060827 7833933
40980 7833933 8258100 9138333 10006320 10435455 10272298 9867874 10094393 11420930 12774181
40971 12774181 12331860 10018163 8115380 8448602 9994694 10568008 9945441 9578838 9766690
40962 9766690 9247578 7790955 7143230 8509776 10607571 11358338 10505464 9421838 9029888
40953 9029888 9081541 9167184 9347014 9696697 9963600 9925867 9752536 9842294 10412010 11268920
40943A1268920P18133L79447K34943K23284r3924o94880r68342p35832o24878
40934I706871q90785p63827J85351R28151M08833o56194q44497l07003k78336
40925G488564o68647j85602J022504J064614n95567j816099q56893R67902J416657
40916G837433O91222N84398J175819Q34064o29165j279474j77902R57449M24965
40907A0418809q04585p25173N81126J351593J056103Q57485J192940R74928j83326
40898A4719900q38534K1817J131244Q91888l6614M2994R07658Q76338j14824l12250
40888A7289617P32603J283453M89202m173J099259K359073J926733N95593L50704
40879B6122064J110122J279908P42506P95930J453963J274924o13q85955o07729
$$ plain form
40943 11268920 11987053 12366500 12601443 12824727 12730803 12035923 11067581 10331749 9706871
40934 9706871 8816086 8052259 8237610 9165761 9574594 8918400 8073903 7766900 7488564
40925 7488564 6819917 6634315 7656819 8721433 8125866 6309767 5452874 6420776 7837433
40916 7837433 8528655 9113053 10288872 11122936 10493771 9214297 9036395 9993844 10418809
40907 10418809 9614224 8889051 9470177 10821770 11877873 12735358 13928298 14903226 14719900
40898 14719900 13881366 13903183 15034427 15926315 15889701 15932695 16840353 17716691 17601867 17289617
40888 17289617 18022220 19305673 19794875 19790702 20889961 23249034 25175767 25771360 26122064
40879 26122064 27232186 28512094 29254600 30050530 31504493 32779417 32778804 31892849 31285120
40870C1285120j49150l48196p50811r01149j122665j461411j367833q96261p55347
40861B3532297q70572n05725n047n09272j665199j804087q43795n34223j115120
40852A5679257o00263J340912J881024m92530k865443k056940M63707J070473
40844A4420197m10302j157735k88817L49911r6262m39934j92451k38381n02226
40835A1444000J45866J256806R22543q54408j664138m46856Q16720K94253j100126
40826A0814660j550004q30528K48665J178980J454405N49681q42545j117456j05062
40817I800796N45666K7091m79839j03497L79417M84518J030767J954229J511965
40808A5151113o56348k035856q91337P95479M92396q19062o51170N93474N62722
$$ plain form
40870 31285120 31135970 30787774 30036963 29135814 28013149 26551738 25183905 24287644 23532297
40861 23532297 22661725 22156000 22150953 21641681 19976482 18172395 17328600 16794377 15679257
40852 15679257 15078994 16419906 18300930 17808400 14942957 12886017 13349724 14420197
40844 14420197 14009895 12852160 12563343 12913254 12816992 12377058 12184607 11946226 11444000
40835 11444000 11589866 12846672 13769215 12914807 11250669 10803813 11620533 11914786 10814660
40826 10814660 9264656 8434128 8682793 9861773 11316178 11865859 11023314 9905858 9800796
40817 9800796 10346462 10373553 9893714 9790217 10169634 10654152 11684919 13639148 15151113
40808 15151113 14494765 12458909 11567572 12363051 12855447 12036385 11385215 11978689 12541411
40799A2541411p66267j223385m06562p2153n28783l8980J587521K056589M34505
40790A3583896r49141j00878J526023J506739J77581l26398M39424R52033M01793
40781A7211072l54589n00152l01257j91292o3964J34628Q6957j70045j8978O50328
40771A6482708Q27800k39769j436689p96131J565324K804021P69951k710636l645975
40762A3620604r45534K127330K262569J63733j123755o64176l03357j209627j948495
40753A1979292q01041J482390K538038J420152m20899j237621j064211j062315
40745A2833785j399486r97122M02724J262998L87503j013756r97757O9388K23116
40736A0771393o21311m65837J081185J721027K98549r98607k14864J051307M54387
$$ plain form
40799 12541411 11775144 10551759 10145197 10073044 9544261 9505281 11092802 13149391 13583896
40790 13583896 12634755 12533877 14059900 15566639 15744220 15417822 15857246 16809279 17211072
40781 17211072 16856483 16356331 16055074 15863782 15799818 15934446 16021403 15851358 15832380 16482708
40771 16482708 17310508 17070739 15634050 14837919 16403243 19207264 19977215 17266579 13620604
40762 13620604 12675070 14802400 17064969 17228702 16104947 15440771 15137414 13927787 11979292
40753 11979292 11178251 12660641 15198679 16618831 16197932 14960311 13896100 12833785
40745 12833785 11434299 10437177 10839901 12102899 12490402 11476646 10478889 10548277 10771393
40736 10771393 10150082 9684245 10765430 12486457 12785006 11786399 11571535 12622842 13077229
40727A3077229j020008q69832N07576O49712n26434o76807O91170J343121J93946
40718A3369673j068393j050752n35787l17116K11727J125998J085060k22728r55872
40709A1641810K1387J126779N73464q16132j103773j98888M62894K69181j45562
40700A1831160k32190k9636K62462M20424L28692K87443N09905M16617l86995
40691A3407882p59525M60973J809443P00064k113290k753180l328K462001J576420
40682A4787460o29021q09521K88266k06721j975967k185179m37072Q02847M06893
40673A0041985k50745l32600n34894p88393L9856J633928K130211J145389M10227
40664A3494964P63707R78854L33117r9583K74800L15823n69348r60105K69560
$$ plain form
40727 13077229 12057221 11187389 11694965 12344677 11818243 11141436 11832606 13175727 13369673
40718 13369673 12301280 11250528 10714741 10397625 10609352 11735350 12820410 12597682 11641810
40709 11641810 11663197 12789976 13363440 12547308 11443535 11244647 11707541 11976722 11831160
40700 11831160 11598970 11569334 11831796 12252220 12580912 12868355 13378260 13794877 13407882
40691 13407882 12648357 13109330 14918773 15618837 13505547 10752367 10749039 13211040 14787460
40682 14787460 14158439 13348918 13637184 13430463 11454496 9269317 8832245 9635092 10041985
40673 10041985 9791240 9458640 8923746 8135353 8175209 9809137 11939348 13084737 13494964
40664 13494964 14258671 15237525 15570642 15471059 15745859 16061682 15492334 14532229 14801789
40655A4801789J870648K012821Q56306j52887n28609q39454j217797j049223L9889
40646A5793483J547489K288538J236111j139636k559977j210281J625885K704811
40638B0286423R02772j470261j985722r53179N817N20092J105941J483098R66069
40629B0861050o1162m96772n7150O06605J031262J252351J249983R23476N11986
40620B5821629M59938R46050J793459K550144K590418J746967R41221J331957
40612C8181783K598167L071548K006807O57432M41540J043315J186269M73453
40604D9660314m55943j002842j037449p52336p13144j487629k676220l006059
40596C8528692j977931o49637j36029k00890j43421j53917o66547j085751m99556
$$ plain form
40655 14801789 16672437 18685258 19541564 19388677 18860068 18020614 16802817 15753594 15793483
40646 15793483 17340972 19629510 20865621 19725985 17166008 15955727 17581612 20286423
40638 20286423 21189195 19718934 17733212 16780033 16785850 17305942 18411883 19894981 20861050
40629 20861050 20799888 20303116 20245966 20852571 21883833 23136184 24386167 25309643 25821629
40620 25821629 26281567 27227617 29021076 31571220 34161638 35908605 36849826 38181783
40612 38181783 40779950 43851498 45858305 46515737 46957277 48000592 49186861 49660314
40604 49660314 49204371 48201529 47164080 46411744 45698600 44210971 41534751 38528692
40596 38528692 36550761 35901124 35765095 35564205 35420784 35266867 34600320 33514569 33015013
40587C3015013O50919R06017j41241j154830p90103N39813J140215J45697j267535
40578C3043965j199094M98694J886846J579076O64194Q11925J502657J097997
40570C9886260j3962P2270J230694J257697o2631j09527K008691L353077J805325
40561D9427894k78649J1154J337654Q91505l01108P44669L164857L165443M53925
40552E8617344j087976K01576J352973K40196q76581K95177J818300P45275j960240
40543E9346044k980429j542297J93254O66976K44808m39662j232024j748698j596468
40534E0911504j114642p48349k45748M63756M94950o19208j722795j611525q93253
40525D4914690q09737j177189j133099r47870j228183j236515j36026Q49508p0719
$$ plain form
40587 33015013 33665932 34571949 34430708 33275878 32485775 33025588 34165803 34311500 33043965
40578 33043965 31844871 32343565 34230411 35809487 36473681 37285606 38788263 39886260
40570 39886260 39872298 39944568 41175262 42432959 42370328 42260801 44269492 47622569 49427894
40561 49427894 49149245 49160399 50498053 51389558 51088450 51833119 54997976 58163419 58617344
40552 58617344 57529368 57730944 59083917 59324113 58447532 58742709 60561009 61306284 59346044
40543 59346044 56365615 54823318 55016572 55683548 55928356 55488694 54256670 52507972 50911504
40534 50911504 49796862 49048513 48802765 49266521 49761471 49142263 47419468 45807943 44914690
40525 44914690 44104953 42927764 41794665 40846795 39618612 38382097 38246071 39095579 39024860
40516C9024860k064423k568698j239743k86531o46277p45277J46486K76165j367833
40507C0528729k778388j928879l6409M52116m10577p94559m25690n67485j195455
40498B2843403q17549P47815J712290R85938l51757r13336p47522m82951j50805
40489B2825526K46129J58518n65247j075114p30506r6523R1013J01840M01830
40480B1357466M84259l00155j316340j347300m42767K05524J50169J61151O46678
40471A9598685Q72552K88574l89146j83968P07214J245680R47018K99135j2350
40462B3373394K13791O59180P51549J12842r22207j418822q52937J50406N39912
40453B2607108K19343J44659Q88965J698711J526930O82443N85769J681135K499439
$$ plain form
40516 39024860 36960437 34391739 33151996 32865465 32219188 31473911 31620397 31896562 30528729
40507 30528729 27750341 25821462 25785053 26237169 25826592 25032033 24606343 24038858 22843403
40498 22843403 22025854 22773669 24485959 25471897 25120140 24206804 23459282 22976331 22825526
40489 22825526 23071655 23230173 22664926 21589812 20859306 20762783 20853796 20955636 21357466
40480 21357466 21841725 21541570 20225230 18877930 18435163 18640687 18790856 18952007 19598685
40471 19598685 20471237 20759811 20370665 20186697 20893911 22139591 23086609 23385744 23373394
40462 23373394 23587185 24246365 24997914 25110756 24188549 22769727 21916790 22067196 22607108
40453 22607108 22826451 22971110 23860075 25558786 27085716 27768159 28353928 30035063 32534502
40444C2534502J611828j07248m65180R17735K039973J585425Q95908J657085L072305
40435D3742333L250856K463517K639334L907431M244531K992687K119425K852356
40427F8212470L483400K303792O78732Q42552K072826J766868l93085k110962
40419G6856593k216444k064300k710667l154579k467059j673925k079536l118007
40411E7372076l338398k571793j772157j412914j315823j542908k190420k598153
40403D0629510j990021q49122n47099j447436k326800k006879p97590J22229J76413
40394C0963205k97534q27197j249357j433745j145923m24672K42228M22241K39060
40385B6488306R5370O6919q1347m18702q17288j262680j634954j320015J00224
$$ plain form
40444 32534502 34146330 34039082 33573902 34491637 36531610 38117035 39012943 40670028 43742333
40435 43742333 46993189 49456706 52096040 56003471 60248002 63240689 65360114 68212470
40427 68212470 71695870 73999662 74678394 75520946 77593772 79360640 78967555 76856593
40419 76856593 74640149 72575849 69865182 66710603 64243544 62569619 60490083 57372076
40411 57372076 54033678 51461885 49689728 48276814 46960991 45418083 43227663 40629510
40403 40629510 38639489 37790367 37243268 35795832 33469032 31462153 30664563 30786792 30963205
40394 30963205 30665671 29838474 28589117 27155372 26009449 25584777 25827005 26249246 26488306
40385 26488306 26583676 26650595 26569248 26150546 25333258 24070578 22435624 21115609 21215833
40376B1215833J690801J792882K76364r67696o01181K34953j63596j224276j015392
40367B1238692M53157J009781k80157j542740r18496O73662J050903j4813p83898
40358B0886091l49792K44399j5670m34755J55044J268153J190806m25579j676560
40349B0842137r45729N81848M23366j470068k358666o49718J653891J773065l4471
40340A9815655j290665r39140r0867L59774O59639P46302j2761j231650j489037
40331A6527250m36407O75212J036398J200591J428205Q58448p95883k224240k159800
40322A6109774r07665M27164J067230N16021j131577k387596j594185M86716J196505
40313A3782387k37484j592314j225705l43798l63634n28441L8071L42623k41847
$$ plain form
40376 21215833 22906634 24699516 24975880 24008184 23407003 23641956 23478360 22254084 21238692
40367 21238692 21691849 22701630 22421473 20878733 19960237 20633899 21684802 21669989 20886091
40358 20886091 20536299 20780698 20765028 20330273 20485317 21753470 22944276 22518697 20842137
40349 20842137 19896408 20478256 20901622 19431554 17072888 16423170 18077061 19850126 19815655
40340 19815655 18524990 17585850 17494983 17854757 18514396 19260698 19247937 18016287 16527250
40331 16527250 16090843 16766055 17802453 19003044 20431249 21289697 20493814 18269574 16109774
40322 16109774 15202109 15629273 16696503 17212524 16080947 13693351 12099166 12585882 13782387
40313 13782387 13544903 11952589 10726884 10383086 10019452 9491011 9529082 9871705 9629858
40304I629858j43743J453494K195140J97747k049734j135948J603029K025591
40296A3775434k84915j888748j442373j100463j654900j026430J167364J996450
40288I541419J53052j418815k99985J393709O68423j445310j824154j15141J416955
40279H070153J557925Q75964k00971j481415j923496p56325Q56613J230426N78756
40270H807630J75084l2931q31305j508224o78003R36562J048547o21059j640348
40261E655953m53868J316540J312337k44512j081193m8477J542433J801333N86299
40252A0386845o08589p92806o36326j032776j372698n16361R20044J021629m47058
40243F921904j418067o54707L54629r8225j237319j279209k47754N52590P90261
$$ plain form
40304 9629858 9486115 10939609 13134749 13332496 11282762 10146814 11749843 13775434
40296 13775434 13490519 11601771 10159398 9058935 7404035 6377605 7544969 9541419
40288 9541419 9694471 8275656 7975671 9369380 10037803 8592493 6768339 6653198 8070153
40279 8070153 9628078 10504042 10303071 8821656 6898160 6141835 6998448 8228874 8807630
40270 8807630 8982714 8949783 8118478 6610254 5932251 6868813 7917360 7296301 5655953
40261 5655953 5202085 6518625 7830962 7586450 6505257 6456780 7999213 9800546 10386845
40252 10386845 9778256 8985450 8349124 7316348 5943650 5427289 6347333 7368962 6921904
40243 6921904 5503837 4849130 5203759 5105534 3868215 2589006 2341252 2893842 3684103
40234C684103Q83729M57844q42216j677903m68533J773127K343975O37568j134363
40225E657331j278426n81210l58123m69834k32093J56492J31109k22434m30188
40216B372624k74090K00236P08158O96880J5753n39581k56658K26206j50307r89909
40206B009312r37580J19134R23208Q89656O38094M57391m282l96472P9926Q20016
40196D598403K91142j171314j304828N09519J931885J175620l90147p97037n49027
40187D294216j007443j438656k80354J664101J995672M07845q03825j37862J239214
40178E932908J571175Q34812J35863j39901n86227j536156k286501j832776k88202
40169A804995Q94973O40183k08425n3290R78817J215812K37913l59236K88267
$$ plain form
40234 3684103 4567832 5025676 4183460 2505557 2037024 3810151 6154126 6791694 5657331
40225 5657331 4378905 3797695 3439572 2969738 2737645 2894137 3025246 2802812 2372624
40216 2372624 2098534 2298770 3006928 3703808 3719561 3179980 2923322 3149528 2999221 2009312
40206 2009312 1071732 1190866 2114074 3003730 3641824 4099215 4094933 3698461 3778387 4598403
40196 4598403 4889545 3718231 2413403 2922922 4854807 6030427 5640280 4843243 4294216
40187 4294216 3286773 1848117 1567763 3231864 5227536 5635381 4831556 4693694 5932908
40178 5932908 7504083 8338895 8474758 8334857 7748630 6212474 3925973 2093197 1804995
40169 1804995 2699968 3340151 3131726 3078436 4057253 5273065 5510978 5151742 5440009
40160E440009P46095k41267j477468j260724j53052J85823k12703j43265L31704
40151C215152K00640k94180r996Q42088R39525J66712l79818n18113r35951j157064
40141B068995J5475J860395K096508M24597p88514j93046O57328K67552l78876
40132F030414N441N65926O2481o23668J4391J296814J345740K06842k32283P49386
40122I421484J727377J338088p1148j310148j700355j268718m97289j34254n72956
40113F932081j269800j313172n80696J79125L78868K01670J52781L74752M94597
40104E550206P6175p00707r83025k77742O79519Q23440L38442K63427N78850J75740
40094F524325r29988j094576L17983J453657N59378j272317j685546m42025O50847
$$ plain form
40160 5440009 6186104 5944837 4467369 3206645 3053593 3239416 3026713 2883448 3215152
40151 3215152 3415792 3121612 3111616 3953704 4893229 5059941 4680123 4162010 3226059 2068995
40141 2068995 2084470 3944865 6041373 6465970 5677456 5484410 6141738 6409290 6030414
40132 6030414 6035855 6601781 6664262 6040594 6054985 7351799 8697539 8904381 8672098 9421484
40122 9421484 11148861 12486949 12415801 11105653 9405298 8136580 7639291 7505037 6932081
40113 6932081 5662281 4349109 3768413 3947538 4326406 4528076 4680857 5055609 5550206
40104 5550206 5626381 4925674 3942649 3664907 4344426 5167866 5506308 5769735 6348585 6524325
40094 6524325 5594337 4499761 4817744 6271401 6830779 5558462 3872916 3430891 4081738
40085D081738O20084K29172J69172J16912k08142m47177l39993m5240L40147P13433
40075E230106O34299J3961k62337M53408J221574P79920k94748l93126M32292
40066G815349N60240l26227n79417O18738J775961J388727J02869n68773m05382
40057A0382085j90366k53151l73696m01206j44692O16256J374013J048543m25769
40048A1632017j632503j511581o62642q1366K29694M37925o3737j424363k207354
40039D716090j133291P09813J091926k37070j303720p97751L58645P20140L14541
40030D439323J89728O92868J001502L12040r13515j239515k0833J464262J410038
40021G335898p0441j018738m16842M65860K30502n73135p26759m14409m21493
$$ plain form
40085 4081738 4701822 4930994 5100166 5217078 5008936 4561759 4221766 4176526 4516673 5230106
40075 5230106 5864405 5878366 5616029 6069437 7291011 8070931 7776183 7383057 7815349
40066 7815349 8375589 8049362 7469945 8088683 9864644 11253371 11356240 10787467 10382085
40057 10382085 10191719 9938568 9564872 9163666 9018974 9635230 11009243 12057786 11632017
40048 11632017 9999514 8487933 7825291 7743925 7973619 8411544 8347807 6923444 4716090
40039 4716090 3582799 4292612 5384538 5147468 3843748 3045997 3404642 4124782 4439323
40030 4439323 4629051 5321919 6323421 6635461 5721946 4482431 4461598 5925860 7335898
40021 7335898 7265457 6246719 5829877 6295737 6526239 5953104 5226345 4811936 4390443
40012D390443l12016O73772J602448Q74122r89769j749424p49684K78485J04957
40003D123334l92785k44890l3161l85633n01500M12980J481540J365948K38547
39994F064380p41008j121853j084724m67167O99254J281847K76953j307040j400686
39985B199956K03863J399643O53857j008323j654558r79156j34979K58337O45526
39976A584166J185630J115922k1168j329631j520282n38313N44175J037274J107636
39967C165409P77849l18458j688931j751778N7495J904983J726849J40519n23781
39958C490156K29157N41422n28962j427219p60789M14771M72785j74583j82588
39949B074150J70099l29564j241110r00189N96275J129176j20085j123990M5699
$$ plain form
40012 4390443 4078427 4752199 6354647 7228769 6239000 4489576 3739892 4018377 4123334
40003 4123334 3730549 3485659 3452498 3066865 2565365 2978345 4459885 5825833 6064380
39994 6064380 5323372 4201519 3116795 2649628 3348882 4630729 4907682 3600642 2199956
39985 2199956 2403819 3803462 4457319 3448996 1794438 815282 680303 938640 1584166
39976 1584166 2769796 3885718 3864550 2534919 1014637 476324 1020499 2057773 3165409
39967 3165409 3943258 3624800 1935869 184091 241586 2146569 3873418 4013937 3490156
39958 3490156 3719313 4260735 3731773 2304554 1543765 1958536 2431321 2256738 2074150
39949 2074150 2244249 1914685 673575 -226614 369661 1498837 1378752 254762 300461
39940C00461K255521K810757J049750j079955j701327q92433J80353Q27963J027935
39931D779025Q11278K10726l77817m13019M3337K02746m48183j229957r34560
39922B643576M79954J512241R36746n11516j074444l39649L47427m0126q21856
39913C132353q91126m44903m01355o30851o8417J377570K278263J577896P9822
39904F009252p42711o96340o16704o59815j64919P83418J060200K90403k99270
39895D963514K71159J030114M23959j271169k314935j959602j062355k90550O78684
39886D68819J783888J954485P09418p81360j180980o44462j17455J55454M31618
39877B779425N42197K57924l017J08421K4369p26244j230628l27493J292912J686662
$$ plain form
39940 300461 2555982 5366739 6416489 5336534 3635207 2742774 2923127 3751090 4779025
39931 4779025 5590303 5801029 5423212 5010193 5053530 5256276 4808093 3578136 2643576
39922 2643576 3123530 4635771 5572517 5061001 3986557 3646908 3994335 3954209 3132353
39913 3132353 2241227 1796324 1394969 764118 695701 2073271 4351534 5929430 6009252
39904 6009252 5266541 4570201 3953497 3293682 3128763 3912181 4972381 5262784 4963514
39895 4963514 5234673 6264787 6688746 5417577 3102642 1143040 80685 -209865 468819
39886 468819 2252707 4207192 4916610 4135250 2954270 2309808 2192353 2347807 2779425
39877 2779425 3321622 3579546 3576529 3684950 3709319 2983075 1752447 1424954 2717866 4404528
39867D404528M16260p93509n59255L55065M77100j59320k72850O04044J285613
39858E757676M29379j501980k359564q27629J546131J924656n3725j553154m50780
39849B911010J576915J533294n53098k012036j612821p26943m65043k49577K52425
39840F54126K27619l56597j53325J134869J811717R13028j56344j15229J19686
39831D079550m71399q85415j02790O82887J79815m39365K30212P25482q92695
39822C106282k868634j838656J477186K832805R82402n74177M88611J776522O78518
39813F060859j199944j094323J63604r3447j602529j735160l5255J148157N53594
39804B165556l51359j31123N75397O13568J20541j93869l34050o88689j170254
$$ plain form
39867 4404528 4820788 4027279 3468024 3823089 4300189 4140869 3868019 4472063 5757676
39858 5757676 6187055 4685075 2325511 1497882 3044013 4968669 4914944 3361790 2911010
39849 2911010 4487925 6021219 5468121 3456085 1843264 1116321 651278 401701 654126
39840 654126 881745 525148 371823 1506692 3318409 4231437 4075093 3959864 4079550
39831 4079550 3608151 2722736 2619946 3302833 3482648 3043283 3273495 3998977 3106282
39822 3106282 237648 -1601008 -123822 2708983 3691385 3117208 3605819 5382341 6060859
39813 6060859 4860915 3766592 3930196 3836749 2234220 499060 463805 1611962 2165556
39804 2165556 1814197 1683074 2258471 2872039 2992580 2798711 2464661 1775972 605718
39795F05718j318809q37632J92354J235392J546008J003387L93045K39698m9096
39786C010065r21891j333640k08611J269370Q80373j095910j856067k59487J254603
39777G38805L36128j679679j890692j52349J142859R14534M38104N15921J75838
39768E39469r92417j455793j75407J262717Q40918o56180p39677R11743J948938
39759A484311R74683n11855p35298l12414p22697j502299j043207M58648J096924
39750h13204L55590o5555P84206J333958N2744j776284j740253Q7351J277752
39741e03695O46604k78140J04035J083296J005910j07736p08299n7446Q66051
39732B050580R12685K29718k56431k04339r7769l31727o18721m33982K72847J028071
$$ plain form
39795 605718 -713091 -1550723 -1358369 -122977 1423031 2426418 2819463 3059161 3010065
39786 3010065 2088174 754534 545923 1815293 2695666 1599756 -256311 -515798 738805
39777 738805 1074933 -604746 -2495438 -2647787 -1504928 -590394 -152290 363631 539469
39768 539469 -452948 -1908741 -2084148 -821431 19487 -636693 -1376370 -464627 1484311
39759 1484311 2458994 1947139 1211841 899427 176730 -1325569 -2368776 -1910128 -813204
39750 -813204 -457614 -523169 261037 1594995 1647739 -128545 -1868798 -1781447 -503695
39741 -503695 142909 -135231 -31196 1052100 2058010 1950274 1241975 1184529 2050580
39732 2050580 2963265 3192983 2936552 2732213 2634444 2302717 1683996 1250014 1522861 2550932
39722B550932J341089J070767L99922l32688q15909r74676r69460q57976m26623
39713I85378L61838R42787O69505k33503p58448l42333M06122M62719l94760j333270
39703G66035j304592j30301J139008J203044J20384n60532J34198J089272P68321
39694C224837k26453k1628J278476J425905l57720j898575j382502J692L99683
39685B443715K68053Q29564J297955L54829q76169l84120R74778N69745j410206
39676D068144j944387j55265J210994L36759r59576p15004m455m70168j221355
39667A45687p01117L81150N85071N25999J402360K111233P94125j585124k187661
39658A471723m94933J210965J482149J113282P30933k53548j557426j458444M23188
$$ plain form
39722 2550932 3892021 4962788 5362710 5030022 4214113 3239437 2269977 1412001 985378
39713 985378 1347216 2290003 2959508 2726005 1967557 1625224 2031346 2494065 2099305 766035
39703 766035 -538557 -668858 470150 1673194 1793578 1233046 1367244 2456516 3224837
39694 3224837 2998384 2976756 4255232 5681137 5323417 3424842 2042340 2044032 2443715
39685 2443715 2711768 3541332 4839287 5194116 4317947 3933827 4908605 5478350 4068144
39676 4068144 2123757 1968492 3179486 3516245 2556669 1841665 1837210 1367042 145687
39667 145687 -555430 -174280 410791 936790 2339150 4450383 5244508 3659384 1471723
39658 1471723 976790 2187755 3669904 4783186 5514119 5260571 3703145 2244701 2667889
39649B667889J828206Q57191j266449j991408q63430M42241P85512O27804O09693
39640C697249M93251j08979q62578j138011q85903n44983k22661M12119J213928
39631B053432J229465O613j262636j059520J83648N85812k54841o40032K55930
39622A097871Q29003j54182j162115m01428R08701M59425j040632q46103J068415
39613G58955J600614n48129k658025k050619J83140J269882O68215j3257K10922
39604e78302P85170Q75814L07752m18998m50344N31223J546823J406680N70134
39595D575952M75608R45886K67477j641214k464412j007690P76747Q46778K6885
39586B802017l4361J35022o79513j492081n58732J269411J520770J508j012040
$$ plain form
39649 2667889 4496095 5353286 4086837 2095429 1231999 1674240 2459752 3087556 3697249
39640 3697249 4190500 4081521 3218943 2080932 1195029 650046 427385 839504 2053432
39631 2053432 3282897 3289510 2026874 967354 1151002 1736814 1481973 841941 1097871
39622 1097871 1926874 1772692 610577 209149 1117850 1577275 536643 -309460 758955
39613 758955 2359569 1811440 -846585 -2897204 -2714064 -1444182 -775967 -789224 -578302
39604 -578302 206868 1082682 1390434 971436 521092 1052315 2599138 4005818 4575952
39595 4575952 5051560 5997446 6264923 4623709 2159297 1151607 1928354 2775132 2802017
39586 2802017 2767656 2902678 2223165 731084 172352 1441763 2962533 2964041 1952001
39577A952001m25570L83155K02996l64353m00259P9680Q07611J547209J504139
39568E286609J76238j160158q01000M67690J73408j727441k284314j99376J736101
39559A667757Q09598j332891j230600J070025K224367O28082j561781j807758
39551D66799l46068Q80745Q36427o3193r68107j192999l90988J070070K131123
39542B423809J912651M85878j282777k349764k013415m33803J172113J462477
39534A377169M51942m51928k61963L56802K85714k37324p3184P93211J017395
39525C257834L9172p99234j68003J164615J403111L34277n69402n22307l69846
39516C770217q25007j216092p84089p3290Q899k99052j38870M99535R16854R16536
$$ plain form
39577 1952001 1526431 1909586 2112582 1748229 1347970 1427650 2235261 3782470 5286609
39568 5286609 5462847 4302689 3501689 3969379 4142787 2415346 131032 -68344 1667757
39559 1667757 2477355 1144464 -86136 983889 3208256 3836338 2274557 466799
39551 466799 120731 1001476 1837903 1774710 806603 -386396 -777384 292686 2423809
39542 2423809 4336460 4822338 3539561 1189797 -823618 -1257421 -85308 1377169
39534 1377169 1829111 1377183 1115220 1472022 1757736 1520412 1447228 2240439 3257834
39525 3257834 3297006 2497772 2329769 3494384 4897495 5231772 4662370 4140063 3770217
39516 3770217 2945210 1729118 945029 871739 880638 581586 442716 942251 1859105 2775641
39506B775641Q25046N84657j00920q47652q68557j91418L40807L35238J98951
39497C051793J55021j06914n79489p08807l92507l08830p48713r54236k92896
39488h85578O12943P74291L60571L46883Q28316P75704k68161j228214r35695
39479C81060J26272N10013m1416l43145J56002M28679k30029p06656J04177J070858
39469A455815M61592q25981k82497J858634K250107m83807l154500k516156N5968
39460a180825J064537J70696k59419L03983J06738j043808j094259M86098J474803
39451B8544N71524m98328k1118R96294Q89955Q3095j33291M0597k92316p92547
39441H72409n92254j1055J07858k3521K28565M85616J12229l07358J35605Q73874
$$ plain form
39506 2775641 3600687 4185344 4084424 3236772 2368215 2176797 2517604 2852842 3051793
39497 3051793 3206814 3099900 2520411 1811604 1419097 1110267 361554 -592682 -885578
39488 -885578 -272635 501656 862227 1209110 2037426 2813130 2544969 1316755 381060
39479 381060 507332 1017345 975929 632784 788786 1217465 987436 280780 384957 1455815
39469 1455815 1917407 1091426 808929 2667563 4917670 4433863 1279363 -1236793 -1180825
39460 -1180825 -116288 54408 -205011 98972 205710 -838098 -1932357 -1446259 28544
39451 28544 600068 101740 80622 1076916 1966871 2049966 1916675 1957272 1664956 872409
39441 872409 280155 269100 376958 353437 582002 1067618 1179847 872489 1008094 1881968
39431A881968O13291m96289j065543o45894j48722j21628q6156K55618M79393
39422F66038L80687L33182L96314N4791p73734j279709p47886M97588J427378
39413I54649J307452L30116n37082n14637K423r4371r09382j121098N8013J410650
39403H86733J301946L0422p51165n13116k66980o59772j128245j086646o48455
39394b835278N1143J036999J764261J440574M25275R9397Q68922J452602P54414
39385E058309o23326j426036j326814p02045K35588J149114J206143R3597j077009
39376B587521r63343J38592O28644k07736j252678j043324M35933J815992J883695
39367D023296P50964m47139q28037n73328m15105n93614p35879o37974n49373
$$ plain form
39431 1881968 2495259 1998970 933427 287533 138811 17183 -68973 186645 666038
39422 666038 1046725 1379907 1776221 1831012 1057278 -222431 -970317 -472729 954649
39413 954649 2262101 2592217 2055135 1540498 1542921 1448550 539168 -581930 -523917 886733
39403 886733 2188679 2219101 1467936 954820 687840 28068 -1100177 -2186823 -2835278
39394 -2835278 -2784135 -1747136 17125 1457699 1882974 1982371 2851293 4303895 5058309
39385 5058309 4434983 3008947 1682133 980088 1215676 2364790 3570933 3664530 2587521
39376 2587521 1624178 1762770 2391414 2183678 931000 -112324 323609 2139601 4023296
39367 4023296 4774260 4327121 3499084 2925756 2510651 1917037 1181158 543184 -6189
39358f189n69508l96994N7957M26636N78319Q81952J301251J007397l18651j487388
39348A474782j195293L2788N83999K28253L00685J185410J337810k27955j917098
39339A803381j556552M22861J546734P36608n96211j061576j071772j330454j155978
39330b262959K53533J862611J805532R9898j184271p05685M69570N72656l95730
39321E15155p90655L75840K031537K179153J83563k359756l184857j680414O13422
39312b117012J783545J360518K77631l39477J5715J013657J576665P45245j013531
39303C302956k001971j384752k66152J04204J41051O84117J029614P6995j247754
39294D38308r68459P09602J495428N86898k47651J90214P17531K16123l64931
$$ plain form
39358 -6189 -575697 -972691 -914734 -488098 90221 972173 2273424 3280821 2962170 1474782
39348 1474782 279489 312277 896276 1124529 1425214 2610624 3948434 3720479 1803381
39339 1803381 246829 669690 2216424 2953032 2356821 1295245 223473 -1106981 -2262959
39330 -2262959 -2009426 -146815 1658717 1758615 574344 -131341 338229 910885 515155
39321 515155 -275500 100340 2131877 4311030 4494593 2134837 -1050020 -2730434 -2117012
39312 -2117012 -333467 1027051 1304682 965205 980920 1994577 3571242 4316487 3302956
39303 3302956 1300985 -83767 -349919 -245715 -104664 579453 1609067 1686062 438308
39294 438308 -530151 179451 1674879 2261777 2014126 2204340 2921871 3137994 2773063
39285B773063J9582N02039M2152n13307o6206M86899k06242j305626r54878O30646
39275A408122J476655Q18845l00146j076958j569149j476062l46048R65403R81387
39266H82049p0508m27495M76896J247469Q68515L6758m40024r13793j704992k008727
39256b053852j025003O92680J854368J822176Q91579k29158q58767p68876l64013
39247c8866o4643K67842P29404P26989j03755q77653o15987P5172L335l99399
39237b97561K09990J359786J056422q19921j764923k94884J690347J578328m72062
39228B245522k182864k139172p48235Q62801J627771R52778m90471r70464L04838
39219e37496J944265K019736M12303j315133j842538j075496K64344J159172P86242
$$ plain form
39285 2773063 2792645 3294684 3336836 2823529 2757323 3244222 3037980 1732354 777476 1408122
39275 1408122 2884777 3703622 3403476 2326518 757369 -718693 -1064741 -99338 882049
39266 882049 811541 384046 860942 2108411 2976926 3013684 2573660 1659867 -45125 -2053852
39256 -2053852 -3078855 -2386175 -531807 1290369 2181948 1952790 1094023 325147 -38866
39247 -38866 -103509 164333 893737 1620726 1516971 639318 23331 98503 101838 -297561
39237 -297561 -87571 1272215 2328637 1508716 -256207 -551091 1139256 2717584 2245522
39228 2245522 62658 -2076514 -2824749 -1961948 -334177 618601 128130 -842334 -537496
39219 -537496 1406769 3426505 3838808 2523675 681137 -394359 -130015 1029157 1815399
39210A815399o57666j764632j205823P45366K306987J898447j79391j779257j095257
39201H4173R74534J582725k82583k097901j349254O25158P58468p69902r42216
39192a416798Q63780J758845L36993r11463J4646J206132L55808j176810r11920
39183A19213L75714K59837r21805q19471O55397J305608N81551K40571R10819
39174B707434J024209k15310j382360j196914k85434K31673K44128Q2916j63731
39165A046611l22722k88439n29313j202447j154406M79034K108758J380888j052651
39156D65313k008231m17442J169302O87671m35490j2707J332381J467674K24453
39147B472924o57386l73393J51901J51044J5791J63912J72489l84766r68921o63460
$$ plain form
39210 1815399 1157733 -606899 -1812722 -1067356 1239631 3138078 2958687 1179430 84173
39201 84173 1058707 2641432 2358849 260948 -1088306 -463148 295320 -474582 -1416798
39192 -1416798 -553018 1205827 1542820 631357 646003 1852135 2207943 1031133 119213
39183 119213 494927 754764 -167041 -986512 -331115 974493 1556044 1796615 2707434
39174 2707434 3731643 3516333 2133973 937059 651625 883298 1127426 1210342 1046611
39165 1046611 723889 435450 -93863 -1296310 -2450716 -1971682 137076 1517964 465313
39156 465313 -1542918 -1960360 -791058 -103387 -538877 -551584 780797 2248471 2472924
39147 2472924 1815538 1442145 1594046 1745090 1760881 1924793 2097282 1712516 743595 80135
39137H0135M10031R24114K7578j213624r87204O43479J583830P33823l28424Q9770
39127A963508J006184M53272j123522j549463m69212L39091R9706j26411K707
39118E95860n69902j720505j558083M03349J908620J267040j70748m73737m7729
39109c65835j97969n49552o1797P13838N58626j92961l65246o7088j85602m79601
39099a193187j23441M29064J17601n65697j18091J342995J945632Q45394n64932
39090B115338p88051k00328j17835p58665j006652l2680J397036J644049L55197
39081B607409p50301j36378J109564P73563p93050r33639Q22119J455435p15987
39072C438735k776700j485056J500903K122106J17777j147311l84187J25154r95432
$$ plain form
39137 80135 490166 1414280 1441858 228234 -758970 -115491 1468339 2202162 1873738 1963508
39127 1963508 2969692 3422964 2299442 749979 280767 619858 719564 593153 595860
39118 595860 25958 -1694547 -3252630 -2849281 -940661 326379 155631 -318106 -365835
39109 -365835 -563804 -1113356 -1175153 -461315 97311 -95650 -460896 -527984 -713586 -1193187
39099 -1193187 -1316628 -887564 -769963 -1335660 -1453751 -110756 1834876 2680270 2115338
39090 2115338 1327287 1126959 1009124 250459 -756193 -788873 608163 2252212 2607409
39081 2607409 1857108 1720730 2830294 3603857 2810807 1877168 2699287 4154722 3438735
39072 3438735 662035 -823021 677882 2799988 2917765 1770454 1386267 1511421 515989
39063E15989k017606j411897j67759M96364J020317J707287J494722M5537j065890
39054F17064p80468k46985o20460j036489l64214P16698J021844P47531N12523
39045E67044j6374r91981j317722l11051R05288J193272J130754J380493R88875
39036C528598p35474k211234j722772k66589J06629l97678k21101M14210J66934
39027a338477l62046O26294K527208K625760L25689j800659j821446p05508l0018
39018D6797J35602J70217n9303k02536M93539J370737P68632j035724j665583
39009B2378l34042Q32593L64275l01960K43575Q28176J85137m06064N09690J585661
38999C529419Q48499p78513j023390m3826L06962j7856M39391J483190J469887
$$ plain form
39063 515989 -1501617 -2913514 -3081273 -2584909 -1564592 142695 1637417 1682954 617064
39054 617064 -163404 -410389 -1030849 -2067338 -2431552 -1714854 -693010 54521 567044
39045 567044 550670 -441311 -1759033 -2070084 -1164796 28476 1159230 2539723 3528598
39036 3528598 2793124 581890 -1140882 -1407471 -1300842 -1698520 -1919621 -1505411 -1338477
39027 -1338477 -1700523 -1074229 1452979 4078739 4404428 2603769 782323 76815 46797
39018 46797 182399 352616 293313 90777 584316 1955053 2723685 1687961 22378
39009 22378 -311664 520929 885204 583244 826819 1654995 1840132 1434068 1943758 3529419
38999 3529419 4377918 3599405 2576015 2532189 2839151 2821295 3260686 4743876 6213763
38990F213763L73805k45404j62069n17975j071496m31822Q73040P27475p79767
38981D979550j151104K07185Q38282m12788j314222l01411O51253l60041j586714
38972A549990o80464R67834M12988j792434k337394l55114J483601J189545j58070
38963B80482q04245o55112l67030j402M64760O53127N66632P59210J174705Q85683
38953B956810m34549j719570j817582r02155l3391J77650M351K3192M26260Q21624
38943d97360P05508J96772K150M17743P93173M06491n07570j047007o45409M95551
38933C20042J526044J362012k39856j817343j514953L28895J269665J33613j281518
$$ plain form
38990 6213763 6587568 6342164 6180095 5662120 4590624 4158802 5031842 5759317 4979550
38981 4979550 3828446 4035631 4873913 4461125 3146903 2845492 3496745 3136704 1549990
38972 1549990 869526 1837360 2250348 457914 -1879480 -2234594 -750993 438552 280482
38963 280482 -523763 -1178875 -1545905 -1547307 -1082547 -429420 137212 896422 2071127 2956810
38953 2956810 2522261 802691 -1014891 -1917046 -1950437 -1772787 -1768436 -1745244 -1318984 -497360
38943 -497360 208148 404920 407070 824813 1617986 2024477 1516907 469900 -175509 320042
38933 320042 1846086 3208098 2968242 1150899 -364054 -35159 1234506 1368119 86601
$$ [...]
##END NTUPLES=NMR SPECTRUM
##END=
