##TITLE=31Pdec_PR198_rm2
 , 24 sc
 10.3.2022
##JCAMPDX= 6.0         $$ Bruker NMR JCAMP-DX V2.0
##DATA TYPE= NMR SPECTRUM
##DATA CLASS= NTUPLES
##ORIGIN= UXNMR, Bruker Analytische Messtechnik GmbH
##OWNER= root
$$ XWIN-NMR		Version 3.5
$$ Thu Mar 10 11:02:33 2022 Russian Standard Time (UT+4h)  she@DPX200
##.OBSERVE FREQUENCY= 81.013821
##.OBSERVE NUCLEUS= ^31P
##.ACQUISITION MODE= SIMULTANEOUS
##.ACQUISITION SCHEME= undefined
##.AVERAGES= 24
##.DIGITISER RES= 16
##SPECTROMETER/DATA SYSTEM= spect
##.PULSE SEQUENCE= zgpg30
##.SOLVENT NAME= CDCl3
##.SHIFT REFERENCE= (INTERNAL, CDCl3, 0, 248.564)
##AUDIT TRAIL= $$ (NUMBER, WHEN, WHO, WHERE, WHAT)
$$ ##TITLE= Audit trail, XWIN-NMR		Version 3.5
$$ ##JCAMPDX= 5.01
$$ ##ORIGIN= Bruker BioSpin GmbH
$$ ##OWNER= she
$$ F:/spectra/data/she/nmr/P31/1/pdata/1/auditp.txt
$$ ##AUDIT TRAIL=  $$ (NUMBER, WHEN, WHO, WHERE, WHAT)
(   1,<2022-03-10 11:01:27.60 +0400>,<she>,<DPX200>,
      <created by zg, POWCHK disabled, PULCHK disabled
       configuration hash MD5:
       00 E9 B6 7A A2 85 ED C7 34 08 36 98 17 FE 4E 26
       data hash MD5: 32K
       7F 0F 9F 96 17 FE 3A A5 DA 24 24 A3 F7 5E 10 D0>)
(   2,<2022-03-10 11:01:30.26 +0400>,<she>,<DPX200>,
      <Start of raw data processing
       efp BC_mod = 2 LB = 1 FT_mod = 6 PKNL = 1 PHC0 = -9183.416 PHC1 = 77.07449 SI = 64K 
       data hash MD5: 64K
       BA 04 14 54 77 05 47 CC 8A E8 B9 ED F6 20 A3 EA>)
(   3,<2022-03-10 11:02:01.25 +0400>,<she>,<DPX200>,
      <pk PHC0 = -46.85653 PHC1 = 133 
       data hash MD5: 64K
       09 B8 FA C2 62 F1 C7 E6 A8 9E 33 F3 5C 34 B6 32>)
(   4,<2022-03-10 11:02:06.76 +0400>,<she>,<DPX200>,
      <abs ABSG = 5 
       data hash MD5: 64K
       FE D1 73 36 D2 16 07 26 26 98 33 39 62 F5 FE DC>)
$$ ##END=
$$ 
$$ hash MD5
$$ 48 44 EA 06 C4 60 6D BA A1 B8 6E 4B 2B AA 42 8C
##$RELAX= 
##$RELAX= 
##$RELAX= 
##$RELAX= 
##$RELAX= 
##$RELAX= 
##$RELAX= 
##$RELAX= 
$$ Bruker specific parameters
$$ --------------------------
##$DU= <F:/spectra>
##$EXPNO= 1
##$NAME= <P31>
##$PROCNO= 1
##$TYPE= <nmr>
##$USER= <she>
##$AMP= (0..31)
100 100 100 100 100 100 100 100 100 100 100 100 100 100 100 100 100 100 
100 100 100 100 100 100 100 100 100 100 100 100 100 100 
##$AQSEQ= 0
##$AQ_mod= 1
##$AUNM= <au_zg>
##$AUTOPOS= <>
##$BF1= 81.014009
##$BF2= 200.13
##$BF3= 200.13
##$BF4= 200.13
##$BF5= 200.13
##$BF6= 200.13
##$BF7= 200.13
##$BF8= 200.13
##$BYTORDA= 1
##$CFDGTYP= 0
##$CFRGTYP= 5
##$CHEMSTR= <none>
##$CNST= (0..31)
1 1 145 1 1 1 1 1 1 1 1 1 1 1 1 1 1 1 1 1 1 1 1 1 1 1 1 1 1 1 1 1 
##$CPDPRG= <waltz16>
##$CPDPRG1= <>
##$CPDPRG2= <waltz16>
##$CPDPRG3= <>
##$CPDPRG4= <mlev>
##$CPDPRG5= <mlev>
##$CPDPRG6= <mlev>
##$CPDPRG7= <mlev>
##$CPDPRG8= <mlev>
##$CPDPRGB= <>
##$CPDPRGT= <>
##$D= (0..31)
0 1 0 0 0 0 0 0 0 0 0 0.03 2e-05 3e-06 0 0 0 0 0 0 0 0 0 0 0 0 0 0 0 0 
0 0 
##$DATE= 1646895687
##$DBL= (0..7)
120 120 120 11 120 120 24 19 
##$DBP= (0..7)
150 150 150 150 150 150 150 150 
##$DBP07= 0
##$DBPNAM0= <>
##$DBPNAM1= <>
##$DBPNAM2= <>
$$ [...]
##$SUBNAM3= <"">
##$SUBNAM4= <"">
##$SUBNAM5= <"">
##$SUBNAM6= <"">
##$SUBNAM7= <"">
##$SUBNAM8= <"">
##$SUBNAM9= <"">
##$SW= 501.771253377433
##$SWIBOX= (0..15)
0 1 3 0 0 0 0 0 0 0 0 0 0 0 0 0 
##$SW_h= 40650.406504065
##$TD= 32768
##$TD0= 1
##$TE= 0
##$TE2= 300
##$TE3= 300
##$TEG= 300
##$TL= (0..7)
0 120 53 12 22 120 120 120 
##$TP= (0..7)
150 150 150 150 150 150 150 150 
##$TP07= 0
##$TPNAME0= <>
##$TPNAME1= <>
##$TPNAME2= <>
##$TPNAME3= <>
##$TPNAME4= <>
##$TPNAME5= <>
##$TPNAME6= <>
##$TPNAME7= <>
##$TPOAL= (0..7)
0.5 0.5 0.5 0.5 0.5 0.5 0.5 0.5 
##$TPOFFS= (0..7)
0 0 0 0 0 0 0 0 
##$TUNHIN= 0
##$TUNHOUT= 0
##$TUNXOUT= 0
##$USERA1= <user>
##$USERA2= <user>
##$USERA3= <user>
##$USERA4= <user>
##$USERA5= <user>
##$V9= 5
##$VALIST= <valist>
##$VCLIST= <CCCCCCCCCCCCCCC>
##$VD= 0
##$VDLIST= <DDDDDDDDDDDDDDD>
##$VPLIST= <PPPPPPPPPPPPPPP>
##$VTLIST= <TTTTTTTTTTTTTTT>
##$WBST= 1024
##$WBSW= 4
##$XGAIN= (0..3)
0 0 0 0 
##$XL= 0
##$YL= 0
##$YMAX_a= 8818
##$YMIN_a= -14208
##$ZGOPTNS= <>
##$ZL1= 120
##$ZL2= 120
##$ZL3= 120
##$ZL4= 120
##$ABSF1= 248.5645
##$ABSF2= -253.2056
##$ABSG= 5
##$ABSL= 3
##$ALPHA= 0
##$AQORDER= 0
##$ASSFAC= 0
##$ASSFACI= 0
##$ASSFACX= 0
##$ASSWID= 0
##$AUNMP= <proc_1d>
##$AZFE= 0.1
##$AZFW= 0.5
##$BCFW= 0
##$BC_mod= 2
##$BYTORDP= 0
##$COROFFS= 0
##$CY= -3
##$DATMOD= 1
##$DC= 0
##$DFILT= <>
##$DTYPP= 0
##$F1P= 0
##$F2P= 0
##$FCOR= 1
##$FTSIZE= 65536
##$FT_mod= 6
##$GAMMA= 0
##$GB= 0
##$INTBC= 1
##$INTSCL= 5.30512e-09
##$ISEN= 30
##$LB= 1
##$LEV0= 0
##$LPBIN= 0
##$MAXI= 10000
##$MC2= 0
##$MEAN= 0
##$ME_mod= 0
##$MI= 50
##$NCOEF= 0
##$NC_proc= -7
##$NLEV= 6
##$NOISF1= 182.463
##$NOISF2= 159.3651
##$NSP= 0
##$NTH_PI= 0
##$NZP= 0
##$OFFSET= 248.5645
##$PC= 4
##$PHC0= -9230.272
##$PHC1= 210.0745
##$PH_mod= 1
##$PKNL= yes
##$PPARMOD= 0
##$PSCAL= 0
##$PSIGN= 0
##$REVERSE= no
##$SF= 81.014009
##$SI= 65536
##$SIGF1= 159.3651
##$SIGF2= -187.1042
##$SINO= 113.3802
##$SIOLD= 16384
##$SREGLST= <1H.CDCl3>
##$SSB= 0
##$STSI= 65536
##$STSR= 0
##$SW_p= 40650.406504065
##$SYMM= 0
##$S_DEV= 0
##$TDeff= 32768
##$TDoff= 0
##$TI= <>
##$TILT= no
##$TM1= 0
##$TM2= 0
##$TOPLEV= 0
##$USERP1= <user>
##$USERP2= <user>
##$USERP3= <user>
##$USERP4= <user>
##$USERP5= <user>
##$WDW= 1
##$XDIM= 65536
##$YMAX_p= 319932557
##$YMIN_p= -122565960
$$ End of Bruker specific parameters
$$ ---------------------------------
##NTUPLES= NMR SPECTRUM
##VAR_NAME=  FREQUENCY,     SPECTRUM/REAL,   SPECTRUM/IMAG
##SYMBOL=    X,             R,               I
##VAR_TYPE=  INDEPENDENT,   DEPENDENT,       DEPENDENT
##VAR_FORM=  AFFN,          ASDF,            ASDF
##VAR_DIM=   65536,         65536,           65536
##UNITS=     HZ,            ARBITRARY UNITS, ARBITRARY UNITS
##FACTOR=    0.620285442955139, 1,           1
##FIRST=     20137.2065510759, 0,            0
##LAST=      -20513.1999529892, 0,           0
##MIN=       -20513.1999529892, -122565960,  0
##MAX=       20137.2065510759, 319932557,    0
$$ Real data points
##PAGE= N=1
##DATA TABLE= (X++(R..R)), XYDATA
$$ [...]
44216b45778J72135j622703l340827k231396Q79513K387234J420634N49510Q17446
44207a214232M50922p95777o06432J216198J562557n06043j506000N53558K187456
44198A342207k6499l398976l001076P05701K748317J155842p97753j04240J857051
44189D80574J924646m30130k734759k600622k76201J751740J589706J03597m79767
44180f71216J59408J95682j086499j938021j035542L77008P47603O78081J233479
44171a340017J539628L78773j142002j010805M74296J330745J069067P94025O11705
44162B705415m04988j667370j172408J193079K699108J189806k081623l978214
44154a517195k796966M59384L122316K901783J2123k545955k006905P80404K390998
$$ plain form
44216 -245778 -73643 -1696346 -5037173 -7268569 -6389056 -4001822 -2581188 -2031678 -1214232
44207 -1214232 -763310 -1559087 -2165519 -949321 613236 107193 -1398807 -845249 1342207
44198 1342207 1315708 -2083268 -5084344 -4378643 -1630326 -474484 -1272237 -1376477 480574
44189 480574 2405220 1975090 -759669 -3360291 -3636492 -1884752 -295046 -191449 -671216
44180 -671216 -511808 -316126 -1402625 -3340646 -4376188 -3999180 -3251577 -2573496 -1340017
44171 -1340017 199611 578384 -563618 -1574423 -1100127 230618 1299685 2093710 2705415
44162 2705415 2300427 633057 -539351 653728 3352836 4542642 2461019 -1517195
44154 -1517195 -4314161 -3854777 -732461 2169322 2181445 -364510 -2371415 -1591011 799987
44145G99987J294251n19698q05879O6030N35906L20471k1207n62347j388727j594024
44135a875237o23645K46682l77528j489098r44190J063888K050077R49634m76939
44126a476356o48105l90542r00881j378745n01610J064885J626193J081095N88656
44117i35410K42297p01084j547116o45709J478317K038076J08933j516525l41462
44108a819683J922480J819678p27594k488103j726419k09581N0628l65366P3052
44099c470908J128412J364399N26037k20185j60567J14549j59207q71154j417797
44090c166421j469301r35802L17444K025514K975828J877521p42519k355380j199537
44081b672653J214041J784443j1196j385275l07302J572229J555523o2024p64108
$$ plain form
44145 799987 2094238 1574540 768661 834691 1370597 1691068 1669861 1107514 -281213 -1875237
44135 -1875237 -2498882 -2252200 -2629728 -4118826 -5063016 -3999128 -1949051 -999417 -1476356
44126 -1476356 -2124461 -2515003 -3415884 -4794629 -5296239 -4231354 -2605161 -1524066 -935410
44117 -935410 -693113 -1394197 -2941313 -3587022 -2108705 -70629 38304 -1478221 -1819683
44108 -1819683 102797 1922475 1194881 -1293222 -3019641 -3229222 -3178594 -3543960 -3470908
44099 -3470908 -2342496 -978097 -452060 -672245 -832812 -718263 -877470 -1748624 -3166421
44090 -3166421 -4635722 -5571524 -5254080 -3228566 -252738 1624783 882264 -1473116 -2672653
44081 -2672653 -1458612 325831 314635 -1070640 -1377942 194287 1749810 1687786 923678
44072I23678J73898R26319L82699k30897K58034R33822L62627j138468k043938
44063E47774j606880l38197Q34781J151188M52202l52308p4605R03853O77346
44054B195154j380939l047083j911176J231922L342410K997432J446688k5397
44046D849011j605784l186102l168095o18153K567056L399293J292553j566102
44038A963677l015868k655443r78787J399865L159036K635578j7139k170310j596249
44029a275640O86305J786127O57036j006433j359962l91667P97765J328651Q33677
44020B055859m31691j416264j168462q4086O84883R38277J223981J136821k48585
44011B690733k046619j963138J62753J563679O09053o65081K8587J481010J202345
$$ plain form
44072 923678 1097576 2023895 2406594 2175697 2433731 3367553 3730180 2591712 547774
44063 547774 -1059106 -1397303 -562522 588666 1040868 688560 613955 1517808 2195154
44054 2195154 814215 -2232868 -4144044 -2912122 430288 3427720 4874408 4849011
44046 4849011 3243227 57125 -3110970 -3729123 -1162067 2237226 3529779 1963677
44038 1963677 -1052191 -3707634 -4686421 -3286556 -127520 2508058 2490919 320609 -1275640
44029 -1275640 -589335 1196792 1853828 847395 -512567 -904234 -106469 1222182 2055859
44020 2055859 1624168 207904 -960558 -1044644 -359761 578516 1802497 2939318 2690733
44011 2690733 644114 -1319024 -1156271 407408 1016461 351380 379967 1860977 3063322
44002C063322l44576p74684r354k18978j810120k613314j488075j5447J87241
43993d023985m08912o58834l50649M31963J766098K823061K037097n68711k613310
43984a566182k088539J36251J578036J163070N5571j08263Q91966J702325J004780
43975B769015p44216j743209j280068o44258q28892q01255M00260J361125L85928
43966a125570j296707j222100K82491R40018P44475J535644K520795P55803l010657
43957A24192l788038J90639L903576K597836j415325k859946j175796L79086Q59969
43948a183807J820656K737670J481105r06583r42028J210248J251899k156766
43940C312394m442955j938807K162212K368418j067073k870385n97633K356847
$$ plain form
44002 3063322 2718746 1944062 1934708 1715730 -94390 -2707704 -4195779 -4211226 -4023985
43993 -4023985 -4432897 -5091731 -5442380 -5010417 -3244319 -421258 1615839 1047128 -1566182
43984 -1566182 -3654721 -3518470 -1940434 -777364 -721793 -830056 61910 1764235 2769015
43975 2769015 2024799 281590 -998478 -1642736 -2471628 -3272883 -2872623 -1511498 -1125570
43966 -1125570 -2422277 -3644377 -3361886 -2421868 -1677393 -141749 2379046 3134849 124192
43957 124192 -3663846 -3473207 430369 3028205 1612880 -1247066 -2422862 -2043776 -1183807
43948 -1183807 636849 3374519 4855624 3949041 3007013 4217261 5469160 3312394
43940 3312394 -1130561 -3069368 -907156 1461262 394189 -2476196 -3073829 -716982
43932g16982K252036R9243o67170N16888J051627l81241j729755q65006R70181
43923E29821R66216q49625j465850M62397K179465O56298k738452l737667r29101
43914d926498K321144K332068k63895j661947K02177L314594M203923J866140
43906G387706j486205l082831k240037l98297O63869K45359j023026j726712q88178
43897b548352Q26479J657471J053073N15199J198367J818274O28395j467251k061427
43888A620228j039163o12533j523961k000684j022031J92685Q37553J748086K749241
43879I49421J897610p88143j979480M5653K067305O82688k185005k366469k6177
43870a702597J189127L41580j06382N97910M21936r15088q72801J112255J888400
$$ plain form
43932 -716982 1535054 1634297 967127 1484015 2535642 2154401 424646 -440360 529821
43923 529821 1496037 646412 -819438 -357041 1822424 2478722 -259730 -3997397 -4926498
43914 -4926498 -2605354 -273286 -537181 -2199128 -1996951 1317643 5521566 7387706
43906 7387706 5901501 2818670 578633 180336 844205 1089564 66538 -1660174 -2548352
43897 -2548352 -1721873 -64402 988671 1503870 2702237 4520511 5148906 3681655 1620228
43888 1620228 581065 -31468 -1555429 -3556113 -4578144 -4385459 -3547906 -1799820 949421
43879 949421 2847031 2058888 79408 125061 2192366 2875054 690049 -1676420 -1702597
43870 -1702597 -513470 -171890 -278272 319638 741574 -173514 -1046315 65940 1954340
43861A954340l36806k732751k161538J29797R31490n5511p61569n97207o49306
43852d279061p92949L79182K590389L326641J129890k086001l048708q35583K144948
43843a471252K802201O91979j576110j468916L63743J017895o97290k567027j930398
43834d835175Q10833K866761K643566J244068L73933J08967n01261j442570j592292
43825c23170n95261K85060r8099j025937j009598q2935M60475L68178O28684J201515
43815a91088P30355o88169p97046J226836K678219J035493k033500l012984j510908
43806b562792L425L90480N80280P41144J24909l86516R05671K844760K176802
43797D818163j191151l340471k146621l26970o16698j353539J30379K468968K315674
$$ plain form
43861 1954340 1617534 -1115217 -3276755 -3146958 -2215468 -2270979 -3032548 -3629755 -4279061
43852 -4279061 -5072010 -4692828 -2102439 1224202 2354092 268091 -2780617 -3616200 -1471252
43843 -1471252 1330949 2022928 446818 -1022098 -658355 359540 -337750 -2904777 -4835175
43834 -4835175 -4024342 -1157581 1485985 2730053 3103986 3212953 2711692 1269122 -323170
43825 -323170 -918431 -633371 -731470 -1757407 -2767005 -2849940 -2389465 -2021287 -1392603 -191088
43815 -191088 539267 -148902 -945948 280888 2959107 3994600 1961100 -1051884 -2562792
43806 -2562792 -2559367 -2168887 -1588607 -847463 -722554 -1109070 -203399 2641361 4818163
43797 4818163 3627012 286541 -1860080 -2187050 -2803748 -4157287 -4026908 -1557940 757734
43788G57734j42131j455199k01170J297557P97764r99272k103876j758050m41505
43779d248148J203827K502263K619812J200322r85074k397292j948212r7067J335930
43770h13639R17251p85627j819199j038447Q66254K329241K175962L35133j709379
43761D57550j752121M47327K010186M37640k412935k584356J0353J329077m84812
43752b542091k303744j175235J301379K241152J990372K290852K473639R76702
43744E253026j157143j782577j299052j444456j669845k92926J597575J196471
43736D01073j273796k509313j091759Q06418J240009R42971J075181J180921N40199
43727A311904m11381r27700q00633q7718O68817L19853j154932j656032Q0276
$$ plain form
43788 757734 615603 -839596 -1040766 256791 1054555 55283 -2048593 -3806643 -4248148
43779 -4248148 -3044321 -542058 2077754 3278076 2293002 -104290 -2052502 -2149569 -813639
43770 -813639 103612 -682015 -2501214 -3539661 -2673407 -344166 1831796 2166929 457550
43761 457550 -1294571 -847244 1162942 1600582 -812353 -3396709 -3386356 -2057279 -2542091
43752 -2542091 -4845835 -6021070 -4719691 -2478539 -488167 1802685 4276324 5253026
43744 5253026 4095883 2313306 1014254 -430202 -2100047 -2392973 -795398 401073
43736 401073 -872723 -3382036 -4473795 -3667377 -2427368 -1484397 -409216 771705 1311904
43727 1311904 900523 -27177 -827810 -915528 -246711 73142 -1081790 -2737822 -2657546
43718b657546J689683L81652k117665j752100J224114K402146M09987r97416N29163
43709h87982K175811J140543q54788j297380j222885k270995k803831r44979J295070
43700e671416J135701k597R55612K996331K508476m62409k105106p92144J095866
43691c41686J501811R75015K04555j060538j956261q13770J592975K287775N27954
43682B917830j052226p40207q7575o59880j473046j346892j074349j348241r84890
43673e849476P24075K053709J400497o4495m41818j03373m08945r24602l39757
43664c954185Q94872J171953L06804m73598n66103l40895q1579k366m50467q05819
43654d301383M17394K763538K999806m64365m085337l402766M34795K207413K62395
$$ plain form
43718 -2657546 -967863 -586211 -2703876 -4455976 -3231862 -829716 -419729 -1417145 -887982
43709 -887982 1287829 2428372 1573584 276204 -946681 -3217676 -6021507 -6966486 -5671416
43700 -5671416 -4535715 -4538312 -3582700 -586369 1922107 1459698 -645408 -1437552 -341686
43691 -341686 1160125 2135140 2339695 1279157 -677104 -1490874 102101 2389876 2917830
43682 2917830 1865604 1125397 1037822 377942 -1095104 -2441996 -3516345 -4864586 -5849476
43673 -5849476 -5125401 -3071692 -1671195 -1735690 -2177508 -2280881 -2689826 -3614428 -3954185
43664 -3954185 -3059313 -1887360 -1580556 -2054154 -2620257 -2961152 -3042731 -3045097 -3495564 -4301383
43654 -4301383 -3883989 -1120451 1879355 1414990 -2670347 -6073113 -5638318 -3430905 -3168510
43645c168510j595534m36502J748236J998273Q09186K64325N10616O20623P86999
43636A537712J138062K74067k305815l921959j910016J904970L108050P45458
43628E70529j598827j065818J013436J859648J042346M3838l33818m72021o60659
43619C98654o89972m60907j44672J71050N27877Q85094J067253Q21957J9909r40050
43609A656193j199775m27021N32132O40548P5313j22598L72896Q09115N28489
43600B865292k99659j100956j332541o61995N02678R54384J19760q16612m35059
43591b04708O45397N96782o75234j307011m41691N53680M77396n432j1300k4116
43581c96237o10547j064655o34795J89551P52378J177806J170673k76509k475184
$$ plain form
43645 -3168510 -4764044 -5200546 -3452310 -1454037 -644851 -380526 130090 750713 1537712
43636 1537712 2675774 2949841 644026 -3277933 -5187949 -3282979 -174929 570529
43628 570529 -1028298 -2094116 -1080680 778968 1821314 1865152 1531334 1059313 398654
43619 398654 -291318 -752225 -896897 -725847 -197970 687124 1754377 2576334 2596243 1656193
43609 1656193 456418 29397 561529 1202077 1277390 1154792 1527688 2336803 2865292
43600 2865292 2565633 1464677 132136 -529859 -27181 927203 1046963 230351 -204708
43591 -204708 440689 1037471 362237 -944774 -1386465 -832785 -355389 -360821 -372121 -396237
43581 -396237 -1006784 -2071439 -2706234 -2516683 -1764305 -586499 584174 307665 -2167519
43572b167519k461513Q79159L988079K899518j005682k877870j251047O92949
43564a303926O42618p003K37893K35860j042547j981671q52066J213454J995363
43555h62025J348927N71512J1044o78505j037961n14783K23517M11079O41569
43546A14374J456112J582516k62291k604151k630177j27367K200037K391642J193528
43537C314223J42275l98588p50663r96506j125191j017071j21330J645179K726595
43528C418923J297631j886638l713331k491585k6716R82142K80813m15584k63587
43519b817932j35520p77073j356446m50868J829979L353901K187692p91246k501978
43510a459491j368506P21018J201834L66813L14865J207701J028858q74013k440953
$$ plain form
43572 -2167519 -4629032 -3749873 238206 3137724 2132042 -745828 -1996875 -1303926
43564 -1303926 -661308 -668311 -430418 -194558 -1237105 -3218776 -4070842 -2857388 -862025
43555 -862025 486902 1058414 1069458 390953 -647008 -1161791 -938274 -527195 114374
43546 114374 1570486 3153002 2890711 286560 -2343617 -2470984 -270947 2120695 3314223
43537 3314223 3456498 3057910 2307247 1310741 185550 -831521 -952851 692328 3418923
43528 3418923 4716554 2829916 -883415 -3375000 -3401716 -2419574 -2138761 -2554345 -2817932
43519 -2817932 -2953452 -3730525 -5086971 -5537839 -3707860 -353959 1833733 1042487 -1459491
43510 -1459491 -2827997 -2106979 -905145 -538332 -223467 984234 2013092 1139079 -1301874
43501a301874j878695m0084J176833J228588O99232M3587l60069J6974J043581
43492F28073J703918J336525L17581p44155j423203j068420M77616J671238P23696
43483C622869j490254k278408j301193j063427k343115k480273o6836K037272
43475e363365J167587o59741k15396J487575J282180m61642p45556N20738N56647
43466b430973j031397j640448n90103j10741o38318K99768L015586L939183J292539
43457B105096j483715r62138R37528L63861k207539k996322q17998J698036K333016
43448a030175J616744Q41306K51493k80240n45648n36172o20533q90371r79064
43439b172660n45188M05087J352516J305230k07377k028188k377258j216921k67775
$$ plain form
43501 -1301874 -3180569 -3220653 -2043820 -815232 -116000 -72413 -432482 -415508 628073
43492 628073 2331991 3668516 3986097 3241942 1818739 750319 1227935 2899173 3622869
43483 3622869 2132615 -145793 -1446986 -2510413 -4853528 -7333801 -7400637 -5363365
43475 -5363365 -4195778 -4855519 -5070915 -3583340 -2301160 -2762802 -3508358 -2987620 -2430973
43466 -2430973 -3462370 -5102818 -5692921 -5803662 -6441980 -6142212 -3126626 812557 2105096
43457 2105096 621381 -340757 596771 960632 -1246907 -4243229 -5061227 -3363191 -1030175
43448 -1030175 586569 1427875 1679368 1399128 853480 317308 -303225 -1193596 -2172660
43439 -2172660 -2717848 -2312761 -960245 344985 137608 -1890580 -4267838 -5484759 -5752534
43430e752534l84806o25568l85711l45383m13035Q82241L440381M383648J946893
43421B746126j362475j966213q0616J205659N56853o21329j111964j153488r97359
43412b784806m47258K03450M87193O62754Q22667L2863j806942k479778l09728
43403e619585K543504K628667L84450n77676P65053J503026l4572j401240j38941
43394E2686K110898K039833n40586k716792k425208m52780J203054J504890Q09582
43385A585577N5291j04966M09574J295332J913937J348439o04996k390200k117095
43376A390893n18594m46599k329534k747340K67870L231321K003800j562781k281918
43367b992882K96784J628258j29909j601129n21420O08461n27354j900386q30658
$$ plain form
43430 -5752534 -6137340 -6762908 -7148619 -7494002 -7907037 -7024796 -3584415 799233 2746126
43421 2746126 1383651 -582562 -663178 542481 1099334 478005 -633959 -1787447 -2784806
43412 -2784806 -3232064 -3028614 -2541421 -1878667 -1056000 -1023137 -2830079 -5309857 -5619585
43403 -5619585 -3076081 -447414 -62964 -640640 124413 1627439 1592867 191627 52686
43394 52686 2163584 4203417 3662831 946039 -1479169 -1931949 -728895 775995 1585577
43385 1585577 1640868 1535902 1945476 3240808 5154745 6503184 5898188 3507988 1390893
43376 1390893 872299 425700 -1903834 -4651174 -4383304 -1151983 851817 -710964 -2992882
43367 -2992882 -2696098 -1067840 -1197749 -2798878 -3320298 -2711837 -3239191 -5139577 -5970235
43358e970235J629372K833917K223561N28633j771384l098116j303913K142338
43350b785827K454750j113915k777969Q65278M278104J262097m338819l986695
43342f142996J857794M316157L65444k671284M73624M547751K757242k359065
43334C144667l625393n76382J055353o97729j609524Q28475L093944J451515k158094
43325I06832l102147n54843J968273J617630p29011k401749k080727m06687J345834
43316c436595K225708J718903l6195j920803k426667j106355Q33060J761898J241424
43307a145622J41735m95717l20056K80915N72487J80045l28307l8422Q88867J201704
43297I37629M25633l09012j15703J94274k21051l76283Q43281K117005J253181
$$ plain form
43358 -5970235 -4340863 -1506946 716615 1245248 -526136 -3624252 -4928165 -2785827
43350 -2785827 -331077 -1444992 -4222961 -3357683 920421 2182518 -2156301 -6142996
43342 -6142996 -4285202 30955 396399 -2274885 -1801261 2746490 5503732 3144667
43334 3144667 -480726 -1057108 -1755 -699484 -2309008 -1480533 1613411 3064926 906832
43325 906832 -2195315 -2750158 -781885 835745 106734 -2295015 -4375742 -4782429 -3436595
43316 -3436595 -1210887 508016 471821 -1448982 -3875649 -4982004 -4148944 -2387046 -1145622
43307 -1145622 -1003887 -1499604 -1819660 -1538745 -966258 -786213 -1114520 -1152942 -264075 937629
43297 937629 1363262 1054250 938547 1132821 911770 535487 1378768 3495773 4748954
43288D748954j131070k192407j211440m91624j242544j570111o7916J377913O84420
43279a095825p25037j90618J627452J657200o13498k235029j272153N93982J016300
43270a237226K79177M9225M23705J89654o84820p56975N61575J897950J805666
43261B527931P54417K59854N56743M03034o77103j314983l92024Q15750J85100
43252C118719j926496k807397j212992Q55776J221970O14533R76323K032164J832137
43243D704737J61325j012299o86321k10056p97968j529597r50834O86513J934241
43234B299741J918921O88158j203160k538881j983889R4648J404326O22895n34873
43225G67886K28974K190910K541628N32829j560172j826078r67076n26858p18787
$$ plain form
43288 4748954 3617884 1425477 214037 -277587 -1520131 -3090242 -3158158 -1780245 -1095825
43279 -1095825 -1820862 -2011480 -384028 1273172 659674 -1575355 -2847508 -2253526 -1237226
43270 -1237226 -958049 -908824 -485119 -295465 -980285 -1737260 -1175685 722265 2527931
43261 2527931 3282348 3542202 4098945 4501979 3824876 2509893 2117869 2933619 3118719
43252 3118719 1192223 -1615174 -2828166 -1972390 -750420 -135887 840436 2872600 4704737
43243 4704737 4866062 3853763 3167442 2957386 2159418 629821 -321013 365500 2299741
43234 2299741 4218662 4906820 3703660 1164779 -819110 -724462 679864 1302759 767886
43225 767886 996860 3187770 5729398 6262227 4702055 2875977 1908901 1382043 663256
43216F63256r57846j040532p78889K21388J404172J239102m15964j293515K57419
43207g01409K325161J706886j327176k995171j186133J592449J805718k60322
43199I60003j358422k92436M84426j008524k835104j883672J205317K681754J200903
43190h45755m17233j0058O00198n27288j313710P60824L157629J435943k978171
43181a37621l965452k16405K557978R47270q75657J053604L285052J121289k685158
43172A084900k279741J341733K210852m31833j627734q2808n1679k569102k631855
43163e037267J900919N549687L536027q65194k042350m12958N3216j041730j231020
43154D09330m08576k81670m71475K60069N84814j121792k681843r73567K348933
$$ plain form
43216 663256 -294590 -1335122 -2114011 -1892623 -488451 750651 334687 -958828 -701409
43207 -701409 1623752 3330638 2003462 -991709 -2177842 -585393 1220325 960003
43199 960003 -398419 -690855 -206429 -1214953 -4050057 -5933729 -4728412 -2046658 -845755
43190 -845755 -1262988 -1273046 -672848 -1200136 -2513846 -1753022 1404607 2840550 -137621
43181 -137621 -4103073 -4319478 -1761500 -814230 -1689887 -636283 2648769 3770058 1084900
43172 1084900 -1194841 146892 2357744 1925911 298177 215369 163690 -2405412 -5037267
43163 -5037267 -3136348 2413339 5949366 5084172 3041822 2628864 2682080 1640350 409330
43154 409330 754 -280916 -752391 -492322 92492 -1029300 -3711143 -4684710 -2335777
43145b335777K907327O35119l79068R46931J018824j828239m006532k222095J514714
43136c748796L149163K081108O64529J47677j52643o03499n87193L628K50396
43127A204370m23234j219947q61183O33103J632402Q93816n83503q69823l9453
43118C66548N7835p99955n22000J484598K542870P74448j553615j419975L85951
43109A316705J190226R69931J338562J594512o0233k326529k237049l81946j77886
43100A226293j829381j802645Q34348K393739O76974j340909m88416J703131K075713
43091C448847P78604r3098m42545j423909k339253j496345O37807J857587J411305
43082B339000N81393L16065J87428k57934o25609m50937M1038K15677k73019j094022
$$ plain form
43145 -2335777 571550 1206669 827601 1774532 2793356 965117 -3041415 -5263510 -3748796
43136 -3748796 -599633 1481475 2146004 2293681 2141038 1537539 950346 953974 1204370
43127 1204370 781136 -438811 -1299994 -666891 965511 1859327 1275824 406001 366548
43118 366548 424383 -375572 -897572 587026 3129896 3904344 2350729 930754 1316705
43109 1316705 2506931 3476862 4815424 6409936 6349703 4023174 1786125 1404179 1226293
43100 1226293 -603088 -2405733 -1571385 822354 1499328 158419 -329997 1373134 3448847
43091 3448847 4227451 4134353 3691808 2267899 -71354 -1567699 -929892 927695 2339000
43082 2339000 2920393 3236458 3423886 3165952 2540343 2089406 2130444 2346121 2073102 979080
43072I79080j535422j298733o63559L25087J889021L138160K185232r32467l096032
43063I90367k059307R577j93245j740118j108205J724255L183231K010661P20060
43054C537276O05366l4867j552587j557518L62009J088264o69096j921582q04388
43045i47123J33044r45332j409193O63752K074799m7127k418665p32041K638689
43036i89197K207115j532304k998274n06305J884090J530516M38535M64999L62989
43027H62164q84965j817951j130931M60881J897203K663745J874395n73562k134609
43018A216370l74349K588339K354557r55636k607505o16548J500595Q16465p96404
43009C125884q41077l40723q15093p53265J334211L139262J677467j640216k778581
$$ plain form
43072 979080 -556342 -1855075 -2518634 -2193547 -304526 2833634 5018866 4086399 990367
43063 990367 -1068940 -1059363 -1252608 -2992726 -4100931 -2376676 806555 2817216 3537276
43054 3537276 4142642 4107775 2555188 997670 1359679 2447943 1778847 -142735 -947123
43045 -947123 -814079 -1759411 -3168604 -2504852 -430053 -477180 -2895845 -3627886 -989197
43036 -989197 1217918 -314386 -3312660 -3818965 -1934875 -404359 34176 499175 862164
43027 862164 -22801 -1840752 -2971683 -2510802 -613599 2050146 3924541 3350979 1216370
43018 1216370 842021 3430360 5784917 4829281 2221776 1605228 3105823 3922288 3125884
43009 3125884 2284807 1944084 1128991 375726 1709937 4849199 6526666 4886450 2107869
43000B107869r14925Q75927L94236j197651j848848j221460k78367J31236k19931
42991b171914q41183p55131L93272J496200J043429r05104k423072j654019J089714
42982d727808L312997K738052r9545k225411j694962J49224Q72538M05787N47748
42973g21380J605874J831662M31901j022841r84511k1206L85928j66475j022563
42964C16389j429964r08957L84483J347293R98591m4738l62824N8591m7395q76651
42954e65182j151671l77731L61472L93699M54076J026813J347231P56733m01731
42945A843709j671648k702394k431600j17059K482644K413866k12512j811394
42937b206388l39805J824080J631231l62262j475085p39780Q12320K138549K492891
$$ plain form
43000 2107869 1192944 2068871 2463107 1265456 -583392 -1804852 -2083219 -1951983 -2171914
42991 -2171914 -3013097 -3768228 -3374956 -1878756 -835327 -1740431 -4163503 -5817522 -4727808
42982 -4727808 -1414811 1323241 1223696 -1001715 -2696677 -2547453 -1674915 -1269128 -721380
42973 -721380 884494 2716156 3148057 2125216 1140705 1119499 1505427 1338952 316389
42964 316389 -1113575 -2022532 -1638049 -290756 707835 663097 300273 358864 311469 -565182
42954 -565182 -1716853 -2094584 -1733112 -1339413 -885337 141476 1488707 2245440 1843709
42945 1843709 172061 -2530333 -4961933 -5078992 -2596348 -182482 -394994 -2206388
42937 -2206388 -2546193 -722113 909118 546856 -928229 -1668009 -855689 1282860 3775751
42928C775751J159614j230650k416162j290871L51554N00859k39583l69187k73856
42919c2531r37408j403744k38819J548609J781785N49673k70956k45202l92294
42910C59113n24471M20416J550163O78709j802200k791036j105614O59112K91884
42901b263924o93182O8530J677174J396750q33596k040266m52633K088975K746065
42892A693893J194273o05933j221544r29781l77427M04097J184247J067229j59860
42883B249194j198358r90470m45416q73156j471718m55789J677005K445080J117631
42874B054003l58187o83968q00852j216672n81069J456010K603242J287745n64348
42865C195904m46558R54778J354348N10262k74787p46061j201819q80895M96593
$$ plain form
42928 3775751 4935365 3704715 1288553 -2318 349236 850095 610512 241325 -32531
42919 -32531 -969939 -2373683 -2612502 -1063893 717892 1267565 996609 751407 359113
42910 359113 -165358 255058 1805221 2483930 681730 -2109306 -3214920 -2555808 -2263924
42901 -2263924 -2957106 -2888576 -1211402 185348 -648248 -2688514 -3141147 -1052172 1693893
42892 1693893 2888166 2282233 1060689 130908 -246519 157578 1341825 2409054 2249194
42883 2249194 1050836 60366 -385050 -1258206 -2729924 -3185713 -1508708 936372 2054003
42874 2054003 1695816 1011848 210996 -1005676 -1586745 -130735 2472507 3760252 3195904
42865 3195904 2749346 3704124 5058472 5568734 5293947 4547886 3346067 2465172 2961765
42856B961765J067327m59708j939922p74685J722243K443527J597335J690611
42848H308493K475952J477388q35091j190323Q57499K150379J502340J302254
42840A6048891K354995K007712o45248k387692j255118J01317o09490j231166
42832A4384201L32906J495722o57138l586455k921346L31619J415607o14522k157304
42823H023290j490349q69874j668314k016704o40070P98871R02570Q89395J816605
42814E745420K141734L11337k170085k629996j056844J23501l71501j207533p46634
42805A39399N36430P82577n46779j676311q04144J193717J627420l12970k273421
42796a334082j961649j81240O98095O7998q02658j064504q68029k53898P27315
$$ plain form
42856 2961765 4029092 3569384 1629462 854777 2577020 5020547 6617882 8308493
42848 8308493 10784445 12261833 11426742 10236419 11093918 13244297 14746637 16048891
42840 16048891 18403886 20411598 19766350 17378658 16123540 16224857 15615367 14384201
42832 14384201 14717107 16212829 15555691 11969236 9047890 9379509 10795116 10180594 8023290
42823 8023290 6532941 5663067 3994753 1978049 1337979 2136850 3039420 3928815 5745420
42814 5745420 7887154 8198491 6028406 3398410 2341566 2465067 2093566 886033 139399
42805 139399 675829 1458406 911627 -764684 -1568828 -375111 1252309 939339 -1334082
42796 -1334082 -3295731 -3476971 -2778876 -2710878 -3513536 -4578040 -5446069 -5699967 -4972652
42787d972652J199435M62959n74609n78495J34662L86510L02724P33028J259234
42778a647204J043876Q94603J821325K311176L74780k149710j435375J859695
42770C073166K582619r77089l880487k039606J441490J444615j157206j708631
42762a221129K33417P08668j490136k915558j452550N63039Q12205N18746J303377
42753b939921J880562O22075j075853q94503O14839J125734K99468k06994J89452
42744c85141M69094K78094L51081O21910J27267r02190r49810K39710R96967L73743
42734A220725m59163m45019l24575p18802m90980J009273J823951J57385j999650
42725b26855j296619J424636J777144j369466l615425j440593K497607L361286
$$ plain form
42787 -4972652 -3773217 -3310258 -3884867 -4463362 -4328700 -3942190 -3639466 -2906438 -1647204
42778 -1647204 -603328 291275 2112600 4423776 4798556 2648846 1213471 3073166
42770 3073166 5655785 4678696 798209 -1241397 200093 1644708 487502 -1221129
42762 -1221129 -987712 -279044 -1769180 -4684738 -6137288 -5574249 -4762044 -4243298 -2939921
42753 -2939921 -1059359 -437284 -1513137 -2407640 -1792801 -667067 -367599 -574593 -385141
42744 -385141 83953 362047 713128 1335038 1462305 560115 -389695 -149985 846982 1220725
42734 1220725 761562 316543 -8032 -726834 -1217814 -208541 1615410 1772795 -226855
42725 -226855 -1523474 -98838 1678306 308840 -3306585 -4747178 -2249571 1111715
42717A111715Q93723j256888j289160n74177q3370O60515J128815N057j647012
42708a050782j048441J519217K286418p2676j808581P5142K775759K031298j105000
42699C602354k175882n25425J95462j387524k063865K91916K808824J960312j012491
42690A693681k127763n39982P89954j08874j651758j574681j82176N95150R7654
42681c008795n96882n42535J49626J157402K325734K860085J560092j187004k816429
42672i8706j461281J295533K256303Q26322n62551k66458N60485M30564j68943
42663B811268j72400J67209K65698N66920J319613J365974j01935j744275j829957
42654B648115p66395j05693r7674j28566m49908j262764j160920R35417L129095
$$ plain form
42717 1111715 2005438 748550 -540610 -1114787 -1198157 -537642 591173 596230 -1050782
42708 -1050782 -2099223 -580006 1706412 1633736 -174845 -99703 2676056 4707354 3602354
42699 3602354 1426472 901047 1096509 -291015 -2354880 -2062964 745860 2706172 1693681
42690 1693681 -434082 -974064 -184110 -292984 -1944742 -3519423 -3701599 -3106449 -3008795
42681 -3008795 -3605677 -4148212 -3998586 -2841184 -515450 2344635 3904727 2717723 -98706
42672 -98706 -1559987 -264454 1991849 2818171 2255620 1989162 2549647 2980211 2811268
42663 2811268 2638868 2806077 3071775 3638695 4958308 6324282 6222347 4478072 2648115
42654 2648115 1881720 1776027 1678353 1549787 1099879 -162885 -1323805 -388388 2740707
42645B740707K690812L36312p13687K48610O96514n06033j301310l80653L90783
42636D202055o60347j965230j313564M83361Q97187n88190k122910k124849o71125
42627c863612J153554K066838J311282m52259j495055r38406K83378Q11469M49984
42618f72827L545K47650J182894J697039M85322j733190k109657L83586K377311
42609A861673M73842l066030l145692K24010J920926J69688q18351J337261K737055
42600A694382K57006k402771q27204K334791J699499j867453l000379o57045J215440
42591a553734R19728O82077J200602M93880j217380j069714R44640J288694r22440
42582G66353k100196l61103J337681N39913p60249k64913O10715N55o50873N51589
$$ plain form
42645 2740707 5431519 5767831 5054144 5302754 5999268 5493235 4191925 3811272 4202055
42636 4202055 3541708 1576478 262914 746275 1643462 1055272 -1067638 -3192487 -3863612
42627 -3863612 -2710058 -643220 668062 215803 -1279252 -2217658 -1934280 -1122811 -672827
42618 -672827 -669282 -421632 761262 2458301 2943623 1210433 -899224 -515638 1861673
42609 1861673 2335515 -730515 -3876207 -3652197 -1731271 -1561583 -2379934 -1042673 1694382
42600 1694382 1951388 -451383 -1278587 1056204 2755703 888250 -2112129 -2769174 -1553734
42591 -1553734 -634006 48071 1248673 1742553 525173 -544541 400099 1688793 766353
42582 766353 -1333843 -1694946 -357265 182648 -577601 -842514 -231799 -231244 -882117 -330528
42572c30528K206532K039739P07724R7645j4446o41536j001388k71619K8829j436933
42562A384019k702449j261615J503613K164413M59779q62142p01512m82032o29857
42553a127783J39154J611442J587369m19140j924844j178319L87621Q02302M13827
42544B91629M45441O14502J47696k81809K11251N44830q77037k900840k432567
42535d236904Q98927L310175J666604k050004l300903j030449J500335J779680
42527a462539J009065J059910J246745J51153j365559j461573l60336L33892M05919
42518d43323O82728P95405l8668o83069N16440K375203K062799l85506k000846
42509B881163j536181p65569o31538K04213J892025K171497K32163j583310j673503
$$ plain form
42572 -330528 1876004 3915743 4623467 4721112 4706666 4065130 3063742 2792123 2820952 1384019
42562 1384019 -1318430 -2580045 -1076432 1087981 1547760 685618 -15894 -497926 -1127783
42553 -1127783 -988629 622813 2210182 1791042 -133802 -1312121 -924500 -122198 291629
42544 291629 737070 1351572 1499268 1217459 1428710 1973540 1096503 -1804337 -4236904
42535 -4236904 -3337977 -27802 1638802 -411202 -3712105 -4742554 -3242219 -1462539
42527 -1462539 -453474 606436 1853181 2004334 638775 -822798 -1183134 -849242 -443323
42518 -443323 239405 1034810 996142 313073 829513 3204716 5267515 4882009 2881163
42509 2881163 1344982 579413 -52125 152088 2044113 4215610 4447773 2864463 1190960
42500A190960j440732j832326j213877R92580K162356P64767o76744l9907N68795
42491D75872q44413j645683Q66315L540798J701101k734883l624047j24873K351827
42482c7986Q40943j469920j324628J66024R50076J313408J679960J015287n65165
42473B567999j030059p8783j72523k103091l012997j045326J344040J347303J61391
42464b022046M56804J873030K128332R20155j86395n79065p99833q83821o31648
42455B75513o26178j135192j041480L65269J665779J208247l49791j193951r69101
42446a800885m42978L06038J382294J755071N37859j162124j635649j093534q67132
42437c021040q63541M4229J632771K482224K187902J462972M60853r72146j855572
$$ plain form
42500 1190960 -249772 -2082098 -3295975 -2303395 -141039 623728 -53016 -92923 475872
42491 475872 -368541 -2014224 -1147909 2392889 4093990 1359107 -2264940 -2389813 -37986
42482 -37986 802957 -666963 -1991591 -1825567 -875491 437917 2117877 3133164 2567999
42473 2567999 1537940 1459157 1286634 -816457 -3829454 -4874780 -3530740 -2183437 -2022046
42464 -2022046 -1565242 307788 2436120 3356275 3169880 2590815 1790982 907161 275513
42455 275513 -350665 -1485857 -2527337 -2162068 -496289 711958 362167 -831784 -1800885
42446 -1800885 -2243863 -1937825 -555531 1199540 1737399 575275 -1060374 -2153908 -3021040
42437 -3021040 -3884581 -3840352 -2207581 274643 2462545 3925517 4386370 3414224 1558652
42428A558652j170023m0315l42986j354285o07486J788258K854779J491597J96277
42419D374468O02910O56465j353485k944659j092392K280785K508146q83644l430251
42410G18343k185917P12927J924854J135675q8798r25475r48518M54013K328174
42401C125278K056472p50867k534312p36029J762070Q39205k014075j787644J769337
42392A729435L354344M96502k559807j695697J000917J380976k67701q82368m2664
42383B513937M82235O56054J482824J843464J77223j779996j180898Q30931O93535
42374E719309j362542j596539N18936J124481j174429k465165j854L042937K652962
42365F458096J65195m55875J056032J674222L27643r20517l98321J254762K412849
$$ plain form
42428 1558652 388629 348314 5328 -1348957 -1956443 -168185 2686594 4178191 4374468
42419 4374468 4977378 5633843 4280358 1335699 243307 2524092 5032238 4148594 718343
42410 718343 -1467574 -754647 1170207 2305882 2217084 1291609 343091 797104 3125278
42401 3125278 5181750 4430883 1896571 1160542 2922612 3761817 1747742 -39902 1729435
42392 1729435 5083779 5580281 3020474 1324777 2325694 3706670 3438969 2556601 2513937
42383 2513937 2996172 3652226 5135050 6978514 7155737 5375741 4194843 5025774 5719309
42374 5719309 4356767 2760228 3279164 4403645 3229216 764051 762197 3805134 6458096
42365 6458096 6623291 6167416 7223448 8897670 9225313 8304796 7906475 9161237 11574086
42356A1574086J825215o30689l005728k388275J251728L911080K468892q48237
42348A4158072j641666M12186J818570J057990M60220J901950L876393M062905
42340B6106620K475577O80562n03391j211459j432576q22322O33949K147035K315988
42331C0389983L33657k561662l779440k432417o37079n31331j292863r75085m7350
42322A8466413m69440j891775j828739J69257J430448J20810k162420k914874
42314A0919680j840186k71242P68036P60739m45721j822377j673125p2967P01703
42305G024540o51738k404574k301555o60010O32701R11047P36727K26667o46368
42296B867437q82769L63396J904124J790908J79584j008897j084511j148041j567802
$$ plain form
42356 11574086 13399301 12768612 9762884 7374609 8626337 12537417 15006309 14158072
42348 14158072 12516406 12928592 14747162 15805152 16265372 18167322 22043715 26106620
42340 26106620 28582197 29262759 28759368 27547909 26115333 25293011 25926960 28073995 30389983
42331 30389983 30723640 28161978 24382538 21950121 21313042 20781711 19488848 18513763 18466413
42322 18466413 17996973 16105198 14276459 14445716 15876164 15996974 13834554 10919680
42314 10919680 9079494 8808252 9576288 10337027 9891306 8068929 6395804 6322837 7024540
42305 7024540 6372802 3968228 1666673 1006663 1639364 2550411 3287138 3513805 2867437
42296 2867437 1984668 2348064 4252188 6043096 6222680 5213783 4129272 2981231 1413429
42287A413429j128246O37726K189780K043667O61647n87708j097494r43021m66919
42278B722861n91970j992503l228183j696813K286982M581570K489172j055681
42270C515435j465528Q29450J397593j027505k620680o60446K220879K174548
42262D363746l39571j878364j038806N41388J175890P34504k27315j032171r22779
42253A376522J9555N26951r1742p30708l03253M11792L05696j1040L63069M89590
42243B356432p32506j933415j078292R54047J562171N59828m0850J09970l77179
42234A380206j015969K16682K483543K350306l82336j582779M76209J831253n87897
42225E169218l283473j528374K701888L395987l89460l363652j912207J471409
$$ plain form
42287 1413429 285183 922909 3112689 5156356 5818003 5230295 4132801 3189780 2722861
42278 2722861 2130891 138388 -3089795 -4786608 -2499626 2081944 4571116 3515435
42270 3515435 2049907 2879357 4276950 3249445 628765 -31681 2189198 4363746
42262 4363746 4024175 2145811 1107005 1648393 2824283 3558787 3331472 2299301 1376522
42253 1376522 1396077 1923028 1831286 1100578 797325 1209117 1514813 1503773 1866842 2356432
42243 2356432 1623926 -309489 -1387781 -433734 1128437 1688265 1647415 1757385 1380206
42234 1380206 364237 580919 3064462 5414768 5032432 3449653 3925862 5757115 5169218
42225 5169218 1885745 357371 3059259 6455246 6065786 2702134 789927 2261336
42217B261336K659339J068850j149349k308285j917874k17123J505615J535625
42209C438134p6171j054895K66080K534409K905279N26987k460884l425649k078889
42200E74401l57351L29503P51539J968820K784669J116069k157286l293067p36354
42191I80943K296256K163307k30450j266628k5818J002975J04969j517961k040039
42182A467554j323268m13783j36750n01694o18808N20230K356823K751062Q64107
42173D965473j127181q96118O87789J222422N52672J65493j88155j873763l722265
42164b13633k804616N53141K294498O22652j031811O48337L497422L054088o37207
42155E982871k978935j290402J776632K154529m54278k798534k461012m01729
$$ plain form
42217 2261336 4920675 5989525 4840176 2531891 614017 396894 1902509 3438134
42209 3438134 3361963 2307068 2573148 5107557 8012836 8539823 6078939 2653290 574401
42200 574401 217050 546553 1298092 3266912 6051581 7167650 5010364 1717297 980943
42191 980943 3277199 5440506 5210056 3943428 3917610 4920585 5025554 3507593 1467554
42182 1467554 144286 -269497 -406247 -907941 -1526749 -1006519 1350304 4101366 4965473
42173 4965473 3838292 2942174 3629963 4852385 5405057 5570550 5382395 3508632 -213633
42164 -213633 -3018249 -2465108 -170610 452042 -579769 68568 3565990 6620078 5982871
42155 5982871 3003936 1713534 3490166 5644695 5190417 2391883 -69129 -470858
42147d70858R35561P57602K53837M36580R83974J310078J437079J267820K70730
42138G182403j265379j850786p29678Q42372J306171O98438j62208r94608j360001
42129C666724l69595J314096J160243j383445k847467m71884K992104K933523
42121F994299j86705j938833j061855n22260j419749j152424J126316K309211
42113D148000P65060n78453O34772K010007O62222j783548k167345j013240q42061
42104A835414j372836n08784J219810J259871m32984j152836J57197J410580Q01988
42095C217420p97189j579574j072188k4724O70053N73370J06606K79355J249463
42086B622592J707916O89248p37651q67090J69596P10477n9730j308636j855667
$$ plain form
42147 -470858 464703 1222305 1476142 1912722 2896696 4206774 5643853 6911673 7182403
42138 7182403 5917024 4066238 3336560 4178932 5485103 6183541 6021333 5026725 3666724
42129 3666724 3297129 4611225 5771468 4388023 1540556 1068672 4060776 6994299
42121 6994299 6807594 4868761 3806906 3284646 1864897 712473 1838789 4148000
42113 4148000 4913060 4334607 4969379 6979386 7641608 5858060 3690715 2677475 1835414
42104 1835414 462578 -46206 1173604 2433475 2000491 847655 1004852 2415432 3217420
42095 3217420 2420231 840657 -231531 -256255 413798 987168 1093774 1373129 2622592
42086 2622592 4330508 5019756 4282105 3415015 3584611 4295088 4235358 2926722 1071055
42077A071055j243858J61542J334378J337585N58350M27107J303460J767650Q04945
42068G522214o48083j352530j476810j412802n36890J174017J888624L87003j524051
42059D020692j374142K40287P80050j55500n78048L38103J126799O85396k66529
42050D817108q37623j090898j043470l21582O92733R77409N71358O11993J273358
42041E650386J321662L35477k97069M16689J285357O71430r15029j462450m06163
42032F600290N00214l25288j961436k133027l46812J379768J332191L95634M28815
42023E870349J358604J624360R48499N31885N44931k24375j742940k123777n91869
42014F195667J108461J402570R19555O57131K86140l30403j73255P66983O60956
$$ plain form
42077 1071055 -172803 -11261 1323117 2660702 3219052 3646159 4949619 6717269 7522214
42068 7522214 6874131 5521601 4044791 2631989 2095099 3269116 5157740 5544743 4020692
42059 4020692 2646550 2886837 3666887 3511387 2933339 3271442 4398241 5083637 4817108
42050 4817108 3979485 2888587 1845117 1523535 2216268 3193677 3765035 4377028 5650386
42041 5650386 6972048 7307525 7010456 7427145 8712502 9383932 8468903 7006453 6600290
42032 6600290 7100504 6775216 4813780 2680753 2333941 3713709 5045900 5441534 5870349
42023 5870349 7228953 8853313 9801812 10333697 10878628 10654253 8911313 6787536 6195667
42014 6195667 7304128 8706698 9626253 10283384 10569524 10239121 10065866 10832849 11493805
42005A1493805r87828j745281J1600K172560K211033J013663N61610K43379j140242
41996A3834299j981281m17180J579206R19335j253256j418470K78545O69915m73248
41987A1737865k95127J405457J613013j02198m97367J345463K061492j0125j686241
41978A5572232l59466J694328J431196r7577j58044J219440K179223K159389J563481
41969B5204202L91395p62352n23335Q04817J166751N39094J421903L793570L722547
41960C5758592j67073l125460j121752K634848K891584P40203R69023L338381
41952D1918346L116482l57555k195658J34735L201763L600458K578320K434277
41944E4431168K575021J889463J602471K799684L747772K616331Q46560R35837
$$ plain form
42005 11493805 10505977 8760696 8772296 10944856 13155889 14169552 14731162 14974541 13834299
41996 13834299 11853018 11435838 13015044 13934379 12681123 11262653 11541198 12211113 11737865
41987 11737865 11442738 12848195 14461208 14359010 13861643 15207106 17268598 17258473 15572232
41978 15572232 15212766 16907094 18338290 18240713 18082669 19302109 21481332 23640721 25204202
41969 25204202 25595597 24833245 24309910 25114727 26281478 26820572 28242475 32036045 35758592
41960 35758592 35591519 32466059 31344307 33979155 36870739 37610942 38579965 41918346
41952 41918346 45034828 44677273 42481615 42616350 45818113 49418571 51996891 54431168
41944 54431168 57006189 58895652 60498123 63297807 67045579 69661910 70508470 71444307
41936G1444307K381397K694602J500058P88305J335565J474210l3403j853814
41928G9731227j870773p1749J449540J149170j42490m89411L90198N85308j231533
41919G9499487l394380l070808l20951J465171r0302l101744l874052j644660
41911F5467761Q13723J021168n24957j848991k119994j801794j267056n92703
41903E9147157k29243n34763q32713k91599L13019o23513k672079l254131j392895
41894D9629240M16742j77687j699862j244434P52973J245030m59049j822102j454169
41885D5186682r99038j613946j693181J58456K406881K826916J516911j10151
41877D7679530j505231k379773j775018K84130J796056J327703P938p05608j281298
$$ plain form
41936 71444307 73825704 76520306 78020364 78808669 80144234 81618444 81585041 79731227
41928 79731227 77860454 77788705 79238245 80387415 80244925 79755514 80145712 80731020 79499487
41919 79499487 76105107 73034299 72713348 74178519 74088217 70986473 67112421 65467761
41911 65467761 66281484 67302652 66777695 64928704 62808710 61006916 59739860 59147157
41903 59147157 58917914 58383151 57550438 57258839 57571858 56948345 54276266 51022135 49629240
41894 49629240 50045982 49868295 48168433 46923999 47676972 48922002 48462953 46640851 45186682
41885 45186682 44187644 42573698 40880517 41038973 43445854 46272770 47789681 47679530
41877 47679530 46174299 43794526 42019508 42303638 44099694 45427397 45435335 44729727 43448429
41868D3448429k145149j769737N36546K066596L16423k505636k321298N97338
41860C8223512K209740Q95768r93511j661147j879776k100875j459180l96997
41852C2837534n95510j515039q06493R74921L99256k606081l278864N80498M247021
41843C0237243K883154j102855k131283L9657J162163O6151k93840J046478J404043
41834C3310911k43626j185467Q6587J075903k89324j980454j396912L16770O42832
41825C0337220J68507J143232K895929K460462m51660k567978j765641K31432
41817C2451503R45147M67346J89525J95800j99354o28509k93888L80238M50777
41808C3958585K33024O55043J228870N23110j313973k280234j194679P84181J810314
$$ plain form
41868 43448429 41303280 39533543 40070089 42136685 42453108 39947472 37626174 38223512
41860 38223512 40433252 41329020 40335509 38674362 36794586 34693711 33234531 32837534
41852 32837534 32242024 30726985 29920492 30895413 31294669 28688588 25409724 25990222 30237243
41843 30237243 33120397 32017542 29886259 29925916 31088079 31154230 30860390 31906868 33310911
41834 33310911 33067285 31881818 31968405 33044308 32754984 30774530 29377618 29694388 30337220
41825 30337220 30505727 31648959 34544888 37005350 36553690 33985712 32220071 32451503
41817 32451503 33396650 33863996 34053521 34249321 34049967 33421458 33127570 33507808 33958585
41808 33958585 34191609 34846652 36075522 36598632 35284659 33004425 31809746 32593927 34404241
41799C4404241J322811l0878j241593j294078J21666J824693K249964J623457
41791C8980283J591804K420079K516555J449083J142139K636424L860969K713555
41783E7310891M76528m06332m50315j963750m654846n785883m649292l577419
41775C6299582l861000l761813j883558J44779J90359j139571j766692j307635
41767B2914451r76463j123901q26591J90376P96389L4459j436068k018808j040918
41758A6512926M61767R90038L86672j77755n8078O496n94617j129609q60654m61942
41748A5075244o61202n84720O08069J434988k1717k466020k571392O5465K189376
41739A3068091J783866O66183R21799J641958J138315J5700k55313o5917o76032
$$ plain form
41799 34404241 35727052 35696174 34454581 33160503 33282169 35106862 37356826 38980283
41791 38980283 40572087 42992166 45508721 46957804 48099943 50736367 54597336 57310891
41783 57310891 57787419 57381087 56930772 54967022 50312176 44526293 39877001 36299582
41775 36299582 32438582 28676769 26793211 26937990 27128349 25988778 24222086 22914451
41767 22914451 21937988 20814087 19987496 20177872 20974261 21008720 19572652 17553844 16512926
41758 16512926 16974693 17964731 18351403 18173648 18115570 18122066 17527449 16397840 15537186 15075244
41748 15075244 14414042 13829322 14437391 15872379 15850662 13384642 10813250 10878715 13068091
41739 13068091 14851957 15518140 16439939 18081897 19220212 19235912 18980599 18914682 18238650
41730A8238650j781315k182316j858140j469725p90995M43325J020764l52058
41722A1268190k620125l226348j250537J669440L307892K674795L90706j696766
41714A0517247j859516l97862N38728j65324j043635l93008J218363K125596J882237
41705A2422826R23258o24761k097285j804710N65561K512433J932130L05363J43979
41696A4278794P96929k1184j722738j622143K65885J106540J05189l71985O97587
41687A3512874J120827m41431j880447j075887P63202J300035N14334p1394M3234
41678A3785347L50074N86370N42248j07855o96531J71980K201911L064201J724806
41669B1622551J67670K39809P68871j27959j576286j289239O35804J754715Q00055
$$ plain form
41730 18238650 16457335 14275019 12416879 10947154 10156159 10599484 11620248 11268190
41722 11268190 8648065 5421717 4171180 5840620 9148512 11823307 12214013 10517247
41714 10517247 8657731 8259869 8798597 8633273 7589638 7196630 8414993 10540589 12422826
41705 12422826 13346084 12721323 10624038 8819328 9384889 11897322 13829452 14134815 14278794
41696 14278794 15075723 15054539 13331801 11709658 11975543 13082083 13187272 12815287 13512874
41687 13512874 14633701 14192270 12311823 11235936 11999138 13299173 13813507 13742113 13785347
41678 13785347 14135421 14721791 15264039 15156184 14459653 14631633 16833544 19897745 21622551
41669 21622551 21790221 22030030 22798901 22670942 21094656 19805417 20441221 22195936 22995991
41660B2995991q63332j364625m63042N86480M88431o81700j265963O7242K137155
41651B1636637K438021Q41275K7366J280889K273198Q39023j293413j115615R73865
41642B7901246K024963J107233O6222Q9491L30485J33722K00307R66173J651857
41633C4471699J551738J023245Q03545J152120J673918J519136L67940m13705
41625D2149636R62962L528186L751962N02140k535431j801492J058734K247032
41617D9863729J823962K509645L912052K941234j45272j103372J863137N374038
41609F7039153O098700M905468M045261L644135L061271K897493L632394M486991
41601I9810866N078410O030808P094375P265961P319560Q929644J0750955R564233
$$ plain form
41660 22995991 22132659 20768034 20304992 20891472 21379903 20698203 19432240 19499482 21636637
41651 21636637 24074658 24915933 24943299 26224188 28497386 29336409 28042996 26927381 27901246
41642 27901246 29926209 31033442 31099664 31189155 31519640 31653362 31853669 32819842 34471699
41633 34471699 36023437 37046682 37850227 39002347 40676265 42195401 42563341 42149636
41625 42149636 43112598 46640784 50392746 50894886 48359455 46557963 47616697 49863729
41617 49863729 51687691 54197336 58109388 61050622 60905350 59801978 61665115 67039153
41609 67039153 73137853 78043321 82088582 85732717 88793988 91691481 95323875 99810866
41601 99810866 104889276 110920084 118014459 125280420 132599980 141529624 152280579 161844812
41593A61844812O374972O384815J0808341J4029664J2145974R101002R936178
41586B30625758J2783293J3018361J1275729J1051985J1472847R227372N615927
41579C05071272M743238N848289M269758m15653l942496n057982o896598j0035205
41571B93584623j1033087r357900r134506j1834533j3490446j1821365j0126115
41564B16786671j0982419j1841194j0489522r397043j0513023j0908327q221011
41557A44434132n696274o756156q852262q098032o017671n834844n760639k645405
41549I4772849O43273j113307o159996p648473m291388j747431k916056m062389
41541F7477082k251579p5360l60728j640388j808306j755686k540355k845655
$$ plain form
41593 161844812 168219784 174604599 185412940 199442604 211588578 220689580 230625758
41586 230625758 243409051 256427412 267703141 278755126 290227973 299455345 305071272
41579 305071272 309814510 315662799 319932557 319516904 315574408 310516426 303619828 293584623
41571 293584623 282551536 273193636 264059130 252224597 238734151 226912786 216786671
41564 216786671 205804252 193963058 183473536 174076493 163563470 152655143 144434132
41557 144434132 138737858 131981702 123129440 115031408 109013737 103178893 97418254 94772849
41549 94772849 95416122 94302815 88142819 80494346 76202958 74455527 71539471 67477082
41541 67477082 65225503 65150143 64789415 63149027 61340721 59585035 57044680 54199025
41533E4199025j863620j167199j443025r56111N78828N10509j891517l166581
41525D4800309j251035P06038k90722j824716n61569J487733M19385k440009k566460
41516C8478954J44144J572398N38412J9804J049868J104581l63927l12796J985490
41507D4216928K594221n77182l484395k051194J116806P92910k558431l695835
41499C6353828q89863J783743J018822j242121j648817m42762j47663j266190
41491C3518977j870432p66103R66053J611404P52151o22862j261374q11019j40615
41482C1376180l68445j460524k222554j838662p86328Q8861O64560J153073J317909
41473B7924070Q74905K22228o3161k15887j006442k540847l883264l844947j953945
$$ plain form
41533 54199025 52335405 51168206 49725181 48769070 49347898 49858407 47966890 44800309
41525 44800309 43549274 44255312 43964590 42139874 41578305 43066038 43485423 41045414 38478954
41516 38478954 38623098 40195496 40733908 40753712 41803580 42908161 42544234 42231438 44216928
41507 44216928 46811149 46233967 42749572 40698378 41815184 42608094 40049663 36353828
41499 36353828 35463965 37247708 38266530 37024409 35375592 34932830 34785167 33518977
41491 33518977 31648545 30882442 31848495 33459899 34212050 33589188 32327814 31516795 31376180
41482 31376180 31007735 29547211 27324657 25485995 24699667 24788528 25453088 26606161 27924070
41473 27924070 28798975 29021203 28958042 28742155 27735713 25194866 21311602 17466655 15512710
41464A5512710R26995K726284J792735r16657k216627l57091K495690K832124
41456B2796163K23233k501942l132097k178758j023066r661Q78042J092838L41530
41447A6486282o65488j083256q77889n45141n80538j222354j874101j212942Q29593
41438I254166J932655K83344k068943j623263J080151J993061K6917j230269K42180
41429I889999J402380l69875k492199j709377J90461j64850j440216j09711K693590
41420G890202K643883l28505j868649n08959N06682n40462j274039l53000J0010
41411F177163j269366j728930j36855P49981q61362k190997o27000J599826J331664
41402C044124o5353N34931K184322J401487j761755l572902k145885N71091K268857
$$ plain form
41464 15512710 16439705 19165989 20958724 20042067 17825440 17468349 19964039 22796163
41456 22796163 23019396 20517454 17385357 15206599 14183533 14173872 15051914 16144752 16486282
41447 16486282 15820794 14737538 13859649 13314508 12733970 11511616 9637515 8424573 9254166
41438 9254166 11186821 11470165 9401222 7777959 8858110 10851171 10878088 9647819 9889999
41429 9889999 11292379 10922504 8430305 6720928 6911389 6746539 5306323 5196612 7890202
41420 7890202 10534085 10205580 8336931 7827972 8334654 7794192 6520153 6167153 6177163
41411 6177163 4907797 3178867 3042012 3791993 2930631 739634 112634 1712460 3044124
41402 3044124 2978771 3513702 5698024 7099511 5337756 1764854 -381031 190060 2458917
41393B458917K532817J528227n97772k486856k194514J68051K120432J766395
41385E295697j22646j330389o56716J000037J613550L02670j385100j361432j171
41376C354500M43814n29169j074505n41960n82339j490800q97152J734158K824013
41367C240560P8153l000207k012031J462763K474928L78684j049984j87564P53531
41358B138833M33243L1983j15412j082999k015380n98917K301827K820025J12455
41349D025658k016181j097787M95579O8658j217579j175824k76518J53154N60512
41340d80328J394227J293372l78215j603321q52889K05348k91676j126347n62381
41331b402210K44653l10717o47641J347613L697502K659001j073353k770704m45130
$$ plain form
41393 2458917 4991734 6519961 5922189 3435333 1240819 1408870 3529302 5295697
41385 5295697 5173051 3842662 3185946 4185983 5799533 6102203 4717103 3355671 3354500
41376 3354500 3798314 3269145 2194640 1652680 1070341 -420459 -1317611 416547 3240560
41367 3240560 3318713 318506 -1693525 -230762 2244166 2622850 1572866 1385302 2138833
41358 2138833 2572076 2604059 2488647 1405648 -609732 -1208649 1093178 3913203 4025658
41349 4025658 2009477 911690 1407269 1475927 258348 -917476 -1193994 -1040840 -480328
41340 -480328 913899 2207271 1829056 225735 -627154 -421806 -713482 -1839829 -2402210
41331 -2402210 -2157557 -2468274 -3115915 -1768302 1929200 4588201 3514848 744144 299014
41322B99014K593911K702002J93586k323970l193113k184521O237J686959J446886
41313A226991K27353K60239J490198J386222q68166k588405j537487O32521R90585
41304A220051l66993j026985j39238R15442J177760R93195L54531j230760k817245
41295i20242k271476N43897K740417J943350o15090k084878j781687j033846k19221
41286c698776J491024L475094L384354N29908k442670k687991o27002J112568
41278E36509J151418L01769j61631K57950J263609J804473O98814j671277l035890
41269A145744j879048M00628J402634Q85839K62218j28326r38434j573538o51869
41260a074152J303132K158522J397086N77829L13189m54257j609617j386416J38052
$$ plain form
41322 299014 2892925 5594927 5788513 3464543 271430 -1913091 -1906854 -219895 1226991
41313 1226991 1454344 1714583 3204781 4591003 3722837 1134432 -403055 229466 1220051
41304 1220051 853058 -173927 -313165 602277 1780037 2773232 3127763 1897003 -920242
41295 -920242 -3191718 -2647821 92596 2035946 1420856 -664022 -2445709 -3479555 -3698776
41286 -3698776 -2207752 1267342 4651696 5181604 2738934 50943 -576059 536509
41278 536509 1687927 1989696 1828065 2086015 3349624 5154097 5852911 4181634 1145744
41269 1145744 -733304 -332676 1069958 1955797 2218015 2089689 1151255 -422283 -1074152
41260 -1074152 228980 2387502 3784588 4362417 4675606 4221349 2611732 1225316 1363368
41251A363368K41856j943757l188893r33114K361141K749105O52388l72717N96666
41242A526043J103739m4104j016761l69077P62125Q04805j26855j106606j610817
41233g7508j262500j8159R78966M44617q15431o01624J345456K794670K440739
41224E229226J584226J365065P62806r24743j892924o01983R78356o0980k666949
41215C772100k865670K13357K702274J507567j435316k353388q59593N29613O85395
41206A896339P91278J394432J341748J44712q94876q17961m15963n03345m72160
41197B464204K15071O26131q1343r97276r52389n23162p83585j098264k12183
41188a342796J228540J486990O05694J58995L99156J16090o54358m43850P10912
$$ plain form
41251 1363368 1605224 -338533 -3527426 -4460540 -2099399 649706 1302094 929377 1526043
41242 1526043 2629782 2585678 1568917 1199840 1961965 2766770 2639915 1533309 -77508
41233 -77508 -1340008 -1358167 -379201 65416 -750015 -1351639 -6183 2788487 5229226
41224 5229226 6813452 8178517 8941323 8016580 6123656 5521673 6500029 6439049 3772100
41215 3772100 906430 1119787 3822061 5329628 3894312 1540924 681331 1210944 1896339
41206 1896339 2687617 4082049 5423797 5568509 4673633 3855672 3439709 2936364 2464204
41197 2464204 2679275 3305406 3224063 2226787 1274398 751236 -32349 -1130613 -1342796
41188 -1342796 -114256 1372734 1978428 2137423 2536579 2652669 1998311 1554461 2265373
41179B265373Q43495n96208j587609q83864N4692m1749J8328J250892J941538
41170C264888L32183j917827j872632J88507J354426N97246j93092K59026P28665
41161B741390j38792j598730j981495q85738O23152J333609R49118J73922j97573
41152A018863l21579q29949j235951k22883J774077K105018l86427k903764k272203
41143c274798L54311J259271j58521r00371L64716J200597k13211j857988j179034
41134d405028Q23593J410903M21325j1279P23674R77958K6324n31362N49575J971655
41124A957338J762592J16445j190767j530066j779981k053849j081850J296346
41116b503792K810158J637772n36065n42724J623114K632685O22514k265227l139733
$$ plain form
41179 2265373 3108868 2512660 925051 41187 95879 54130 72458 1323350 3264888
41170 3264888 3597071 1679244 -193388 -4881 1349545 1946791 1753699 2012725 2741390
41161 2741390 2602598 1003868 -977627 -1863365 -1240213 93396 1042514 1216436 1018863
41152 1018863 697284 -132665 -1368616 -1591499 182578 2287596 1901169 -1002595 -3274798
41143 -3274798 -2920487 -1661216 -1819737 -2720108 -2355392 -1154795 -1368006 -3225994 -4405028
41134 -4405028 -3581435 -2170532 -1749207 -1760486 -1036812 -58854 -32530 -563892 -14317 1957338
41124 1957338 3719930 3836375 2645608 1115542 -664439 -2718288 -3800138 -2503792
41116 -2503792 306366 1944138 1408073 865349 2488463 5121148 5743662 3478435 338702
41107C38702j970246m53504P96616J941386K239481R64602p66027j198778n47342
41098A344890m51777j131101j058604M02878J774067J355661p31402k727633k869058
41089d092079r89998J088424J406356M50778N66414K154650K580256M18621j639662
41080A943760q41453Q46895j66090k646396j949519K189416M364368J507233k373388
41071B874826k204352R67083K313475M32407j591327j404175k07240m7036p68296
41062C65365o96737P79384K216502J700850o89231k470982j562727Q73016J760447
41053B275887K38669j298342p61616Q39864J176312k48123j882436k146766q05813
41044b612364R39196J336983l8410j324524o69568P49081K21855j868903j906011
$$ plain form
41107 338702 -1631544 -2085048 -1288432 652954 2892435 3857037 3091010 1892232 1344890
41098 1344890 893113 -237988 -1296592 -893714 880353 2236014 1504612 -1223021 -4092079
41089 -4092079 -5082077 -3993653 -2587297 -2136519 -1570105 584545 3164801 3583422 1943760
41080 1943760 1102307 1949202 1783112 -863284 -2812803 -623387 3740981 5248214 2874826
41071 2874826 670474 1637557 3951032 4383439 2792112 1387937 1180697 1133661 365365
41062 365365 -331372 448012 2664514 4365364 3676133 1205151 -357576 515440 2275887
41053 2275887 2514556 1216214 454598 1294462 2470774 2222651 340215 -1806551 -2612364
41044 -2612364 -1673168 -336185 -374595 -1699119 -2368687 -1619606 -1397751 -3266654 -5172665
41035e172665J372071M223883L032115m43637j779946j34588J330946M56191j438490
41026A445880k091156j030341N98879J426970Q63908l04132n03099O78525J754851
41017B840285J407125L54978O5293N75159Q85977O09235r3605j267376k500756
41008B876315k513494q72102Q66745J201860P86331R16072J188337N75377l38954
40999D686487l31714K48339M11203O25921J618679K161765Q76891o18406L85846
40990A0065011L016101L526793R44494j457592j195261J48471R6654j076312j717497
40981A2350862j653971j707041j820569j443347q46037p05973j005047j169437
40973A999440p35055M19880J700866J743047l4685j990943j955665k11771J061810
$$ plain form
41035 -5172665 -3800594 423289 3455404 3011767 1231821 1097233 2428179 2884370 1445880
41026 1445880 -645276 -1675617 -1076738 350232 1214140 910008 406909 1085434 2840285
41017 2840285 4247410 4602388 4667681 5242840 6128817 6738052 6644447 5377071 2876315
41008 2876315 362821 -509281 357464 1559324 2345655 3261727 4450064 5025441 4686487
40999 4686487 4354773 4603112 5014315 5640236 7258915 9420680 10297571 9679165 10065011
40990 10065011 13081112 16607905 17552399 16094807 14899546 15048017 15144671 14068359 12350862
40981 12350862 10696891 8989850 7169281 5725934 4879897 4173924 3168877 1999440
40973 1999440 1264385 1684265 3385131 5128178 5093493 3102550 1146885 935114 1996924
40964A996924J141588J262916J751861J365389K9595n16548K79859P85213J93559
40955H290356j80655K22475j0364j126799j006971R02443J684443l64528k217267
40946F193133o13998K544556L131894J073934m37497n10591r27418j749646j051684
40937G652683R13516J450507q1732j187403m27471O79020Q15658O92587O94728
40928A1202093j39580j544801j461119M52401J546673J29563j887236k130174
40920F167820j172716p71168q09630k40209N94420P76525O91671J141020J633241
40911H010974J263077L29179l51516p09034p87157r7361J204569J883601J489169
40902A2235501J028745P29196o82278l003037l486431j003213J292776M14505
$$ plain form
40964 1996924 3138512 4401428 6153289 7518678 7548273 7031725 7311584 8096797 8290356
40955 8290356 8109701 8332176 8321812 7195013 6188042 7090485 8774928 8410400 6193133
40946 6193133 5579135 8123691 11255585 12329519 11892022 11381431 10454013 8704367 7652683
40937 7652683 8566199 10016706 9934974 8747571 8320100 8999120 9814778 10507365 11202093
40928 11202093 11062513 9517712 8056593 8508994 10055667 10185230 8297994 6167820
40920 6167820 4995104 4223936 3414306 3174097 3768517 4545042 5236713 6377733 8010974
40911 8010974 9274051 9603230 9251714 8542680 7755523 7658162 8862731 10746332 12235501
40902 12235501 13264246 13993442 13311164 10308127 6821696 5818483 7111259 7525764
40894G525764j631852j048698J573353K447502Q48818l08853J13449J4582j403925
40885H130140j891123l06818J131827N33159p52229p45035J47017N10768K00502
40876F958208l41403j098234j502103m53794J469548J994813N87927m59158J98236
40867G354040P02545n94673k055720j536237j4723L02108l29012k68249K59892
40858C819971P002m26641L05156J192391J35773k101165k495122m30802J338190
40849A344753R30520l20177o59767m49850n82055m84633O17323J843950J699249
40840C939313K76791q27878n35991N95880J223821P79241N0723P4223N91224L99920
40830F567267n47159o81472O76994J745096P52655j156217j532124l77846P0744
$$ plain form
40894 7525764 5893912 4845214 6418567 8866069 9714887 9406034 9519483 9534065 8130140
40885 8130140 6239017 5932199 7064026 7597185 6844956 6099921 6246938 6757706 6958208
40876 6958208 6616805 5518571 4016468 3562674 5032222 7027035 7614962 7155804 7354040
40867 7354040 8056585 7461912 5406192 3869955 3855232 4157340 3828328 3560079 3819971
40858 3819971 3826973 3400332 3705488 4897879 5033652 2932487 437365 6563 1344753
40849 1344753 2275273 1955096 1295329 845479 263424 -221209 396114 2240064 3939313
40840 3939313 4216104 3388226 2852235 3448115 4671936 5451177 5501900 5576123 6167347 6567267
40830 6567267 6020108 5338636 6015630 7760726 8513381 7357164 5825040 5447194 5517938
40821E517938r09358j531918o87389K45274j44155q73963j01798J948348L028761
40812F491740J634424j117333k578132j452019O16616R43603o54747j502124L4375
40803B416403J923854J445743o12649j226762J00678P37441p16335k235735j570919
40794B61719M92630J489768N86827p45314p58622O35714J745398R27449j151546
40785C484023j813883K17976K730338K771167M88896j596895k141904j551523
40777B588195j7422K167680K990211P30427k492166k653412L33625K270292R41135
40768F858565r78873o93002O61082Q37115K43113L66237Q97012R16916R50028
40759A0058193J533220J560298K36343j013820o86746L47693M97014p3394n04762
$$ plain form
40821 5517938 4608580 3076662 2389273 2634547 2490392 1616429 1514631 3462979 6491740
40812 6491740 8126164 7008831 4430699 2978680 3595296 4538899 3884152 2382028 2416403
40803 2416403 4340257 5786000 5173351 3946589 4047267 4784708 4068373 1832638 261719
40794 261719 754349 2244117 2830944 2085630 1327008 1962722 3708120 4635569 3484023
40785 3484023 1670140 1888116 4618454 7389621 7878517 6281622 4139718 2588195
40777 2588195 2570773 4738453 7728664 8459091 5966925 3313513 3647138 5917430 6858565
40768 6858565 5879692 5186690 5847772 6684887 6928000 7294237 8191249 9108165 10058193
40759 10058193 11591413 13151711 13388054 12374234 11687488 12035181 12532195 12458801 11954039
40750A1954039j043515j766715j301875R34111K817748K148279j89385j831022
40742A1721665k220446k087812j227574O43034K037545J288829q39814k261543
40734G053884k328367j611812k86902J187024J301214k48766j102670M16307K116994
40725F496906J055245j636972k395425o61990Q28368O37859N4826N2325j2394
40716D418748m77936q18681j048158j369860q39283J165844K813219J958522k30778
40707E571637q48256J57313L38378o98326q14066M66819R83273k46872j574017
40698C335883j738396j270211m14101J181475K338747J328820n88744k89672J954246
40689E838047K388952n5174j878658r24689L10424l16648o61668J293138K902818
$$ plain form
40750 11954039 10910524 9143809 7841934 8776045 11593793 13742072 13552687 11721665
40742 11721665 9501219 7413407 6185833 6828867 8866412 10155241 9315427 7053884
40734 7053884 4725517 3113705 2826803 4013827 5315041 5066275 3963605 4379912 6496906
40725 6496906 7552151 5915179 3519754 2857764 3686132 4323991 4378817 4431142 4418748
40716 4418748 3940812 3122131 2073973 704113 -135170 1030674 3843893 5802415 5571637
40707 5571637 4723381 4880694 5219072 4520746 3706680 4173499 5156772 4909900 3335883
40698 3335883 1597487 327276 -86825 1094650 3433397 4762217 4173473 3883801 5838047
40689 5838047 8226999 8171825 6293167 5368478 5678902 5362254 4700586 5993724 8896542
40680H896542Q79517k907351l994611j922468j07138j63177l14917P73508K023601
40671C163506K168070J392408L46698n92900r10371l51143K83907L8474p57101
40662D781548j099624q70884n82324j61224P09626J523433J420746L65399r80590
40653E106106j938331j751713L0347K246075K548065L44770j988024k159241q32494
40644A605560R1927N12428J320880J805793M93112j851313k577040p57536J510421
40635B154232J883351M34684q69890l99210J585313K950963J658076j517650l031043
40626D848826o46411L255601M215059J230045k184639k690019r58859O3190p40424
40617F392369j759144j365997j09082L06625n04250j149507n84250L69239M71706
$$ plain form
40680 8896542 9776059 6868708 2874097 951629 844491 681314 366397 1139905 3163506
40671 3163506 5331576 6723984 7070682 6477782 5567411 5216268 5500175 5538649 4781548
40662 4781548 3681924 2811040 2228716 2067492 2777118 4300551 5721297 6086696 5106106
40653 5106106 3167775 1416062 1446409 3692484 6240549 6585319 4597295 2438054 1605560
40644 1605560 1697487 2209915 3530795 5336588 5829700 3978387 1401347 643811 2154232
40635 2154232 4037583 4472267 3602377 3203167 4788480 7739443 9397519 7879869 4848826
40626 4848826 4202415 7458016 11673075 12903120 10718481 8028462 7069603 7132793 6392369
40617 6392369 4633225 3267228 3158146 3464771 2960521 1811014 1226764 1596003 2067709
40608B067709J44505N84063J288019N45260j377608j844802K80629K435143J750742
40599E873660q59478k079153p82884Q61123O78696r34351k021244j418651L28078
40590c54204J770396K017091J536072J343500J514595J231763L06923m68270p18470
40581H179396q84847q18801L79311K277086K596240J74646k916822l754736k030883
40572C200590K47879J470771J362914K24852j133691j428929l54006O55621L62462
40563D608463m51108m28121J68209L18208K75026Q41481J408911P30304q11651
40554F659722j585962j051664n8472P74476J333881J175192J88039l62957O71915
40545G744170K202224K233501R97389N78675J487739J905705P49585o29594o34976
$$ plain form
40608 2067709 2212214 2796277 4084296 4629556 3251948 1407146 1687775 4122918 5873660
40599 5873660 5014182 2935029 2152145 3013268 3691964 2757613 736369 -682282 -354204
40590 -354204 1416192 3433283 4969355 6312855 7827450 9059213 9366136 8897866 8179396
40581 8179396 7294549 6475748 6855059 9132145 11728385 11903031 8986209 5231473 3200590
40572 3200590 3448469 4919240 6282154 6507006 5373315 3944386 3590380 4246001 4608463
40563 4608463 4157355 3729234 3897443 4215651 4490677 5332158 6741069 7471373 6659722
40554 6659722 5073760 4022096 3963624 4738100 6071981 7247173 7435212 7072255 7744170
40545 7744170 9946394 12179895 13177284 13755959 15243698 17149403 17898988 17269394 16634418
40536A6634418L11985O33008l19057j713171k145880r04615J108362J977836J007467
40527A6590353k71032k99969K05505l50002j621564j868175q36306j9845j93298
40518A1335667o56694r01202j135715j166335n95111p0283m67691j002540k28800
40509E111296J243517J351190r2572j101384o85309J98663J005931K079820K444471
40500A1555623L79248k937589l772581j265400Q94687K03996p09087J222003L893844
40491I464744K996098j212020m077043k884690L67560K426216K180998M82378
40483I744241j104698j158876K39927J189596M77905m66175k9150M96001r16143
40474H472628k850025k128283O64196J532848l92311j111337J573574L877271
$$ plain form
40536 16634418 16946403 17579411 17260354 15547183 13401303 12496688 13605050 15582886 16590353
40527 16590353 16319321 16019352 16224857 15874855 14253291 12385116 11548810 11528965 11335667
40518 11335667 10678973 9777771 8642056 7475721 6880610 6810327 6342636 5340096 5111296
40509 5111296 6354813 7706003 7613431 6512047 5826738 6025401 7031332 9111152 11555623
40500 11555623 11934871 8997282 5224701 3959301 4853988 5057984 4348897 5570900 9464744
40491 9464744 12460842 11248822 7171779 4287089 4654649 7080865 9261863 9744241
40483 9744241 8639543 7480667 7720594 8910190 9388095 8921920 8892770 9388771 8472628
40474 8472628 5622603 3494320 4158516 5691364 5299053 4187716 5761290 9638561
40466I638561J767534k437467l381574n45274J686025R80074m29488m66881j66790
40457F644720n22638p8766K040465L487293J878429j154660j984394j25012J382069
40448A1567506M80098j460057k072599r42890N57383J083176L87824n50142k63686
40439H786613J502238K927777K088963k80251j409480r0077J826819K070124P19385
40430A8142111m82920m91958L20511J065720J082641K22962r88231j736690j674118
40421A5460028r58659K21887J400333J491404N795j585698j324311L62391J126293
40412A6199463K89251k46212O06692J213887R6331j455889j480855l11797M86024
40403A5396895O44008O87606K96666p58235j296917m74946L54549k63812j177548
$$ plain form
40466 9638561 11406095 8968628 5587054 5041780 6727805 7707879 7278391 6811510 6644720
40457 6644720 6122082 6043316 8083781 11571074 13449503 12294843 10310449 10185437 11567506
40448 11567506 12047604 10587547 8514948 7572058 8129441 9212617 9600441 9050299 8786613
40439 8786613 10288851 13216628 15305591 15025340 13615860 13525783 15352602 17422726 18142111
40430 18142111 17659191 17167233 17487744 18553464 19636105 19859067 18870836 17134146 15460028
40421 15460028 14501369 14723256 16123589 17614993 17620788 16035090 14710779 15073170 16199463
40412 16199463 16488714 16242502 16849194 18063081 18159412 16703523 15222668 14910871 15396895
40403 15396895 16040903 16728509 17025175 16266940 14970023 14495077 14849626 14585814 13408266
40394A3408266m95245J014534J219182L32623J49728K57776j360003l972330m179003
40385F375528j165009J648551J593762K55310K06574J060416J041248L01598J59194
40376A1477172M85162K43514k82723L4931R81889J153168J02620j136131j591188
40367A1468414j243379m48444N30334J352687J653086J342363N79550l29333q12879
40358A4092399k99414J066666K398988K995353K819123J984634N55032q55507
40350B4757274j156107p3547J222501J404062N04258l37757l11818L48987Q66778
40341B7224631P07287r6535j124970j909497k106882j631678r57304r72446j811462
40332A7321144k095491n57339J590213J614095q84280k985815k391318l79070
$$ plain form
40394 13408266 12913021 13927555 15146737 15479360 15629088 15886864 14526861 10554531 6375528
40385 6375528 5210519 6859070 8452832 8708142 8914716 9975132 11016380 11317978 11477172
40376 11477172 11962334 12205848 11923125 11958056 12939945 14093113 14195733 13059602 11468414
40367 11468414 10225035 9776591 10306925 11659612 13312698 14655061 15234611 14905278 14092399
40358 14092399 13792985 14859651 17258639 20253992 23073115 25057749 25612781 24757274
40350 24757274 23601167 23527620 24750121 26154183 26658441 26320684 26008866 26357853 27224631
40341 27224631 27931918 27835383 26710413 24800916 22694034 21062356 20105052 19132606 17321144
40332 17321144 15225653 14668314 16258527 17872622 16988342 14002527 11611209 11232139
40324A1232139O97174Q01045R41184M91149j281359k495082r28335J807833K042012
40315A3307760k56956j376324J66030J451123J72942j774811j701994k69192P9759
40306I798337j100799k149965j752670j8214J894264K392503Q74870j054409j279154
40297G604763j20123M33452K65946J005502K180543J205082j730232k726364j72281
40288G946288K133767P11059k172047k325185o0229J243245Q79330Q04903J215084
40279A0376215M86369j009543j151750j06843k42217j623413j398995J276063
40271F605886L182931J679431j320841k184063n47582P84248M1226j449397j433379
40262E358460L52989J985074J678430j80251j596768j333923n9878Q93451R66180
$$ plain form
40324 11232139 11929313 12730358 13671542 14162691 12881332 10386250 9457915 11265748 13307760
40315 13307760 13050804 11674480 11840510 13291633 13464575 11689764 9987770 9718578 9798337
40306 9798337 8697538 6547573 4794903 4776689 6670953 9063456 9938326 8883917 7604763
40297 7604763 7484640 7918092 8184038 9189540 11370083 12575165 10844933 8118569 7946288
40288 7946288 10080055 10791114 8619067 6293882 6233653 7476898 8356228 9161131 10376215
40279 10376215 10862584 9853041 8701291 8594448 8352231 6728818 5329823 6605886
40271 6605886 9788817 11468248 10147407 7963344 7415762 8200010 8241236 6791839 5358460
40262 5358460 5711449 7696523 9374953 9194702 7597934 6264011 6204133 7097584 8063764
40253H063764K11246j172682k389025k165381l60431J336500J320440K2006r28475
40244C937962p52117J07037Q63492Q20416k41971j410579j395545m86907k66118
40235A175670p31002J22172K541899L374746N35820l032843l002802J83720K257749
40226C425129J448559J91511M87671J175736P63643o6733k32610k24043p82864
40217F185999j321412j039962k96404K71125P54024J046403J67109k133504l964244
40208c30866l032363L55694L194926K955613K32126k091855j957937N6483J951513
40199A333334K555175K008081P35558q17421j673933j052146K22233N14529j75294
40190C650116k96651L73392J38811j445247k224884q20133R21780Q64406p8833
$$ plain form
40253 8063764 8275010 7102328 4713303 2547922 2187491 3523991 4844431 4866437 3937962
40244 3937962 3185845 3292882 4156374 4976790 4734819 3324240 1928695 1441788 1175670
40235 1175670 444668 566840 3108739 6483485 7019305 3986462 983660 1167380 3425129
40226 3425129 4873688 5065199 5552870 6728606 7492249 7425516 7192906 6968863 6185999
40217 6185999 4864587 3824625 3528221 3799346 4553370 5599773 5766882 3633378 -330866
40208 -330866 -3363229 -3007535 187391 3143004 3375130 1283275 -674662 -618179 1333334
40199 1333334 3888509 5896590 6632148 5814727 4140794 3088648 3310881 3825410 3650116
40190 3650116 3353465 3726857 3865668 2420421 195537 -624596 297184 1161590 1082757
40181A082757P7026R03060P94596K08239O53151J493846Q47886r51778j782493
40172C326290j256127r56064j354883j259820k87795O63906J304707J860387J485483
40163C526084n22844k387796j817586N2071J72928j117923m34017K473715L400292
40154C344924L23694k827509j847636J594840K802478P65021j409736j509875
40146A236201m80529j4545l49493o64649k09306J004663J877880J128285q18254
40137B710253j800775o79326R37263Q85136n37963j142546M3164J589242J661846
40128C666294K93157p68830k64561R47522R84789m02459j356346o38830N20413
40119B981149N04009j25579P1274P11226M39684l55904j67626Q21567J052457
$$ plain form
40181 1082757 1159783 2062843 2857439 3065678 3718829 5212675 6060561 5108783 3326290
40172 3326290 2070163 1114099 -240784 -1500604 -1788399 -1124493 180214 2040601 3526084
40163 3526084 3003240 615444 -1202142 -1150071 -977143 -2095066 -2529083 -55368 3344924
40154 3344924 3668618 841109 -1006527 588313 3390791 4155812 2746076 1236201
40146 1236201 755672 741127 391634 -273015 -482321 522342 2400222 3528507 2710253
40137 2710253 909478 230152 1167415 2052551 1514588 372042 415206 2004448 3666294
40128 3666294 3959451 3190621 2926060 3873582 4858371 4455912 3099566 2460736 2981149
40119 2981149 3485158 3359579 3430853 4142079 4581763 4225859 4058233 4879800 5932257
40110E932257L00998m19917j089005k043854j894215N42230K859221J691985j476110
40101D403590j796285J225578K657275J53445k322800j243380J119126J409039
40093E605588O50721R84613J014738j012819k776929j510067P07653L08530j461863
40084B510165r53328J010095M75181k283146k677512O23619L479646K746424K77631
40075E208775j019833j060695q09330j33028P47669N41693p14257j009651M90626
40066B241969J972671J873813R53018K75787n34496j681608k029119j058521j10543
40057A902971k09475l46275O16134J824211J706033K76593j033014j067111J95116
40048C865183J621733J609182k9669j084535L25725K371681J535516j871373l601222
$$ plain form
40110 5932257 6233255 5813338 4724333 2680479 786264 1328494 4187715 5879700 4403590
40101 4403590 2607305 3832883 6490158 6643603 4320803 3077423 4196549 5605588
40093 5605588 6256309 7240922 8255660 7242841 4465912 2955845 3663498 3972028 2510165
40084 2510165 1556837 2566932 3042113 758967 -1918545 -1294926 2184720 4931144 5208775
40075 5208775 4188942 3128247 2318917 2185889 2933558 3475251 2760994 1751343 2241969
40066 2241969 4214640 6088453 7041471 7317258 6782762 5101154 3072035 2013514 1902971
40057 1902971 1693496 1347221 1963355 3787566 5493599 5770192 4737178 3670067 3865183
40048 3865183 5486916 7096098 7066429 5981894 6307619 8679300 10214816 8343443 4742221
40039D742221j864764p2423j035784k122280K29110L946110L934252N2071k389358
40030E419155m96928K250278J676092r39643j229420J654329L910392K333815
40022A4578070j677659m109750l031915l28290Q71554l16064j874431j460044
40014B651471Q21263K562821J929034j60340j261044o04858n2177j243993k787229
40005A854948j898744J298864L232959J612964j215097j566362L20494R83722
39997D623748q28355k492984j842434k33178K14459K1225Q05208K031476J878509
39988D177674N13676m4790P91182J322603L46314j158591j805026j623462j214853
39979A304727m47408Q43162J828018J639632P92589M26467M47080k87394j890804
$$ plain form
40039 4742221 2877457 2805034 1769250 -353030 -123920 3822190 7756442 7808513 5419155
40030 5419155 4922227 7172505 8848597 7908954 6679534 8333863 12244255 14578070
40022 14578070 12900411 8790661 5758746 5430456 6302010 5985946 4111515 2651471
40014 2651471 3472734 6035555 7964589 7804249 6543205 5938347 5886170 4642177 1854948
40005 1854948 -43796 1255068 4488027 6100991 4885894 3319532 3640026 4623748
39997 4623748 3795393 1302409 -540025 -773203 -558744 -537519 267689 2299165 4177674
39988 4177674 4691350 4646560 5437742 6760345 7106659 5948068 4143042 2519580 1304727
39979 1304727 857319 1700481 3528499 5168131 5960720 6387187 6834267 6546873 4656069
39970D656069k867225k133268n75407K76710L92556R10084J994692K379103J316128
39961F349442k02039q81066q66792j066050j352923p39079P36417J548822O29659
39952D156391j037123j472272n8814J741237K074371P53693o60267q13425j01653
39943D582138K55877K15072P20333J455903O05298k059229l628293j707193J563498
39934B003404J916367r84495l017514j643373P50317J006316k61465n94314K21615
39925f03142Q10089J171540J899326J757020n32864k891398k037339J107102K117670
39916B798004k64545k234894j066822Q88270O67497n10893j11136J058474P80767
39907B004722k62306j28897K37113j099380k340346j59048L759215L855643p14105
$$ plain form
39970 4656069 1788844 -344424 -919831 -643121 -250565 659519 2654211 5033314 6349442
39961 6349442 6147403 5266337 4399545 3333495 1980572 1241493 1977910 3526732 4156391
39952 4156391 3119268 1646996 1588182 3329419 5403790 6157483 5497216 4683791 4582138
39943 4582138 4838015 5053087 5773420 7229323 7834621 5775392 2147099 439906 2003404
39934 2003404 3919771 2935276 -82238 -1725611 -975294 31022 -230443 -824757 -603142
39925 -603142 206947 1378487 3277813 5034833 4501969 1610571 -426768 680334 2798004
39916 2798004 2533459 298565 -768257 120013 787510 276617 165481 1223955 2004722
39907 2004722 1742416 1613519 1850632 751252 -1589094 -1748142 2011073 5866716 5152611
39898E152611m003405j919654J952475K346335n7271j080081m170N22079l07263
39889B601656q14606n35470n58600n88547O55309K241746J744783o64126k138614
39880A943531j527152o19650n14880m6734J187371J415515j95741j762330j702938
39871a823008j122796j366518j400088K14400K403656K875673J321548n19955
39863E82912j277425r63126k14488K99375K48070J23638O03050J137813N42447
39854A082266o59517m08178J575412K810229J702253M716j45451L88418l88140
39845E962008j962101k149157o10136R12202J324542J038535N20849j48589o23022
39836D265131p02310q52635j096462m74704J006030J466941Q3613q79389N01746
$$ plain form
39898 5152611 1149206 -770448 1182027 3528362 3471091 2391010 2386840 2908919 2601656
39889 2601656 1787050 1251580 692980 104433 759742 3001488 4746271 4082145 1943531
39880 1943531 416379 -203271 -718151 -764885 422486 1838001 1642260 -120070 -1823008
39871 -1823008 -2945804 -4312322 -5712410 -5498010 -3094354 -218681 1102867 582912
39863 582912 -694513 -1657639 -1872127 -1572752 -1324682 -1201044 -597994 539819 1082266
39854 1082266 422749 14571 1589983 4400212 6102465 6107181 5961730 6350148 5962008
39845 5962008 3999907 1850750 1240614 2152816 3477358 4515893 5036742 4888153 4265131
39836 4265131 3562821 2710186 1613724 1139020 2145050 3611991 3695604 2816215 3317961
39827C317961K106972P74176k350466l303402j412983K03831Q8633J7371O52455
39818I4548J92225j307592p83954K423577M159288J475325k463635l060065r39694
39809b09977J04620m50989n9028J489441J594957k20660j225950j49925P80511
39800A653000j64708j354261p29828Q90537J435324O52330l55985j200528j931466
39791a105585j850044m64627J142590J563174J033323O84481N96673K15883q8012
39782A727856K15394K10607j033590j964052l17357K592968K717177o39416l060823
39773D48764j396143J401478R83621j527231j622240J169143K766847J297413
39765C521652m62251m10144k96364j482621j672764R25877L401091K024962j685969
$$ plain form
39827 3317961 5424933 6199109 3848643 545241 -867742 -663911 -575278 -557907 94548
39818 94548 286773 -1020819 -1804773 618804 4778092 6253417 3789782 729717 -209977
39809 -209977 -105357 -556346 -615374 874067 2469024 2248364 1022414 872489 1653000
39800 1653000 1488292 134031 -595797 294740 1730064 2382394 2026409 825881 -1105585
39791 -1105585 -2955629 -3420256 -2277666 -714492 318831 1003312 1599985 1815868 1727856
39782 1727856 1943250 2153857 1120267 -843785 -1161142 1431826 4149003 3509587 448764
39773 448764 -947379 454099 1437720 -89511 -1711751 -542608 2224239 3521652
39765 3521652 3059401 2649257 2352893 870272 -802492 123385 3524476 5549438 3863469
39756C863469k916974o06658J468799O81728j105677j206506j01617N8369q61783
39747g26850q12725J341435L891187L920088P27249k876209l457447j031592J090898
39738B066034Q06536l46816l10885J16345q32531k299058j910851K86530J800953
39729f23743J411730L84342j13455m30475q91722r25578k92730M18683Q71642
39720a91306J202630J195884O28271J24838J39249l03804j951159l166422j864792
39711d186611R23515K157053J191668J88951K01111J2718q22183j040170m06944
39702a780892k44460m93662M76790K240967K032382n76794k282136j093381P14778
39693a006408Q09440M91151J541159K565832J606968k00132p48524n51853j146315
$$ plain form
39756 3863469 946495 339837 1808636 2490364 1384687 178181 76564 134933 -726850
39747 -726850 -1539575 -198140 3693047 7613135 8340384 5464175 2006728 975136 2066034
39738 2066034 2872570 2525754 2214869 2331214 1498683 -800375 -2711226 -2424696 -623743
39729 -623743 787987 1172329 1058874 628399 -263323 -1188901 -1481631 -1062948 -191306
39720 -191306 1011324 2207208 2835479 2960317 3099566 2795762 844603 -2321819 -4186611
39711 -4186611 -3263096 -1106043 85625 274576 475687 488405 -333778 -1373948 -1780892
39702 -1780892 -2025352 -2519014 -2042224 198743 2231125 1654331 -627805 -1721186 -1006408
39693 -1006408 -196968 294183 1835342 4401174 6008142 5808010 5059486 4507633 3361318
39684C361318j866520j230242J70070Q92436J004100P96196n84546k628955k420877
39675b507020O67101K347147l79191l466844j525730L234778M042242J71053k321989
39666B61547m70916J834042J263928j59512p4797K9818j278957j968259l80875
39657i43981J359918J029211J2880K49252O72226j05827o16332N37255J371244
39648C565846j64965k005659j076781J331624J464067q84908k364850j462736
39640a598362m5437L99256N80715J112284J285072O29152m77592j812490k929137
39631b856539k270669Q77346L972214L584430J75705k309405j851539m67777l47943
39622a494177q22607m05830O09352J154440J188642J107079P52879J30310j59725
$$ plain form
39684 3361318 1494798 264556 434626 1327062 2331162 3127358 2542812 -86143 -2507020
39675 -2507020 -1839919 507228 128037 -3338807 -4864537 -1629759 2412483 2583536 261547
39666 261547 -209369 1624673 2888601 2729089 2654292 2684110 1405153 -563106 -943981
39657 -943981 415937 1445148 1458028 1707280 2379506 2273679 1657347 2194602 3565846
39648 3565846 3400881 1395222 318441 1650065 3114132 2229224 -135626 -1598362
39640 -1598362 -1643799 -1244543 -663828 448456 1733528 2362680 1885088 72598 -2856539
39631 -2856539 -5127208 -4249862 -277648 3306782 3482487 1173082 -678457 -1146234 -1494177
39622 -1494177 -2316784 -2722614 -2113262 -958822 229820 1336899 2089778 2220088 2060363
39613B060363o0150l56836j150580j444736r18990n48866p08733l58428R17053
39604b569903J781102J268850M30244M92894Q97285O64830K61856L53902L8466
39595C619526j584121l031324j962324J228701L452930K671529p7337k486510
39587A831070l216022k117834J65265K185871K425859P96672j154307j887326
39579i70752j253831j53250O03141Q92973J085005J314210R97653l65396j802219
39570C47534j418585R24234K714838J873344l29633j137055k39976K92658l94928
39561B632431q84703k86155K85454j00981n36838J5119R49499J194761Q70441
39552D139028O04688L72199J60564O40594J901239K546919J413387o77171k164739
$$ plain form
39613 2060363 2000213 1643377 492797 -951939 -1870929 -2419795 -3128528 -3486956 -2569903
39604 -2569903 -788801 480049 910293 1403187 2300472 2965302 3227158 3581060 3619526
39595 3619526 2035405 -995919 -2958243 -1729542 1723388 4394917 4317580 1831070
39587 1831070 -1384952 -3502786 -3337521 -1151650 1274209 2070881 916574 -970752
39579 -970752 -2224583 -2377833 -1774692 -881719 203286 1517496 2515149 2149753 347534
39570 347534 -1071051 -146817 2568021 4441365 4111732 2974677 2734701 3027359 2632431
39561 2632431 1747728 1461573 1747027 1646046 1109208 1124327 2073826 3268587 4139028
39552 4139028 4743716 5115915 5276479 5917073 7818312 10365231 11778618 11101447 8936708
39543H936708k814780l088027k484779m89618J474735J333373m39642j192202
39535A235768p9643O80027l86629j251664M64208L163604K992806l98671k844515
39526C575291j451174J203879Q97791j913702k744472K15737L366035K867165
39518F016550j92400j960426j227965j041K56333J02117J09918K8184J65408J265285
39508D561963K578537K234708P4686j904485k379773j881012q27647J044697K670269
39499F171943J991521m90693j450357L67751J976308R15332q99072p94848J77003
39490G964888j91500q52979K47305J554453J43085k688829k890323k22530J452588
39481D516158N40032m25762L0556L0513j367718k019837p73138K91689j22068
$$ plain form
39543 8936708 6121928 3033901 549122 59504 1534239 2867612 2427970 1235768
39535 1235768 1156125 1836152 1449523 197859 662067 3825671 6818477 6419806 3575291
39526 3575291 2124117 3327996 4225787 2312085 -432387 -216650 3149385 6016550
39518 6016550 5824150 3863724 2635759 2634718 2891051 2993168 3103086 3131270 3296678 4561963
39508 4561963 7140500 9375208 9449894 7545409 5165636 3284624 2456977 3501674 6171943
39499 6171943 8163464 7672771 6222414 6590165 8566473 9481805 8582733 7787885 7964888
39490 7964888 7773388 6920409 7167714 8722167 8865252 6176423 3286100 3063570 4516158
39481 4516158 5056190 4630428 4660984 4691497 3323779 1303942 530804 822493 700425
39472G00425k2609J850631L045118J407501r96434j212669n4099p5345j108331
39463C534188j272889o14755k79760L35204K034087K847979N32478k869946l096457
39454A150129p2256J821651L14658j797562j359928Q70542K219219J659075j85830
39445D619698k334648l287753j658101J556746L215522J928542j77386r18748
39437B943872j016154j722136j857148k7684J974610J447787m69119j19917K572168
39428C726279L334416J22470l254602k569869O57651J774866p0775j454924m78850
39419A786662R10924R18952N36733P17184J17092k095951l713036k494574Q3331
39410c232683R70266J23935q0653Q79803J306444Q53424J011033J675729P14042
$$ plain form
39472 700425 677816 2528447 5573565 6981066 5984632 4771963 4717864 4642519 3534188
39463 3534188 2261299 1646544 1366784 1701988 3736075 6584054 7116532 4246586 1150129
39454 1150129 1077873 2899524 3214182 1416620 56692 927234 3146453 4805528 4619698
39445 4619698 2285050 -1002703 -2660804 -1104058 2111464 4040006 3862620 2943872
39437 2943872 1927718 205582 -1651566 -1679250 295360 1743147 1274028 1154111 3726279
39428 3726279 7060695 7183165 3928563 1358694 2016345 3791211 3720436 2265512 1786662
39419 1786662 2697586 3616538 4153271 4870455 4987547 2891596 -821440 -3316014 -3232683
39410 -3232683 -2262417 -2138482 -2219135 -1339332 -32888 820536 1831569 3507298 4221340
39401D221340j956120l077629o50449K802898L667701J843976k50349j462050
39393E139318k210144k308134j134376N27075J072338L76487k48026j93895l9074
39384I81569q3145j4949K8015l81413p05861R3545J575079J814813L2216k001675
39374A338194k101148m25716R32160P77406J12368L35895J108280R74945k72338
39365B780046j182836q67938k50814k73098k15075Q16005J898261J627460N47363
39356D879374J44428J40347p39807j802088j133246O98184R23683q61774j718662
39347E30439r1197J687823J270999k48343p08879j34868L51511M82950o3810j920331
39337A156294l626462k146850J993824L697937M91640k973033j700153J847512
$$ plain form
39401 4221340 2265220 -812409 -1462858 1340040 5007741 6851717 6601368 5139318
39393 5139318 2929174 621040 -513336 13739 1086077 1462564 1214538 1020643 981569
39384 981569 898424 883475 911490 530077 -175784 -82239 1492840 3307653 3339869 1338194
39374 1338194 -762954 -1188670 -256510 520896 633264 969159 2077439 3052384 2780046
39365 2780046 1597210 729272 478458 205360 -9715 806290 2704551 4332011 4879374
39356 4879374 5023802 5164149 4424342 2622254 1489008 2187192 3110875 2249101 530439
39347 530439 439242 2127065 3398064 3149721 2440842 2305974 2657485 3140435 3076625 1156294
39337 1156294 -2470168 -4617018 -2623194 1074743 1566383 -1406650 -3106803 -1259291
39329a259291J976811r11687j501606J233023K629255M28279j946792j685858
39321a037866p00305j139551j398393M84661K878292K988677R33015j057998j787964
39312A62568j557126r05842l28546j05595L00766J418970K254790J421789k93886
39303B367888p72343R4571N17770K31256O96971J632800Q08856j855386l385744
39294C36639k127154J05700J356295J785712J524207j66308k173531j720831R46765
39285a32506J871241n30917k663070j597077L77135L12476k98206R31825K194999
39276D65900P40067j537783q67930J945874K910139J357851J32121J48935l17661
39267D977513j358581j223132l24753q38964k146002j305600J430916K244451
$$ plain form
39329 -1259291 717520 -194167 -1695773 -462750 2166505 2594784 647992 -1037866
39321 -1037866 -1738171 -2877722 -4276115 -3791454 -913162 2075515 3008530 1950532 162568
39312 162568 -1394558 -2300400 -2628946 -2734541 -2433775 -1014805 1239985 2661774 2367888
39303 2367888 1595545 1690116 2207886 2439142 3136113 4768913 5577769 3722383 336639
39294 336639 -1790515 -1684815 -328520 1457192 2981399 2815091 641560 -1079271 -132506
39285 -132506 1738735 1207818 -1455252 -3052329 -2675194 -2362718 -2660924 -1729099 465900
39276 465900 1205967 -331816 -1199746 746128 3656267 5014118 5146239 5295174 4977513
39267 4977513 3618932 2395800 2071047 1232083 -913919 -2219519 -788603 1455848
39259A455848j50777k504896k409242j312681o15817P84417K883124K832111k79594
39250F82493k688266j305348J444828J662045p4061o86339m3579q1706l59298
39241a449231Q29896K069798M85734k567145k587110P33204K384326j10599k670597
39232b881724j295110J665778J822858j42494n28780N37824j59419k230519j587475
39223d799061K207116M142989J538495j436700n02661J747343L57482l506240
39215b51237m254018p60737K261792K023224J226328K282855K979738Q39785k076557
39206D271173k371739p17837l32064j641083k093072o06250J044089J294567O54681
39197d97535K29408L85497J099496J975577J875723J03468k069357k611738j442807
$$ plain form
39259 1455848 1305071 -1199825 -3609067 -4921748 -5537565 -4753148 -1870024 962087 682493
39250 682493 -2005773 -3311121 -1866293 -204248 -278309 -964648 -1008227 -1089933 -1449231
39241 -1449231 -619335 1450463 1936197 -630948 -3218058 -2484854 -100528 -211127 -2881724
39232 -2881724 -4176834 -2511056 -688198 -830692 -1359472 -821648 -981067 -3211586 -4799061
39223 -4799061 -2591945 1551044 3089539 1652839 1150178 2897521 3255003 -251237
39215 -251237 -4505255 -5265992 -3004200 -980976 245352 2528207 5507945 6347730 4271173
39206 4271173 1899434 1181597 849533 -791550 -2884622 -3490872 -2446783 -1152216 -497535
39197 -497535 -268127 117370 1216866 3192443 5068166 5171634 3102277 490539 -952268
39188i52268l71697l31445l67054L30737J031484Q04824L7390k24248K40461O63093
39178H61277L48868m07884n24882M71195J303729J66022k472160l576815j249299
39169e079949K347307L371217R92815j940324k573700p86241J542960K467424
39161C41509J222720j089250k150964r72936O08890L88058r12569q09549Q72042
39152b502049J641353L69648r05217k45511J306331J608865N54028l25648l15884
39143A185916l7292p7093l17231l42222J90975J191051J754589Q93298r12113
39134C529878j793602p60422R68688J570546P43849m49723j057269q21023o8004
39125A862918K71428o52875k170477k278542k35570J975915K048417M43703m55272
$$ plain form
39188 -952268 -1323965 -1655410 -2022464 -1691727 -660243 144581 181971 -42277 198184 861277
39178 861277 1210145 802261 277379 748574 2052303 2218325 -253835 -3830650 -5079949
39169 -5079949 -2732642 638575 1631390 -308934 -2882634 -3668875 -2125915 341509
39161 341509 1564229 474979 -1675985 -2648921 -2040031 -1651973 -2564542 -3374091 -2502049
39152 -2502049 -860696 -491048 -1396265 -1641776 -335445 1273420 1827448 1501800 1185916
39143 1185916 1148624 1071531 754300 412078 603053 1794104 3548693 4441991 3529878
39134 3529878 1736276 975854 1944542 3515088 4258937 3809214 2751945 1930922 1862918
39125 1862918 2134346 1481471 -689006 -2967548 -3203118 -1227203 821214 1264917 809645
39116H09645J74730P76951J94279n51152j14886Q70894O87106q44295j934843
39107F8429j149051P63967J779646Q65833j056908k187030j575677O1497J069507
39098a359787N53067n89909p23002L81550J251393R68566N56284J023309J246734
39089C308205j97319j896885j108453J559775K244478l05527k332234p26796K020460
39080B565704J754375r35701k254739j465758j003877j112324N06263L226426
39072A280369K937682j193074m126586k075016J687801J852881j072683k245455
39064b954081n1636K231576J891734L4354j037699p06868L75550J335880J170626
39055B289436l50401j598878p39088J358112J855958l184j692483j093679N18800
$$ plain form
39116 809645 984375 1761326 1955605 1404453 1289567 2160461 2847567 2003272 68429
39107 68429 -1080622 -316655 1462991 2328824 1271916 -915114 -2490791 -2429294 -1359787
39098 -1359787 -806720 -1396629 -2119631 -1738081 -486688 481878 1038162 2061471 3308205
39089 3308205 3110886 1214001 105548 1665323 3909801 3604274 1272040 545244 2565704
39080 2565704 4320079 3384378 1129639 -336119 -1339996 -2452320 -1946057 1280369
39072 1280369 4218051 3024977 -1101609 -3176625 -1488824 364057 -708626 -2954081
39064 -2954081 -3005717 -774141 1117593 1151947 114248 -592620 -217070 1118810 2289436
39055 2289436 1939035 340157 -398931 959181 2815139 2811955 1119472 25793 544593
39046E44593N85761r45143j631339l170K340171K579692J47682k346185k113812
39037h41750L19793J812607Q91046m40569j60981N12617n02633k076954j309985
39028a796809J438323K450551K50197j963474j069656J483744K183222N25236
39020C501334r50784o62641L91256O98537K2921q72489r79688K95220K153612
39011C597278K574846O79682j677048k129174j011812n26768j089394q22485R80105
39002E75230K282150J394532k85524l82088Q71216J185581j79561j450354j190404
38993B820778k70975j24936m53172r9018N53120j28574k138910k986701r14359
38984c742747K125790K481316m23478l177721k802100l53794J126020Q58792N70436
$$ plain form
39046 544593 1130354 185211 -1446128 -1449298 890873 3470565 3618247 1272062 -841750
39037 -841750 -521957 1290650 2181696 1741127 1580146 2092763 1590130 -486824 -1796809
39028 -1796809 -358486 2092065 2342262 378788 -690868 792876 2976098 3501334
39020 3501334 2550550 1887909 2279165 2977702 3000623 2128134 1148446 1443666 3597278
39011 3597278 6172124 6851806 5174758 3045584 2033772 1507004 417610 -404875 575230
39002 575230 2857380 4251912 3966388 3584300 4455516 5641097 5461536 4011182 2820778
38993 2820778 2549803 2424867 1971695 1872677 2425797 2297223 158313 -2828388 -3742747
38984 -3742747 -1616957 864359 440881 -2736840 -5538940 -5892734 -4766714 -3907922 -3337486
38975c337486J156111J437331O14187j20004M29528J309765Q17639p10259j179342
38966D17470J96640J561764Q24334j445232k537570r78330J516494K086600K67816
38957A909986j568856j432007r7281N15615J63083J3815L68947N30197N91875
38948I95374J227965J665673L31817j910650j912814R97478L106839J405850j758547
38939D148985k110090K34092J495083L92058m43899N47221J312256j02561k421912
38930C051233l385698k652165q96545J589908L638615K948636n96112l353023
$$ plain form
38975 -3337486 -2181375 -744044 -129857 -249861 179667 1489432 2307071 1596812 417470
38966 417470 614110 2175874 3000208 1554976 -982594 -1960924 -444430 1642170 1909986
38957 1909986 341130 -1090877 -1188158 -672543 -509460 -495645 -126698 403499 995374
38948 995374 2223339 3889012 4220829 2310179 397365 1394843 4501682 5907532 4148985
38939 4148985 2038895 2272987 3768070 4160128 3716229 4263450 5575706 5473145 3051233
38930 3051233 -334465 -2986630 -3883175 -2293267 1345348 4293984 3697872 344849
$$ [...]
##END NTUPLES=NMR SPECTRUM
##END=
