##TITLE=31Pdec_PR197_int
 D2O, 24 sc
 12.1.2022
##JCAMPDX= 6.0         $$ Bruker NMR JCAMP-DX V2.0
##DATA TYPE= NMR SPECTRUM
##DATA CLASS= NTUPLES
##ORIGIN= UXNMR, Bruker Analytische Messtechnik GmbH
##OWNER= root
$$ XWIN-NMR		Version 3.5
$$ Wed Jan 12 10:30:10 2022 Russian Standard Time (UT+4h)  she@DPX200
##.OBSERVE FREQUENCY= 81.013821
##.OBSERVE NUCLEUS= ^31P
##.ACQUISITION MODE= SIMULTANEOUS
##.ACQUISITION SCHEME= undefined
##.AVERAGES= 24
##.DIGITISER RES= 16
##SPECTROMETER/DATA SYSTEM= spect
##.PULSE SEQUENCE= zgpg30
##.SOLVENT NAME= CDCl3
##.SHIFT REFERENCE= (INTERNAL, CDCl3, 0, 248.564)
##AUDIT TRAIL= $$ (NUMBER, WHEN, WHO, WHERE, WHAT)
$$ ##TITLE= Audit trail, XWIN-NMR		Version 3.5
$$ ##JCAMPDX= 5.01
$$ ##ORIGIN= Bruker BioSpin GmbH
$$ ##OWNER= she
$$ F:/spectra/data/she/nmr/P31/1/pdata/1/auditp.txt
$$ ##AUDIT TRAIL=  $$ (NUMBER, WHEN, WHO, WHERE, WHAT)
(   1,<2022-01-12 10:28:55.40 +0400>,<she>,<DPX200>,
      <created by zg, POWCHK disabled, PULCHK disabled
       configuration hash MD5:
       00 E9 B6 7A A2 85 ED C7 34 08 36 98 17 FE 4E 26
       data hash MD5: 32K
       C3 AC E8 5B 6C 97 2E EF 90 6A DA FA 18 60 EE 0F>)
(   2,<2022-01-12 10:28:59.93 +0400>,<she>,<DPX200>,
      <Start of raw data processing
       efp BC_mod = 2 LB = 1 FT_mod = 6 PKNL = 1 PHC0 = -9173.396 PHC1 = 93.46992 SI = 64K 
       data hash MD5: 64K
       94 16 16 4B 10 3D F0 C8 4D 5B AC CF D9 C3 74 AE>)
(   3,<2022-01-12 10:29:29.92 +0400>,<she>,<DPX200>,
      <pk PHC0 = 31.94411 PHC1 = -126 
       data hash MD5: 64K
       88 E0 FB 43 4A 41 FE 16 34 9F B3 1B 5D 34 36 9D>)
$$ ##END=
$$ 
$$ hash MD5
$$ 55 4A 3D DE FB 91 F9 54 48 16 EA CB B8 99 B5 80
##$RELAX= 
##$RELAX= 
##$RELAX= 
##$RELAX= 
##$RELAX= 
##$RELAX= 
##$RELAX= 
##$RELAX= 
$$ Bruker specific parameters
$$ --------------------------
##$DU= <F:/spectra>
##$EXPNO= 1
##$NAME= <P31>
##$PROCNO= 1
##$TYPE= <nmr>
##$USER= <she>
##$AMP= (0..31)
100 100 100 100 100 100 100 100 100 100 100 100 100 100 100 100 100 100 
100 100 100 100 100 100 100 100 100 100 100 100 100 100 
##$AQSEQ= 0
##$AQ_mod= 1
##$AUNM= <au_zg>
##$AUTOPOS= <>
##$BF1= 81.014009
##$BF2= 200.13
##$BF3= 200.13
##$BF4= 200.13
##$BF5= 200.13
##$BF6= 200.13
##$BF7= 200.13
##$BF8= 200.13
##$BYTORDA= 1
##$CFDGTYP= 0
##$CFRGTYP= 5
##$CHEMSTR= <none>
##$CNST= (0..31)
1 1 145 1 1 1 1 1 1 1 1 1 1 1 1 1 1 1 1 1 1 1 1 1 1 1 1 1 1 1 1 1 
##$CPDPRG= <waltz16>
##$CPDPRG1= <>
##$CPDPRG2= <waltz16>
##$CPDPRG3= <>
##$CPDPRG4= <mlev>
##$CPDPRG5= <mlev>
##$CPDPRG6= <mlev>
##$CPDPRG7= <mlev>
##$CPDPRG8= <mlev>
##$CPDPRGB= <>
##$CPDPRGT= <>
##$D= (0..31)
0 1 0 0 0 0 0 0 0 0 0 0.03 2e-05 3e-06 0 0 0 0 0 0 0 0 0 0 0 0 0 0 0 0 
0 0 
##$DATE= 1641968934
##$DBL= (0..7)
120 120 120 11 120 120 24 19 
##$DBP= (0..7)
150 150 150 150 150 150 150 150 
##$DBP07= 0
##$DBPNAM0= <>
##$DBPNAM1= <>
##$DBPNAM2= <>
##$DBPNAM3= <>
##$DBPNAM4= <>
##$DBPNAM5= <>
##$DBPNAM6= <>
##$DBPNAM7= <>
##$DBPOAL= (0..7)
0.5 0.5 0.5 0.5 0.5 0.5 0.5 0.5 
##$DBPOFFS= (0..7)
0 0 0 0 0 0 0 0 
$$ [...]
##$SUBNAM2= <"">
##$SUBNAM3= <"">
##$SUBNAM4= <"">
##$SUBNAM5= <"">
##$SUBNAM6= <"">
##$SUBNAM7= <"">
##$SUBNAM8= <"">
##$SUBNAM9= <"">
##$SW= 501.771253377433
##$SWIBOX= (0..15)
0 1 3 0 0 0 0 0 0 0 0 0 0 0 0 0 
##$SW_h= 40650.406504065
##$TD= 32768
##$TD0= 1
##$TE= 0
##$TE2= 300
##$TE3= 300
##$TEG= 300
##$TL= (0..7)
0 120 53 12 22 120 120 120 
##$TP= (0..7)
150 150 150 150 150 150 150 150 
##$TP07= 0
##$TPNAME0= <>
##$TPNAME1= <>
##$TPNAME2= <>
##$TPNAME3= <>
##$TPNAME4= <>
##$TPNAME5= <>
##$TPNAME6= <>
##$TPNAME7= <>
##$TPOAL= (0..7)
0.5 0.5 0.5 0.5 0.5 0.5 0.5 0.5 
##$TPOFFS= (0..7)
0 0 0 0 0 0 0 0 
##$TUNHIN= 0
##$TUNHOUT= 0
##$TUNXOUT= 0
##$USERA1= <user>
##$USERA2= <user>
##$USERA3= <user>
##$USERA4= <user>
##$USERA5= <user>
##$V9= 5
##$VALIST= <valist>
##$VCLIST= <CCCCCCCCCCCCCCC>
##$VD= 0
##$VDLIST= <DDDDDDDDDDDDDDD>
##$VPLIST= <PPPPPPPPPPPPPPP>
##$VTLIST= <TTTTTTTTTTTTTTT>
##$WBST= 1024
##$WBSW= 4
##$XGAIN= (0..3)
0 0 0 0 
##$XL= 0
##$YL= 0
##$YMAX_a= 1403
##$YMIN_a= -1622
##$ZGOPTNS= <>
##$ZL1= 120
##$ZL2= 120
##$ZL3= 120
##$ZL4= 120
##$ABSF1= 0
##$ABSF2= 0
##$ABSG= 0
##$ABSL= 0
##$ALPHA= 0
##$AQORDER= 0
##$ASSFAC= 0
##$ASSFACI= 0
##$ASSFACX= 0
##$ASSWID= 0
##$AUNMP= <proc_1d>
##$AZFE= 0.1
##$AZFW= 0.5
##$BCFW= 0
##$BC_mod= 2
##$BYTORDP= 0
##$COROFFS= 0
##$CY= -3
##$DATMOD= 1
##$DC= 0
##$DFILT= <>
##$DTYPP= 0
##$F1P= 0
##$F2P= 0
##$FCOR= 1
##$FTSIZE= 65536
##$FT_mod= 6
##$GAMMA= 0
##$GB= 0
##$INTBC= 1
##$INTSCL= 5.30512e-09
##$ISEN= 30
##$LB= 1
##$LEV0= 0
##$LPBIN= 0
##$MAXI= 10000
##$MC2= 0
##$MEAN= 0
##$ME_mod= 0
##$MI= 50
##$NCOEF= 0
##$NC_proc= -7
##$NLEV= 6
##$NOISF1= 182.463
##$NOISF2= 159.3651
##$NSP= 0
##$NTH_PI= 0
##$NZP= 0
##$OFFSET= 248.5645
##$PC= 4
##$PHC0= -9141.452
##$PHC1= -32.53008
##$PH_mod= 1
##$PKNL= yes
##$PPARMOD= 0
##$PSCAL= 0
##$PSIGN= 0
##$REVERSE= no
##$SF= 81.014009
##$SI= 65536
##$SIGF1= 159.3651
##$SIGF2= -187.1042
##$SINO= 113.3802
##$SIOLD= 16384
##$SREGLST= <1H.CDCl3>
##$SSB= 0
##$STSI= 65536
##$STSR= 0
##$SW_p= 40650.406504065
##$SYMM= 0
##$S_DEV= 0
##$TDeff= 32768
##$TDoff= 0
##$TI= <>
##$TILT= no
##$TM1= 0
##$TM2= 0
##$TOPLEV= 0
##$USERP1= <user>
##$USERP2= <user>
##$USERP3= <user>
##$USERP4= <user>
##$USERP5= <user>
##$WDW= 1
##$XDIM= 65536
##$YMAX_p= 308886344
##$YMIN_p= -140702924
$$ End of Bruker specific parameters
$$ ---------------------------------
##NTUPLES= NMR SPECTRUM
##VAR_NAME=  FREQUENCY,     SPECTRUM/REAL,   SPECTRUM/IMAG
##SYMBOL=    X,             R,               I
##VAR_TYPE=  INDEPENDENT,   DEPENDENT,       DEPENDENT
##VAR_FORM=  AFFN,          ASDF,            ASDF
##VAR_DIM=   65536,         65536,           65536
##UNITS=     HZ,            ARBITRARY UNITS, ARBITRARY UNITS
##FACTOR=    0.620285442955139, 1,           1
##FIRST=     20137.2065510759, 0,            0
##LAST=      -20513.1999529892, 0,           0
##MIN=       -20513.1999529892, -140702924,  0
##MAX=       20137.2065510759, 308886344,    0
$$ Real data points
##PAGE= N=1
##DATA TABLE= (X++(R..R)), XYDATA
$$ [...]
45207 -4499756 -3636288 -1862354 -866233 -368582 357769 359767 -1210815 -2786110 -2513766
45198 -2513766 -1498152 -2202676 -4460540 -5698443 -4568494 -1984572 864632 3177529
45190 3177529 3785880 2173985 -74521 -1018657 -1062001 -1746362 -2608666 -1902158 42992
45181 42992 1128100 1081933 1722941 3272386 3448679 1192316 -1400186 -2160791 -1584111
45172 -1584111 -1050324 -363607 1190727 2872243 3409233 2929780 2385756 1829019 818520
45163 818520 -31582 374298 1547361 1551927 -276051 -2061638 -1834831 -361806 -97486
45154 -97486 -1536681 -2312809 -572447 2288100 3575693 2829111 1658612 902655 110162
45145 110162 -525683 -155480 701347 628736 200836 1629498 4664367 5845889 3467544
45136 3467544 433918 -67470 840344 296479 -1265565 -1106191 998248 2391501 1651079
45127 1651079 57185 -1047745 -1670298 -1681413 -382490 1784213 2975207 2151592 333615
45118 333615 -753881 -401413 756193 1387323 686851 -516258 -607457 365206 462653
45109 462653 -1091066 -2459604 -2162692 -1398312 -1420575 -821713 1761121 4138356 3262777
45100 3262777 198863 -1295820 -412664 314507 -90544 140382 1445890 1751569 465057
45091 465057 -50220 1403031 2530529 1308470 -719152 -1141680 -433100 -584673 -1565716
45082 -1565716 -1554516 74305 1910710 2346949 1003446 -1378360 -3562564 -4539186 -4128924
45073 -4128924 -2782721 -944759 904738 2058210 2355222 2632296 3287184 3137461 1279909
45064 1279909 -644925 -126641 2596633 4717340 4528079 2800427 626116 -1751842
45056 -1751842 -3723842 -4192662 -3156434 -1652588 -124352 1288598 1342754 -826150 -3149606
45047 -3149606 -2638877 21997 1208181 -84150 -1145611 -723146 -1106549 -3401774 -4754715
45038 -4754715 -2827367 295998 1446086 737462 -196148 -1551893 -3720360 -4657457 -2482168
45029 -2482168 854606 1830625 121798 -1877640 -3092629 -4176068 -4819559 -3945789 -2242257
45020 -2242257 -1570103 -1954126 -1734173 -568407 191584 17623 -326161 -793074 -2091187
45011 -2091187 -3536584 -3251449 -1022095 1031003 1159991 -298366 -2174837 -3701395
45003 -3701395 -4265331 -3746869 -3435929 -4796217 -6917376 -7123293 -4753097 -2369380 -2183073
44994 -2183073 -3085288 -2656523 -718664 765702 466152 -1177351 -3009447 -3926165 -3024736
44985 -3024736 -512126 1635694 1427657 -468882 -1168289 814050 3652325 4682016
44977 4682016 3548027 1735643 94547 -1422073 -2181304 -1172426 974977 2240839
44969 2240839 2000102 1759129 2475758 3087008 2695030 2239463 2612602 2991292 2677702
44960 2677702 2709754 3684352 3896087 2063493 125877 465218 1879572 1529082 -405687
44951 -405687 -1536565 -1624264 -2143497 -2281833 77684 3455595 3686522 468558 -1750757
44942 -1750757 -772347 198886 -1553633 -3743028 -3344667 -1549705 -1158296 -2028734 -2342553
44933 -2342553 -1941916 -1449878 -324816 1400809 1606504 -899652 -3782853 -4158888 -2274335
44924 -2274335 26503 2197850 3923320 3713366 1445072 -114174 646387 1075652 -1426191
44915 -1426191 -4455457 -3981521 -747385 1054657 307632 -136923 1407856 3356776 3908230
44906 3908230 3046717 1500690 232700 520461 2242412 3005863 1319058 -739407 -608801
44897 -608801 738094 967412 739561 2175747 4472196 5060458 4021541 3331140 2788668
44888 2788668 960800 -770363 237718 2767832 2931265 440488 -981268 261798
44880 261798 1682285 1460849 736201 402516 -159603 -420546 1011807 2708260 1396276
44871 1396276 -2438402 -4353969 -2483670 201992 1398415 2454923 4107463 4071778
44863 4071778 1393472 -1125791 -1520945 -1650469 -2876466 -2860035 65546 3052047 2966094
44854 2966094 1396439 1690193 3520610 4119698 2929293 1524230 454288 -709460
44846 -709460 -1487826 -1364605 -1281760 -1940898 -2045201 -404695 1787593 2887592 3278231
44837 3278231 3797161 3592755 1939709 448240 951937 2618681 3433257 3136871 2579465
44828 2579465 1692649 278141 -662343 -473560 -279222 -996830 -1584614 -1138248 -864839
44819 -864839 -1949996 -3372827 -3901272 -4223475 -4953609 -4740095 -2742247 -745293 -289853
44810 -289853 -45184 1264024 1905896 311645 -1349758 -481037 1306339 922534 -740785
44801 -740785 -399698 2091684 4238792 5670916 7708733 9052590 6959128 2653288
44793 2653288 648090 2072170 3220144 1733925 -67655 462576 2380809 3456494
44785 3456494 3440153 3203102 2834507 2058036 931822 -540282 -1958501 -1882625 217433
44776 217433 1862169 242705 -3352346 -5051583 -4127774 -3413778 -3843003 -2994131 -192524
44767 -192524 1406113 -64521 -1916707 -1399606 -23715 -360142 -1449886 -884715 705253
44758 705253 922569 54947 680881 3244798 5124186 4354097 1938451 36150 -349898
44749 -349898 595714 2311284 3952131 4457996 3265217 979755 -837654 -901097 432675
44740 432675 1372241 857960 2116 387549 1539156 1626511 343075 -796826 -1073979
44731 -1073979 -1473196 -2572022 -3475427 -3553460 -3482937 -3789034 -3986103 -3902020 -4173718 -4635697
44721 -4635697 -3977822 -1970999 -301559 -76652 -154554 831374 2399544 3497639 4277803
44712 4277803 5080266 5094818 3771899 2414385 2571059 3698461 4116643 3560444 3030650
44703 3030650 2585404 1084841 -1796202 -4659373 -5784225 -4710290 -2421276 -509992
44695 -509992 -4446 -542036 -822952 -12624 1656767 3510535 4791361 4501088 2182439
44686 2182439 -885149 -2587880 -2412594 -1596564 -658733 1220000 3676883 4398821 2448516
44677 2448516 335233 676937 2358347 2370342 320021 -1491308 -1842630 -1741127 -1884861
44668 -1884861 -1658856 -1209589 -2064590 -4481031 -6089649 -4822951 -2002515 -745892 -1845110
44659 -1845110 -3012252 -2346497 -843445 -506960 -1243088 -1353196 -667319 -993628 -2785880
44650 -2785880 -3519874 -1171108 2256443 3185064 1652976 1124294 3042732 4678776 3549127
44641 3549127 1297498 1221998 3710835 6169198 6436305 4610006 2284522 1309166 2463334
44632 2463334 4232031 3932704 1153871 -1303959 -1326190 -720762 -2447269 -5870064 -7472149
44623 -7472149 -5877750 -3443063 -2474378 -2242928 -826768 1697027 3271536 2509499 444516
44614 444516 -415592 1271416 3999942 4898119 3160705 1085606 955499 1977996 1720819
44605 1720819 -176264 -1567780 -1028064 188579 -60346 -2188275 -4690598 -5952204
44597 -5952204 -5719844 -4907441 -4130836 -2791387 -280578 2115252 2012832 -740621 -3139321
44588 -3139321 -2753063 -1032087 -1054965 -2962768 -3880888 -2106241 788326 2289920 1613294
44579 1613294 -408498 -2616773 -4085297 -4386886 -3813897 -2857810 -1633803 -436983 -197551
44570 -197551 -1201494 -2002535 -1191347 179026 -241825 -2637853 -4597147 -4263253 -2120591
44561 -2120591 517448 2847513 4012217 3231407 1289689 152135 303661 174154 -976422
44552 -976422 -1497523 103568 2744670 4363528 4548477 4138670 3530229 2973990 3350794
44543 3350794 4837000 5698502 4238896 1273682 -1052542 -2157504 -2778778 -2581685 -572580
44534 -572580 2112913 2528804 -93494 -2852871 -2915260 -976917 467099 804524 1341692
44525 1341692 2505333 3054800 2069197 157589 -1548645 -2423560 -2183577 -889133 523183
44516 523183 831756 224644 388577 2114990 3694174 2799753 -480662 -3586937 -4290409
44507 -4290409 -2599940 -2574 2055127 2686998 1682926 -133189 -1221095 -753088
44499 -753088 421550 731577 -252312 -1306873 -1026844 426985 1374400 547414 -1368423
44490 -1368423 -2671100 -2894724 -3085501 -3642261 -3331353 -1409990 676548 1365976 1618393
44481 1618393 3235445 5205339 4541137 954470 -2207086 -2627662 -1895315 -2219467 -2884184
44472 -2884184 -2191413 -815780 -440657 -415617 1260637 4230758 5883061 5162483 3780739
44463 3780739 3240069 2821472 1289575 -1037655 -2801605 -3214707 -2635063 -2155614 -2652033
44454 -2652033 -3637263 -3484561 -1636173 119239 -166497 -1836299 -2623859 -1843055 -800460
44445 -800460 -460634 -674613 -1472053 -2954999 -3884163 -2616035 196677 1940622 1537194
44436 1537194 585604 574044 1124396 1632248 2336206 2825830 1845057 -124887 -395992
44427 -395992 2101408 4611901 4261635 2214559 1680804 3026386 3594273 1955516 -231649
44418 -231649 -917859 -216332 477937 646096 1054430 2421516 4127973 4409900 2197038
44409 2197038 -1231387 -3176930 -2408908 -361512 830289 546413 -377840 -761474 291039
44400 291039 2503861 3673762 1555488 -2592562 -4362350 -1649851 2158326 2578564
44392 2578564 -28738 -1581189 -200496 2080223 3168210 3285569 3025628 1921739
44384 1921739 104758 -878599 -318882 296812 -379035 -1237433 -338846 2021076 3530474
44375 3530474 2947530 1634317 1657147 3072352 3723332 1852177 -1445948 -3095159 -1579036
44366 -1579036 1309536 2940949 2962568 2575013 1751290 -515434 -3429122 -4540394 -3403838
44357 -3403838 -2579067 -3585686 -4185464 -1907453 1478809 1925236 -1172822 -4209234 -4530458
44348 -4530458 -3563195 -3743441 -4723074 -4508522 -2874748 -1449781 -933971 -263428 1248705
44339 1248705 2540790 2280878 782981 -278352 351474 2420101 4518898 5259370 4417868
44330 4417868 3073985 2345332 2073701 1274113 -262449 -1654309 -2262354 -2346500 -2162849
44321 -2162849 -1543798 -833004 -955143 -1773213 -1726419 -254714 793863 -175096 -1655690
44312 -1655690 -1050561 1249058 2343478 1165641 -377110 -937542 -1569480 -2954722 -3413421
44303 -3413421 -1509085 1286548 2552069 2179876 1734419 1636953 1044174 -90619 -763460
44294 -763460 -499584 340111 1574620 3105618 4065775 3534975 2088570 1360369 1985484
44285 1985484 2998450 3255254 2523374 1270599 303245 497209 1978027 3643415 4266492
44276 4266492 3889772 3458340 3519855 4102465 5238927 6429021 6120351 3247419 -816295
44267 -816295 -3297701 -3192948 -2151339 -1961324 -2405291 -2169704 -928602 272910 386268
44258 386268 -360658 -565797 908383 3508721 5291422 4821132 2396147 -635274 -2979283
44249 -2979283 -3669864 -2464737 -594514 69572 -627391 -869254 179282 831093 -317312
44240 -317312 -1767362 -1318961 540746 1767536 2032651 2202874 1619185 -869926 -3602671
44231 -3602671 -3355290 -285460 1685789 369538 -1834714 -1932723 -476345 107678 -764434
44222 -764434 -1778418 -2030694 -1662408 -1003069 -306109 204842 590730 855859 424425
44213 424425 -893827 -1803994 -1178791 -390390 -1519095 -3376987 -2418207 1874512 5810988
44204 5810988 6748292 6158702 5969658 5422108 3823007 2966456 3774670 3499408 -159597
44195 -159597 -4495668 -5174997 -2425339 -11434 560082 758397 884699 -469750 -2842284
44186 -2842284 -3748023 -2717921 -2141331 -3328778 -4677962 -4555787 -3354965 -1903400 -297242
44177 -297242 895022 586596 -845685 -1609267 -1186028 -950876 -1601918 -2150855 -2052113
44168 -2052113 -2103542 -2549375 -2517154 -2042058 -2311545 -3114212 -2626753 -871311 -652600 -3265685
44158 -3265685 -5688219 -4374219 -148565 3010991 2922193 806319 -1167983 -1837273 -896416
44149 -896416 1363499 3883365 5284023 4700302 2273827 -483036 -1084468 1573242 5054922
44140 5054922 5513162 2524554 -372057 -808646 -603364 -2002735 -3694222 -3383876 -2307910
44131 -2307910 -3638857 -7207024 -9174371 -7064807 -2443314 1661494 3645321 3337835
44123 3337835 1442450 -333407 -442760 488020 299893 -1590146 -3310819 -3307796 -2349841
44114 -2349841 -1909612 -1949951 -1434110 -125186 1148902 1558788 1005368 204313 283323
44105 283323 1681216 3295334 3507048 2250268 1202472 1671662 3190417 4494419 4915900
44096 4915900 4387407 3074365 1643143 1051941 1389922 1627759 1109332 442187 127392
44087 127392 -742115 -3071549 -5515586 -5263225 -1479875 3154078 5050980 3237898 -321758
44078 -321758 -3265248 -4666940 -4597609 -3241943 -1134550 624360 1388415 1753952 2410732
44069 2410732 2712171 1668126 25105 -343388 781063 1714873 1896239 2867498 4975212
44060 4975212 5497897 2456660 -1473893 -1949243 1015842 3273804 2628538 1230397 1200179
44051 1200179 1303137 -224188 -2276135 -2727139 -1867790 -1530998 -1931549 -1714637 -484278
44042 -484278 856764 1898936 2843946 3010102 1266043 -1714866 -3363633 -2092720 818394
44033 818394 2742055 2314395 263199 -1565314 -1749392 -535608 366871 -103148 -637145
44024 -637145 981281 4652319 7483167 7034959 3990736 945956 -512487 -688003 -523875
44015 -523875 -563347 -838098 -835092 330750 2857903 5294988 5440336 2623791 -1304354
44006 -1304354 -3612963 -3126053 -867922 1337756 2433342 2419855 1728366 700834 -519135
43997 -519135 -1925158 -3397199 -4308454 -3710846 -1479146 909045 1582636 452904 -675769
43988 -675769 -592900 -335334 -1497768 -3693012 -5026799 -4807468 -4313781 -4612904 -4923742
43979 -4923742 -3849705 -1388878 1015828 1935998 1000743 -955823 -2332501 -1944994 -308924
43970 -308924 758070 229701 -1063668 -1847877 -1941702 -1694648 -980832 94121 435956
43961 435956 -606071 -1821132 -1869528 -1685788 -2880265 -4209950 -2689541 1302292 3406253
43952 3406253 1461792 -815544 859692 4784768 5707846 2486982 -785915 -1142440
43944 -1142440 -125880 100116 262340 1609876 2924566 2400213 638391 -549806 -923082
43935 -923082 -1237507 -1169388 -138994 703674 -219279 -1987863 -1870106 948927 4226798
43926 4226798 5538318 4738551 3264802 2338562 2259102 2498987 2204223 1179696 214670
43917 214670 -94399 -206049 -585037 -777441 -617125 -1130670 -2659953 -3345930 -1596749
43908 -1596749 1001738 1728990 814856 669388 1756923 2554731 3220288 5358926 7819289
43899 7819289 7057169 2992907 214074 1170835 2268233 -211803 -3981563 -4498729 -2031103
43890 -2031103 -497436 -1065518 -1515044 -1053497 -1186341 -1870236 -1164800 576597 138949
43881 138949 -3509804 -6909441 -6739149 -4245082 -2941798 -3622562 -3832432 -1597392 1986074
43872 1986074 3924849 2438363 -1129937 -3596361 -3407935 -2235361 -2350627 -3341736 -3000860
43863 -3000860 -933027 698698 175074 -1707298 -2959158 -2524722 -781397 1073987
43855 1073987 1989360 2098563 2464292 3192341 2935339 1424512 868101 2720215 4569180
43846 4569180 3210401 -145343 -1222819 1021689 3150997 2753206 1548979 1840936
43838 1840936 3147867 3993912 4279466 4133693 2770414 202924 -1886563 -2423006 -2226118
43829 -2226118 -2010839 -1308678 -360515 -493484 -1372992 -666423 2005578 3654984 2311665
43820 2311665 -50727 -1032546 -1237943 -1752787 -1345190 705568 1874446 123073 -2081505
43811 -2081505 -1403630 821627 966846 -642001 -517589 1887168 3576671 3295023 2923283
43802 2923283 3275197 2717064 834296 -258342 565302 1709213 1700866 1084691 662967
43793 662967 376789 518655 1514645 2089167 336802 -3007810 -5191304 -5607654 -6168821
43784 -6168821 -7118250 -6188829 -3047046 -842401 -1494253 -2749592 -2107412 -682953 -628048
43775 -628048 -1224324 -398902 1593403 2686462 2161099 1172389 856731 1384827 2153834
43766 2153834 2086663 852005 133994 1822681 4573884 4765959 1700527 -1155974 -1441171
43757 -1441171 -1079519 -2188132 -3256568 -2369219 -1209204 -2198872 -3939033 -3364212 -767710
43748 -767710 1147155 1855115 2721194 3231286 1737730 -538474 -543967 1449607 1863220
43739 1863220 -408521 -2232563 -1383220 340030 878893 1408675 3656209 6247464 6397653
43730 6397653 3803008 652648 -1311640 -2039989 -2204411 -2346155 -2487694 -1794788 623497
43721 623497 3983521 5951632 5249012 3138499 1637014 1314517 1528599 1618447 1028689
43712 1028689 -528340 -2059446 -1655795 970528 3457842 3673306 2616203 2806291 4491302
43703 4491302 5408133 4255316 2543087 2394478 3851804 5230695 5297371 4153350 2402354
43694 2402354 455120 -1220094 -1957604 -1602629 -1070864 -1509643 -2779888 -3410097 -2497944
43685 -2497944 -1125750 -1101782 -2497409 -3392755 -2317784 -66876 1573649 2246818 3038316
43676 3038316 4125185 3843394 1139979 -1973250 -2290284 153297 1618556 -188578
43668 -188578 -2474984 -1146919 3090028 5568313 4293592 2162268 1717830 1386622 -874483
43659 -874483 -3293670 -2869725 -270212 1243078 617381 -514463 -1330435 -2387666 -3043387
43650 -3043387 -1835215 269948 398577 -1644252 -2501617 -314054 2189964 1490321 -1980591
43641 -1980591 -4818961 -4906412 -3035189 -1327799 -1271298 -2523309 -3089506 -1738099 -261311
43632 -261311 -1471801 -4816471 -6584190 -5197909 -3315231 -3209496 -3200404 -1103889 1513112
43623 1513112 1719817 -55727 -1046199 -572720 -90079 266074 1648022 3364224 3291517
43614 3291517 1667168 1205313 2771446 3973031 3072536 1479320 912071 576452 -947845
43605 -947845 -2879856 -3340149 -2136356 -697902 -11374 -78514 -779312 -1896115 -2646493
43596 -2646493 -2334531 -1328363 -680477 -1022615 -2271786 -3908776 -5094005 -5169298 -4571664
43587 -4571664 -4546482 -5427843 -6052953 -5532647 -4599389 -4231487 -3928776 -2743865 -1347572
43578 -1347572 -1360281 -2694633 -3157062 -1146972 2353393 4941949 5087426 2923049 -287283
43569 -287283 -2884411 -3787331 -3476025 -3573525 -4907851 -6446184 -6653177 -5290184 -3143551
43560 -3143551 -666384 1880726 3322884 2311971 -393517 -1972604 -974862 435018
43552 435018 -822585 -4446921 -6961193 -6218091 -3883957 -2731085 -2994157 -2745621 -1029281
43543 -1029281 927587 1587781 1042862 710658 1643993 3423524 4563842 4023779 2371252
43534 2371252 1172750 1148347 1480529 1201419 493978 21513 -240056 -542295 -391864
43525 -391864 669191 1638430 903473 -1343729 -2966577 -2654012 -1576712 -1494575 -2246194
43516 -2246194 -2223357 -803022 815622 1201006 366448 -397527 -133468 525184 -25825
43507 -25825 -2204016 -4140978 -3637674 -1079003 849502 619920 -399573 -395746 238807
43498 238807 125161 -463980 -159661 929036 1338778 844283 712459 991926 -130457
43489 -130457 -3128525 -5292164 -3889137 21091 2722798 2086082 -887721 -4076333
43481 -4076333 -6031022 -6140175 -4847250 -3756060 -3940036 -4135691 -2338049 669154 1458836
43472 1458836 -1508319 -5286979 -5711952 -2095602 2511595 4731083 3377712 -392638
43464 -392638 -4001445 -5087613 -3522406 -1517295 -965155 -1372581 -1248297 -452197 166226
43455 166226 498938 902663 893145 -148790 -1470550 -1851439 -1498981 -1273516 -732529 779861
43445 779861 1677240 -309415 -4006505 -5327880 -2728373 801583 2357851 2768120 3877620
43436 3877620 5060164 4934828 4286862 4415339 4243002 2067349 -945434 -1979523 -566280
43427 -566280 1409841 3045174 4778416 5782232 4279584 879594 -1377372 -1122446
43419 -1122446 -179084 -69113 330572 2190628 4143105 4263700 3056626 2544965 3406988
43410 3406988 4631264 5217032 4823296 3456212 1813123 1286719 2359401 3512839 2925707
43401 2925707 844447 -830182 -949654 -37111 931664 1609595 2162643 2835465 3599484
43392 3599484 3771768 2390210 -331425 -2328804 -1444263 2104888 5688082 6770119
43384 6770119 5045514 2211134 193494 -292828 178896 761787 1167010 1361059 948311
43375 948311 -324192 -1628323 -1749092 -910453 -693666 -1663442 -2381413 -1603093 -155799
43366 -155799 577118 884283 1871241 3250292 3820783 3677364 3987643 4671502 4314557
43357 4314557 2713902 1551028 1774192 2073450 1090588 -325681 -522514 335093 637867
43348 637867 -229202 -1348090 -1961744 -2291257 -2564999 -2481301 -1984023 -1562008 -1312836 -541608
43338 -541608 1119688 2789687 3157100 1896626 -173149 -1999393 -2901457 -2589984 -1190593
43329 -1190593 723841 2420669 3326676 3063384 1592348 -423198 -1886639 -2328314 -2276744
43320 -2276744 -2189655 -1718225 -753760 -384846 -1528494 -3104883 -3147317 -1600736 -339764
43311 -339764 -300875 -478484 -200842 -297045 -1063030 -1243962 -546638 -1042134 -3897682 -6523872
43301 -6523872 -5762353 -2692466 -1128484 -1940218 -2242896 -367013 1740749 1988921 1041993
43292 1041993 378716 -51934 -635867 -620408 476729 1574950 1586362 859047 19243
43283 19243 -897018 -1102892 990201 4920320 7370228 6147445 3139763 1371756 1071517
43274 1071517 873767 851252 1526174 1616476 -56244 -1768829 -1295684 92250 -406101
43265 -406101 -2177465 -2265835 -813870 -903586 -2771568 -2971501 -478645 1022117 -958656
43256 -958656 -3688093 -3838545 -2539759 -2530697 -3220855 -2329024 -396211 152991 -699815
43247 -699815 -698589 820768 2174710 2135076 965770 -950783 -3109020 -3913562 -2207267
43238 -2207267 426802 1267017 231004 -316061 553302 1226325 631363 -196179 -426276
43229 -426276 -938171 -2314192 -3291384 -2646452 -1170053 -371306 -345085 -268244 -126025 -556537
43219 -556537 -1460432 -1987558 -1758439 -1204605 -768201 -494893 -448112 -889715 -1765094 -2336900
43209 -2336900 -1749610 -45080 1672870 2351782 2003680 1197716 3414 -1606303 -2622528
43200 -2622528 -1811592 134481 1009525 273818 -143644 718776 944314 -767107 -1937023
43191 -1937023 343619 4410541 5928755 4119065 2338978 2437210 2449257 834322 -691365
43182 -691365 -263327 1235846 2276992 2962811 3221839 1469626 -2369896 -4888724 -3319410
43173 -3319410 55823 859828 -1092918 -1806911 905556 4599521 5855266 4274178
43165 4274178 1926472 507559 4829 -599155 -1760814 -2385572 -1055728 1359472 1842558
43156 1842558 -710868 -3205165 -2284965 736159 1683808 -435795 -2369612 -1693157 202630
43147 202630 1074496 1000741 1165165 1618983 1834688 1900919 1752749 600623 -1491130 -2697890
43137 -2697890 -1605546 576352 1362732 21448 -1857069 -2443887 -1516891 -532661 -1244603
43128 -1244603 -3692813 -5466868 -4071864 -317885 2134345 1319612 -582994 -580238 967182
43119 967182 1453866 243936 -644599 41203 953982 435978 -1028946 -1760466 -1262693
43110 -1262693 -458321 -5361 412974 977889 922825 -429930 -2272425 -2926694 -1977692
43101 -1977692 -889550 -1037668 -1980437 -2443894 -2207160 -1882352 -1451170 -456121 669164
43092 669164 1018626 882697 1346177 2086149 1389762 -1082969 -3286466 -3418416 -2092094
43083 -2092094 -918400 -259425 499871 1529604 2478483 2985340 2537543 815716 -1241407
43074 -1241407 -2009209 -1436444 -1148598 -1551383 -884387 1504594 3129958 1704335 -1282986
43065 -1282986 -2788283 -2605569 -2800704 -3779877 -3966103 -3049880 -2586748 -3090730 -3131002
43056 -3131002 -1924747 -686528 -687906 -1628020 -2435674 -2347047 -1119208 416432 316270
43047 316270 -2170427 -4613850 -3873617 -346107 2613290 3336987 3153746 2995679 1971932
43038 1971932 111081 -762897 -267582 -468619 -1942424 -1999018 789400 3249491 1949058
43029 1949058 -1421317 -2616784 -1243166 -690065 -2265414 -3294910 -1591435 1395861
43021 1395861 3027952 2706220 1421120 -173806 -1937922 -3549749 -4680606 -5374939
43013 -5374939 -5787568 -5906385 -5583185 -4510805 -2583887 -764762 -692891 -2416287 -3508771
43004 -3508771 -2003994 586609 1086502 -1060717 -3462817 -4400224 -4248218 -3169838 -321369
42995 -321369 3566371 5519296 4147250 2150064 2760420 5074730 5420675 2687521 -283305
42986 -283305 -771149 644776 1814943 2147125 2543022 3092894 2511483 139280 -2565359
42977 -2565359 -3376754 -1897456 -19096 404472 -386733 -928670 -851598 -1234713 -2709644
42968 -2709644 -4334789 -4750598 -3660740 -1824929 -366132 -373731 -2139034 -4158468 -3970298
42959 -3970298 -999628 2238962 2905076 1134873 -619013 -859452 -98126 879453 1824099
42950 1824099 2018983 556858 -1690137 -2303855 -667675 601610 -937278 -4139408
42942 -4139408 -6062608 -5941730 -5162343 -4149364 -2070970 370236 769160 -1345639 -3065621
42933 -3065621 -1816161 1183552 2741727 1625522 -899880 -3266262 -4563436 -4171037
42925 -4171037 -2319313 -665371 -739548 -2035869 -2896731 -2835626 -2632605 -2646497 -2555053 -2351679
42915 -2351679 -2060283 -931031 1371252 3230838 2669058 180357 -2005868 -3137540
42907 -3137540 -4076325 -4507585 -2976355 -154830 931865 -959907 -3546706 -4556638
42899 -4556638 -4370739 -3822606 -2288461 42342 723322 -1557758 -4326211 -4700634 -3470115
42890 -3470115 -3014699 -3026802 -1548401 1079190 2673170 2778401 2622572 2245429 886646
42881 886646 -361251 315174 1938482 1769571 -172329 -1022493 330347 1981526 2609804
42872 2609804 2726781 1925103 -1054169 -4525487 -4456002 -634902 1975184 462836 -1635017
42863 -1635017 -393210 2039214 1420131 -1301267 -1954781 -498709 -682666 -2838405 -2749975
42854 -2749975 1128897 4347779 2767594 -1546421 -3695093 -2637549 -1348338 -1739282
42846 -1739282 -2585802 -2348329 -1553197 -1639382 -2856771 -4149168 -4508895 -3846366 -2741952
42837 -2741952 -1789713 -1296870 -1383395 -1999746 -2751439 -3077779 -2902974 -2843481 -3431664 -4339813
42827 -4339813 -4689235 -3960930 -2406989 -838974 -144498 -559086 -1234581 -1104807 -370934
42818 -370934 -325875 -1367438 -2193909 -1592485 24383 1666686 3131644 4142860 3446497
42809 3446497 649811 -1913699 -1467126 1251983 2598157 830049 -1954356 -3367408
42801 -3367408 -3875122 -4937501 -5952243 -5249283 -3156196 -1766601 -1722467 -1245803 974860
42792 974860 3426631 3511181 1061288 -1072566 -195228 3134451 5720923 5256630 2611000
42783 2611000 417968 46894 692321 1109856 1120725 1058022 724791 -172265 -1004758 -708304
42773 -708304 626507 1571664 1217631 479039 776610 1882414 2179529 1085051 -20017
42764 -20017 131429 794976 498172 -554710 -833935 64017 932146 1080301 1351915 2422194
42754 2422194 3455238 3310438 2049320 481992 -795139 -1232873 -362616 1182442 1875674
42745 1875674 1377078 993727 1102226 35862 -2793945 -4753098 -3585474 -1446943 -1916774
42736 -1916774 -4061059 -3655037 -296125 1346342 -1149653 -3717926 -1709051 3276368
42728 3276368 5972362 4580226 1526246 -1413314 -4505845 -6816332 -5761404 -1202625
42720 -1202625 3055607 3663017 1649174 330238 886902 1828014 1789103 893644 -388152
42711 -388152 -2001465 -3553220 -3999896 -2835830 -1060464 -267824 -905568 -2029394 -2859026
42702 -2859026 -3847337 -5573474 -7098367 -6617941 -3917912 -1013391 234511 78337 -338127
42693 -338127 -950198 -2063489 -2595587 -1148332 1209702 1405650 -1574453 -4761392 -4598349
42684 -4598349 -1214897 1953906 2178756 -112598 -2532122 -3255799 -2333376 -1263876 -1450320
42675 -1450320 -2797337 -3974077 -4175977 -4025821 -4317571 -4625385 -4004818 -2555750 -1290764
42666 -1290764 -713982 -479881 -256812 100489 1139161 3389411 6123832 7586011 6919761
42657 6919761 5134472 3841096 3778769 4814040 6383051 7385040 6601728 4108347 1692250
42648 1692250 1063450 2045160 3177665 3630167 3751636 4069714 4509613 4492848 3379235
42639 3379235 1129741 -1132573 -1864164 -969955 -200533 -915128 -2249230 -2559756 -1895798
42630 -1895798 -1569060 -1767630 -1321542 157660 1501785 1656558 869409 10201 -125417
42621 -125417 1102899 3294381 4233665 1944802 -2105914 -3999955 -2396457 -340758
42613 -340758 -654241 -1753334 -318405 3503718 6355890 6406741 5055127 3883889 2506141
42604 2506141 248076 -1992443 -2807091 -2137929 -1105055 -563858 -459027 -240637 409695
42595 409695 1057169 832433 -341840 -1216841 -622795 914016 1809041 1392344 301799
42586 301799 -809007 -1801329 -2365407 -1999549 -869854 236507 921119 1316235 1343068
42577 1343068 859666 469653 1038603 2360642 3376453 3645738 3434295 2593070 965431
42568 965431 -169000 888144 3311696 3947539 1522817 -1198580 -951572 1787459 3740143
42559 3740143 2938811 239237 -2449514 -3686130 -2727484 -54789 2236613 1998255 -635199
42550 -635199 -3311189 -4020587 -2920698 -1584908 -1124667 -1249619 -876222 387302 1441875
42541 1441875 874513 -1069103 -2596067 -2704548 -2248125 -2144291 -2004336 -1626371 -2256591
42532 -2256591 -4481443 -6057329 -4350087 -526020 1384222 -27590 -1619950 -413335
42524 -413335 2072365 2200970 -472180 -2698481 -2113151 -177995 184838 -1476556 -2862448
42515 -2862448 -2237452 -772455 -853751 -2617720 -3500031 -1764320 723247 736043 -1754820
42506 -1754820 -3204967 -1205258 2187885 3099849 593103 -2828463 -4702640 -4727227 -3635684
42497 -3635684 -2016987 -787717 -1047863 -2398756 -2725885 -879914 1488408 2119896 1215989
42488 1215989 644814 797108 334308 -1056386 -1889532 -1376722 -682292 -818329 -1103505
42479 -1103505 -817233 -668492 -1269499 -1770721 -1576574 -1773967 -2907559 -2960615 -139947
42470 -139947 3512358 4294442 2032378 -40605 -399233 -797873 -2236021 -2868036 -1374999
42461 -1374999 533727 849253 134156 -197683 -347844 -879840 -860763 592110 2344598
42452 2344598 2801095 2138151 1205820 -343242 -2841551 -4879133 -4913859 -3509286 -2034382
42443 -2034382 -408358 1772239 3232082 2597427 897772 81466 141387 198591 1081538
42434 1081538 3729300 6129396 5436059 2618399 1351137 2470356 3315149 2702687 2482219
42425 2482219 3384612 3413534 1801195 795967 1692594 2578739 2107985 2119288 3993548
42416 3993548 5587946 4811005 3491984 4278372 5905575 5288973 2803761 1648298 2687028
42407 2687028 3527373 2623411 1127983 358703 86536 -144572 -117737 178376 431665
42398 431665 924345 2092649 3328745 3705953 3439730 2963109 1358543 -1936376 -4449727
42389 -4449727 -2753465 2420021 6059471 4921380 1234551 -939984 -782096 -358072
42381 -358072 -983753 -2164108 -3279622 -4269400 -4815479 -4433915 -3510500 -3072326 -3278486
42372 -3278486 -3076079 -1792549 -354023 -172402 -1103323 -1501188 -653286 -107819 -1414187
42363 -1414187 -3269126 -2865867 -133543 1718360 817379 -640398 -92123 1227765 582100
42354 582100 -1508171 -2268650 -1579565 -2044037 -4106024 -5002692 -3515863 -2090033 -2581455
42345 -2581455 -3222527 -2021495 -300845 -200510 -999523 -813007 -105692 -503411 -1517198
42336 -1517198 -1505486 -822098 -905334 -1077522 416249 2607225 2563135 115625 -1648828
42327 -1648828 -1312163 -1130504 -2832532 -4607606 -4244690 -2659466 -1994596 -2222519 -2011620
42318 -2011620 -1388822 -1133582 -739667 622670 2025089 1990813 1027967 590869 203173
42309 203173 -1659695 -4075217 -4060709 -1004105 1976837 2118549 182478 -1588241 -2495992
42300 -2495992 -2890797 -2599629 -1707530 -1435970 -2359942 -2957801 -1839142 -284972 -391312
42291 -391312 -1554900 -1313025 633314 1796263 584788 -1649703 -2832833 -2451711 -950460
42282 -950460 1223393 3024345 2995659 1205898 -381160 -468084 44279 15374 -141401
42273 -141401 103185 -265 -607672 244716 3771501 7264903 6824760 2870321 -171257
42264 -171257 42017 1126356 491214 -572235 393249 2307792 1590316 -2614827 -6819961
42255 -6819961 -7298437 -4135746 -458135 1256765 1149371 755035 860114 1028601 883639
42246 883639 992054 1909712 2836695 2240415 -79479 -2451334 -3192296 -2261663 -728745
42237 -728745 565927 1298160 1418413 1331151 1707555 2495357 2773298 2208399 1774914 2105458
42227 2105458 2089284 536897 -1434832 -1503612 459751 1936649 1168101 -572130 -923004
42218 -923004 583109 2431983 3093846 2134579 75063 -1949992 -2902843 -2919783 -3123305
42209 -3123305 -3816283 -3785343 -2252689 -449648 98793 -43045 706798 2107421 2453737
42200 2453737 1672227 1705174 3232567 4287020 3321559 1667272 1281065 1659393 1027763
42191 1027763 -490633 -1085854 -89209 1439235 2620016 3284909 2870631 991462 -798381
42182 -798381 -155259 2555334 4125160 2822910 775891 700389 2090629 2411922 777985
42173 777985 -1362778 -2353733 -1586751 596295 2820235 3300905 2018488 1404667 3246019
42164 3246019 5826812 6140630 4179299 2605272 2478196 2045257 218983 -1392075 -1140922
42155 -1140922 19050 100364 -1081411 -2093790 -1965597 -819586 838694 2336957 2885602
42146 2885602 2358620 1597744 1231464 712566 -784230 -2985473 -4615267 -4419635 -1830300
42137 -1830300 2490072 6234115 6653111 3219179 -1453168 -4092426 -3656249 -1340528
42129 -1340528 1184576 2695391 2733992 2272543 3125460 5344059 6216140 3672975 -143693
42120 -143693 -1093253 1405932 3690192 3277481 2222767 3396224 5652445 5396301 1993830
42111 1993830 -1296420 -2086808 -1942521 -3292216 -5151614 -4350329 -596040 2228772 914623
42102 914623 -2643696 -3740879 -881462 2636232 3380311 1886091 887045 1157655 1213319
42093 1213319 456288 291825 1724384 3690628 4684268 4697705 4471382 3872706 2391016
42084 2391016 664817 50088 695938 1263377 762374 -344242 -1122239 -1214800 -488941
42075 -488941 1244770 3328243 4029107 2407280 -187731 -1719840 -2012553 -2153542 -1858998
42066 -1858998 243159 3361953 4242817 1642742 -1148307 -593611 1958837 2392196 97792
42057 97792 -1401067 -234545 1057807 -74474 -2175094 -2429835 -1052400 -333674 -716446
42048 -716446 -571418 738399 2079538 2736342 3269736 4057598 4721343 5117038 5315048
42039 5315048 4620690 2392682 -19683 -96882 2522616 5269431 5926529 5023814 4054450
42030 4054450 3064036 1533190 330109 844569 2705431 4072781 4044584 3246164 2012543
42021 2012543 -323000 -3612338 -5708577 -4504024 -840952 1853289 1245680 -1322875
42013 -1322875 -2599479 -1342678 529330 858391 101458 212992 1436765 1959279 983903
42004 983903 375363 2034312 4828069 5922047 4787891 3916334 5031609 6352080 4965007
41995 4965007 881812 -2963109 -4429819 -4186938 -3805065 -3558751 -3043981 -2611849 -2709885
41986 -2709885 -2491528 -642532 2527355 5124776 5898629 5345282 4526998 3914202 3592833
41977 3592833 3505644 3151967 2023224 588202 -172672 -352597 -953123 -1928953 -2044807
41968 -2044807 -1247753 -1302082 -2928236 -4133264 -3093350 -1205843 -1145660 -2846643 -3684885
41959 -3684885 -2232626 307046 2283189 3181663 2898087 1385675 -439428 -1019583 -58557
41950 -58557 1037342 1123006 723200 1020747 2222475 3298341 2890599 562278 -2386665
41941 -2386665 -3832490 -3243962 -2420013 -2871384 -3582955 -2920977 -1615022 -1618324 -2752735
41932 -2752735 -3055519 -2111986 -1295671 -755824 818032 3056699 3725071 2572025 2187495
41923 2187495 3657247 4537798 3068887 1322163 1585076 2344195 1057863 -1212160 -1577128
41914 -1577128 -361287 -525419 -2521217 -3430209 -1624177 946069 2055500 2098028 2322660
41905 2322660 2281444 795832 -1631238 -2934456 -1801240 919067 3070325 3203121 1850430
41896 1850430 800529 1080749 2048071 2551790 2210101 1197560 -227933 -1339741 -1100492
41887 -1100492 482403 2104796 2954092 3507244 3817951 2803650 552821 -635960 489371
41878 489371 1672385 466245 -1594045 -1204630 1491444 3341475 3153501 2524627 1908423
41869 1908423 -89479 -2878706 -3393903 -895480 1311883 799318 -615939 -564719 -47864
41860 -47864 -912900 -2055760 -1344892 565128 1557134 1760353 2712987 3860225 3241959
41851 3241959 1234805 370339 1328297 2069645 1403865 669908 1009651 1361841 391553
41842 391553 -1370439 -2505970 -2500096 -1634138 -297893 805710 940770 545703 986488
41833 986488 2429768 3286772 2620633 1666636 1727089 1904056 648809 -1341383 -1802375
41824 -1802375 -225022 1480191 1956463 2248608 3780881 5812762 6240106 4383100 1753595
41815 1753595 73523 -490443 -795537 -1174919 -1175675 -708191 -624826 -1542838 -2448352 -1487855
41805 -1487855 1458112 3871174 3226865 109752 -2426466 -2467013 -882070 763156 2217720
41796 2217720 3524463 3603232 1651942 -877590 -1657145 -554015 498769 532934 365506
41787 365506 256393 -778997 -2435702 -2413329 16092 1872512 321423 -2870973 -3612013
41778 -3612013 -1352287 548310 305891 125496 1971407 4001365 3522202 1451407 966359
41769 966359 2560997 3353168 1601660 -618229 -538713 1220303 1635026 -261422 -1960860
41760 -1960860 -1057327 1369343 2296226 834440 -956144 -1265824 -772204 -969380 -1718135
41751 -1718135 -1711601 -520179 1097050 2379644 2897632 2217708 586024 -347789 1018063
41742 1018063 3886158 5387262 3683782 4146 -2618365 -2096440 1038460 3981516
41734 3981516 3941219 918959 -2118415 -2651999 -1478907 -940947 -1272091 -855029 361019
41725 361019 454774 -993782 -1734558 -381421 1246373 1054858 -33586 76659 973154
41716 973154 511647 -1336759 -2066721 -406328 1650752 1552849 -474868 -1992005 -1527583
41707 -1527583 -4024 978566 1245266 1755594 2678454 2880991 1710136 268606 -44414
41698 -44414 451410 447907 -76048 81134 1092836 1693356 1335833 973644 1035531 407764
41688 407764 -1505030 -3311778 -3605457 -3087879 -3182040 -3581582 -2912914 -1180634 176388
41679 176388 403521 76414 -306248 -974265 -1921196 -2433832 -2055428 -1374069 -1419309 -2428295
41669 -2428295 -3329256 -2612664 -96236 2331474 2516230 622006 -1091606 -1220866 -615489
41660 -615489 -352442 98163 1536746 3102100 3127087 1273256 -1278359 -3101225 -3143758
41651 -3143758 -1160765 1280063 1366284 -1731888 -4995231 -4695663 -934344 2669658 3454653
41642 3454653 2048638 392191 -502415 -350331 998340 2894536 3813330 3098503 2170806
41633 2170806 2913446 5009277 5909138 3931839 746706 -295542 1610330 3467001
41625 3467001 2351573 -666215 -2191170 -1266531 -111393 -250929 -603970 -40435 782620
41616 782620 1255598 2009927 2877828 2133714 -436264 -2066051 -718155 1920670 3352338
41607 3352338 3823546 4354826 3721584 854812 -1839817 -1622176 -378357 -1978565 -5523786
41598 -5523786 -6087758 -2378177 1093348 644969 -1926778 -3008733 -1953623 -239387
41590 -239387 1244535 2017050 1404824 -8077 -220056 1294215 2232543 471860 -3012910
41581 -3012910 -5427512 -5114183 -2500674 515443 1662767 347235 -1119458 -108187
41573 -108187 2508560 3376140 1507129 -661359 -1355471 -1444194 -1592380 -850018 567285
41564 567285 438497 -1673737 -2899617 -1480596 193468 -571338 -2509337 -2708153 -1030495
41555 -1030495 486776 852831 235303 -1442808 -3636456 -4571898 -3710831 -2977312 -3402787
41546 -3402787 -2921882 -195360 1941223 432016 -2683075 -3066248 -828020 -2159 -1775107
41537 -1775107 -2758269 -597639 2627812 3922691 3294835 2675985 3028597 3795816 3858252
41528 3858252 2353274 -370915 -2531456 -2775834 -1926204 -1565884 -1613753 -984865 209310
41519 209310 1203955 2433127 4296779 4793013 1508990 -3971104 -6742365 -4433784 93736
41510 93736 2684723 2263660 426658 -1163035 -1711380 -1130021 -92423 527817 650901
41501 650901 652207 324345 -571490 -1159934 -470791 781755 1191093 978011 1353217 2057198
41491 2057198 1826595 988215 1144591 2459071 3708308 4704767 5894680 5981829 3416461
41482 3416461 223092 335676 3408408 4493945 1374570 -1981195 -1578916 901878
41474 901878 1619928 407894 -557029 -1258024 -2918237 -4262416 -2822910 692735 2915928
41465 2915928 2504249 1301143 926396 1010520 946569 893060 721352 12117 -772760 -987503
41455 -987503 -1509290 -3618926 -6224626 -6552819 -3992571 -1074819 -25067 -367505 -693228
41446 -693228 -782823 -833519 -326379 865107 1494959 596169 -755475 -868712 -135581 -713292
41436 -713292 -3408616 -6199513 -6484899 -4079167 -1227973 111479 263569 855651 2379301
41427 2379301 3470102 2741893 707132 -721562 -506503 283739 -254896 -2565497 -4895301
41418 -4895301 -5037608 -2802757 -490480 -626729 -3325585 -6199692 -6874864 -5302931 -3502183
41409 -3502183 -3187042 -3844473 -3422433 -1112859 1119480 813425 -1400363 -2206570 -182410
41400 -182410 2064942 1931845 1069061 2852822 6672109 8159816 5318346 1174333 -705105
41391 -705105 -488969 -304620 -653026 -730451 -623149 -962299 -1345565 -894941 284544 1482035
41381 1482035 2342588 2405120 999821 -1052953 -1135043 1935062 5569085 6345142 4321614
41372 4321614 2292307 1563815 947474 -315846 -1131144 -512945 862755 1626534 1028908
41363 1028908 -800115 -2715939 -2906323 -813373 1505487 1524687 -420629 -1705030 -1196238
41354 -1196238 -403724 -588764 -943775 -517842 -18863 -413844 -1176489 -1315908 -1134189
41345 -1134189 -1594411 -2560877 -2883828 -1951341 -270058 1273121 2023727 1656625 360441
41336 360441 -1042588 -1600526 -1025816 55908 667837 437855 95063 710525 2213956
41327 2213956 3131355 2252456 75875 -1968779 -3130490 -3364678 -2434416 -241702 2228614
41318 2228614 3560640 3505035 2963741 2601589 2514185 2873498 3551743 3467870 1938069 393215
41308 393215 747645 2083914 1396367 -1759939 -3912509 -2311131 1306348 3416301 3302136
41299 3302136 2691790 2215326 913522 -1239250 -2860386 -3392278 -3826980 -4827948 -5690329
41290 -5690329 -5491680 -3959315 -1136875 2278545 4204671 2740203 -905000 -2949370
41282 -2949370 -1595584 676877 802173 -585984 -733240 536421 577433 -1614592 -3530002
41273 -3530002 -2837721 -752340 -26003 -1071890 -1991562 -1533660 -61505 1885198 3896207
41264 3896207 4644663 2729541 -879508 -3145928 -2608916 -1086537 -717668 -992572 -288558
41255 -288558 1024925 1107329 -334624 -1558703 -1287293 -74228 948375 1300011 959030
41246 959030 201455 -153173 518363 1453165 1141214 -676629 -2731556 -4013784 -4548407
41237 -4548407 -4260976 -2702500 -520686 386252 -734791 -2176751 -2053317 -846762 -301061
41228 -301061 -637512 -573884 272809 843233 715918 1041748 2605760 4244560 4373919
41219 4373919 3290664 2568150 2530415 1970042 630693 167676 1469239 2521725 973679
41210 973679 -1909555 -2346070 736371 4085855 4634904 3230342 2336235 2217331 1603087
41201 1603087 467133 -343479 -1017806 -1848973 -1628683 270153 1495867 -186802 -2449784
41192 -2449784 -1230437 2462264 3536007 1140068 411560 3830446 6434010 3511038
41184 3511038 -1623627 -2663817 233495 1800314 491976 -91098 1828219 3528463
41176 3528463 2933949 1640596 1363655 1317527 753000 745659 1782937 2415114 1802826 995315
41166 995315 434735 -998540 -3066511 -3269082 -687561 1999073 2367317 1550371 1514866
41157 1514866 1612823 472788 -932621 -1036829 -633366 -1042023 -947199 1592052 5099892
41148 5099892 6101911 4046768 1615756 470550 -120267 -545895 -89725 721963 242893
41139 242893 -961321 101932 4391266 8644177 9235533 6378487 3121114 1760898
41131 1760898 2463279 3949490 4359000 2642458 -210 -1236868 -653093 -128359 -718011
41122 -718011 -1208825 -615927 126623 256779 746289 2093413 2655635 1255368 -383519
41113 -383519 -133784 1134858 1124655 -228617 -1298696 -1887641 -2915501 -3674863 -2438662
41104 -2438662 260626 1727716 740416 -1229323 -2520044 -2720787 -1648019 599474
41096 599474 2446167 2289762 1318165 2113555 4247183 4525785 2278180 768734 1945817
41087 1945817 3417947 2775747 1489687 1750880 2532686 2091087 1674211 2950189 4004071
41078 4004071 2196216 -642145 -550105 2016570 2969064 1618655 1505340 3401596 3123708
41069 3123708 -1292500 -5197620 -3731525 1085901 3729155 2949243 1900243 2256698
41061 2256698 2656012 2369842 2413988 2784863 2064705 313478 -703614 -818969 -1983949
41052 -1983949 -4456819 -5388652 -2919140 666309 1902045 521161 -1194358 -2037239
41044 -2037239 -2526507 -2718007 -1740925 419383 2453361 3325987 3082616 1988139 186076
41035 186076 -1532745 -1896686 -681835 768014 1072926 261151 -673209 -1035998 -851630
41026 -851630 -524418 -492744 -882608 -1245450 -979955 -187228 305315 -19099 -710809 -990939
41016 -990939 -725858 -518149 -1003681 -2151067 -3137165 -3061146 -1991046 -936948 -410853
41007 -410853 335042 1838935 2995650 2542176 1419891 1621377 2741479 2183494 -476564
40998 -476564 -2021506 -159875 2837994 3519237 2385012 2575462 4545339 5515808 4121890
40989 4121890 2313907 1982064 2502077 2604683 2219704 1341824 -638915 -3117537 -3846027
40980 -3846027 -1869593 824212 2032341 2005319 1911828 1523338 397524 -273481 653728
40971 653728 1912291 1556739 195792 -32075 787481 304131 -2228540 -4479054 -4113901
40962 -4113901 -1495143 1395086 3147900 3292586 1880906 -232910 -1490697 -946506
40954 -946506 701328 1738086 1015047 -932405 -2123937 -950158 1892383 3986796
40946 3986796 4124115 3436730 2830151 1108646 -2426086 -5101602 -3569843 1164445 4490526
40937 4490526 4132957 2339259 1522817 926641 -811788 -2571167 -2548977 -1239011 -193537
40928 -193537 828034 2970339 5371076 5745204 3844438 2075750 2146595 2864051 2166535
40919 2166535 122128 -1271896 -838025 288949 203616 -1293238 -2456068 -1888870 -260702
40910 -260702 926780 1543175 2499982 3502990 2851658 5464 -3095904 -4179898 -3045222
40901 -3045222 -951086 1290284 3388822 4573607 4057870 2395183 1198578 1350208
40893 1350208 2244002 2874535 2991087 2952414 2892820 2402235 1087772 -640722 -1681489
40884 -1681489 -1466808 -776775 -737712 -1219807 -995373 593744 2918243 4897669 5685575
40875 5685575 4766581 2571458 861885 1056383 2150800 1959807 573943 526635 2879557
40866 2879557 5317094 5353268 3489011 1688375 540804 -266602 -329097 487936 815668
40857 815668 -154294 -534201 1752693 5151158 5996158 3600825 1055825 795853 2022304
40848 2022304 3009546 3357840 3024914 1507873 -660702 -1551705 -483673 538354 -422431
40839 -422431 -2357547 -2877496 -1676723 -614163 -776403 -1176650 -500519 1118157 2448863
40830 2448863 2574815 1673355 771899 796173 1599611 2032727 1243858 -228022 -934514
40821 -934514 -29107 1819849 2919824 2018975 -391335 -2276493 -2027174 -248092 980170
40812 980170 659766 -110419 22644 762787 930205 455492 370918 861667 601577 -1295311
40802 -1295311 -3498072 -3766337 -1909474 -285718 -852704 -2663876 -3283565 -2072495 -655519
40793 -655519 -234764 -134873 372041 446007 -738372 -1930265 -1186251 1011537 1836412
40784 1836412 -282098 -3437365 -4327394 -1887286 1712102 3407627 2251815 22754
40776 22754 -1184294 -1451759 -2102803 -2584802 -556108 3821733 6134500 2880587 -3211238
40767 -3211238 -6344390 -5289488 -3987162 -4554464 -4238651 -887427 2828267 3529047 2066070
40758 2066070 885494 -691602 -4289656 -7542978 -6304481 -1297179 2180190 1689435
40750 1689435 471886 1744572 4282505 5507355 5323040 4511356 2481997 -589801
40742 -589801 -2068765 -448857 1486764 416573 -2300539 -2719871 -428325 1233822
40734 1233822 526987 -944123 -1906699 -3053098 -4288754 -3918174 -1917152 -943825 -2426854
40725 -2426854 -4205553 -3751323 -1485464 717216 2113930 2503937 1302548 -820410
40717 -820410 -1403476 604482 2902262 3079353 1854935 975015 125433 -1374082 -1999330
40708 -1999330 -469392 1059315 -18710 -2021094 -1342620 1480874 2620060 1388835
40700 1388835 853837 1670906 635444 -3010183 -4856907 -1733874 3184689 4947985
40692 4947985 3402230 1890634 1896620 2387311 2689484 2820525 2231303 953342 764315
40683 764315 2674797 4551875 3829138 1331708 -255988 -482883 -739281 -822852 707364
40674 707364 3038704 3304330 781639 -1820093 -2056874 -595094 463234 374451 -53175
40665 -53175 17371 428951 120365 -1681276 -4035684 -4864930 -3612166 -2135776 -1978347
40656 -1978347 -2295221 -1939603 -1772013 -2717956 -3251641 -1669574 429960 222723 -1600966
40647 -1600966 -1753314 238161 1307891 27693 -1162812 -121943 1777451 2249692
40639 2249692 1377973 617696 580129 1298174 2826865 4210078 3663575 1149523 -942853
40630 -942853 -964741 -104512 -50944 -505041 -609315 -927570 -1974418 -2383542 -850671 1268376
40620 1268376 1691367 732274 609561 1634936 1727301 45964 -1351209 -568482 1240180
40611 1240180 1562996 22731 -1468590 -1646633 -1361185 -1779736 -2429697 -1935573 -20446
40602 -20446 2195873 3566204 3717427 2821224 1586764 1177849 1890581 2202177 735018
40593 735018 -1098125 -653055 1608767 2197072 -98796 -2176931 -1678561 -710944 -1651325
40584 -1651325 -2454313 -294064 2584830 1871040 -1171790 -844659 3871934 7026458 4356407
40575 4356407 -674314 -2378208 -537509 899661 213580 -677000 -48121 1439463 2291553
40566 2291553 2068385 1547908 1684456 2248933 1744330 -382501 -2122456 -1377834 553396
40557 553396 611850 -1239852 -2221052 -1890184 -3036478 -6192639 -7462982 -4273914 252682
40548 252682 1700658 311840 -639698 -66935 725980 1321118 2305644 3179994 3010686
40539 3010686 2300215 1870821 1112932 -296641 -483677 1951114 4676624 4266913 1249729
40530 1249729 -752952 -490106 -337865 -1923093 -3658023 -3539216 -1967610 -613954 -77328
40521 -77328 343813 1467272 3270686 4540671 3708068 788988 -2059172 -2863132 -2004458
40512 -2004458 -1040702 -371361 483319 1241260 1294634 1202164 2029795 3587430 4782598
40503 4782598 5193552 4859578 3296706 529875 -1502923 -647638 2435006 4675211 4098086
40494 4098086 1536004 -1002320 -2172661 -1522287 598990 2896100 3782209 2589565
40486 2589565 4806 -2347514 -2692484 -513181 2353511 3219931 1795972 582773
40478 582773 1274404 2486802 2278439 1108446 505194 324913 -522757 -1641720 -1588589
40469 -1588589 -236291 1042841 1225453 439135 -532187 -604502 854267 2778041 3114863
40460 3114863 1622544 406828 755079 1368539 934024 226927 71042 -438787 -1686355
40451 -1686355 -1862261 78771 1994771 1733450 669297 1182984 2516598 2341370 939311
40442 939311 521005 1433981 2143346 2179785 2282937 2301927 1489800 260173 -453977 -791965
40432 -791965 -1249383 -1586042 -1758075 -2076536 -1357454 2162055 6571094 6786002 1770737
40423 1770737 -2741101 -1840795 2267702 4931075 5516738 5286437 3695024 1556050 2868547
40414 2868547 8100638 10947230 7803973 4586547 7007252 10567379 9047711 6318092
40406 6318092 8931278 13236297 12482413 10986063 16660274 24698906 25709129 25549672
40398 25549672 36893887 54866909 67249830 89128544 152760639 248541244 308886344
40391 308886344 279539039 187199027 106591737 73896147 64653978 49098668 31069283
40384 31069283 24881069 25794952 21406670 13380023 10644456 12292354 11349902 7870091
40376 7870091 6503663 6545005 4326612 1448054 2124747 5293989 6463577 5098754 4177715
40367 4177715 4366964 3881570 2614396 1952158 1694140 809277 119338 1125516 3149493
40358 3149493 4155101 3540348 2289742 1384718 1399197 2476161 3786211 4335795 4662214
40349 4662214 5945407 7453007 7276005 5573495 4209577 3182610 852949 -2071496
40341 -2071496 -2805697 -1545605 -1961962 -5094878 -6975432 -4611345 -557296 1216625
40333 1216625 784250 653169 1379203 1816235 1734073 1445165 418577 -1378425 -2215778
40324 -2215778 -807266 1468549 2324527 1367701 -182645 -1168060 -732803 1446361 4001660
40315 4001660 4683421 3427063 2699238 3671696 4243720 2354398 -828365 -2758249 -2795134
40306 -2795134 -2006621 -1285653 -1202360 -2255848 -3838310 -4241025 -2817251 -850911 450205
40297 450205 1212448 1593429 1227640 619622 900036 1573339 985057 -394680 -207700
40288 -207700 1360430 937631 -2603685 -5688064 -5342006 -3559609 -3511446 -4490783 -3986477
40279 -3986477 -2223774 -1088308 -578586 206524 403903 -802221 -1487819 183422 2063624
40270 2063624 1020835 -1459870 -1217540 1641561 2600485 -5736 -2261129 -759652
40262 -759652 2504711 3595831 2021629 137331 -780455 -1268071 -1564111 -1059191 334264
40253 334264 1737081 2264612 1645275 101936 -1666582 -2582452 -2035014 -784813 -483570
40244 -483570 -1851898 -3535402 -3409186 -1193877 1017706 1467953 1087008 1917509 3930076
40235 3930076 5259589 5331464 5491442 6209275 6091088 4642268 3677883 4431427 5232660
40226 5232660 3952243 1211427 -839647 -1715320 -2467231 -3187921 -2739605 -769686 1532908
40217 1532908 2638218 1808961 -404109 -2108016 -1496488 826891 2116848 959392
40209 959392 -970943 -1692663 -1678957 -2238977 -2858646 -2275497 -955078 -312173 -360353 -163036
40199 -163036 164806 -166150 -975386 -1628618 -2360408 -3321377 -3322164 -1511585 646009 1165034
40189 1165034 452526 356070 1236631 2191254 3189846 4497094 4834326 2853403 -119156
40180 -119156 -1511756 -1215537 -1159162 -1698540 -1457373 -524150 -575386 -1607838 -1689313 -451319
40170 -451319 194630 -494148 -868982 -13258 700677 252199 -393811 -396981 -386158 -679354
40160 -679354 -577195 -407824 -1680179 -4061012 -4939166 -3428382 -2007610 -2412501 -2749221
40151 -2749221 -1036667 986109 513871 -1798922 -3021991 -2346738 -1396358 -1088746 -974795
40142 -974795 -1072486 -1727736 -2048317 -940792 589021 580134 -653175 -929031 159696
40133 159696 636727 -392868 -1286450 -833210 -257549 -730942 -894273 1047236 3966464
40124 3966464 4813661 2663710 -155599 -1168782 -391339 631152 979861 566924 -732619
40115 -732619 -2657060 -3666503 -2165031 998080 2723065 1293852 -1309824 -1989279
40107 -1989279 -517121 727369 498433 -6128 106045 -408290 -2668136 -5143596 -5245880
40098 -5245880 -2759459 62250 1622555 2472699 3357911 3466388 1844703 -358322 -683262
40089 -683262 1484127 3854808 4057606 2602762 1881117 2708728 3442471 2740459 1531647
40080 1531647 1236401 1338202 285400 -1828024 -3100165 -2292590 -233297 1315160 1269183
40071 1269183 -166338 -1582700 -1311228 719891 2416623 1935904 217657 -309071 885801
40062 885801 2101847 2243282 1942713 1707562 1100099 315058 497007 1634832 2028903
40053 2028903 808189 -795522 -1584487 -1870702 -1822782 -606069 1338554 1511924 -1024836
40044 -1024836 -3350020 -2574160 -194390 508328 -74022 1202780 4438676 5898702 3661605
40035 3661605 418787 -781156 -501536 -709295 -1148626 -396893 1081861 1472075 458940
40026 458940 -520901 -484566 340581 1610852 3044507 3660312 2524120 500939 -189047
40017 -189047 1319254 3390561 4034957 3258856 2554922 2745231 3177582 2762703 1127564
40008 1127564 -1130499 -2818813 -2883285 -1239165 1137035 3182180 4525680 4936717 3643187
39999 3643187 375071 -3012422 -3528187 -535737 2845443 3119030 567087 -1448657
39991 -1448657 -1095527 -223300 -1386962 -4245103 -6126480 -5392704 -2996205 -957411 -368089
39982 -368089 -989312 -1961707 -2489445 -2216867 -1348046 -428944 52928 -115129 -918723 -2181156
39972 -2181156 -3467701 -4009818 -3125855 -1169685 206777 -275810 -1370259 -154268 3958981
39963 3958981 7330705 6051790 1103114 -2659760 -2547136 -582406 410710 480653 903740
39954 903740 1356624 929380 217991 68164 -405888 -2073027 -3218265 -1605271 1522069
39945 1522069 2582181 787559 -905921 -443961 735456 729599 -81757 -783164 -1752242
39936 -1752242 -2802236 -1943747 1417080 3949676 2194653 -2125761 -3835103 -1194900
39928 -1194900 1997603 1820195 -966873 -2843114 -2228353 -497954 583587 713416 587425
39919 587425 764662 1150249 1156603 403618 -651027 -1128004 -829555 -396479 -298097 -373894
39909 -373894 -519440 -906479 -1128813 -147985 2121466 3982104 3724107 1749276 -44550
39900 -44550 -649688 -714547 -1140055 -1989199 -2863033 -3442629 -3483093 -3003921 -2551227 -2511333
39890 -2511333 -2209637 -711275 1392873 2277787 1433573 610715 1319863 2543171 2217113
39881 2217113 174076 -1872087 -2783054 -2860792 -2476293 -1574814 -771570 -1189220 -2482629
39872 -2482629 -2575784 -489751 1799184 1730692 -459137 -2270782 -2321412 -1455268 -575048
39863 -575048 688245 2413010 3103682 1392770 -1701930 -3608212 -3157207 -1635687 -840240
39854 -840240 -1104969 -1614797 -1781302 -1566623 -909188 334102 1902223 3227485 4149706
39845 4149706 5018908 5851968 5844893 4194525 1304640 -1164812 -1568187 331747 3014968
39836 3014968 4260886 2990074 292239 -1713935 -2211260 -2320155 -3084737 -3710329 -2821942
39827 -2821942 -867330 270223 61095 43756 1113175 1739370 284569 -2079398 -2707229
39818 -2707229 -1299499 -255417 -862010 -1254925 515675 3019176 3190715 952354 -345458
39809 -345458 1286719 3373827 2343873 -1255763 -3187943 -1089817 2546260 3750942
39801 3750942 1736468 -1092829 -2471470 -1938865 -40849 2116448 2726070 704916
39793 704916 -2418884 -3806764 -2961846 -2264967 -3169011 -3937815 -2580017 -116494 1175888
39784 1175888 1361913 2112645 3140643 2270977 -771450 -3341929 -3471024 -2240644 -1500815
39775 -1500815 -1299329 -1058616 -1433408 -2935898 -3968155 -2566106 426359 2200820 1980040
39766 1980040 1908521 3333644 4339211 2547152 -933816 -2407248 -314112 2675224
39758 2675224 3005034 585679 -1329879 -273447 2621507 4270843 3213465 776662
39750 776662 -840769 -709917 538079 1673304 1826766 1047159 167828 -187522 -370350
39741 -370350 -945203 -1422648 -757507 874307 2017312 1979560 1626252 1541268 866508 -919847
39731 -919847 -2427502 -2177569 -1053347 -1042128 -2018323 -1786872 599279 3363766 4292937
39722 4292937 3148887 1399497 619547 1317459 2284713 1264023 -2315171 -5504022 -4730731
39713 -4730731 -681099 2063499 971791 -1373137 -1539531 -79347 180018 -1233547
39705 -1233547 -2360497 -2337827 -2135124 -2113420 -1541737 -692739 -967277 -2410704 -3251788
39696 -3251788 -2634580 -1868646 -2027372 -2055389 -543951 1858467 3130684 2299371 289523
39687 289523 -1075735 -439486 1873310 3535987 2214948 -1425683 -3869355 -2823379
39679 -2823379 -11408 1311486 558264 -141532 543918 1536104 1338683 -80291 -1944198
39670 -1944198 -3790304 -5084749 -4856333 -2949207 -1034596 -1002034 -2391527 -2729136 -809655
39661 -809655 1591264 2190044 1341422 1194832 2217251 2542528 1119517 -509509 -704706
39652 -704706 -282271 -843792 -1833227 -1467846 39545 602097 -359345 -963806 107479
39643 107479 1649465 1950001 1125785 310716 -194783 -741536 -1189993 -1066933 -368482
39634 -368482 470884 933322 483284 -923119 -2257315 -2464321 -2225467 -3179017 -5042233
39625 -5042233 -5376577 -3092678 -343992 394114 -450349 -762410 157852 1322825 1786888
39616 1786888 1097213 -950364 -3457402 -4343529 -2760342 -701309 -626840 -2367515 -3900862
39607 -3900862 -4135391 -3236351 -1359279 946441 2121306 1494249 777433 1466235 1991477
39598 1991477 210051 -2399936 -2450958 -13069 1454754 628971 -111105 567767 566274
39589 566274 -1554283 -3545879 -2984443 -1177214 -897182 -2122087 -2709213 -2053283 -1514545
39580 -1514545 -1811143 -2130116 -1687846 -658894 391445 1043358 1197826 1249554 1607600
39571 1607600 1833568 1149366 -139464 -1109233 -2153177 -4423991 -6925976 -6775940 -3629846
39562 -3629846 -1168553 -2047975 -3732161 -2208155 1909128 4383256 3618216 2382837
39554 2382837 3117151 4702120 4881277 3410289 1430987 -499078 -2252712 -3141927 -2510892
39545 -2510892 -819231 903860 2390368 4047960 5661228 6106435 4842344 3144010
39537 3144010 2903747 4054953 4232913 1819972 -1558612 -2971174 -2073301 -1260782 -1995561
39528 -1995561 -2992684 -2517390 -542190 2065856 4508699 5340162 3068142 -1059164 -3050500
39519 -3050500 -945488 2245357 2578317 448825 -758317 164790 1508623 2231882 2991686
39510 2991686 3645669 2811760 497808 -1361090 -1698503 -1488472 -1497243 -1022962 251698
39501 251698 1112479 623994 -447795 -994865 -961648 -527283 610848 2038989 2114971
39492 2114971 146657 -1838057 -1166174 1874220 3976262 2725177 -482151 -2256132
39484 -2256132 -1453502 -320908 -996504 -2295956 -1634046 680241 1647867 287799 -828098
39475 -828098 -18139 613329 -825472 -1894208 643568 4970990 6202861 3531572 970324
39466 970324 752154 496959 -1701422 -3503860 -2102470 1228267 3106565 2647804 1649192
39457 1649192 1470060 1808533 1795595 862597 -771848 -1674877 -360846 2521912 4600245
39448 4600245 4851284 4410106 3811631 1948312 -1076036 -2721878 -1503035 543270 861887
39439 861887 -204230 -973065 -1155609 -737585 1479012 5254560 6945777 3734884 -1609053
39430 -1609053 -3881320 -2351986 -754303 -1104298 -1719291 -1393703 -1239778 -1475853 -333387
39421 -333387 2332403 3788170 2575610 888524 872676 1423765 930809 525988 1805000
39412 1805000 3448320 3232966 1921614 1942427 3127940 3025477 1108301 -516899 -806744
39403 -806744 -1089156 -1888037 -1373694 1463421 4456004 5140738 4385407 4922597 7222251
39394 7222251 9019714 8525087 6056418 2655271 -741828 -2466503 -817587 3175746
39386 3175746 5505983 3442381 -1050840 -3830891 -3608424 -2471289 -1916623 -874588
39378 -874588 1722114 4517197 5274116 3737570 1737086 1025086 1844032 3118883 3422982
39369 3422982 2245099 729148 521272 1593004 2170322 1238833 -115277 -568014 -360910
39360 -360910 -121419 689690 2434257 3456741 1744571 -1875856 -4171529 -3261416 -380095
39351 -380095 2190422 3393549 3400538 2876644 2717970 3345428 3957266 3589617 2972075 3871700
39341 3871700 6325171 8125956 7674513 5871687 4454593 3930628 4125151 5319548 7436925
39332 7436925 9108417 9039649 7735910 6636240 6099099 5528900 5004812 5243744 5965031
39323 5965031 5744298 3956824 1841069 1016620 1616043 2549647 3200570 3986261 5112576
39314 5112576 5639754 4684962 3221867 3273502 4822976 5089121 2315498 -1002081 -952978
39305 -952978 2360996 5054856 5182367 4875002 5614145 4988589 957916 -3438883 -3538125
39296 -3538125 122072 2397804 630067 -2653510 -4469895 -5046050 -5484488 -5076307 -3018353
39287 -3018353 -505415 917629 1378432 1409516 497522 -1276021 -1959717 -310681 1808349
39278 1808349 1946381 742837 550102 1376061 1119703 -519815 -1370884 -372143 828746
39269 828746 644773 -275678 -580062 -115721 601682 1282779 1466797 698717 -272461 -37288
39259 -37288 1170878 1540069 742933 755812 2405229 3380387 1618449 -1275365 -2419994
39250 -2419994 -1994231 -2371050 -3784288 -3947137 -2033311 -172025 -176189 -1063125 -1004957
39241 -1004957 -64371 352665 -242782 -893676 -494294 1046847 2661770 2964587 1668365
39232 1668365 80631 -390854 121272 654824 1159744 2027692 2294790 449770 -2646212
39223 -2646212 -3869172 -1865887 950316 1793329 1135216 1125710 1817338 1354852 -657082
39214 -657082 -2382638 -2548772 -2008988 -1919648 -2021194 -1670834 -1264856 -1302514 -764142 1983756
39204 1983756 6448199 9424430 8174341 3884258 880013 1961234 5279960 6680094
39196 6680094 4615570 1498060 232540 978966 2039145 2543190 2853190 3054472 2651022
39187 2651022 1693966 879895 314121 -671226 -2038741 -2423835 -811700 1717951 2830885
39178 2830885 1525720 -721644 -1648103 -727346 405600 118951 -1066435 -1088846 898325
39169 898325 3163602 3363988 1384201 -626669 -906939 187394 1340335 2166265 3102983
39160 3102983 3995542 4011138 3087381 2319153 2261210 1821707 -5483 -1995244 -2015433 -476380
39150 -476380 -361238 -2877516 -5084994 -3765990 -221586 1375642 -223420 -2120409
39142 -2120409 -2034782 -1206400 -1330456 -1456519 -194448 1047308 -143402 -3183559 -5079681
39133 -5079681 -4693520 -3826990 -3888646 -4000861 -3233923 -2541667 -3061370 -3939020 -3394993 -1206988
39123 -1206988 1118958 2187588 1733392 258516 -1295567 -1736287 -501719 1550529
39115 1550529 2957007 3303797 3371001 3568232 3171104 1689625 257370 591801 2644152
39106 2644152 4292305 3778417 1711987 47675 -321069 -87314 -25862 -52149 145680
39097 145680 497355 871434 1259445 1389289 906328 187662 136732 829817 1251488 779227
39087 779227 -45939 -714580 -1543173 -2518514 -2631084 -1546578 -791201 -1722814 -3201338
39078 -3201338 -3072710 -1407924 -296898 -593212 -876229 105277 1814664 3237170 4116652
39069 4116652 4282413 3402563 2219365 2406477 4071640 4846863 2881687 -385536 -2005186
39060 -2005186 -1232276 201066 990963 1586452 2563504 3377357 3357049 2808782 2411917
39051 2411917 2208845 1797660 1090245 433866 287755 1020362 2609458 4274054 4907352
39042 4907352 4355009 3882404 4732885 6384010 6973376 5598659 3473827 2334173 2318313
39033 2318313 2319086 2155789 3123667 5875003 8775857 9413846 7312755 4187753 1822257
39024 1822257 812150 1232063 2996910 5042975 5575828 4220806 2922934 3404106 4499576
39015 4499576 3727882 1243584 203884 2543873 6067852 7031905 4572752 1117341
39007 1117341 -982014 -1559157 -1447161 -876950 210876 1323268 1800863 1588250 1031010
38998 1031010 295174 -552740 -1287682 -1778458 -2139730 -2336322 -2138143 -1749258 -1750446 -1956016
38988 -1956016 -1218891 842600 2790908 3130376 2408655 2234762 2707492 2383809 715420
38979 715420 -992591 -1304186 -156321 1539503 2727281 2567481 1090430 -429670 -791827
38970 -791827 -421246 -463852 -806680 -678685 -745111 -2255623 -4132731 -3667985 -740969
38961 -740969 1442148 882875 -729732 -1456412 -2001061 -3088530 -2938351 -311171 2315431
38952 2315431 1988637 -104206 -725249 267434 679958 712194 2623210 5991902 7583423
38943 7583423 6325777 4471885 3195272 1079697 -1870201 -2811980 -650264 1483359
38935 1483359 727852 -1485041 -2399820 -2223673 -2597007 -3009249 -1886750 200395 1340125
38926 1340125 1251204 848505 -163410 -2548438 -5066297 -5469448 -3770622 -2113658 -1467170
38917 -1467170 -749193 639119 1651054 1451756 557689 -477605 -1905259 -3634279 -4632517
38908 -4632517 -4305996 -3510260 -3438700 -4130431 -4633507 -4246332 -3246097 -2544820 -2598874 -2602671
38898 -2602671 -1337123 834883 1793992 452924 -1199470 -402955 2469448 4107160
38890 4107160 2501812 -644729 -2245745 -1161167 1494050 4126488 5690576 5682238 4249837
38881 4249837 2273760 804331 429329 1208284 2678368 3668680 2821138 5478 -3093163
38872 -3093163 -4471300 -3834387 -2657418 -2350353 -2973955 -3799740 -4342114 -4335212 -3325750
38863 -3325750 -1223212 913494 1640685 843214 -291133 -1276923 -3014007 -5686622 -7413181
38854 -7413181 -6559164 -4358087 -3197248 -2922708 -1320552 1773483 3664025 2910652 1551159
38845 1551159 1674920 2173925 1064546 -902876 -1631819 -1373796 -2070346 -3577965 -3594845
38836 -3594845 -1571840 118711 -202024 -1102130 -558303 957314 1548118 828042 44643
38827 44643 -167390 -543080 -1638761 -2737960 -2797554 -1883763 -1100721 -1159617 -1421950 -674271
38817 -674271 1239380 3015254 3324728 2255489 1014367 604195 1208398 2442162 3597272
38808 3597272 3931072 3344782 2571701 2138558 1456391 -337841 -2862118 -4631551 -4717443
38799 -4717443 -3606479 -2409677 -1799238 -1690636 -1411072 -225517 1784554 3458128 3657798
38790 3657798 2455590 735269 -994038 -2605846 -3492851 -2771478 -518186 1970583
38782 1970583 3385066 3396156 2493242 1434341 843905 772634 647637 95595 -415341
38773 -415341 -311359 83354 85089 -125467 182765 912559 1173147 750688 491841 1005980
38763 1005980 1881446 2372707 2010148 444613 -2268353 -4956318 -5932913 -4772351 -2691439
38754 -2691439 -906854 392902 1077841 321741 -2227979 -5252138 -6697515 -5671900
38746 -5671900 -2959328 -128568 1455638 1382760 579717 454825 1130262 1089840 -825110
38737 -825110 -3687757 -5508039 -5439345 -4085781 -2112605 222535 2209194 2656259 1311554
38728 1311554 -474236 -1215331 -1034124 -1262936 -2457818 -3561670 -3344637 -2122919 -1357377
38719 -1357377 -1648194 -1926777 -1002727 757769 1996213 2145594 1707543 961449 -381774
38710 -381774 -1966070 -2498299 -1524517 -554920 -1207123 -2749732 -2887706 -916371 1360808
38701 1360808 2226159 2101252 2108588 1911423 599714 -1011881 -1043245 381925 813437
38692 813437 -892009 -2477875 -1405782 1350528 2744381 2071360 1447309 1937236 1899663
38683 1899663 142396 -1588944 -1030209 1163061 2323167 1371305 -236445 -854301 -395227
38674 -395227 329283 824259 1157860 1626533 2303753 2687277 2133394 884016 -33791
38665 -33791 -323293 -832425 -1770596 -1782053 -100843 1462925 520993 -2433338 -4454558
38656 -4454558 -3959234 -2332058 -1463547 -1320262 -651387 1009130 2815310 3593934 3034976
38647 3034976 2125138 2116128 2711204 2120802 -198256 -1956394 -816891 2047653 3340204
38638 3340204 2276626 1420867 2586976 4346679 4579744 3390804 2081949 875879
38630 875879 -663842 -2017243 -2212150 -1508083 -1215979 -1845376 -2274515 -945004 2313187
38621 2313187 5626741 6556092 4721170 2448032 1862425 1996382 406719 -2735654 -4434064
38612 -4434064 -3084790 -609790 561703 534367 612928 758332 96628 -1302890 -2739583
38603 -2739583 -3947216 -4542810 -3630183 -1389662 229226 81484 -187513 1253346 3002859
38594 3002859 2218661 -670970 -1889168 543739 3906164 4124647 544434 -3761155
38586 -3761155 -5583650 -4540869 -2799877 -2468609 -3442146 -3996050 -3311993 -2377013 -1915438
38577 -1915438 -834860 1894705 4883625 5744706 4389802 2977602 2736032 2804079 2349487
38568 2349487 1789218 1364994 402415 -1177411 -2288235 -2592466 -3384362 -5313920 -6643841
38559 -6643841 -5359386 -2057514 866228 2242560 2722348 2803874 2109358 815129 201067
38550 201067 1071983 2623956 3539720 3488224 2910912 1944093 401304 -1375095 -2456477
38541 -2456477 -2377434 -1795722 -1696502 -2076828 -1914382 -662643 703957 839824 93274
38532 93274 375828 2444985 4310338 3552424 729751 -1094821 -347332 1210710 1397890
38523 1397890 779545 1352603 3073801 3757797 2337837 323433 -469183 -61445 561664
38514 561664 1126313 1858406 2557881 2874536 2806893 2196947 653212 -1172002 -1376041
38505 -1376041 783100 3181717 3157844 980854 -667716 -302442 1062603 2083584 2625590
38496 2625590 2812154 2330934 1370021 812185 793146 335147 -892210 -1701918 -1131253
38487 -1131253 24535 337808 -455080 -1618188 -2574483 -3056835 -2800299 -1928696 -1135752
38478 -1135752 -835615 -681579 -441216 -587033 -1326243 -1797173 -1121356 278871 1305324
38469 1305324 1760597 2420717 3651737 4696345 4511034 3000370 1266315 562261 946365
38460 946365 1257631 638190 -481302 -1379603 -2149875 -2830372 -2425356 -414371 1560872
38451 1560872 1639824 813565 1386408 2562555 997915 -3385639 -5792285 -2929294 2022749
38442 2022749 3734254 1766392 -54112 200699 710873 -169722 -1569518 -2244437 -2461343
38433 -2461343 -2832938 -3082298 -2811999 -2315648 -2095275 -2367567 -3110147 -3884868 -3959117 -3391315
38423 -3391315 -3286371 -3951432 -3834698 -1837920 336423 203631 -1808529 -2988196 -2379387
38414 -2379387 -1752751 -2338208 -2980399 -2342364 -1050659 -621772 -1500149 -2900588 -3649477
38405 -3649477 -2840890 -665188 1241323 1317276 -22534 -1074953 -1213936 -1209241 -1416470
38396 -1416470 -1305738 -815049 -539580 -474961 -141745 71377 -569351 -1350522 -860128 425675
38386 425675 583709 -462002 -627525 697729 1397332 181547 -1214062 -1027330 -268037
38377 -268037 -456259 -660903 708033 2690792 3046096 1829995 1160269 1843556 2558144
38368 2558144 2304450 1647434 1420500 1888222 3249387 5333471 6658606 5429510 1948983
38359 1948983 -1207055 -1884435 -315308 1766758 2947777 2868961 2183036 2115527 3225143
38350 3225143 4372467 3773491 1249573 -1526519 -3218666 -4087735 -4609587 -4183064 -2337856
38341 -2337856 -311722 84948 -997742 -1360780 531599 3688715 5805882 5615783 3671599
38332 3671599 1486947 384209 581564 836851 -462538 -3222138 -5244544 -4736270 -2586748
38323 -2586748 -975979 -242025 1170697 3646093 5254085 4526509 2826548 2632066 4297968
38314 4297968 5702966 4763595 1661225 -1067910 -604962 3037959 6049267 4658899
38306 4658899 225662 -1811989 965279 4552849 4143719 643645 -1309898 18928
38298 18928 2206816 2959177 2156393 86629 -2937916 -5167727 -4747674 -2634967 -1307523
38289 -1307523 -695046 1269544 4063948 4525416 2104961 95159 302098 614008 -252446
38280 -252446 94106 2929209 4768453 2417215 -1436564 -2065346 114457 866610 -783740
38271 -783740 -1671029 -297382 1184978 1343019 1578561 2637658 2678603 605729 -1651159
38262 -1651159 -2199306 -2046997 -2674285 -2844884 -634473 2574333 3184943 454834 -2214039
38253 -2214039 -1911232 13270 401605 -1012103 -1677921 -545386 348233 -620545 -1987620
38244 -1987620 -1795040 -926768 -1306087 -2066083 -728852 2202849 3347781 1668498 121670
38235 121670 766865 1542244 98132 -1969636 -1611413 806268 2065650 512986 -2553529
38226 -2553529 -5119053 -5937709 -4557752 -1887530 -120708 -434457 -1554053 -1969072 -2169045
38217 -2169045 -2990810 -3515279 -2890934 -2510548 -3593672 -4187996 -1874299 1737667 2870235
38208 2870235 1247268 121488 906391 1722314 1560866 1889326 3145998 3356364 1719276
38199 1719276 349545 778873 1528503 846419 -691130 -1940000 -3058143 -3926491 -3203640
38190 -3203640 -924456 310232 -986349 -2372274 -884201 2337388 3529038 1457131
38182 1457131 -1410660 -2433830 -1371141 435039 1711520 1930522 1399248 783894 233385
38173 233385 -482034 -866211 -81 1625355 2137333 893013 -553051 -956710 -1008840
38164 -1008840 -1301203 -737813 1291520 3019637 2707788 1455447 1396447 2351750 2560104
38155 2560104 1651095 541276 -646768 -2060601 -2360951 -252370 2663639 3331653 1445328
38146 1445328 -410889 -788417 -729432 -775783 379434 3117007 5237004 4637900 2031232
38137 2031232 -249662 -840219 133751 1754242 2696319 2194312 1284008 1760633 3471596
38128 3471596 4345651 3636069 2998901 3332490 2861249 122832 -3093605 -4010175 -2673584
38119 -2673584 -1248226 -578211 156470 1056392 1225209 607323 -144214 -1451212 -4100060
38110 -4100060 -6704264 -6504383 -3425010 -900168 -1378573 -3046648 -2684268 -194173 1701650
38101 1701650 1379993 -40213 -740304 -306498 349810 124500 -1359519 -3303074 -4309485
38092 -4309485 -3933739 -3234230 -3123374 -2822401 -1054757 1674623 3347086 2910708 1216328
38083 1216328 -599789 -2306447 -3767468 -4278000 -3548997 -2479066 -2111594 -2410555 -2713492
38074 -2713492 -2738519 -2416070 -1439867 -37995 313539 -1647170 -4690698 -5662580 -3103246
38065 -3103246 623104 1962707 510331 -730663 301624 1729459 493751 -2862150
38057 -2862150 -4372640 -1822395 2445898 4978557 5464981 5604064 5295202 2890610 -1076359
38048 -1076359 -3456139 -2641389 -764100 -401580 -1013947 -401902 1610962 2911130 2029465
38039 2029465 -172191 -1635365 -979548 1492708 3888540 4156832 2095954 -405253
38031 -405253 -1524960 -1233009 -438801 522749 1621609 2198227 1489272 -232969 -1850611
38022 -1850611 -2462932 -1855271 -477596 707528 1076431 1188417 1753482 1878500 160122
38013 160122 -2293207 -2452970 87026 1938341 922763 -686920 -407640 -102093 -2662019
38004 -2662019 -6314092 -6619840 -3160274 45354 471987 -561685 -1391476 -1847243 -1382057
37995 -1382057 623131 2249701 857328 -1884306 -1304012 2812053 4995387 2355852
37987 2355852 -935785 -522330 1502001 1051803 -817153 -421964 1600756 1419381 -1271351
37978 -1271351 -2967104 -2421046 -2081342 -3095418 -3390528 -1876883 -739345 -1855341 -3813087
37969 -3813087 -4226085 -2935155 -1478364 -973434 -1565741 -2598615 -2665718 -893689 1413105
37960 1413105 1984536 811391 374298 2061724 4176179 4427740 2848762 1128231 236582
37951 236582 -180768 -780858 -1707985 -2390982 -1950410 -381550 904635 750092 129674
37942 129674 885518 2777521 3669803 2816663 1860201 1925044 1862910 578139 -772406
37933 -772406 -509835 1002724 2192923 2669073 3104492 3442095 2937408 1755205 1032729
37924 1032729 1252759 1634104 1275547 122404 -1227933 -1986699 -1459747 404988 2578985
37915 2578985 3549589 2606151 427651 -1544756 -2184665 -1322852 384655 2140234 3507961
37906 3507961 4233421 3953550 2561521 661711 -902773 -1882177 -2505774 -2851308 -3023229
37897 -3023229 -3531241 -4428841 -4424038 -2302628 811867 2329353 1666123 1019205 1922530
37888 1922530 2967217 2346498 971964 1050300 2585785 3421386 2325311 149959 -1830177
37879 -1830177 -2910789 -2429652 -206038 2265199 2910540 1804908 1031929 1330204 959061
37870 959061 -1047167 -2655043 -1766235 266812 529191 -988629 -1608562 -495117 40568
37861 40568 -1340995 -2379470 -715685 1927651 1778586 -1495976 -4027575 -2785861 802792
37852 802792 3150455 2754714 922344 -636787 -1474465 -1966472 -2301950 -2109674 -828268
37843 -828268 1378620 3135998 3079782 1794495 1444885 2825979 3951316 2737612 107918
37834 107918 -1195461 -351730 810270 783507 221967 294713 839421 1139154 1365277 2056713
37824 2056713 2811875 2645830 1502668 600361 1129835 2901601 4328470 3864940 1783525
37815 1783525 287688 1127503 3188024 3474602 722803 -3077608 -5232019 -5243485 -4380104
37806 -4380104 -3520993 -2744420 -2326188 -2636986 -3209200 -3120599 -2269543 -1278138 -334609 687501
37796 687501 1107789 -61967 -2184096 -3010310 -1369679 1256096 2599133 2016895 231478
37787 231478 -2113542 -4268389 -4724519 -2656710 248240 1317532 423589 40136 1189805
37778 1189805 1571551 -664599 -3188629 -2246776 1613614 3681273 1465932 -1944250
37770 -1944250 -2489219 -695437 -69865 -1462080 -2349782 -1593209 -1447035 -3485152 -5330263
37761 -5330263 -3930304 -460065 999585 -728070 -2300766 -706561 2696251 4464276
37753 4464276 3720743 2599054 2820753 3754456 3926188 3020300 1964496 1835004 2869933
37744 2869933 4009090 3629792 1524986 -263100 199140 1879713 1987796 67292 -1254897
37735 -1254897 -337009 926695 193025 -1627330 -1952375 -430532 1232945 2376741 3493441
37726 3493441 3758567 1687719 -1429973 -2056993 461518 2326073 723864 -1832552
37718 -1832552 -1270012 1873393 3303967 1259695 -1286390 -1154168 873481 1642276 -116473
37709 -116473 -2534883 -3198961 -1993027 -959971 -1449611 -2085296 -502968 3088280 5602682
37700 5602682 4865219 2169121 77233 -775912 -1222381 -1336056 -689633 47966 -146770
37691 -146770 -825496 -909670 -815515 -1617009 -2513634 -1582247 913918 2424708 1717568 257910
37681 257910 -568553 -1212199 -2020789 -1905674 -362626 1111965 1165906 538522 404034
37672 404034 379584 -200003 -598287 -175825 -170837 -1772422 -3530904 -3208644 -1521328 -1232146
37662 -1232146 -2586126 -2611320 205211 3241816 3403116 1421509 277679 545735 -61207
37653 -61207 -2579206 -4721228 -3992170 -1207247 716814 674060 297271 1027257 2020050
37644 2020050 1786415 649748 219896 903279 1288836 198895 -1596225 -2221556 -876513
37635 -876513 1244379 2262413 1734675 1110926 1687231 2569347 1808394 -462215 -1629672
37626 -1629672 -33904 2773660 4363503 4509977 4376764 4113569 3392730 3113937 3982708
37617 3982708 4279519 2069220 -828016 -564254 2774683 4628574 2491815 -593433
37609 -593433 -942690 646910 1273434 737005 831264 1642312 1721008 897345 172007 -357485
37599 -357485 -998449 -871119 570605 1397589 -407910 -3036240 -2650127 859317 3252512
37590 3252512 1805370 -1248090 -2400930 -1401162 -421456 -685180 -1739437 -2783247 -3134477
37581 -3134477 -2310076 -927359 -688405 -2302966 -4159639 -4165554 -2341362 -628338 -581411
37572 -581411 -2032501 -3548472 -3518972 -1361453 1591488 2928009 1676446 -455251 -1142030
37563 -1142030 -260280 366085 -239148 -938994 -390627 779304 621389 -1583176 -4288729
37554 -4288729 -5469484 -4793429 -3389079 -1860742 354902 3369764 5652087 5430970
37546 5430970 2924484 313846 -476814 499337 1524281 861404 -1555193 -3699928 -3321284
37537 -3321284 -741488 1089025 240549 -1511671 -1182245 1028161 2004437 357195 -1562367
37528 -1562367 -1167262 801523 1705552 729873 -531196 -668283 -93758 -17547 -827773
37519 -827773 -1786410 -1837211 -581561 1271210 2405578 1991678 261728 -1839294 -3188469
37510 -3188469 -2819956 -531486 2481780 4182132 3434593 1062838 -1008506 -1442114 -347070
37501 -347070 1053487 1468899 666966 -334655 -499317 5257 351331 446533 790736
37492 790736 1139844 649661 -502313 -1123801 -1084594 -1738268 -3386172 -4077023 -2501088
37483 -2501088 -575256 -935931 -2795656 -2942140 -671277 1133017 517664 -739459 -456402
37474 -456402 255935 -786312 -2474014 -1534518 2196580 4860177 3853309 1290913 515154
37465 515154 1377510 1402823 191722 -263866 724265 1386398 541563 -615181 -761313
37456 -761313 -496649 -883204 -1541851 -1602665 -1280517 -1132556 -879710 -336519 -390354 -1567888
37446 -1567888 -2733497 -2861504 -2955165 -4205392 -5306236 -4105547 -1306421 238409 -211335
37437 -211335 -583901 170178 562557 -217002 -530030 676193 1637541 640311 -968032
37428 -968032 -986826 29712 -62596 -1298460 -1741743 -900244 -503786 -1716155 -3585274
37419 -3585274 -4624370 -4343034 -2920759 -814628 976444 1556085 1387367 1776821 2876964
37410 2876964 3402765 2637859 1476201 964305 961733 937779 1096350 1792190 2460549 2087160
37400 2087160 601367 -828315 -992583 19728 722799 -249224 -2230780 -2665472 -58783
37391 -58783 3536702 4378079 1631411 -1350625 -1185149 1400834 2975395 2072741 542693
37382 542693 206084 123143 -1636694 -4614014 -6025432 -4282039 -1167297 238728 -825698
37373 -825698 -2202954 -1731448 214423 1610763 1572762 1340558 2450097 4661957 6163716
37364 6163716 5555621 3234981 857053 -269304 -147388 303702 256170 -519799 -1776995
37355 -1776995 -2881190 -2836438 -976765 1918014 3791820 3382081 1852528 1485759 2793864
37346 2793864 3930357 3261629 1486237 448943 641626 1007085 907781 1008226 1869845
37337 1869845 2669536 2135738 422167 -718041 166918 2486638 4111212 3673946 2077653
37328 2077653 1309132 1917629 2494046 1949451 1219214 1610824 2292869 1243975 -1382751
37319 -1382751 -2907146 -1860936 -177763 -295595 -1675247 -2095754 -1276911 -919441 -1633566
37310 -1633566 -2198751 -1942220 -1586069 -1291935 -94249 1828904 2386657 454412 -2055638
37301 -2055638 -2511525 -800898 1126966 1940002 1748143 1101656 566432 698982 1286568
37292 1286568 1233883 159916 -791240 -762700 -648431 -1415868 -2210968 -1836904 -957554 -795014
37282 -795014 -655205 842984 2786178 2923760 1380561 654806 1711688 2790041 2661601
37273 2661601 2441621 3193625 4108422 4258696 4085594 3923062 3011594 1270290 147563
37264 147563 298848 254415 -1054457 -2255349 -1837558 -863960 -1308254 -2962610 -4119301
37255 -4119301 -4295769 -4116474 -3310018 -1124661 1654596 3241012 3292322 3008429 2941594
37246 2941594 2489673 1465022 382588 -797746 -2426136 -3635448 -3042030 -1323225
37238 -1323225 -1037874 -2997084 -4627029 -3296710 33044 2101374 1633011 692713 1635260
37229 1635260 3961396 4999264 3286123 340259 -1351033 -1453966 -1779775 -3169618
37221 -3169618 -3931890 -2380043 341001 1702589 1446987 1711174 3387784 4551213 3518746
37212 3518746 1651318 1321173 2130472 1363236 -1775870 -4478359 -3945166 -1247044 126821
37203 126821 -1003455 -2252715 -1538387 -205810 -791032 -3012773 -4203131 -3316574 -2088325
37194 -2088325 -1747698 -984483 1382175 3600383 3049390 259544 -1356819 162487 3028079
37185 3028079 4187521 2800605 557188 -564029 -14294 1460625 2860211 3583224
37177 3583224 3396248 2356502 1125519 929911 2370489 4242131 4426631 2331724 -217503
37168 -217503 -867898 1032625 4209052 6635024 6740364 4489664 1752641 721957 1532109
37159 1532109 2332120 1947104 1195050 1168265 1765545 2654350 4024795 5339004 5024569
37150 5024569 2820449 897067 1080015 2416524 3143414 3442646 4185095 4542909 3441536
37141 3441536 2126664 2376734 3070696 1751931 -840818 -1304159 1083598 2933030 1621537
37132 1621537 -1339498 -3090826 -3013102 -2050882 -687994 709245 1257333 835412 575093
37123 575093 796541 46495 -2358827 -4433457 -4013964 -1964697 -901373 -1444494 -1763148
37114 -1763148 -656606 787722 1030233 191827 -484323 -579445 -933150 -2022155 -2670272
37105 -2670272 -1276531 1731089 3851062 3521837 2011584 1219408 811515 -650994 -2573797
37096 -2573797 -2680464 -452126 2024043 3027274 3014395 2926789 2649164 1995615 1571975
37087 1571975 1730604 1932490 1743062 1213432 48928 -1949207 -3382071 -2253516 949981
37078 949981 3296043 3288297 2527755 2615250 2864561 2466761 2465109 3679365 4770551 4424708
37068 4424708 3567724 3270873 2344880 -469641 -3531286 -4318591 -3263848 -2747620 -3122117
37059 -3122117 -2658219 -1017317 147718 133184 97470 673712 1011753 788051 1136079
37050 1136079 2756016 4594536 5113796 3831436 1318265 -1307094 -2799149 -2714694 -1876115
37041 -1876115 -1081696 68665 1907434 3164809 2496090 849004 166019 228018 -692461
37032 -692461 -2247060 -2096565 -85345 841981 -731566 -2126792 -832234 1183409 499472
37023 499472 -1988076 -1996544 1588936 4612843 3315894 -612784 -2717983 -1758214 -387901
37014 -387901 -514167 -872421 12218 918463 -109713 -2362241 -3369334 -2650144 -2165815
37005 -2165815 -2966974 -3833318 -3934087 -4389748 -5751664 -6096190 -3761294 -459339 766998
36996 766998 -226266 -1013286 -693223 -940590 -2639529 -4011467 -3281295 -1438895 -836101
36987 -836101 -1955227 -2964430 -2256081 -421040 555663 -356134 -2094836 -2851696 -2208320
36978 -2208320 -1337132 -1208178 -1525491 -1581265 -1049646 383114 2798399 4883975 4676809
36969 4676809 2506568 1379391 2864367 4465598 3326867 880581 806525 3361965
36961 3361965 5173989 4538528 3454323 3663325 3841065 2236418 -288054 -1636641 -1385617
36952 -1385617 -854628 -1287274 -2852877 -4491330 -4352242 -1718209 1244564 1433274 -997734
36943 -997734 -2441667 -749711 1791733 1869722 -307519 -1797984 -1037262 846660 2266110
36934 2266110 2962824 3519525 4152962 4258043 3050672 963281 1083 1505847 3766289
36925 3766289 3662312 933256 -1302869 -965899 401951 733400 708894 1854721 3261821
36916 3261821 2748011 236042 -2303648 -3529578 -3397159 -2072056 -286059 100620 -1749388
36907 -1749388 -3573757 -2557343 483134 2111726 1307844 592244 1732829 3235971
36899 3235971 3170993 1950747 869728 25340 -669906 -260454 1584056 3096174 2558106
36890 2558106 880732 144853 436144 174040 -946593 -1512115 -855643 37666 399193
36881 399193 637395 887255 313957 -1228507 -2266119 -1579677 17032 899258 789660
36872 789660 561628 634217 810399 1128304 1550049 1268598 -229940 -1749634 -1670056 -545361
36862 -545361 -574502 -2182260 -3060174 -1433939 1431118 3123178 3007616 1945700 452904
36853 452904 -1171219 -1819136 -555656 1713471 3076162 2917586 2137710 1416182 635503
36844 635503 -165142 -641618 -980886 -1733393 -2738372 -3120393 -2331238 -559056 1494874
36835 1494874 2611366 1688310 -598931 -1745167 -355236 1828991 2327554 1203027
36827 1203027 94601 -753509 -2045857 -3054745 -2563242 -1488079 -1478716 -1522092 463827
36818 463827 3035603 2583349 -309115 -719654 2854576 5480252 3253179 -693036 -1414581
36809 -1414581 314426 300165 -1828649 -2656130 -992965 783890 1041247 530097 -280342
36800 -280342 -1911598 -3635515 -3711614 -2311290 -1447781 -1647173 -1344908 -483 766298
36791 766298 -208082 -2029463 -3257717 -3165688 -1413765 1506898 3589108 3301014 2100410
36782 2100410 2470939 3720545 2854936 -225043 -1995242 -707821 1031569 658189 -737382
36773 -737382 -1306521 -1808911 -3284876 -3988167 -2037633 622119 490822 -2130744 -3471783
36764 -3471783 -1778688 706174 1629716 1469047 1543526 1512226 549353 -469212 185621
36755 185621 2525023 4538276 4567165 3105319 1890252 1682258 1515755 271531 -1467056
36746 -1467056 -1797177 122863 2676419 3340124 1482694 -883062 -1291235 477336 2175944
36737 2175944 1680373 -480584 -1715063 -488960 1978888 3585042 3930365 4005319 4086468
36728 4086468 3561270 2643490 2478342 3109894 2914737 906865 -1567320 -2399546 -1177512
36719 -1177512 743724 1887252 1556962 -192916 -2466075 -3707732 -2831337 -181917
36711 -181917 2910675 5230519 6142359 5614155 4277964 3000909 1969263 653779 -1026291
36702 -1026291 -2204530 -2218143 -1569068 -1122318 -968347 -759533 -566546 -570383 -393591 305004
36692 305004 857264 240525 -1282045 -2159726 -1556415 -595706 -913273 -2290531 -2633970
36683 -2633970 -688049 1916470 2315271 15406 -2392720 -2628381 -1502290 -1140791 -1612796
36674 -1612796 -1248298 217434 1071522 414804 -564818 -762395 -729608 -1204858 -1801641
36665 -1801641 -2195861 -2934878 -3831775 -3261680 -685896 1624741 1339244 -621352 -1622612
36656 -1622612 -1263346 -1415265 -2710649 -3425569 -2175390 210432 2000657 2279247 1059933
36647 1059933 -878972 -1982790 -1154038 631863 1233876 191111 -651378 251298 2209605
36638 2209605 3472742 3194540 1779050 315620 -29805 864022 1507103 729723 51147
36629 51147 2005640 5783579 7230401 4474134 907091 411406 1926092 1718933 -604412
36620 -604412 -1976759 -1114404 -137002 -570089 -1194966 -984409 -1083792 -2198477 -2675229
36611 -2675229 -1297921 197659 -184265 -1247685 -539561 1509650 2269598 1060615 -277817
36602 -277817 -755762 -1269524 -2025682 -1806573 -591484 -258443 -1499360 -2429815 -1687027
36593 -1687027 -637533 -753110 -944429 263706 1732140 1564904 680408 1569224 4095587
36584 4095587 5488527 4500642 2821244 1994324 1585199 1199295 1803145 3638298 4776618
36575 4776618 3446452 579348 -1421386 -1582503 -817602 -217086 -21326 122874 667380
36566 667380 1585761 1994315 1074250 -444364 -902803 -253448 -533370 -2917192 -5692955
36557 -5692955 -6447045 -5138460 -3563349 -2682091 -2098291 -1591631 -1447299 -1394443 -706383
36548 -706383 513215 1305617 1269456 1040265 1197477 1469388 1197205 71846 -1598049
36539 -1598049 -2976582 -3248526 -2379798 -953944 898170 3507466 6169129 6918136 4910324
36530 4910324 1978394 436128 223641 -185561 -894117 -660607 502948 1033167 313815
36521 313815 -527664 -783271 -1282730 -2667974 -4192007 -5034347 -5324141 -5032159 -3409776
36512 -3409776 -693341 1031060 213308 -1776275 -2193214 -419953 1469345 1545591 244726
36503 244726 -480511 537294 2578180 3940727 3702705 2443723 1155426 -88432 -1713946
36494 -1713946 -3297730 -3818102 -3298589 -2900682 -2987187 -2360268 -69126 3136405 5788643
36485 5788643 6984108 6124036 2982635 -864475 -2344801 -380388 2150274 1909239
36477 1909239 -412726 -1341685 294125 2086681 1841725 130965 -1482936 -2505566
36469 -2505566 -2871548 -2151181 -538572 778787 1147450 1053964 660568 -470539 -1413792
36460 -1413792 60089 3827492 5985693 3563578 -854395 -2126969 592811 3083761
36452 3083761 2107190 -848882 -2696419 -2877133 -2739835 -2704107 -2010531 -426231 1337746
36443 1337746 2535903 2795725 2096164 1027080 454672 314347 -487018 -2270202 -3592276
36434 -3592276 -3033264 -1211445 130234 490057 792900 1483026 1770511 1038982 53639
36425 53639 220355 1915337 3816072 4019385 2071019 -268327 -917271 -15950 541641
36416 541641 226182 791037 3143317 5139602 4437046 2286320 1967818 3880974 4875145
36407 4875145 2907617 -91736 -1187003 -372364 106579 -751704 -1656056 -1236154 48140
36398 48140 582887 -396997 -1903091 -2362444 -1538262 -771027 -1014659 -1365776 -412193 1530503
36388 1530503 2769027 2540265 1588450 510131 -897745 -2321590 -2536008 -1089823 781647
36379 781647 1710215 1735586 1617391 1470498 802022 -689427 -2810994 -4838965 -5692330
36370 -5692330 -4936513 -3591169 -2936074 -2677535 -1644924 -68542 727695 912654 2078045
36361 2078045 4116792 4808113 3539596 2650735 3421617 3576628 1230133 -1307161 -967487
36352 -967487 802032 153966 -2750674 -3636489 -616794 2993617 3450615 1156568 -934764
36343 -934764 -1159939 54401 1456680 1700536 124100 -2193216 -3261616 -2675489 -2018401
36334 -2018401 -2335420 -2764821 -2356144 -1658759 -1580860 -2038937 -2640628 -3410712 -3992098 -3550215
36324 -3550215 -2516944 -2981728 -5913822 -9099904 -9459612 -6801764 -3824820 -2722920
36316 -2722920 -3132505 -3452595 -3094488 -2947235 -3936123 -5472218 -5768108 -4073290 -2022330
36307 -2022330 -1720670 -2875397 -3339835 -2387596 -1441846 -1139094 -42546 2395630 3781545
36298 3781545 1878023 -1668661 -3169111 -1753622 18725 194222 -337901 -50158 899802
36289 899802 1528599 1733635 2013737 2351737 2352098 2048582 1869083 1963896 1910234 1054350
36279 1054350 -651669 -1844495 -410285 3945479 8099674 8114004 3867434 -449236
36271 -449236 -1322239 142932 728921 127135 912084 3786832 5766638 4339637 1248810
36262 1248810 85049 1407096 2616207 2155644 1286747 1347474 1637463 1156725 567613
36253 567613 880997 1503211 1209346 116456 -876191 -1760634 -2829605 -3160462 -1721723
36244 -1721723 337552 657191 -933449 -2030996 -1157215 283691 394743 -537626 -949683
36235 -949683 -447345 -152780 -1168374 -3415695 -5572069 -5945628 -4109714 -1655294 -336877
36226 -336877 293674 1865758 3986289 4339863 2488789 971818 1245987 1027350 -2088163
36217 -2088163 -6257599 -7401757 -4531630 -395772 2554546 4100243 4335846 2760449
36209 2760449 110921 -1218248 31671 2117924 2361470 207416 -2566403 -3918419
36201 -3918419 -3138240 -1059336 619691 614870 -841186 -2332079 -2747033 -2094770 -975511
36192 -975511 71527 609983 378946 -360788 -875969 -477048 1113723 3526429 5482650
36183 5482650 5398144 3190507 1166683 1960156 5439496 8525973 8274601 4521997 -459339
36174 -459339 -4119489 -5375076 -4998597 -4522109 -4394256 -3503852 -1111392 1408622 2027536
36165 2027536 909045 163089 666549 926829 -251613 -1702027 -1717747 -642367 -109838
36156 -109838 -469878 -576268 116662 742107 507516 -178560 -528739 -516715 -636066 -1005952
36146 -1005952 -1294213 -1367606 -1532572 -1998541 -2343295 -1791781 -128725 1793910 2681471
36137 2681471 2005031 502743 -544473 -441589 514994 1582374 2334171 2827457 3149804
36128 3149804 3116999 2612357 1935831 1385106 704699 -385083 -1206375 -647855 1038903
36119 1038903 2020275 1151279 -458756 -1084653 -741356 -670469 -1167662 -1516224 -1779577
36110 -1779577 -2854036 -4510112 -5110068 -3942492 -2368587 -1763764 -1639433 -971606 -270622
36101 -270622 -754050 -2011180 -2158524 -440075 1665086 2416350 1921048 1546088 1802168
36092 1802168 1775100 748670 -428943 -334188 925919 1598297 678483 -537229 -313857
36083 -313857 762892 447810 -1735476 -3406638 -2354085 746233 3639665 5298409
36075 5298409 6049730 5854471 4283819 1996557 548040 442629 643081 283263 -338993
36066 -338993 -785486 -1203346 -1495285 -1039485 -16395 202911 -958197 -2020208 -1501568
36057 -1501568 -265930 -143193 -941738 -947002 -156114 -539832 -2512214 -3600701 -2067722
36048 -2067722 144841 80275 -2029780 -3477088 -3093867 -2109114 -1362840 -270733 1116178
36039 1116178 1477801 535865 -102002 433195 715725 -393892 -1309572 77428 2777828
36030 2777828 3536529 1110154 -2137735 -3165881 -1423839 1203561 2514887 1667651
36022 1667651 -431467 -1945866 -1733179 -406156 396040 -266758 -1793597 -2679459 -1868307
36013 -1868307 98531 1194870 -124184 -2884672 -4452539 -3713194 -2166327 -1342368
36005 -1342368 -731887 593809 1859631 1734042 407112 -1208542 -3187691 -5499269
35997 -5499269 -6338808 -4111287 -503402 1044976 -246014 -2089548 -2941334 -3468244 -4144594
35988 -4144594 -4369011 -4496911 -5755309 -7304015 -6483168 -3223250 -1008743 -1655167 -2315236
35979 -2315236 -206035 2602584 2461936 64189 -702104 1315846 3464909 3828943 3429921
35970 3429921 3553911 3771972 3370987 2533690 1388946 -292050 -1894406 -2111559 -833530
35961 -833530 551862 1144079 1449808 1986124 2322725 1965140 1117623 271547 -118533
35952 -118533 345352 1356123 1672252 712670 -246219 10084 310764 -1198579 -3634884
35943 -3634884 -4282645 -2786635 -1562742 -1664963 -1257682 855486 3078320 3786728 3653969
35934 3653969 3704120 3563026 3254094 3998240 5171676 3355471 -2703144 -8672409 -9634830
35925 -9634830 -6609007 -4375138 -4353573 -3923357 -2021778 -735957 -949815 -751445 685578
35916 685578 1442628 538843 -227552 122827 -348568 -2774123 -4707184 -3821250 -1869182
35907 -1869182 -1875816 -3313784 -3343318 -1514794 110182 775505 1648739 2757394 2446078
35898 2446078 427652 -1242688 -1151553 -482206 -1001882 -2566112 -3545214 -2797341 -667431
35889 -667431 1296852 1508907 -101101 -1897347 -2567804 -2645924 -3037001 -3157449 -2225158
35880 -2225158 -1345159 -2021346 -3264955 -2758938 -566843 1026415 1196636 1128947 904585
35871 904585 -665057 -2548759 -1695517 1903049 4165081 2989780 1659509 3385536
35863 3385536 5958973 5538656 2949890 1861798 2559188 2122543 -63617 -1415823 -723184
35854 -723184 279617 277672 -29509 -102931 -310860 -198005 1051615 2220297 1218124
35845 1218124 -1069973 -1380576 931121 2870441 2650513 2130838 3103773 4395751 4310550
35836 4310550 3054548 1123720 -1828942 -4856570 -5499356 -3656945 -2608317 -3926306
35828 -3926306 -4582284 -1932847 1558046 2135416 602118 239595 949483 55583 -2204676
35819 -2204676 -2689914 -686112 1050696 959066 483787 500623 -374654 -2618201 -4112742
35810 -4112742 -3275158 -1425093 -523560 -639082 -1055882 -1936407 -3309658 -3951540 -2836669
35801 -2836669 -704801 926878 1415339 939421 -83929 -808848 -345245 881997 1220533
35792 1220533 -9241 -1398080 -1285105 153813 1358699 1252056 134165 -767664 -458039
35783 -458039 618330 805092 -538157 -1681353 -769031 1236052 1792002 568763 -324406
35774 -324406 147954 810032 976292 1441940 1954345 699205 -2206127 -3577754 -1618480
35765 -1618480 971729 804719 -1363357 -2357607 -1461529 -563797 -569193 -730218 -965699
35756 -965699 -1906205 -2783915 -1960784 327421 2128614 2769672 3345418 4066916 3688763
35747 3688763 2227952 1816557 3660904 6030661 6525871 4855531 2216326 -646713
35739 -646713 -3323775 -4739099 -3918885 -1532086 463540 782690 -155163 -1111314 -1505945
35730 -1505945 -1830889 -2567168 -2941027 -1562808 1279048 2981971 1442595 -2163471 -4787425
35721 -4787425 -5136098 -4239871 -2902004 -903113 1040894 1072424 -912273 -2260941 -1098125
35712 -1098125 740068 262843 -2232665 -3492143 -1873305 440029 418700 -1928258 -3685575
35703 -3685575 -2651385 124100 1842375 1467621 607798 615878 354803 -1633901 -3890302
35694 -3890302 -3507398 -750291 583856 -1658862 -4947684 -5722254 -3950673 -2108448
35686 -2108448 -1427500 -1522586 -2443345 -4447861 -6300305 -6229581 -4492369 -3031838 -2765420
35677 -2765420 -3060967 -3589149 -4554292 -5090386 -3639360 -412457 2309063 2856968 1766160
35668 1766160 495039 -3106 573876 1566277 1267258 -1120844 -3699528 -4113852 -3162240
35659 -3162240 -3385730 -4262484 -2567142 1643024 3599911 677377 -3020404 -2242154 2081547
35650 2081547 4954560 4701931 3923541 4134922 3950087 2737652 2055996 2503523 2418342
35641 2418342 909178 -554112 -798862 -749790 -1295431 -1651345 -1328491 -1646470 -3535187
35632 -3535187 -5514844 -5701635 -4509710 -3551597 -2941497 -1608048 411890 1896680 2401026
35623 2401026 2624680 2808459 2272042 924263 20276 656478 2117161 2528529 1149926
35614 1149926 -612529 -956042 -89468 111343 -940197 -1329239 481999 2814307 2813041
35605 2813041 713250 -404815 736998 1835552 812780 -1045947 -1431065 -582128
35597 -582128 -438853 -1419121 -2119276 -1609993 -271332 1262929 2491591 2716046 1673519
35588 1673519 235216 -623557 -1093371 -1679857 -1749790 -355416 1881648 3135366 2507789
35579 2507789 726890 -964743 -1579985 -573550 1486833 2860147 2467588 1316998
35571 1316998 893485 854353 -126544 -1891993 -3014144 -3021824 -2541146 -1667576 -299847
35562 -299847 327829 -997875 -2644843 -1575015 1839493 3439311 976086 -2579113
$$ [...]
##END NTUPLES=NMR SPECTRUM
##END=
