##TITLE=31Pdec_PR196_rm
 , 24 sc
 7.04.2021
##JCAMPDX= 6.0         $$ Bruker NMR JCAMP-DX V2.0
##DATA TYPE= NMR SPECTRUM
##DATA CLASS= NTUPLES
##ORIGIN= UXNMR, Bruker Analytische Messtechnik GmbH
##OWNER= root
$$ XWIN-NMR		Version 3.5
$$ Wed Apr  7 16:14:21 2021 Russian Standard Time (UT+4h)  she@DPX200
##.OBSERVE FREQUENCY= 81.013821
##.OBSERVE NUCLEUS= ^31P
##.ACQUISITION MODE= SIMULTANEOUS
##.ACQUISITION SCHEME= undefined
##.AVERAGES= 24
##.DIGITISER RES= 16
##SPECTROMETER/DATA SYSTEM= spect
##.PULSE SEQUENCE= zgpg30
##.SOLVENT NAME= CDCl3
##.SHIFT REFERENCE= (INTERNAL, CDCl3, 0, 248.564)
##AUDIT TRAIL= $$ (NUMBER, WHEN, WHO, WHERE, WHAT)
$$ ##TITLE= Audit trail, XWIN-NMR		Version 3.5
$$ ##JCAMPDX= 5.01
$$ ##ORIGIN= Bruker BioSpin GmbH
$$ ##OWNER= she
$$ F:/spectra/data/she/nmr/P31/1/pdata/1/auditp.txt
$$ ##AUDIT TRAIL=  $$ (NUMBER, WHEN, WHO, WHERE, WHAT)
(   1,<2021-04-07 16:12:43.03 +0400>,<she>,<DPX200>,
      <created by zg, POWCHK disabled, PULCHK disabled
       configuration hash MD5:
       00 E9 B6 7A A2 85 ED C7 34 08 36 98 17 FE 4E 26
       data hash MD5: 32K
       94 7A 17 CB B8 F6 0B E3 6D B0 C0 E9 DE 39 59 8B>)
(   2,<2021-04-07 16:13:00.59 +0400>,<she>,<DPX200>,
      <Start of raw data processing
       efp BC_mod = 2 LB = 1 FT_mod = 6 PKNL = 1 PHC0 = -5699.051 PHC1 = 2073.002 SI = 64K 
       data hash MD5: 64K
       5D 04 AB DD D6 C3 B0 96 43 61 FB 9F 3F 93 6C 7F>)
(   3,<2021-04-07 16:13:44.89 +0400>,<she>,<DPX200>,
      <pk PHC0 = 927.0806 PHC1 = -1977.799 
       data hash MD5: 64K
       D5 81 D0 E0 3F 7B AE 7B E1 A8 F2 9B 29 EB 23 06>)
(   4,<2021-04-07 16:13:47.64 +0400>,<she>,<DPX200>,
      <abs ABSG = 5 
       data hash MD5: 64K
       EC 35 B4 8E 6E 1F 8C 3B 9A 4A A9 D8 9C C6 1A B5>)
$$ ##END=
$$ 
$$ hash MD5
$$ 4D 52 38 97 02 41 D0 DB 4B 1E D5 9D 20 ED ED 04
##$RELAX= 
##$RELAX= 
##$RELAX= 
##$RELAX= 
##$RELAX= 
##$RELAX= 
##$RELAX= 
##$RELAX= 
$$ Bruker specific parameters
$$ --------------------------
##$DU= <F:/spectra>
##$EXPNO= 1
##$NAME= <P31>
##$PROCNO= 1
##$TYPE= <nmr>
##$USER= <she>
##$AMP= (0..31)
100 100 100 100 100 100 100 100 100 100 100 100 100 100 100 100 100 100 
100 100 100 100 100 100 100 100 100 100 100 100 100 100 
##$AQSEQ= 0
##$AQ_mod= 1
##$AUNM= <au_zg>
##$AUTOPOS= <>
##$BF1= 81.014009
##$BF2= 200.13
##$BF3= 200.13
##$BF4= 200.13
##$BF5= 200.13
##$BF6= 200.13
##$BF7= 200.13
##$BF8= 200.13
##$BYTORDA= 1
##$CFDGTYP= 0
##$CFRGTYP= 5
##$CHEMSTR= <none>
##$CNST= (0..31)
1 1 145 1 1 1 1 1 1 1 1 1 1 1 1 1 1 1 1 1 1 1 1 1 1 1 1 1 1 1 1 1 
##$CPDPRG= <waltz16>
##$CPDPRG1= <>
##$CPDPRG2= <waltz16>
##$CPDPRG3= <>
##$CPDPRG4= <mlev>
##$CPDPRG5= <mlev>
##$CPDPRG6= <mlev>
##$CPDPRG7= <mlev>
##$CPDPRG8= <mlev>
##$CPDPRGB= <>
##$CPDPRGT= <>
##$D= (0..31)
0 1 0 0 0 0 0 0 0 0 0 0.03 2e-05 3e-06 0 0 0 0 0 0 0 0 0 0 0 0 0 0 0 0 
0 0 
##$DATE= 1617797562
##$DBL= (0..7)
120 120 120 11 120 120 24 19 
##$DBP= (0..7)
150 150 150 150 150 150 150 150 
##$DBP07= 0
##$DBPNAM0= <>
##$DBPNAM1= <>
##$DBPNAM2= <>
$$ [...]
##$SUBNAM3= <"">
##$SUBNAM4= <"">
##$SUBNAM5= <"">
##$SUBNAM6= <"">
##$SUBNAM7= <"">
##$SUBNAM8= <"">
##$SUBNAM9= <"">
##$SW= 501.771253377433
##$SWIBOX= (0..15)
0 1 3 0 0 0 0 0 0 0 0 0 0 0 0 0 
##$SW_h= 40650.406504065
##$TD= 32768
##$TD0= 1
##$TE= 0
##$TE2= 300
##$TE3= 300
##$TEG= 300
##$TL= (0..7)
0 120 53 12 22 120 120 120 
##$TP= (0..7)
150 150 150 150 150 150 150 150 
##$TP07= 0
##$TPNAME0= <>
##$TPNAME1= <>
##$TPNAME2= <>
##$TPNAME3= <>
##$TPNAME4= <>
##$TPNAME5= <>
##$TPNAME6= <>
##$TPNAME7= <>
##$TPOAL= (0..7)
0.5 0.5 0.5 0.5 0.5 0.5 0.5 0.5 
##$TPOFFS= (0..7)
0 0 0 0 0 0 0 0 
##$TUNHIN= 0
##$TUNHOUT= 0
##$TUNXOUT= 0
##$USERA1= <user>
##$USERA2= <user>
##$USERA3= <user>
##$USERA4= <user>
##$USERA5= <user>
##$V9= 5
##$VALIST= <valist>
##$VCLIST= <CCCCCCCCCCCCCCC>
##$VD= 0
##$VDLIST= <DDDDDDDDDDDDDDD>
##$VPLIST= <PPPPPPPPPPPPPPP>
##$VTLIST= <TTTTTTTTTTTTTTT>
##$WBST= 1024
##$WBSW= 4
##$XGAIN= (0..3)
0 0 0 0 
##$XL= 0
##$YL= 0
##$YMAX_a= 41283
##$YMIN_a= -55870
##$ZGOPTNS= <>
##$ZL1= 120
##$ZL2= 120
##$ZL3= 120
##$ZL4= 120
##$ABSF1= 248.5645
##$ABSF2= -253.2056
##$ABSG= 5
##$ABSL= 3
##$ALPHA= 0
##$AQORDER= 0
##$ASSFAC= 0
##$ASSFACI= 0
##$ASSFACX= 0
##$ASSWID= 0
##$AUNMP= <proc_1d>
##$AZFE= 0.1
##$AZFW= 0.5
##$BCFW= 0
##$BC_mod= 2
##$BYTORDP= 0
##$COROFFS= 0
##$CY= -3
##$DATMOD= 1
##$DC= 0
##$DFILT= <>
##$DTYPP= 0
##$F1P= 0
##$F2P= 0
##$FCOR= 1
##$FTSIZE= 65536
##$FT_mod= 6
##$GAMMA= 0
##$GB= 0
##$INTBC= 1
##$INTSCL= 5.30512e-09
##$ISEN= 30
##$LB= 1
##$LEV0= 0
##$LPBIN= 0
##$MAXI= 10000
##$MC2= 0
##$MEAN= 0
##$ME_mod= 0
##$MI= 50
##$NCOEF= 0
##$NC_proc= -3
##$NLEV= 6
##$NOISF1= 182.463
##$NOISF2= 159.3651
##$NSP= 0
##$NTH_PI= 0
##$NZP= 0
##$OFFSET= 248.5645
##$PC= 4
##$PHC0= -4771.97
##$PHC1= 95.203
##$PH_mod= 1
##$PKNL= yes
##$PPARMOD= 0
##$PSCAL= 0
##$PSIGN= 0
##$REVERSE= no
##$SF= 81.014009
##$SI= 65536
##$SIGF1= 159.3651
##$SIGF2= -187.1042
##$SINO= 113.3802
##$SIOLD= 16384
##$SREGLST= <1H.CDCl3>
##$SSB= 0
##$STSI= 65536
##$STSR= 0
##$SW_p= 40650.406504065
##$SYMM= 0
##$S_DEV= 0
##$TDeff= 32768
##$TDoff= 0
##$TI= <>
##$TILT= no
##$TM1= 0
##$TM2= 0
##$TOPLEV= 0
##$USERP1= <user>
##$USERP2= <user>
##$USERP3= <user>
##$USERP4= <user>
##$USERP5= <user>
##$WDW= 1
##$XDIM= 65536
##$YMAX_p= 296585275
##$YMIN_p= -32071428
$$ End of Bruker specific parameters
$$ ---------------------------------
##NTUPLES= NMR SPECTRUM
##VAR_NAME=  FREQUENCY,     SPECTRUM/REAL,   SPECTRUM/IMAG
##SYMBOL=    X,             R,               I
##VAR_TYPE=  INDEPENDENT,   DEPENDENT,       DEPENDENT
##VAR_FORM=  AFFN,          ASDF,            ASDF
##VAR_DIM=   65536,         65536,           65536
##UNITS=     HZ,            ARBITRARY UNITS, ARBITRARY UNITS
##FACTOR=    0.620285442955139, 1,           1
##FIRST=     20137.2065510759, 0,            0
##LAST=      -20513.1999529892, 0,           0
##MIN=       -20513.1999529892, -32071428,   0
##MAX=       20137.2065510759, 296585275,    0
$$ Real data points
##PAGE= N=1
##DATA TABLE= (X++(R..R)), XYDATA
$$ [...]
$$ plain form
42003 24139 97193 168142 151539 -17290 -134776 28356 346663 459192 256023 36537
41993 36537 125005 465140 692270 560715 213109 -1797 68745 240550 261232 111035
41983 111035 -42952 -91970 -51868 37715 107362 4924 -333290 -663408 -630683 -244039
41973 -244039 85435 89050 -10174 126250 410108 409061 -78246 -723176 -976296 -607621
41963 -607621 55941 422324 219902 -222706 -377622 -142499 123799 147568 27415 -79684
41953 -79684 -227233 -461245 -615407 -549569 -371966 -212331 -5552 258690 317411 -12996
41943 -12996 -444444 -519766 -198173 170110 350634 391495 365849 271252 154826 66665 -66772
41932 -66772 -278696 -370493 -173670 97438 91209 -147819 -241313 -38470 238189 396482
$$ packed form
42003B4139P3054P0949j6603j68829j17486J63132L18307J12529k03169k19486
41993C6537Q8468L40135K27130j31555l47606k14906P0542J71805K0682j50197
41983A11035j53987m9018M0102Q9583O9647j02438l38214l30118L2725L86644
41973b44039L29474L615r9224J36424K83858j047m87307o44930k53120L68675
41963f07621O63562L66383k02422m42608j54916K35123K66298K3769j20153j07099
41953g9684j47549k34012j54162O5838J77603J59635K06779K64242N8721l30407
41943a2996m31448p5322L21593L68283J80524M0861k5646r4597j16426q8161j33437
41932f6772k11924r1797J96823K71108o229k39028r3494K02843K76659J58293
$$ plain form
41922 396482 465605 464655 329482 119825 -11109 -83860 -225493 -339566 -197260 120458
41912 120458 252711 99194 -36302 65677 256768 322513 233555 10549 -320290 -557308
41902 -557308 -464802 -159143 18094 58130 263156 593272 586930 129503 -260885 -219809
41892 -219809 -76166 -219915 -433688 -342504 -105900 -101524 -235922 -158012 56986 28070
41882 28070 -243952 -373176 -241094 -135955 -210222 -267923 -181872 -117525 -209539 -341741 -392509
41871 -392509 -442641 -595980 -780751 -856411 -800181 -705035 -665474 -696513 -717947 -635091 -464630
41860 -464630 -312943 -210213 -94416 10810 -7839 -115041 -114879 17525 51036 -107329
41850 -107329 -216087 -98708 48345 -2248 -141959 -194122 -260377 -442565 -487462 -144946
$$ packed form
41922C96482O9123r50j35173k09657j30934p2751j41633j14073J42306L17718
41912A20458J32253j53517j35496J01979J91091O5745q8958k23006l30839k37018
41902e57308R2506L05659J77237M0036K05026L30116o342m57427l90388M1076
41892b19809J43643j43749k13773R1184K36604M376j34398P7910K14998k8916
41882B8070k72022j29224J32082J05139p4267n7701Q6051O4347r2014j32202n0768
41871c92509n0132j53339j84771p5660N6230R5146L9561l1039k1434Q2856J70461
41860d64630J51687J02730J15797J05226j8649j07202J62J32404L3511j58365
41850a07329j08758J17379J47053n0593j39711n2163o6255j82188m4897L42516
$$ plain form
41840 -144946 312547 391165 78785 -196117 -220035 -158446 -111779 32115 270196 408007
41830 408007 364823 233117 47394 -163801 -152215 291924 851908 917161 389693 -170932
41820 -170932 -318536 -203162 -126422 -58497 129503 301884 252884 51406 -82602 -103817
41810 -103817 -139165 -279866 -517116 -750264 -760384 -367146 251533 587736 334786 -234509
41800 -234509 -577534 -470970 -158859 -2455 -118977 -338333 -434713 -385492 -368721 -472271
41790 -472271 -523119 -349828 -100114 -60651 -220149 -291985 -173024 -83233 -181219 -320589
41780 -320589 -314658 -218900 -203679 -301770 -398447 -363875 -150260 120854 182216 -87437 -422358
41769 -422358 -460860 -262965 -231748 -479894 -631939 -400619 -22506 116363 24509 -10157
$$ packed form
41840a44946M57493P8618l12380k74902k3918O1589M6667J43894K38081J37811
41830D08007m3184j31706j85723k11195J1586M44139N59984O5253n27468n60625
41820a70932j47604J15374P6740O7925J88000J72381m9000k01478j34008k1215
41810a03817l5348j40701k37250k33148j0120L93238O18679L36203k52950n69295
41800b34509l43025J06564L12111J56404j16522k19356r6380M9221J6771j03550
41790d72271n0848J73291K49714L9463j59498p1836J18961Q9791r7986j39370
41780c20589N931R5758J5221r8091r6677L4572K13615K71114O1362k69653l34921
41769d22358l8502J97895L1217k48146j52045K31320L78113J38869r1854l4666
$$ plain form
41759 -10157 91632 122677 -59647 -338566 -503019 -464360 -289292 -94651 60601 171765
41749 171765 191326 48740 -157529 -156478 116963 305407 76289 -356931 -535360 -468416
41739 -468416 -561067 -840131 -827204 -333295 186010 345658 372959 555715 638409 281292
41729 281292 -247644 -418689 -241266 -137999 -172781 -17635 340585 472455 206747 -63438
41719 -63438 10564 232554 227861 -2544 -170938 -138574 -8256 96419 139450 127078 93809
41708 93809 83980 71242 -23596 -177166 -240392 -152012 -58670 -109323 -222403 -196990 -13991
41697 -13991 114413 17684 -211327 -327522 -219776 -13302 116748 155155 203727 280603
41687 280603 284586 173157 48279 2215 -4892 -14769 76087 385483 817355 1114382 1136031
$$ packed form
41759a0157J01789L1045j82324k78919j64453L8659J75068J94641J55252J11164
41749A71765J9561j42586k06269J051K73441J88444k29118m33220j78429O6944
41739d68416r2651k79064J2927M93909N19305J59648K7301J82756Q2694l57117
41729B81292n28936j71045J77423J03267l4782J55146L58220J31870k65708k70185
41719f3438P4002K21990m693k30405j68394L2364J30318J04675M3031j2372l3269
41708I3809r829j2738r4838j53570o3226Q8380R3342n0653j13080K5413J82999
41697a3991J28404r6729k29011j16195J07746K06474J30050L8407M8572P6876
41687B80603L983j11429j24878m6064p107r877R0856L09396M31872K97027K1649
$$ plain form
41676 1136031 967616 759340 581962 454820 383280 309208 127585 -161237 -377565 -338857
41666 -338857 -98317 84051 45058 -80327 -53834 100210 82790 -243956 -567280 -483657
41656 -483657 -83630 106051 -170012 -525053 -447312 38465 493940 700954 828457 983683
41646 983683 953090 540620 -69289 -482583 -515846 -300300 -59635 73186 84751 71431
41636 71431 172537 399896 568382 510390 317171 222599 272503 290817 193654 126757 194452
41625 194452 251369 135998 -41842 -68364 21070 12900 -108743 -147558 -76108 -115431 -322627
41614 -322627 -409144 -184784 74214 -4610 -323286 -452793 -260777 -54782 -84414 -226753
41604 -226753 -271399 -247239 -290874 -366392 -309016 -76215 184365 296981 219394 69883 21569
$$ packed form
41676A136031j68415k08276j77378j27142p1540p4072j81623k88822k16328L8708
41666c38857K40540J82368l8993j25385K6493J54044j7420l26746l23324Q3623
41656d83657M00027J89681k76063l55041P7741M85777M55475K07014J27503J55226
41646I83683l0593m12470o09909m13294l3263K15546K40665J32821J1565j3320
41636G1431J01106K27359J68486n7992j93219r4572M9904J8314r7163o6897O7695
41625A94452N6917j15371j77840k6522Q9434q170j21643l8815P1450l9323k07196
41614c22627q6517K24360K58998p8824l18676j29507J92016K05995k9632j42339
41604b26753m4646K4160m3635p5518N7376K32801K60580J12616p7587j49511m8314
$$ plain form
41593 21569 124638 227772 147296 -84094 -237454 -184012 -71646 -146368 -458456 -795787
41583 -795787 -878857 -606627 -141833 241775 407202 417210 360474 240708 95248 52039
41573 52039 120474 91473 -134486 -277479 -48765 317964 314822 -62796 -252929 16555
41563 16555 276057 25942 -488499 -656964 -413788 -249955 -389531 -486999 -266389 -397
41553 -397 -60057 -287307 -197590 291926 698871 606535 183215 -101489 -108492 -128957 -380530
41542 -380530 -662635 -647843 -360856 -163574 -291603 -583625 -718717 -597903 -408472 -371565
41532 -371565 -504170 -627911 -581311 -406457 -301355 -379826 -529018 -545833 -366178 -102485
41522 -102485 98598 164847 107264 5935 -28785 52915 194905 303694 317638 202859
$$ packed form
41593B1569J03069J03134q0476k31390j53360N3442J12366p4722l12088l37331
41583g95787q3070K72230M64794L83608J65427J0008n6736j19766j45460m3209
41573E2039O8435k9001k25959j42993K28714L66729l142l77618j90133K69484
41563A6555K59502k50115n14441j68465K43176J63833j39576r7468K20610K65992
41553c97n9660k27250Q9717M89516M06945r2336m23320k84704p003k0465k51573
41542c80530k82105J4792K86987J97282j28029k92022j35092J20814J89431L6907
41532c71565j32605j23741M6600J74854J05102p8471j49192j6815J79655K63693
41522a02485K01083O6249n7583j01329l4720Q1700J41990J08789J3944j14779
$$ plain form
41512 202859 -11413 -158107 -42780 284899 524567 500543 369505 315328 258636 96622
41502 96622 9471 196618 464824 467845 273567 274984 550706 751284 685584 582791 625498
41491 625498 635784 451247 255645 252536 290990 121750 -179835 -348718 -349044 -382550 -562847
41480 -562847 -809820 -1010228 -1104535 -1072589 -971884 -912124 -877853 -692250 -284813 138779
41470 138779 349139 389196 440422 497995 381780 32321 -367437 -564377 -445048 -117121
41460 -117121 152750 151012 -74975 -294968 -390272 -423187 -400218 -207635 108914 254769
41450 254769 78874 -147629 -92891 153944 253575 175237 249207 628922 1009238 1054751
41440 1054751 928932 1145092 1872639 2589603 2599513 1836683 936509 463077 341861 232239
$$ packed form
41512B02859k14272j46694J15327L27679K39668k4024j31038n4177n6692j62014
41502I6622q7151J87147K68206L021j94278J417K75722K00578o5700j02793M2707
41491F25498J0286j84537j95602l109L8454j69240l01585j68883l26l3506j80297
41480e62847k46973k00408r4307L1946J00705N9760L4271J85603M07437M23592
41470A38779K10360M0057N1226N7573j16215l49459l99758j96940J19329L27927
41460a17121K69871j738k25987k19993r5304l2915K2969J92583L16549J45855
41450B54769j75895k26503N4738K46835R9631p8338P3970L79715L80316M5513
41440A054751j25819K16160P27547P16964R910p62830r00174m73432j21216j09622
$$ plain form
41430 232239 144745 289065 502345 364465 -111678 -423621 -326880 -147070 -165407 -192853
41420 -192853 -37514 78788 -47852 -164926 -3152 184157 16390 -340973 -423560 -209938
41410 -209938 -84158 -162364 -189360 -80406 -50444 -146611 -114976 149228 399524 412392 253197
41399 253197 73313 -74045 -145112 -109578 -94841 -247843 -425340 -336286 -29350 117355
41389 117355 -25891 -145764 -5261 209638 252364 175656 91723 -94562 -408194 -550395
41379 -550395 -299280 41648 11717 -306090 -396452 -114891 79416 -166496 -565451 -649332
41369 -649332 -468631 -445130 -657750 -707959 -354639 101054 263861 184038 165664 244329
41359 244329 211473 58435 8508 101075 119246 1438 -50744 -493 -112560 -442615 -581228
$$ packed form
41430B32239q7494J44320K13280j37880m76143l11943R6741J79810j8337k7446
41420a92853J55339J16302j26640j17074J61774J87309j67767l57363q2587K13622
41410b09938J25780p8206k6996J08954K9962r6167L1635K64204K50296J2868j59195
41399B53197j79884j47358p1067L5534J4737j53002j77497Q9054L06936J46705
41389A17355j43246j19873J40503K14899M2726p6708q3933j86285l13632j42201
41379e50395K51115L40928k9931l17807r0362K81561J94307k45912l98955q3881
41369f49332J80701K3501k12620n0209L53320M55693J62807p9823j8374P8665
41359B44329l2856j53038m9927R2567J8171j17808n2182N0251j12067l30055j38613
$$ plain form
41348 -581228 -238533 245869 381275 246125 259238 424477 350492 -30133 -309455 -247331
41338 -247331 -84086 -73201 -135982 -165051 -267072 -456216 -457812 -121882 237491 238866 -25950
41327 -25950 -166645 -68680 29668 -39388 -180156 -258736 -263865 -214794 -116840 -39711 -58962
41316 -58962 -97408 -10849 140368 121528 -93437 -190342 70862 481907 641679 477403
41306 477403 267980 200730 183699 129880 140287 272452 365291 279210 121888 33837 -70525
41295 -70525 -300835 -491584 -415012 -191101 -146193 -311127 -414132 -363891 -357830 -463946 -493018
41284 -493018 -393978 -377454 -485594 -441861 -155389 18382 -177751 -448109 -388579 -87044
41274 -87044 108172 162312 265378 363378 238786 -45448 -218812 -270008 -436549 -747937
$$ packed form
41348e81228L42695M84402J35406j35150J3113J65239p3985l80625k79322O2124
41338b47331J63245J0885o2781k9069j02021j89144j596L35930L59373J375k64816
41327b5950j40695R7965R8348o9056j40768p8580n129M9071R7954P7129j9251
41316e8962l8446Q6559J51217j8840k14965r6905K61204M11045J59772j64276
41306D77403k09423o7250j7031n3819J0407J32165R2839q6081j57322q8051j04362
41295g0525k30310j90749P6572K23911M4908j64934j03005N0241O061j06116k9072
41284d93018R9040J6524j08140M3733K86472J73771j96133k70358N9530L01535
41274h7044J95216N4140J03066R8000j24592k84234j73364n1196j66541l11388
$$ plain form
41264 -747937 -961634 -963269 -876362 -757058 -529479 -264774 -179339 -271052 -263775 -21817 239186
41253 239186 263698 61122 -197242 -398000 -510280 -533926 -494034 -406810 -265820 -140103
41243 -140103 -178291 -373614 -471549 -319242 -148553 -239735 -456133 -453018 -233093 -104510
41233 -104510 -148382 -144667 -27310 2668 -129046 -250812 -292015 -382841 -534671 -590039 -568942
41222 -568942 -677117 -870340 -820229 -455475 -124626 -40898 17893 230841 377244 253234
41212 253234 55388 -4528 -117774 -495952 -854190 -750236 -272239 69930 50543 -105209
41202 -105209 -214763 -354717 -528523 -524413 -267286 -14554 -9672 -152217 -206151 -173115 -226408
41191 -226408 -348994 -297811 2712 233120 32874 -485373 -788873 -542460 4183 353046
$$ packed form
41264g47937k13697j635Q6907J19304K27579K64705Q5435r1713P277K41958K61003
41253B39186K4512k02576k58364k00758j12280k3646L9892Q7224J40990J25717
41243a40103l8188j95323r7935J52307J70689r1182k16398L115K19925J28583
41233a04510m3872L715J17357K9978j31714j21766m1203r0826j51830n5368K1097
41222e68942j08175j93223N0111L64754L30849Q3728N8791K12948J46403j24010
41212B53234j97846n9916j13246l78178l58238J03954M77997L42169j9387j55752
41202a05209j09554j39954j73806M110K57127K52732M882j42545n3934L3036n3293
41191b26408j22586N1183L00523K30408k00246n18247l03500K46413N46643L48863
$$ plain form
41181 353046 321003 102604 -93873 -236079 -341830 -399419 -437182 -498016 -526700 -426903 -220125
41170 -220125 -3818 211371 458567 660327 703967 616710 475516 240150 -79398 -217226
41160 -217226 34474 382070 322775 -118305 -395987 -259036 -68645 -131074 -198449 61857
41150 61857 491620 690052 552148 238099 -131231 -424552 -397305 700 402457 446838
41140 446838 256306 172844 213489 165126 50162 54232 77437 -175297 -642754 -886196 -710548
41129 -710548 -414778 -284355 -205784 -8238 129852 -56121 -422364 -542393 -314070 -131584
41119 -131584 -333406 -701331 -737833 -360032 -35587 -139884 -436320 -446535 -176800 -97599
41109 -97599 -385231 -594535 -304749 221654 371113 22400 -303440 -139703 375284 738206
$$ packed form
41181C53046l2043k18399j96477j42206j05751n7589l7763o0834k8684R9797K06778
41170b20125K16307K15189K47196K01760M3640q7257j41194k35366l19548j37828
41160b17226K51700L47596n9295m41080k77682J36951J90391o2429o7375K60306
41150F1857M29763J98432j37904l14049l69330k93321K7247L98005M01757M4381
41140D46838j90532q3462M0645m8363j14964M070K3205k52734m67457k43442J75648
41129g10548K95770J30423P8571J97546J38090j85973l66243j20029K28323J82486
41119a31584k01822l67925l6502L77801L24445j04297k96436j0215K69735P9201
41109i7599k87632k09304K89786N26403J49459l48713l25840J63737N14987L62922
$$ plain form
41099 738206 667387 313483 -7408 -142672 -157724 -152791 -118422 -1268 169277 324629
41089 324629 477923 652119 711695 477717 59972 -155545 19874 317373 394081 290176
41079 290176 273025 374354 383915 256508 212259 363861 493311 332617 -89281 -502397
41069 -502397 -687141 -606039 -353197 -105300 -52709 -234623 -466936 -555935 -548055 -606156 -661249
41058 -661249 -442159 49007 361759 140351 -358305 -615203 -572914 -586721 -716168 -608399
41048 -608399 -202994 28316 -141713 -219807 219075 715584 548444 -110800 -408266 -84021
41038 -84021 221376 38847 -261325 -154841 253499 501303 417046 145476 -165490 -384663
41028 -384663 -351637 -92922 114041 109059 69494 173469 291278 242346 138351 216601 484191
$$ packed form
41099G38206p0819l53904l20891j35264j5052M933L4369J17154J70545J55352
41089C24629J53294J74196N9576k33978m17745k15517J75419K97499P6708j03905
41079B90176j7151J01329R561j27407m4249J51602J29450j60694m21898m13116
41069e02397j84744Q1102K52842K47897N2591j81914k32313q8999P880n8101n5093
41058f61249K19090M91166L12752k21408m98656k56898M2289j3807j29447J07769
41048f08399M05405K31310j70029p8094M38882M96509j67140o59244k97466L24245
41038h4021L05397j82529l00172J06484M08340K47804q4257k71570l10966k19173
41028c84663L3026K58715K06963m982l9565J03975J17809m8932j03995P8250K67590
$$ plain form
41017 484191 738070 821351 720493 542536 480574 623871 752851 564137 140874 -114765
41007 -114765 -83991 -87302 -320562 -564698 -654104 -779684 -1027564 -1046269 -565700 95937
40997 95937 449882 470516 415323 302053 14551 -298552 -395445 -357922 -420352 -529056 -475159
40986 -475159 -319523 -269521 -261138 -91872 127425 88494 -191866 -366464 -260282 -30781
40976 -30781 149221 255597 308574 394103 697760 1220899 1594082 1499853 1127237 849036
40966 849036 639729 250365 -222964 -465763 -510087 -614351 -673143 -368201 116562 206801
40956 206801 -151477 -369508 -176131 -19303 -222839 -399558 -131858 310345 434756 292916
40946 292916 271366 433520 563085 619292 681786 644913 418798 255157 410195 632965
$$ packed form
41017D84191K53879Q3281j00858j77957o1962J43297J28980j88714m23263k55639
41007a14765L0774l311k33260k44136q9406j25580k47880j8705M80569O61637
40997I5937L53945K0634n5193j13270k87502l13103r6893L7523o2430j08704N3897
40986d75159J55636N0002Q383J69266K19297l8931k80360j74598J06182K29501
40976c0781J80002J06376N2977Q5529L03657N23139L73183r4229l72616k78201
40966H49036k09307l89364m73329k42799m4324j04264n8792L04942M84763R0239
40956B06801l58278k18031J93377J56828k03536j76719K67700M42203J24411j41840
40946B92916k1550J62154J29565N6207O2494l6873k26115j63641J55038K22770
$$ plain form
40936 632965 483082 63561 -89858 157896 359588 236832 84989 197620 351077 222168
40926 222168 -12864 71987 472826 743981 624397 311424 82568 -17795 -15615 155154
40916 155154 458211 630520 491727 228890 134587 178299 107427 -97623 -184609 -68440
40906 -68440 -4260 -207180 -536488 -705278 -628780 -424410 -209543 -34035 93182 209962
40896 209962 339816 388035 246018 18643 -68695 -32147 -120052 -350366 -396492 -125930
40886 -125930 99143 -34841 -258629 -133551 224416 306492 -4870 -299885 -314496 -289058
40876 -289058 -502796 -793881 -776815 -367896 97069 227214 -18861 -291259 -237551 68502
40866 68502 218688 32264 -197382 -159147 28420 79946 29964 118168 332234 422858 298295
$$ packed form
40936F32965j49883m19521j53419K47754K01692j22756j51843J12631J53457j28909
40926B22168k35032Q4851M00839K71155j19584l12973k28856j00363K180J70769
40916A55154L03057J72309j38793k62837r4303M3712p0872k05050q6986J16169
40906f8440O4180k02920l29308j68790P6498K04370K14867J75508J27217J16780
40896B09962J29854M8219j42017k27375q7338L6548q7905k30314m6126K70562
40886a25930K25073j33984k23788J25078L57967Q2076l11362k95015j4611K5438
40876b89058k13738k91085J7066M08919M64965J30145k46075k72398N3708L06053
40866F8502J50186j86424k29646L8235J87567N1526m9982Q8204K14066R0624j24563
$$ plain form
40855 298295 76329 -185139 -479247 -642165 -507933 -235209 -140320 -244523 -329273 -373210
40845 -373210 -527481 -695760 -597963 -277399 -80015 -70620 38307 272834 253664 -122923
40835 -122923 -390263 -217536 60756 17287 -179275 -128208 68319 -12240 -360175 -515919
40825 -515919 -291301 -25984 -36352 -202204 -253109 -165575 -92638 -109804 -215104 -430663
40815 -430663 -706623 -809076 -523155 7612 325445 152381 -268396 -471796 -344318 -195861
40805 -195861 -261193 -393381 -376717 -293189 -337358 -440957 -382413 -191850 -147584 -371152 -674333
40794 -674333 -821602 -737398 -471576 -175738 -77118 -232514 -348322 -119274 293679 445237
40784 445237 250643 79534 161395 288299 227337 55584 -86096 -232705 -392840 -423026
$$ packed form
40855B98295k21966k61468k94108j62918J34232K72724R4889j04203q4750m3937
40845c73210j54271j68279R7797L20564J97384R395J08927K34527j9170l76587
40835a22923k67340J72727K78292m3469j96562N1067J96527q0559l47935j55744
40825e15919K24618K65317j0368j65852n0905Q7534P2937j7166j05300k15559
40815d30663k75960j02453K85921N30767L17833j73064m20777k03400J27478J48457
40805a95861o5332j32188J6664Q3528m4169j03599N8544J90563M4266k23568l03181
40794f74333j47269Q4204K65822K95838R8620j55396j15808K29048M12953J51558
40784D45237j94594j71109Q1861J26904o0962j71753j41680j46609j60135l0186
$$ plain form
40774 -423026 -318434 -330033 -558271 -717513 -564313 -284420 -159894 -110443 86820 330431
40764 330431 340396 152164 79205 216974 323967 213623 -19086 -200254 -272595 -247950
40754 -247950 -159869 -103078 -161746 -274898 -307842 -255321 -236750 -300623 -376083 -408858 -399279
40743 -399279 -312917 -115127 86715 101366 -79392 -203632 -47953 293937 514069 451224
40733 451224 248002 126836 105239 30717 -145612 -287093 -307651 -322128 -427516 -475317
40723 -475317 -269678 84644 266378 152862 -65898 -185118 -180566 -105950 -23331 -37312
40713 -37312 -154616 -130478 229875 620019 495900 -116623 -539921 -379819 -66025 -112512
40703 -112512 -294047 -85249 395591 516713 100207 -347980 -417480 -266595 -182814 -144452
$$ packed form
40774d23026J04592j1599k28238j59242J53200K79893J24526M9451J97263K43611
40764C30431R965j88232p2959J37769J06993j10344k32709j81168p2341K4645
40754b47950Q8081N6791n8668j13152l2944N2521J8571o3873p5460l2775R579
40743c99279Q6362J97790K01842J4651j80758j24240J55679L41890K20132o2845
40733D51224k03222j21166k1597p4522j76329j41481k0558j4477j05388m7801
40723d75317K05639L54322J81734j13516k18760j19220M552P4616Q2619j3981
40713c7312j17304K4138L60353L90144j24119o12523m23298J60102L13794m6487
40703a12512j81535K08798M80840J21122m16506m48187o9500J50885Q3781L8362
$$ plain form
40693 -144452 -45519 13877 -67827 -154369 -87227 42146 51435 -45693 -102015 -66824 14689
40682 14689 125835 246385 292941 239627 206856 281450 340245 222546 4923 -92131 -43806
40671 -43806 -62833 -268361 -492413 -505824 -318880 -155394 -188100 -378132 -541126 -517250
40661 -517250 -306947 -80376 -19523 -119130 -192641 -113396 20589 38190 -51874 -78735 36462
40650 36462 169654 164226 8919 -195202 -353226 -412383 -367941 -296121 -303062 -376267 -374228
40639 -374228 -250829 -197276 -420628 -825766 -1076011 -988167 -733301 -588782 -596485 -564211
40629 -564211 -359711 -89943 47843 19570 -32690 -20659 -34311 -169625 -338805 -383756
40619 -383756 -308907 -232803 -148242 61525 362429 554868 566847 521571 441632 178414 -211993
$$ packed form
40693a44452R8933N9396q1704q6542O7142J29373R289r7128n6322L5191Q1513
40682A4689J11146J20550M6556n3314l2771P4594N8795j17699k17623r7054M8325
40671d3806j9027k05528k24052j3411J86944J63486l2706j90032j62994K3876
40661e17250K10303K26571O0853r9607p3511P9245J33985J7601r0064k6861J15197
40650C6462J33192n428j55307k04121j58024n9157M4442P1820o941p3205K039
40639c74228J23399N3553k23352m05138k50245Q7844K54866J44519p703L2274
40629e64211K04500K69768J37786k8273n2260J2031j3652j35314j69180m4951
40619c83756P4849P6104Q4561K09767L00904J92439J1979m5276p9939k63218l90407
$$ plain form
40608 -211993 -343131 -31131 303730 138280 -410293 -748693 -644075 -460584 -511861 -601526
40598 -601526 -404816 3367 271192 256294 139836 118399 193061 280745 371295 478683
40588 478683 517527 376761 141624 80595 279671 440482 285303 48184 191091 645826
40578 645826 811324 445235 51620 84850 264858 140883 -104050 -23812 233053 153035
40568 153035 -209471 -279756 59506 278409 117737 -2907 259395 631978 763291 753497
40558 753497 791485 750817 545564 459120 684832 897355 722300 326231 96348 12643
40548 12643 -180917 -403830 -356524 -89262 39145 -77907 -222817 -316840 -504198 -739752
40538 -739752 -738844 -461621 -253203 -314218 -371926 -135715 184321 151620 -221529 -425672 -140118
$$ packed form
40608b11993j31138L12000L34861j65450n48573l38400J04618J83491n1277q9665
40598f01526J96710M08183K67825j4898j16458k1437P4662Q7684R0550J07388
40588D78683L8844j40766k35137o1029J99076J60811j55179k37119J42907M54735
40578F45826J65498l66089l93615L3230J80008j23975k44933Q0238K56865q0018
40568A53035l62506p0285L39262K18903j60672j20644K62302L72583J31313r794
40558G53497L7988m0668k05253q6444K25712K12523j75055l96069k29883q3705
40548A2643j93560k22913M7306K67262J28407j17052j44910r4023j87358k35554
40538g39752R08K77223K08418o1015n7708K36211L20036l2701l73149k04143K85554
$$ plain form
40527 -140118 300220 304278 -238185 -833686 -983815 -690713 -283144 48395 326194 509341
40517 509341 431982 66253 -358827 -595900 -614731 -538563 -457310 -370311 -242945 -76952
40507 -76952 48507 41606 -49935 -50021 84330 147202 -9588 -201317 -166798 40363 195116
40496 195116 294823 451395 498033 154886 -418129 -706275 -559284 -366969 -386346 -374481
40486 -374481 -120172 117019 35713 -198800 -243946 -104651 -2059 65739 251997 482875
40476 482875 508352 290279 64928 24806 127608 211357 176744 74527 50711 134562 121486
40465 121486 -147660 -437103 -345903 97820 428435 399043 249501 196853 109784 -87646
40455 -87646 -146877 46433 160563 -48092 -263049 -110995 192224 196718 -40271 -101804
$$ packed form
40527a40118M40338M058n42463n95501j50129K93102M07569L31539K77799J83147
40517E09341p7359l65729m25080k37073j8831P6168Q1253Q6999J27366J65993
40507g6952J25459o901r1541q6J34351O2872j56790j91729L4519K07161J54753
40496A95116R9707J56572M6638l43147n73015k88146J46991J92315j9377J1865
40486c74481K54309K37191q1306k34513m5146J39295J02592O7798J86258K30878
40476D82875K5477k18073k25351m0122J02802Q3749l4613j02217k3816Q3851j3076
40465A21486k69146k89443R1200M43723L30615k9392j49542n2648q7069j97430
40455h7646n9231J93310J14130k08655k14957J52054L03219M494k36989o1533
$$ plain form
40445 -101804 78153 190994 136744 103606 105802 -46489 -291997 -310239 -46643 176186
40435 176186 170421 118041 174315 201891 68429 -94641 -119301 -54316 -19032 8112 93100
40424 93100 180511 166958 47188 -107609 -234399 -277205 -185480 27301 278554 491552
40414 491552 622210 625839 484524 273758 126207 110310 178574 221586 146900 -55678 -294987
40403 -294987 -465206 -561755 -645297 -695148 -608131 -364274 -82634 111304 170159 88920 -71373
40392 -71373 -140809 -4520 191192 192513 -9359 -200352 -292707 -369849 -393943 -220679 46442
40381 46442 100575 -62950 -79635 189553 400087 277272 38187 -10640 57462 26956 -65629
40370 -65629 -91012 -109705 -196331 -236462 -174171 -193532 -380207 -486237 -312259 -29644 153329
$$ packed form
40445a01804J79957J12841n4250l3138K196j52291k45508j8242K63596K22829
40435A76186n765n2380N6274K7576j33462j63070k4660O4985L5284K7144Q4988
40424I3100Q7411j3553j19770j54797j26790m2806R1725K12781K51253K12998
40414D91552J30658L629j41315k10766j47551j5897O8264M3012p4686k02578k39309
40403b94987j70219r6549q3542m9851Q7017K43857K81640J93938N8855q1239j60293
40392g1373o9436J36289J95712J321k01872j90993r2355p7142k4094J73264K67121
40381D6442N4133j63525j6685K69188K10534j22815k39085m8827O8102l0506r2585
40370f5629k5383j8693q6626m0131O2291j9361j86675j06030J73978K82615J82973
$$ plain form
40359 153329 310352 484342 446543 144837 -5625 256531 494589 191459 -390410 -561605
40349 -561605 -208286 158597 224485 149130 73609 -91565 -341208 -485158 -443921 -311670
40339 -311670 -141621 48384 144446 91618 46736 111669 125720 13069 42906 373371 659802
40328 659802 563310 317464 274391 234267 -149109 -597384 -558832 -125129 137585 129903 239499
40317 239499 512412 582421 417269 373889 468508 334153 -20972 -151640 14308 27591
40307 27591 -272555 -503419 -462582 -412986 -455628 -311576 44780 212253 69222 -4518
40297 -4518 145562 179636 -17236 -68131 113867 20215 -536775 -905885 -542197 122164
40287 122164 333331 56745 -202619 -211140 -91523 77178 268685 399023 565042 1039292
$$ packed form
40359A53329J57023J73990l7799l01706j50462K62156K38058l03130n81869j71195
40349e61605L53319L66883O5888p5355p5521j65174k49643j43950M1237J32251
40339c11670J70049J90005R6062n2828m4882O4933J4051j12651K9837L30465K86431
40328F59802r6492k45846m3073m0124l83376m48275L8552M33703K62714p682J09596
40317B39499K72913P0009j65152m3380R4619j34355l55125j30668J65948J3283
40307B7591l00146k30864M0837M9596m2642J44052L56356J67473j43031p3740
40297d518J50080L4074j96872n0895J81998r3652n56990l69110L63688O64361
40287A22164K11167k76586k59364q521J19617J68701J91507J30338J66019M74250
$$ plain form
40277 1039292 1697082 1896108 1327981 536747 150950 68394 -97992 -247140 -85210 185648
40267 185648 138599 -165851 -339280 -321362 -313152 -274625 -74516 40094 -271303 -792542
40257 -792542 -949790 -603310 -143660 124916 207228 107809 -183795 -426136 -330613 -38958
40247 -38958 33739 -184251 -385477 -436203 -518244 -704990 -823433 -788983 -707975 -614504 -442310
40236 -442310 -251306 -142744 5667 344505 653751 571987 192719 -34813 2135 -5219
40226 -5219 -139658 -95197 185309 283055 -6882 -270924 -130511 138803 87742 -153961
40216 -153961 -123950 182449 313199 102013 -93779 12833 222792 220265 59756 35913
40206 35913 227222 410488 386041 205051 55917 44533 122405 157836 51556 -156353
$$ packed form
40277A039292O57790J99026n68127p91234l85797q2556j66386j49148J61930K70858
40267A85648m7049l04450j73429J7918Q210L8527K00109J14610l11397n21239
40257g92542j57248L46480M59650K68576Q2312r9419k91604k42341R5523K91655
40247c8958P2697k17990k01226n0726q2041j86746j18443L4450Q1008R3471J72194
40236d42310J91004J08562J48411L38838L09246q1764l79268k27532L6948p354
40226e219j34439M4461K80506R7746k89937k64042J40413K69314n1061k41703
40216a53961L0011L06399J30750k11186j95792J06612K09959k527j60509k3843
40206C5913J91309J83266k4447j80990j49134j1384P7872L5431j06280k07909
$$ plain form
40196 -156353 -275434 -138926 167988 337549 177064 -149937 -324537 -260696 -156492 -182675
40186 -182675 -288785 -353895 -363659 -338891 -210462 94109 477605 700307 603241 265812
40176 265812 -70743 -228669 -228836 -177565 -57760 236829 625734 797879 611014 372635
40166 372635 466068 791696 881600 541326 56867 -261748 -401588 -422242 -262954 37289
40156 37289 219748 142191 13369 58502 144981 -3623 -363776 -638380 -645993 -475939 -319992
40145 -319992 -312539 -458354 -582561 -463606 -143822 56387 -2546 -16172 314264 763658
40135 763658 868618 621698 471004 621474 753663 570358 253225 133656 184573 148755
40125 148755 8063 -14990 125462 213745 159504 157845 303788 317029 -67619 -593850 -715123
$$ packed form
40196a56353j19081J36508L06914J69561j60485l27001j74600O3841J04204k6183
40186a82675j06110o5110r764K4768J28429L04571L83496K22702r7066l37429
40176B65812l36555j57926j67N1271J19805K94589L88905J72145j86865k38379
40166C72635R3433L25628Q9904l40274m84459l18615j39840k0654J59288L00243
40156C7289J82459p7557j28822M5133Q6479j48604l60153k74604p613J70054J55947
40145c19992P453j45815j24207J18955L19784K00209n8933j3626L30436M49394
40135G63658J04960k46920j50694J50470J32189j83305l17133j19569N0917l5818
40125A48755j40692k3053J40452Q8283n4241j659J45943J3241l84648n26231j21273
$$ plain form
40114 -715123 -310694 165903 316704 240979 194675 140948 -73106 -321923 -329046 -85791
40104 -85791 155879 244369 223462 144767 54846 92916 312050 470569 310273 -21766 -172471
40093 -172471 -145092 -253264 -516840 -569033 -271778 25912 33919 -76824 -55991 3647 -86727
40082 -86727 -240235 -283910 -296371 -448790 -668203 -734643 -598253 -376949 -155051 18723
40072 18723 57849 -42003 -120505 -66580 -7175 -119424 -355348 -499569 -412148 -111201 270356
40061 270356 523941 499809 282719 96568 12438 -46715 -27953 188809 399610 181746
40051 181746 -423180 -775237 -495062 -48061 -55940 -375387 -387485 23187 363117 334574
40041 334574 187418 197308 268040 218666 110175 87367 126856 108633 -5060 -160191 -273529
$$ packed form
40114g15123M04429M76597J50801p5725m6304n3727k14054k48817p123K43255
40104h5791K41670Q8490k0907p8695q9921L8070K19134J58519j60296l32039j50705
40093a72471K7379j08172k63576n2193K97255K97690Q007j10743K0833N9638r0374
40082h6727j53508m3675j2461j52419k19413o6440J36390K21304K21898J73774
40072A8723L9126r9852p8502N3925N9405j12249k35924j44221Q7421L00947L81557
40061B70356K53585k4132k17090j86151q4130n9153J8762K16762K10801k17864
40051A81746o04926l52057K80175M47001p879l19447j2098M10672L39930k8543
40041C34574j47156R890P0732m9374j08491k2808L9489j8223j13693j55131j13338
$$ plain form
40030 -273529 -276006 -200265 -196706 -327805 -414370 -275023 -46783 -20057 -193586 -283605 -192762
40019 -192762 -155134 -316158 -467480 -382391 -178887 -116906 -193663 -191766 -45583 91518 133698
40008 133698 184320 315094 413501 354836 190032 41311 -84476 -239756 -375880 -407440
39998 -407440 -391522 -453719 -544726 -479477 -249460 -70151 -41663 -997 159467 272148 190716
39987 190716 89249 213154 492085 660031 632442 513639 359303 194413 137450 229603
39977 229603 276460 154113 107806 386677 740079 712553 333121 36396 -38036 -148560
39967 -148560 -359747 -402917 -217352 -101027 -178845 -219851 -143013 -195212 -422596 -477287 -213932
39956 -213932 8185 -77896 -212056 -109499 47374 11018 -45596 109606 264140 99008
$$ packed form
40030b73529k477P5741L559j31099q6565J39347K28240K6726j73529r0019R0843
40019a92762L7628j61024j51322Q5089K03504O1981p6757J897J46183J37101M2180
40008A33698N0622J30774R8407n8665j64804j48721j25787j55280j36124l1560
39998d07440J5918o2197r1007O5249K30017J79309K8488M0666J60464J12681q1432
39987A90716j01467J23905K78931J67946k7589j18803j54336j64890n6963R2153
39977B29603M6857j22347m6307K78871L53402k7526l79432k96725p4432j10524
39967a48560k11187m3170J85565J16325p7818m1006P6838n2199k27384n4691K63355
39956b13932K22117q6081j34160J02557J56873l6356n6614J55202J54534j65132
$$ plain form
39946 99008 -224663 -292507 -78746 74211 3486 -130813 -175698 -139874 -73327 -30969 -77089
39935 -77089 -153748 -86124 131171 255576 158512 16801 -19319 -42516 -77771 79767 442739
39924 442739 619216 369728 36369 33089 230073 262599 140572 80271 8106 -245451
39914 -245451 -471532 -344235 -11855 92488 -82310 -229929 -262448 -329324 -350923 -113052
39904 -113052 191621 120309 -247703 -291686 219105 723571 670669 251090 -21355 -80548
39894 -80548 -233209 -540999 -729479 -674519 -603294 -716613 -875771 -838842 -651367 -564731
39884 -564731 -600068 -475734 -90509 191183 13043 -407204 -565394 -415420 -360010 -507455
39874 -507455 -484902 -140433 117983 -22952 -271504 -247455 -91300 -133867 -314810 -387719
$$ packed form
39946I9008l23671o7844K13761J52957p0725j34299m4885L5824O6547M2358m6120
39935g7089p6659O7624K17295J24405r7064j41711l6120k3197l5255J57538L62972
39924D42739J76477k49488l33359l280J96984L2526j22027o0301p2165k53557
39914b45451k26081J27297L32380J04343j74798j47619l2519o6876k1599K37871
39904a13052L04673p1312l68012m3983N10791N04466n2902m19579k72445n9193
39894h0548j52661l07790j88480N4960P1225j13319j59158L6929J87475Q6636
39884e64731l5337J24334L85225K81692j78140m20247j58190J49974N5410j47445
39874e07455K2553L44469K58416j40935k48552K4049J56155m2567j80943p2909
$$ plain form
39864 -387719 -404442 -521867 -583741 -381454 -111822 -81663 -152779 3104 266516 245926
39854 245926 -14748 -85045 113460 182696 -67039 -316501 -258544 -4444 174251 170806
39844 170806 -6453 -307421 -559128 -566419 -370796 -203214 -173104 -215516 -290768 -372610 -305587
39833 -305587 15323 368164 428490 231793 76698 10519 -194686 -533563 -649403 -348998
39823 -348998 94561 299959 191221 -48604 -202575 -108907 247663 628797 709172 438726
39813 438726 100932 -23649 95780 337909 597452 806818 915595 900686 764708 564402
39803 564402 443252 481828 481397 150623 -381224 -565634 -181457 256901 186735 -208388
39793 -208388 -338450 -108067 53003 -57150 -185065 -154417 -109521 -131803 -65152 128977
$$ packed form
39864c87719j6723j17425o1874K02287K69632L0159p1116J55883K63412k0590
39854B45926k60674p0297J98505O9236k49735k49462N7957K54100J78695l445
39844A70806j77259l00968k51707p291J95623J67582L0110m2412p5252q1842O7023
39833c05587L20910L52841O0326j96697j55095o6179k05205l38877j15840L00405
39823c48998M43559K05398j08738k39825j53971R3668L56570L81134Q0375k70446
39813D38726l37794j24581J19429K42129K59543K09366J08777j4909j35978k00306
39803E64402j21150L8576m31l30774n31847j84410L84177M38358p0166l95123
39793b08388j30062K30383J61070j10153j27915L0648M4896k2282O6651J94129
$$ plain form
39783 128977 225510 115586 10184 81646 170127 45301 -236165 -424482 -405028 -278078
39773 -278078 -177369 -128871 -88201 -55951 -91427 -172139 -129295 121035 350749 278859 32615
39762 32615 5242 217781 257678 -10129 -170686 32129 226845 65961 -129351 79914
39752 79914 436831 359402 -124706 -461250 -440170 -351603 -343335 -241753 -33761 33665 -84075
39741 -84075 -138151 -35689 28977 -50654 -155157 -203827 -219884 -153122 17714 64307 -230808
39730 -230808 -649308 -759000 -502675 -187401 13244 124143 56029 -274068 -581404 -496789
39720 -496789 -182282 -133947 -380464 -444498 -145029 153106 212598 262527 447733 468526
39710 468526 80080 -444237 -660876 -495989 -198028 24858 123602 132723 112111 62947
$$ packed form
39783A28977R6533j09924j05402P1462Q8481j24826k81466j88317J9454J26950
39773b78078J00709M8498M0670L2250l5476q0712M2844K50330K29714p1890k46244
39762C2615k7373K12539L9897k67807j60557K02815J94716j60884j95312K09265
39752G9914L56917p7429m84108l36544K1080Q8567Q268J01582K07992O7426j17740
39741h4075n4076J02462O4666p9631j04503m8670j6057O6762J70836M6593k95115
39730b30808m18500j09692K56325L15274K00645J10899o8114l30097l07336Q4615
39720d96789L14507M8335k46517o4034K99469K98135N9492M9929J85206K0793
39710D68526l88446n24317k16639J64887K97961K22886R8744R121k0612m9164
$$ plain form
39700 62947 -93871 -315575 -328871 17340 402931 373149 -47060 -420122 -512231 -474525
39690 -474525 -455677 -418378 -336733 -236525 -66944 157775 193966 -93827 -371854 -246634
39680 -246634 96704 155677 -100242 -247658 -152892 -110956 -234521 -290453 -211784 -213709 -308235
39669 -308235 -243710 -30255 13062 -146619 -158073 70194 174891 -21360 -202283 -126765
39659 -126765 -15506 -100749 -228487 -194723 -99753 -92803 -95434 -32212 -35521 -179483 -271050
39648 -271050 -128337 138296 289266 230731 42935 -92147 15577 329181 485271 191429
39638 191429 -345513 -684340 -727878 -668209 -494108 -47350 481424 646807 388100 98061
39628 98061 -562 -77612 -231513 -280339 -131222 54724 157344 181114 21091 -431430
$$ packed form
39700F2947j56818k21704j3296L46211L85591k9782m20209l73062r2109L7706
39690d74525J8848L7299Q1645J00208J69581K24719L6191k87793k78027J25220
39680b46634L43338N8973k55919j47416R4766M1936j23565n5932P8669j925r4526
39669c08235O4525K13455M3317j59681j1454K28267J04697j96251j80923P5518
39659a26765J11259q5243j27738L3764R4970O950k631O3222l309j43962r1567
39648b71050J42713K66633J50970n8535j87796j35082J07724L13604J56090k93842
39638A91429n36942l38827m3538N9669J74101M46758N28774J65383k58707k90039
39628I8061r8623p7050j53901m8826J49117J85946J02620K3770j60023m52521
$$ plain form
39618 -431430 -921674 -1012719 -684380 -338353 -195282 -122856 -54685 -95435 -180897 -103173 96442
39607 96442 198591 235930 377026 457469 180718 -272838 -442417 -355567 -452489 -748580
39597 -748580 -768744 -381723 -13315 74252 53939 -1833 -238949 -500641 -404437 -72685
39587 -72685 -57758 -390481 -474422 -125479 95232 -124393 -321184 -104813 207474 239127
39577 239127 173578 270180 348715 204687 22922 -26655 -125795 -385034 -549703 -442331
39567 -442331 -249923 -129247 -9966 24846 -272711 -755022 -921369 -723121 -671133 -929362
39557 -929362 -1019851 -687074 -301701 -106271 149409 476382 392334 -162016 -484332 -195810
39547 -195810 144317 49156 -108979 49928 121978 -253735 -546743 -185746 387128 420736
$$ packed form
39618d31430m90244r1045L28339L46027J43071P2426O8171m0750q5462P7724J99615
39607I6442J02149L7339J41096Q0443k76751m53556j69579Q6850r6922k96091
39597g48580k0164L87021L68408Q7567k0313n5772k37116k61692R6204L31752
39587g2685J4927l32723q3941L48943K20711k19625j96791K16371L12287L1653
39577B39127o5549R6602P8535j44028j81765m9577r9140k59239j64669J07372
39567d42331J92408J20676J19281L4812k97557m82311j66347J98248N1988k58229
39557i29362r0489L32777L85373J95430K55680L26973q4048n54350l22316K88522
39547a95810L40127r5161j58135J58907P2050l75713k93008L60997N72874L3608
$$ plain form
39537 420736 73473 1473 178337 86794 -221595 -203444 194181 466782 399183 264208
39527 264208 221456 141172 -2878 -89279 -145615 -251474 -257833 -12182 281608 310223 91350
39516 91350 -159234 -357694 -423817 -145659 433958 818643 675920 348581 317257 475797
39506 475797 425412 196717 145249 324083 455004 398388 251518 107019 32894 120483
39496 120483 279545 217390 -118191 -359321 -247149 -16595 30586 -19852 13469 21373 -136108
39485 -136108 -304809 -305319 -227187 -179145 -84884 26731 -69044 -336884 -382994 -85371 166144
39474 166144 144460 142931 317403 285697 -162198 -549789 -448370 -186216 -250436 -484927
39464 -484927 -498829 -409440 -514498 -618681 -379960 -29655 -67036 -431480 -590658 -325570
$$ packed form
39537D20736l47263p2000J76864r1543l08389J8151L97625K72601o7599j34975
39527B64208m2752q0284j44050q6401n6336j05859o359K45651K93790K8615k18873
39516I1350k50584j98460o6123K78158N79617L84685j42723l27339l1324J58540
39506D75797n0385k28695n1468J78834J30921n6616j46870j44499p4125Q7589
39496A20483J59062o2155l35581k41130J12172K30554M7181n0438L3321P904j57481
39485a36108j68701n10P8132M8042R4261J11615r5775k67840m6110K97623K51515
39474A66144k1684j529J74472l1706m47895l87591J01419K62154o4220k34491
39464d84927j3902Q9389j05058j04183K38721L50305l7381l64444j59178K65088
$$ plain form
39454 -325570 86700 362941 460143 439536 405452 441478 414153 107375 -302741 -335712 26059
39443 26059 179383 -197081 -633418 -624311 -341794 -185182 -167337 -183381 -336013 -534028
39433 -534028 -339292 286249 658448 332574 -189778 -282164 -124142 -173605 -294823 -142898
39423 -142898 83161 29054 -92772 94936 388329 375610 201723 248573 381057 230948
39413 230948 -47220 -9387 306819 484544 405436 260503 107188 -62800 -73397 118580
39403 118580 156706 -168496 -446863 -244778 175580 279338 65922 -96742 -125375 -163973
39393 -163973 -165781 -40812 58587 37668 114965 375471 470356 183517 -139097 -156426 -59824
39382 -59824 -99113 -94374 111068 235896 83639 -45143 74973 174547 84225 108571 345813
$$ packed form
39454c25570M12270K76241R7202k0607l4084L6026k7325l06778m10116l2971L61771
39443B6059J53324l76464m36337R107K82517J56612J7845j6044j52632j98015
39433e34028J94736O25541L72199l25874n22352r2386J58022m9463j21218J51925
39423a42898K26059n4107j21826J87708K93393j2719j73887M6850J32484j50109
39413B30948k78168L7833L16206J77725p9108j44933j53315j69988j0597J91977
39403A18580L8126l25202k78367K02085M20358J03758k13416j62664k8633l8598
39393a63973j808J24969R9399k0919P7297K60506R4885k86839l22614j7329R6602
39382e9824l9289M739K05442J24828j52257j28782J20116R9574r0322K4346K37242
$$ plain form
39371 345813 358556 33027 -39578 365844 530751 4395 -507496 -326103 5774 -280376
39361 -280376 -780340 -640403 -36372 224538 72546 25842 99871 -45826 -224993 -22898
39351 -22898 326048 311739 90508 155157 399362 389039 216861 232577 296721 133276 275
39340 275 174663 255339 -137213 -484311 -143227 501674 647289 350768 199332 185361
39330 185361 -43069 -261497 -68083 208672 48967 -232829 -54609 284800 120984 -339489
39320 -339489 -422044 -207112 -195051 -161587 417451 1126176 1057498 305296 -161163 47326
39310 47326 477062 815376 1109476 1245935 1194988 1458068 2303077 2974752 2686794 1895337
39300 1895337 1482750 1270133 623955 -41103 147623 839636 900672 274055 -77514 115959
$$ packed form
39371C45813J2743l25529p2605M05422J64907n26356n11891J81393L31877k86150
39361b80376m99964J39937O04031K60910j51992m6704P4029j45697j79167K02095
39351b2898L48946j4309k21231O4649K44205j0323j72178J5716O4144j63445j33001
39340B75J74388Q0676l92552l47098L41084O44901J45615k96521j51436j3971
39330A85361k28430k18428J93414K76755j59705k81796J78220L39409j63816m60473
39320c39489q2555K14932J2061L3464N79038P08725o8678p52202m66459K08489
39310D7326M29736L38314K94100J36459n0947K63080Q45009O71675k87958p91457
39300A895337m12587k12617o46178o65058J88726O92013O1036o26617l51569J93473
$$ plain form
39290 115959 245370 187751 394419 714689 561356 179172 345404 874195 834117 215237
39280 215237 -50553 254126 374076 56198 -82759 213491 509144 667189 972326 1245391
39270 1245391 1033747 656403 850811 1450731 1643869 1417683 1457995 1760641 1712910 1426175
39260 1426175 1569593 1981384 1888618 1407024 1340243 1600073 1391389 886105 1063317 1893330
39250 1893330 2372610 2407349 2914705 3963464 4682255 5248276 6984418 9919660 12073108
39241 12073108 11915106 10027238 7707422 5461937 3556045 2552912 2436248 2356603 1914475
39232 1914475 1631081 1715983 1587863 1076502 855132 1186650 1436743 1277869 1172358 1249923
39222 1249923 958423 270147 -14706 374331 725362 654956 644736 900843 970580 880435
$$ packed form
39290A15959J29411n7619K06668L20270j53333l82184J66232N28791m0078o18880
39280B15237k65790L04679J19950l17878j38957K96250K95653J58045L05137K73065
39270A245391k11644l77344J94408N99920J93138k26186M0312L02646m7731k86735
39260A426175J43418M11791r2766m81594o6781K59830k08684n05284J77212Q30013
39250A893330M79280L4739N07356J048759P18791N66021J736142K935242K153448
39241A2073108j58002j887868k319816k245485j905892j003133j16664p9645m42128
39232A914475k83394Q4902j28120n11361k21370L31518K50093j58874j05511P7565
39222A249923k91500o88276k84853L89037L51031p0406j0220K56107O9737r0145
$$ plain form
39212 880435 1301484 2147199 2413612 1933882 1859593 2777553 3804745 4347018 5335428 7628399
39202 7628399 10262900 11429829 10531774 8446385 6340979 4906691 4246009 3929412 3459475
39193 3459475 2878758 2543366 2403335 2143268 1867754 1877897 2002006 2021509 2402588 3506047
39183 3506047 4432271 3978685 2525448 1576322 1571386 1606160 1228632 963528 987743 803239
39173 803239 400747 354887 617537 542859 177121 196370 568309 636135 462036 668745
39163 668745 1067881 945787 561466 769614 1314038 1182219 515013 395197 854235 940766
39153 940766 696511 1133671 2236461 2914770 2973874 3189855 3437850 2799277 1579093
39144 1579093 1105395 1416158 1274870 582732 535107 1209702 1327639 711663 644080 1381154
$$ packed form
39212H80435M21049Q45715K66413m79730p4289R17960J027192N42273R88410K292971
39202G628399K634501J166929q98055k085389k105406j434288o60682l16597m69937
39193C459475n80717l35392j40031k60067k75514J0143J24109J9503L81079J103459
39183C506047R26224m53586j453237r49126m936L4774l77528k65104K4215j84504
39173H03239m02492m5860K62650p4678l65738J9249L71939O7826j74099K06709
39163F68745L99136j22094l84321K08148N44424j31819o67206j19816M59038Q6531
39153I40766k44255M37160J102790O78309N9104K15981K47995o38573j220184
39144A579093m73698L10763j41288o92138m7625O74595J17937o15976o7583P37074
$$ plain form
39134 1381154 1635368 1016668 714130 1211971 1533479 1284568 1282351 1660693 1513818 871297
39124 871297 845759 1426648 1367912 605150 430425 939933 809935 -103 49087 1158171
39114 1158171 1640349 915752 399363 713441 693689 -40872 -190055 678655 1246538 974474
39104 974474 1015874 1796028 2194812 1936526 2299981 3705644 5052807 6017039 7400171
39095 7400171 8728331 8338201 6407971 5015137 4673230 3840055 2320860 1839477 2595950
39086 2595950 2693400 1765179 1696575 2909336 3498180 2955677 3070882 4141872 4098795 2508165
39076 2508165 1592632 2081007 1982225 722609 403131 1564059 1913974 804550 665879
39067 665879 2307938 3195546 2265566 1987398 3542592 4433272 3192573 2083541 2691082
$$ packed form
39134A381154K54214o18700l02538M97841L21508k48911k217L78342j46875o42521
39124H71297k5538N80889n8736p62762j74725N09508j29998q10038M9190J109084
39114A158171M82178p24597n16389L14078j9752p34561j49183Q68710N67883k72064
39104I74474M1400P80154L98784k58286L63455J405663J347163R64232J383132
39095G400171J328160l90130j930230j392834l41907q33175j519195m81383P56473
39086B595950R7450r28221o8604J212761N88844n42503J15205J070990m3077j590630
39076B508165r15533M88375r8782j259616l19478J160928L49915j109424j38671
39067F65879J642059Q87608r29980k78168J555194Q90680j240699j109032O07541
$$ plain form
39058 2691082 3141911 2167813 1631761 2513398 2695462 1275151 731769 2247080 3263628
39049 3263628 2264164 1491374 2334646 2659679 1406413 1081493 2872918 4064487 3105376
39040 3105376 2384250 3259392 3474335 2232720 2350396 4486486 5011313 2660845 1272579
39031 1272579 2712973 3477216 1742149 1016075 2980832 3773753 1565833 551516 2907433
39022 2907433 4347740 2515936 1891161 5037260 7135565 5021392 3328816 5482906
39014 5482906 7172345 5284619 4338605 7116641 8391121 5363465 4235919 8432770
39006 8432770 11183956 8559308 8009381 14123604 18834532 17044008 17921765 27648589
38998 27648589 36397200 37855681 44354763 63571102 80160695 86984819 114236633 188637805
$$ packed form
39058B691082M50829r74098n36052Q81637J82064j420311n43382J515311J016548
39049C263628r99464p72790Q43272L25033j253266l24920J791425J191569r59111
39040C105376p21126Q75142K14943j241615J17676K136090N24827k350468j388266
39031A272579J440394P64243j735067p26074J964757P92921k207920j014317K355917
39022B907433J440307j831804o24775L146099K098305k114173j692576K154090
39014E482906J689439j887726r46014K778036J274480l027656j127546M196851
39006H432770K751186k624648n49927O114223M710928j790524Q77757R726824
38998B7648589Q748611J458481O499082J9216339J6589593O824124K7251814P4401172
$$ plain form
38990 188637805 273883107 296585275 236101608 149597429 98038257 83612894 75386175
38983 75386175 61724301 51801547 48489435 46264343 44669932 46008010 48551497 52485780
38975 52485780 61393356 72571628 82892380 107535482 165831943 237449656 263788093
38968 263788093 215781068 135533562 84502602 71996643 64675269 47113790 34700045
38961 34700045 34822549 33665935 24496318 18400428 20666062 21201913 14983304 10809057
38953 10809057 13155641 14007339 9181275 5997950 8395475 9633270 5935828 3442858
38945 3442858 5649680 6842783 3789520 1925675 4295777 5599736 2745280 771343
38937 771343 2892733 4553241 2618576 1156191 2971498 4198941 2268082 934612
$$ packed form
38990A88637805Q5245302K2702168o0483667q6504179n1559172j4425363q226719
38983G5386175j3661874r922754l312112k225092j594411J338078K543487L934283
38975E2485780Q907576J1178272J0320752K4643102N8296461P1617713K6338437
38968B63788093m8007025q0247506n1030960j2505959p321374j7561479j2413745
38961C4700045J22504j156614r169617o095890K265634N35851o218609m174247
38953A0809057K346584Q51698m826064l183325K397525J237795l697442k492970
38945C442858K206822J193103l053263j863845K370102J303959k854456j973937
38937G71343K121390J660508j934665j462385J815307J227443j930859j333470
$$ plain form
38929 934612 2612794 3615582 1629398 352507 2219685 3750659 2463646 1452001
38921 1452001 2893472 3770410 2188999 1418396 3499072 5057464 3558766 1817570
38913 1817570 2353350 2942302 1639247 799490 2319790 3921128 3655787 3299667 4145365
38904 4145365 4235476 2681620 1931470 3047651 3575118 2572876 2700936 4826556 5778037
38895 5778037 4077774 2694134 3420111 3761595 2200962 1300387 2581168 3414560 2094059
38886 2094059 1086541 2144889 2976719 1880030 1026467 2030762 2799929 1866573 1402478
38877 1402478 2849639 3887228 2781270 1555298 1919649 2200835 1140894 607244 1756153
38868 1756153 2581741 1892503 1606883 2655863 2906002 1553075 1096671 2531152 3220191
$$ packed form
38929I34612J678182J002788j986184j276891J867178J530974j287013j011645
38921A452001J441471Q76938j581411p70603K080676J558392j498698j741196
38913A817570N35780N88952j303055q39757J520300J601338k65341l56120Q45698
38904D145365R0111j553856p50150J116181N27467j002242J28060K125620R51481
38895E778037j700263j383640P25977L41484j560633r00575J280781Q33392j320501
38886B094059j007518J058348Q31830j096689q53563J004295P69167r33356m64095
38877A402478J447161J037589j105958j225972L64351K81186j059941n33650J148909
38868A756153Q25588o89238k85620J048980K50139j352927m56404J434481O89039
$$ plain form
38859 3220191 1993648 1509197 3028050 3911357 2964234 2981856 5154321 6449391 5579578
38850 5579578 5798663 8534523 10408122 10135846 11681909 16525721 20533571 23923852
38842 23923852 35529055 58349659 77998413 76807929 56067000 33822655 22495631
38835 22495631 18858363 15579756 11876895 9890703 8877084 7416828 6411141 6585866
38827 6585866 6542967 5427808 4473488 4426059 4253449 3462290 3034720 3258924 3105350 2349084
38817 2349084 2009595 2295520 2275932 1790306 1622267 1742136 1371257 706805 662879 1086280
38807 1086280 1061607 679430 729224 1055657 948866 657434 835900 1100269 774823 360769
38797 360769 630056 1055568 772121 236230 305564 591989 358927 87741 518500 1118925
$$ packed form
38859C220191j226543m84451J518853Q83307r47123J7622K172465J295070q69813
38850E579578K19085K735860J873599k72276J546063M843812M007850L390281
38842B3923852J1605203K2820604J9648754j190484k0740929k2244345j1327024
38835B2495631l637268l278607l702861j986192j013619j460256j005687J74725
38827F585866m2899j115159r54320m7429j72610p91159m27570K24204j53574p56266
38817B349084l39489K85925j9588m85626j68039J19869l70879o64452m3926M23401
38807A086280k4673l82177M9794L26433j06791k91432J78466K64369l25446m14054
38797C60769K69287M25512k83447n35891O9334K86425k33062k71186M30759O00425
$$ plain form
38787 1118925 1107198 977337 1454384 2007655 1906330 1612698 1706036 1712846 1398548 1736487
38777 1736487 3139745 4375494 4757282 5535126 7350932 8351596 6986551 4781532
38769 4781532 3959419 4051399 3394567 2375833 2438534 3146034 2984981 2133536 1889024 2190763
38759 2190763 2086117 1824628 2210429 2709577 2417975 2057267 2808167 4024715 4356613
38750 4356613 4344988 5588876 7900483 9453493 9341233 8124619 6385603 4520759 3376176
38741 3376176 3361952 3492787 2793280 1891027 1800076 2131573 2042204 1859362 2131896 2195122
38731 2195122 1391532 604696 838669 1383662 1145694 656684 952287 1578607 1568521 1319734
38721 1319734 1650662 2038075 1629749 992714 1072777 1439853 1283615 1066643 1501838 2048076
$$ packed form
38787A118925j1727j29861M77047N53271j01325k93632R3338O810l14298L37939
38777A736487J403258J235749L81788P77844J815806J000664j365045k205019
38769D781532q22113R1980o56832j018734O2701P07500j61053q51445k44512L01739
38759B190763j04646k61489L85801M99148k91602l60708P50900J216548L31898
38750D356613j1625J243888K311607J553010j12260j216614j739016j864844j144583
38741C376176j4224J30835o99507r02253r0951L31497q9369j82842K72534O3226
38731B195122q03590p86836K33973N44993k37968m89010K95603O26320j0086k48787
38721A319734L30928L87413m08326o37035Q0063L67076j56238k16972M35195N46238
$$ plain form
38711 2048076 2084806 2290406 3139355 3461558 2378277 1216987 1465685 2236078 1912610
38702 1912610 963241 826495 1231173 976542 333749 372663 822274 778799 635489 1217948
38692 1217948 1933637 1811979 1397557 1625675 1931238 1528578 1354611 2497135 3840092
38683 3840092 3634686 2402150 1907301 2185700 1991111 1363658 1339331 1769858 1714079 1396599
38673 1396599 1651685 2073642 1768830 1222837 1396749 1757844 1254390 428595 481763 1049216
38663 1049216 988236 568921 785264 1278050 1042323 458175 577717 1131573 1205987 1099740
38653 1099740 1578564 2158047 2048823 1850284 2365773 2804259 2205798 1536147 2167077
38644 2167077 3325409 3332603 2435118 2120820 2488637 2553955 2371032 2655523 3038024 2768907
$$ packed form
38711B048076L6730K05600Q48949L22203j083281j161290K48698P70393l23468
38702A912610r49369j36746M04678k54631o42793L8914M49611m3475j43310N82459
38692A217948P15689j21658m14422K28118L05563m02660j73967J142524J342957
38683C840092k05406j232536m94849K78399j94589o27453k4327M30527n5779l17480
38673A396599K55086M21957l04812n45993J73912L61095n03454q25795N3168N67453
38663A049216o0980m19315K16343M92786k35727n84148J19542N53856P4414j06247
38653A099740M78824N79483j09224j98539N15489M38486n98461o69651O30930
38644B167077J158332P194q97485l14298L67817O5318j82923K84491L82501k69117
$$ plain form
38634 2768907 2400107 2812589 3419229 3205131 2592339 2469405 2503125 2205341 2324265 3276246
38624 3276246 3701492 2627775 1478230 1755129 2421469 1934032 1115130 1412560 2014924
38615 2014924 1473889 603387 904690 1617873 1252165 577593 1106475 2019732 1665011
38606 1665011 762251 1018028 1852088 1644375 981990 1472500 2506238 2394427 1610157
38597 1610157 1749328 2402667 2192852 1730292 2361340 3204827 2668251 1658693 1988042
38588 1988042 2868717 2391034 1208619 1265629 2092993 1907994 1187950 1577398 2440077
38579 2440077 2096407 1282545 1762196 2750175 2372725 1372878 1647498 2481863 2036087
38570 2036087 1113318 1542102 2350184 1591892 385604 948058 2255732 1977640 1008832
$$ packed form
38634B768907l68800M12482O06640k14098o12792j22934L3720k97784J18924R51981
38624C276246M25246j073717j149545K76899O66340m87437q18902K97430O02364
38615B014924n41035q70502L01303P13183l65708o74572N28882R13257l54721
38606A665011r02760K55777Q34060k07713o62385M90510J033738j11811p84270
38597A610157J39171O53339k09815m62560O31048Q43487n36576j009558L29349
38588A988042Q80675m77683j182415N7010Q27364j84999p20044L89448Q62679
38579B440077l43670q13862M79651R87979l77450r99847K74620Q34365m45776
38570B036087r22769M28784Q08082p58292j206288N62454J307674k78092r68808
$$ plain form
38561 1008832 1609970 2830739 2437970 1535551 2426689 3817956 3175641 1801033 2328309
38552 2328309 3410330 2436532 1110775 2369436 4316683 3624863 2233556 3723839
38544 3723839 5955520 4986672 3297424 5582798 9389499 9451059 8358227 12167694 18154137
38535 18154137 19212056 18221407 23962472 34229562 39925963 46762481 72377874 114521494
38527 114521494 141608975 128597330 88554620 54370561 39983767 34866683 28443555
38520 28443555 22267976 19792244 18819584 16718189 14369029 13083218 12837749 13554509
38512 13554509 14650168 14998021 15558085 18503333 22378459 23914355 25628005 33102677
38504 33102677 43679196 50515021 61082933 93659707 144403191 175711835 156661888
$$ packed form
38561A008832O01138J220769l92769r02419Q91138J391267o42315j374608N27276
38552B328309J082021r73798j325757J258661J947247o91820j391307J490283
38544C723839K231681r68848j689248K285374L806701O1560j092832L809467N986443
38535A8154137J057919r90649N741065J0267090N696401O836518K5615393M2143620
38527A14521494K7087481j3011645m0042710l4184059j4386794n117084o423128
38520B8443555o175579k475732r72660k101395k349160j285811k45469P16760
38512A3554509J095659L47853N60064K945248L875126J535896J713650P474672
38504C3102677J0576519O835825J0567912L2576774N0743484L1308644j9049947
$$ plain form
38497 156661888 103892338 61488402 47743314 44389355 34331238 23660685 21634173
38490 21634173 22309582 17400589 11108451 10368019 11911616 9662295 5991848 5976697 7623688
38481 7623688 6474618 4058386 4031863 4918477 3629321 1822550 2471448 4004689 3534520
38472 3534520 2311246 2779632 3636134 2689495 1420796 2083849 3253593 2588584 1215960
38463 1215960 1306864 1980760 1476559 804584 1534525 2420962 1783536 892170 1585350 2785729
38453 2785729 2657593 2040536 2551035 3352975 2914470 2030342 2148171 2549756 1991226
38444 1991226 1306033 1682976 2176654 1555116 827491 1359544 2242205 2080021 1668264
38435 1668264 2340903 3292665 3080476 2289380 2265287 2615244 2310341 1895001 2314111 2853121
$$ packed form
38497A56661888n2769550m2403936j3745088l353959j0058117j0670553k026512
38490B1634173O75409m908993o292138p40432J543597k249321l670447j5151J646991
38481G623688j149070k416232k6523Q86614j289156j806771O48898J533241m70169
38472C534520j223274M68386Q56502r46639j268699O63053J169744o65009j372624
38463A215960R0904O73896n04201o71975P29941Q86437o37426q91366O93180J200379
38453B785729j28136o17057N10499Q01940m38505q84128J17829M01585n58530
38444A991226o85193L76943M93678o21538p27625N32053Q82661j62184m11757
38435A668264O72639R51762k12189p91096k4093L49957l04903m15340M19110N39010
$$ plain form
38425 2853121 2440450 1730791 1797769 2040048 1453950 716851 942073 1559411 1433847 938235
38415 938235 986909 1159082 682861 170733 518193 1143846 1098436 844269 1206944 1664364
38405 1664364 1399828 958718 1153403 1418304 952997 401182 674625 1184869 981113
38396 981113 603112 1037437 1802356 1830469 1359971 1231394 1175071 525002 -164866 57858
38386 57858 786823 939763 567048 466017 635941 589364 566423 996858 1359393 971099
38376 971099 332757 358835 843745 968049 751885 771487 985714 997584 932307 1033987
38366 1033987 1029639 817519 973546 1635658 1867972 1187929 642153 1149239 1885879 1714691
38356 1714691 1143257 1282259 1793866 1598768 904977 781729 1213733 1268200 874854 860337
$$ packed form
38425B853121m12671p09659O6978K42279n86098p37099K25222O17338j25564m95612
38415I38235M8674J72173m76221n12128L47460O25653m5410k54167L62675M57420
38405A664364k64536m41110J94685K64901m65307n51815K73443N10244k03756
38396I81113l78001M34325P64919K8113m70498j28577n6323o50069o89868K22724
38386E7858P28965J52940l72715j01031J69924m6577k2941M30435L62535l88294
38376I71099o38342K6078M84910J24304k16164J9602K14227J1870o5277J01680
38366A033987m348k12120J56027O62112K32314o80043n45776N07086P36640j71188
38356A714691n71434J39002N11607j95098o93791j23248M32004N4467l93346j4517
$$ plain form
38346 860337 1390713 1785556 1756565 1602945 1341242 773291 225590 181481 422481 480714
38336 480714 558653 1006866 1351519 959819 279091 255671 823062 1105951 892420 780019
38326 780019 986294 1063286 786110 465950 379142 530078 854234 1134582 1013405 572360
38316 572360 436467 791696 926238 367018 -252154 -217985 112288 77485 -90143 158380
38306 158380 552695 519541 299848 472492 838618 857495 749764 1058971 1506723 1426007
38296 1426007 1019790 1031059 1394965 1410025 1157201 1559479 2888113 4204463 4546208
38287 4546208 3946584 3089411 2527760 2375912 2351257 2077800 1587842 1315601 1366216 1246771
38277 1246771 705953 286902 491621 925301 924637 567459 370120 406113 424460 455998
$$ packed form
38346H60337N30376L94843k8991j53620k61703n67951n47701m4109K41000N8233
38336D80714P7939M48213L44653l91700o80728k3420N67391K82889k13531j12401
38326G80019K06275P6992k77176l20160q6808J50936L24156K80348j21177m41045
38316E72360j35893L55229J34542n59220o19172L4169L30273l4803j67628K48523
38306A58380L94315l3154k19693J72644L66126J8877j07731L09207M47752q0716
38296A426007m06217J1269L63906J5060k52824M02278J328634J316350L41745
38287D546208n99624q57173n61651j51848k4655k73457m89958k72241N0615j19445
38277A246771n40818m19051K04719M33680o64l57178j97339L5993J8347L1538
$$ plain form
38267 455998 612664 651810 403192 241954 471658 656551 290233 -262880 -256964 322607
38257 322607 865835 1069710 1066250 899147 566577 362744 549802 888865 1005318 934435
38247 934435 842211 609715 211136 54680 377278 744209 716851 536916 569010 610239
38237 610239 407113 294140 582430 848501 616002 241587 307971 621776 668609 592332
38227 592332 796263 982424 579615 -156345 -436165 -141056 157466 218943 319832 534934
38217 534934 629277 593289 606730 599975 467050 483427 866261 1202478 1009703 569313 466266
38206 466266 608311 502999 231457 283184 610776 700312 463583 273124 232924 172598
38196 172598 214836 566362 891723 706950 279021 303868 770498 995465 766172 595493
$$ packed form
38267D55998J56666L9146k48618j61238K29704J84893l66318n53113N916N79571
38257C22607N43228K03875l460j67103l32570k03833J87058L39063J16453p0883
38247I34435r2224k32496l98579j56456L22598L66931k7358j79935L2094M1229
38237F10239k03126j12973K88290K66071k32499l74415O6384L13805M6833p6277
38227E92332K03931J86161m02809p35960k79820K95109K98522O1477J00889K15102
38217E34934R4343l5988J3441o755j32925J6377L82834L36217j92775m40390j03047
38206D66266J42045j05312k71542N1727L27592Q9536k36729j90459m0200o0326
38196A72598M2238L51526L25361j84773m27929K4847M66630K24967k29293j70679
$$ plain form
38186 595493 774314 976534 933355 778099 592348 283539 36808 233557 769631 1057002
38176 1057002 856655 555052 480710 497563 436201 405372 466838 436021 217321 6864
38166 6864 5293 185751 418029 589205 600789 477451 423347 541885 625432 489895 348452
38155 348452 519260 906965 1130018 1058265 896108 822967 839245 876446 829864 609116
38145 609116 328486 245015 363153 396128 274575 305092 614875 881678 880653 831386 908530
38134 908530 921185 809893 889791 1195749 1194644 644388 138292 238562 656692 877107
38124 877107 961478 1070375 859524 162704 -343310 -61670 485785 493180 203349 333558
38114 333558 651307 365645 -344129 -491972 89842 536149 434402 331642 551615 632340
$$ packed form
38186E95493J78821K02220m3179j55256j85751l08809k46731J96749N36074K87371
38176A057002k00347l01603p4342J6853o1362l0829O1466l0817k18700k10457
38166F864j571J80458K32278J71176J1584j23338n4104J18538Q3547j35537j41443
38155C48452J70808L87705K23053p1753j62157p3141J6278L7201m6582k20748
38145F09116k80630q3471J18138L2975j21553L0517L09783K66803j025m9267P7144
38134I08530J2655j11292P9898L05958j105n50256n06096J00270M18130K20415
38124H77107Q4371J08897k10851o96820n06014K81640N47455P395k89831J30209
38114C33558L17749k85662p09774j47843N81814M46307j01747j02760K19973Q0725
$$ plain form
38104 632340 295818 -1534 98488 301716 329723 384353 560319 510803 121380 -122697
38094 -122697 116431 469734 482165 302904 314290 480163 506914 355305 197594 77284
38084 77284 -64473 -175618 -152950 -6845 183366 366917 495804 536754 553325 634957
38074 634957 733727 724796 625336 601240 753559 993203 1087941 808161 185401 -342438 -314169
38063 -314169 141629 416411 266358 109531 269637 449130 329073 181219 369420 669667
38053 669667 664005 465191 457855 617132 681604 724127 924454 1026408 688923 184745 71445
38042 71445 305751 361358 131821 29679 210506 360928 313693 289350 439007 634883
38032 634883 772888 858726 794120 488653 150055 70552 200425 308699 411037 613379
$$ packed form
38104F32340l36522k97352J00022K03228K8007N4630J75966m9516l89423k44077
38094a22697K39128L53303J2431j79261J1386J65873K6751j51609j57711j20310
38084G7284j41757j11145K2668J46105J90211J83551J28887M0950J6571Q1632
38074F34957R8770q931r9460k4096J52319K39644R4738k79780o22760n27839K8269
38063c14169M55798K74782j50053j56827J60106J79493j20057j47854J88201L00247
38053F69667n662j98814p336J59277O4472M2523K00327J01954l37485n04178j13300
38042G1445K34306N5607k29537j02142J80827J50422m7235k4343J49657J95876
38032F34883J38005Q5838o4606l05467l38598p9503J29873J08274J02338K02342
$$ plain form
38022 613379 727977 543239 296571 352259 583011 620887 529991 612864 723470 474838
38012 474838 41251 18005 461937 771076 608560 298626 180694 185683 222942 416861
38002 416861 734794 857523 648617 371715 264994 244765 181005 149245 251782 422331
37992 422331 520553 471630 301304 152312 181170 328711 373777 320020 417989 644052 589807
37981 589807 143207 -207282 -121114 67254 35412 106630 570916 933161 631354 67308
37971 67308 67468 647336 1158267 1352757 1413260 1211058 522993 -196605 -269761 72405 2589
37960 2589 -518339 -704038 -304736 65117 98782 242699 708669 1017234 870202 613773
37950 613773 491620 251080 -165025 -325596 -79607 120209 21225 -20625 204561 323793
$$ packed form
38022F13379J14598j84738k46668N5688K30752L7876r0896Q2873J10606k48632
38012D74838m33587k3246M43932L09139j62516l09934j17932M989L7259J93919
38002D16861L17933J22729k08906k76902j06721k0229o3760l1760J02537J70549
37992D22331R8222m8923j70326j48992K8858J47541M5066n3757R7969K26063n4245
37981E89807m46600l50489Q6168J88368l1842P1218M64286L62245l01807n64046
37971F7308J60N79868N10931J94490O0503k02202o88065p19598p3156L42166o9816
37960B589n20928j85699L99302L69853L3665J43917M65970L08565j47032k56429
37950F13773j22153k40540m16105j60571K45989J99816r8984m1850K25186J19232
$$ plain form
37940 323793 104274 -84152 23950 74652 -226980 -514410 -351801 65613 294590 304448
37930 304448 309390 322173 282326 288491 351768 248802 -71721 -271709 -97531 250652 467531
37919 467531 533904 547549 500548 420061 409359 414005 291065 172316 322618 585326 505640
37908 505640 113843 -11648 345795 674309 546945 228720 149071 289310 434831 562049
37898 562049 641936 506361 225708 177577 436162 551276 258716 -48655 80012 500089
37888 500089 775323 754496 516802 128831 -213976 -185137 197595 448406 263947 -72432
37878 -72432 -208031 -206805 -200226 -19766 413559 747379 687694 474287 440578 455417 265239
37867 265239 60320 181126 501273 611049 447748 282003 223403 188069 239040 504968
$$ packed form
37940C23793k19519j88426J08102N0702l01632k87430J62609M17414K28977R858
37930C04448M942J2783l9847O165O3277j02966l20523j99988J74178L48183K16879
37919D67531O6373J3645m7001q0487j0702M646j22940j18749J50302K62708p9686
37908E05640l91797j25491L57443L28514j27364l18225p9649J40239J45521J27218
37898E62049P9887j35575k80653m8131K58585J15114k92560l07371J28667M20077
37888E00089K75234k0827k37694l87971l42807K8839L82732K50811j84459l36379
37878g2432j35599J226O579J80460M33325L33820n9685k13407l3709J4839j90178
37867B65239k04919J20806L20147J09776j63301j65745n8600l5334N0971K65928
$$ plain form
37857 504968 815294 846514 643901 616911 941964 1281288 1228507 834583 539497 646342
37847 646342 971305 1065412 763679 386131 296676 421447 432169 279134 207760 294335
37837 294335 351155 328801 414450 616090 628401 299097 -79105 -138598 139022 510714
37827 510714 746267 708480 430248 227119 446019 965570 1235845 974812 540208 412760
37817 412760 565858 589198 270576 -170505 -358824 -142048 269293 510593 452948 311646
37807 311646 287844 291384 217364 258555 592064 944168 911268 605969 506423 711048 840095
37796 840095 687251 467836 356036 262805 180534 287230 565766 731125 673821 595646
37786 595646 590208 478964 205999 40155 221757 665717 1093871 1239498 957956 407439
$$ packed form
37857E04968L10326L1220k02613k6990L25053L39324n2781l93924k95086J06845
37847F46342L24963R4107l01733l77548q9455J24771J0722j53035p1374Q6575
37837B94335N6820k2354Q5649K01640J2311l29304l78202n9493K77620L71692
37827E10714K35553l7787k78232k03129K18900N19551K70275k61033m34604j27448
37817D12760J53098K3340l18622m41081j88319K16776M11341K41300n7645j41302
37807C11646k3802L540p4020M1191L33509L52104l2900l05299r9546K04625J29047
37796H40095j52844k19415j11800r3231q2271J06696K78536J65359n7304p8175
37786E95646n438j11244k72965j65844J81602M43960M28154J45627k81542n50517
$$ plain form
37776 407439 28009 41638 144278 39168 -25061 238341 450700 97034 -491956 -548510
37766 -548510 -124134 15616 -261900 -254673 268059 617802 395766 159184 391048 693953
37756 693953 593256 372320 477889 740035 799768 749850 767237 632148 188578 -191751
37746 -191751 -159623 30688 4437 -91743 73459 437134 755897 995717 1097726 814611
37736 814611 215606 -125178 92876 409686 357352 172895 231200 309366 59615 -240613
37726 -240613 -103017 347590 613879 604328 566775 517535 331914 169867 249700 403017
37716 403017 356662 232911 303228 510753 703863 1039585 1649845 2202523 2311088 2095464
37706 2095464 1841183 1450241 802839 315293 454283 924111 1012420 604691 236771 247332
$$ packed form
37776D07439l79430J3629J02640j05110o4229K63402K12359l53666n88990n6554
37766e48510M24376J39750k77516P227N22732L49743k22036k36582K31864L02905
37756F93953j00697k20936J05569K62146N9733m9918J7387j35089m43570l80329
37746a91751L2128J90311k6251r6180J65202L63675L18763K39820J02009k83115
37736H14611n99005l40784K18054L16810n2334j84457N8305P8166k49751l00228
37726b40613J37596M50607K66289r551l7553m9240j85621j62047P9833J53317
37716D03017m6355j23751P0317K07525J93110L35722O10260N52678J08565k15624
37706B095464k54281l90942o47402m87546J38990M69828Q8309m07729l67920J0561
$$ plain form
37696 247332 458617 628841 709554 713099 731331 946309 1275679 1298371 938698 815299
37686 815299 1369945 2121807 2522275 3087494 4651142 6677303 7456035 6187311 3970529
37677 3970529 2410654 1970477 2034383 1944017 1512699 928620 545546 561446 737671 667589
37667 667589 350386 159037 230869 312771 261002 233861 279707 197285 -25564 -72027 186077
37656 186077 417356 322587 63437 -52977 -19012 19568 101892 333734 591305 640442
37646 640442 479105 318949 260526 202309 85049 32901 164933 392670 532868 560307
37636 560307 593990 642545 565143 355686 231898 278272 254635 30923 -56012 296473 718008
37625 718008 605704 108546 -12397 426088 713216 366445 -142277 -199874 29546 32924
$$ packed form
37696B47332K11285J70224Q0713L545J8232K14978L29370K2692l59673j23399
37686H15299N54646P51862M00468N65219J563648K026161P78732j268724k216782
37677C970529j559875m40177O3906r0366m31318n84079l83074J5900J76225p0082
37667F67589l17203j91349P1832Q1902n1769k7141M5846q2422k22849m6463K58104
37656A86077K31279r4769k59150j16414L3965L8580Q2324K31842K57571M9137
37646F40442j61337j60156n8423n8217j17260n2148J32032K27737J40198K7439
37636E60307L3683M8555p7402k09457j23788M6374k3637k23712q6935L52485M21535
37625G18008j12304m97158j20943M38485K87128l46771n08722n7597K29420L378
$$ plain form
37615 32924 -199528 -331905 -323394 -343622 -329296 -151848 10500 -47194 -135737 6371 210101
37604 210101 164270 -28972 -68221 1834 -47550 -129978 -14922 178869 165337 16832 23610
37593 23610 169873 214091 137558 56309 -125180 -479424 -675847 -387706 80833 152882
37583 152882 -151437 -287458 -49185 225781 277277 182587 11833 -231059 -338313 -113133
37573 -113133 160898 22693 -403944 -540721 -268260 -81777 -244172 -420304 -337099 -209808
37563 -209808 -250435 -269597 -62987 233045 447690 658779 910905 995592 770830 411886
37553 411886 129741 -84561 -253046 -244433 -19844 217524 314842 374650 494610 547298
37543 547298 411941 208978 103296 44982 -113102 -374656 -620014 -740831 -642345 -256519
$$ packed form
37615C2924k32452j32377Q511k0228J4326J77448J62348n7694q8543J42108K03730
37604B10101m5831j93242l9249P0055m9384q2428J15056J93791j3532j48505O778
37593B3610J46263M4218p6533q1249j81489l54244j96423K88141M68539P2049
37583A52882l04319j36021K38273K74966N1496r4690j70754k42892j07254K25180
37573a13133K74031j38205m26637j36777K72461J86483j62395j76132Q3205J27291
37563b09808m0627j9162K06610K96032K14645K11089K52126Q4687k24762l58944
37553D11886k82145k14302j68485Q613K24589K37368R7318N9808J19960N2688
37543E47298j35357k02963j05682n8314j58084k61554k45358j20817R8486L85826
$$ plain form
37533 -256519 304193 705891 655034 196249 -305248 -480515 -276792 7557 42207 -170878
37523 -170878 -343257 -314391 -240944 -306375 -454189 -530095 -475024 -247339 185862 607310
37513 607310 607177 143666 -244760 -105584 312694 458780 235104 -39012 -190098 -275035
37503 -275035 -274803 -144998 -43268 -101838 -123801 85905 279086 126485 -167432 -162328 42572
37492 42572 -55525 -494216 -742613 -532983 -215216 -148338 -253384 -335764 -398192 -454157 -411999
37481 -411999 -295220 -247544 -233796 -79641 142973 155143 -48471 -164959 -102651 -112811
37471 -112811 -296591 -405775 -287678 -134664 -111025 -82588 94509 319019 450387 507428
37461 507428 527902 476812 394334 391607 432593 372823 255229 294120 532141 788976 959060
$$ packed form
37533b56519N60712M01698n0857m58785n01497j75267K03723K84349L4650k13085
37523a70878j72379K8866P3447o5431j47814p5906N5071K27685M33201M21448
37513F07310j33m63511l88426J39176M18278J46086k23676k74116j51086q4937
37503b75035K32J29805J01730n8570k1963K09706J93181j52601k93917N104K04900
37492D2572r8097m38691k48397K09630L17767O6878j05046q2380o2428n5965M2158
37481d11999J16779M7676J3748J54155K22614J2170k03614j16488O2308j0160
37471a12811j83780j09184J18097J53014K3639K8437J77097K24510J31368N7041
37461E07428K0474n1090q2478k727M0986n9770j17594L8891K38021K56835J70084
$$ plain form
37450 959060 1068714 1060446 856988 616600 558358 565826 376730 127092 203604 530089 569100
37439 569100 177501 -97726 166194 640177 750035 436096 87385 703 178413 435897
37429 435897 500933 218222 -204822 -392335 -319889 -325311 -512972 -544145 -199843 236781
37419 236781 408693 360641 322186 316883 275978 290524 451130 614935 591718 425486 288093
37408 288093 230886 217775 265378 379353 459278 406796 260093 154983 213507 440859 627107
37397 627107 469129 -7405 -309220 -79391 314540 235850 -279640 -579741 -387518 -122555
37387 -122555 -107388 -90260 166755 412156 409109 419276 719630 1021086 857929 284423
37377 284423 -268274 -601509 -775178 -727610 -356305 106368 246830 17647 -206403 -139076
$$ packed form
37450I59060J09654q268k03458k40388n8242P468j89096k49638P6512L26485L9011
37439E69100l91599k75227K63920M73983J09858l13939l48711q6682J77710K57484
37429D35897O5036k82711m23044j87513P2446n422j87661l1173L44302M36624
37419B36781J71912m8052l8455n303m0905J4546J60606J63805k3217j66232j37393
37408B88093n7207j3111M7603J13975P9925n2482j46703j05110N8524K27352J86248
37397F27107j57978m76534l01815K29829L93931p8690n15490l00101J92223K64963
37387a22555J5167J7128K57015K45401l047J0167L00354L01456j63157n73506
37377B84423n52697l33235j73669M7568L71305M62673J40462k29183k24050O7327
$$ plain form
37367 -139076 134844 403849 584981 671060 637964 507579 385599 353948 370158 312674
37357 312674 122664 -101268 -179304 -59132 98357 106386 -40910 -226313 -358919 -346192
37347 -346192 -86447 300258 410140 29049 -465428 -526818 -160699 164079 221159 173985
37337 173985 81905 -173305 -422375 -280937 144672 228252 -226403 -591569 -357148 71397
37327 71397 23005 -423011 -661698 -511661 -314872 -230972 -53728 243294 326859 42537
37317 42537 -267531 -227149 37977 80590 -249955 -597404 -552703 -174363 97305 17901
37307 17901 -182255 -197012 -86454 -77663 -120655 -6610 178025 143855 -68900 -102210 109745
37296 109745 200171 -26346 -302995 -406668 -499083 -690233 -695432 -298190 188553 328783
$$ packed form
37367a39076K73920K69005J81132Q6079l3096j30385j21980l1651J6210n7484
37357C12674j90010k23932p8036J20172J57489Q029j47296j85403j32606J2727
37347c46192K59745L86705J09882l81091m94477o1390L66119L24778N7080m7174
37337A73985r2080k55210k49070J41438M25609Q3580m54655l65166K34421M28545
37327G1397m8392m46016k38687J50037J96789Q3900J77244K97022Q3565k84322
37317D2537l10068M0382K65126M2613l30545l47449M4701L78340K71668p9404
37307A7901k00156j4757J10558Q791m2992J14045J84635l4170k12755l3310K11955
37296A09745R0426k26517k76649j03673r2415j91150n199L97242M86743J40230
$$ plain form
37286 328783 177088 93104 142955 81161 -192383 -507460 -681889 -633356 -334791 84877
37276 84877 310180 174367 -72472 -79092 126057 224184 82707 -122979 -202890 -116520 113220
37265 113220 405355 550575 360581 -75158 -434311 -490090 -298140 -73684 20273 -18705
37255 -18705 -55407 38738 230777 359410 330963 203036 73755 -5802 -15044 16054 -10581
37244 -10581 -124675 -199477 -182946 -294983 -683743 -983787 -669534 117312 595668 373978
37234 373978 -31753 7969 375770 550708 453547 430511 572516 574909 284876 -24263
37224 -24263 -40368 180613 313946 147455 -204327 -426277 -341891 -109831 922 -18273
37214 -18273 34072 170264 163865 -24283 -102730 90118 291465 230006 66711 108089 284362
$$ packed form
37286C28783j51695q3984M9851o1794k73544l15077j74429M8533K98565M19668
37276H4877K25303j35813k46839o620K05149R8127j41477k05686p9911Q6370K29740
37265A13220K92135J45220j89994m35739l59153n5779J91950K24456R3957l8978
37255a8705l6702R4145J92039J28633k8447j27927j29281p9557r242L1098k6635
37244a0581j14094p4802J6531j12037l88760l00044L14253P86846M78356k21690
37234C73978m05731L9722L67801J74938r7161k3036J42005K393k90033l09139
37224b4263j6105K20981J33333j66491l51782k21950Q4386K32060J10753j9195
37214a8273N2345J36192o399j88148p8447J92848K01347o1459j63295M1378J76273
$$ plain form
37203 284362 274537 51929 -53083 144560 395402 323047 -124763 -613639 -761204 -501948
37193 -501948 -104272 168529 309985 399781 357264 118765 -61016 146207 608114 835659
37183 835659 679009 510341 595100 713831 616143 439773 399249 415827 363740 359394 473792
37172 473792 455872 109762 -301299 -404976 -265983 -205927 -259943 -213547 -59340 -18002
37162 -18002 -149304 -284119 -330209 -363112 -424015 -462118 -456841 -409405 -272322 -59790 66794
37151 66794 -2126 -161039 -301637 -519967 -876520 -1111527 -901386 -324452 196342 377213
37141 377213 288353 148381 114451 223300 348964 268120 -71123 -413896 -479661 -294019
37131 -294019 -103682 -66194 -157113 -258237 -198656 150342 672420 1037010 1063736 897079
$$ packed form
37203B84362r825k22608j05012J97643K50842p2355m47810m88876j47565K59256
37193e01948L97676K72801J41456Q9796m2517k38499j79781K07223M61907K27545
37183H35659j56650j68668Q4759J18731r7688j76370m0524J6578n2087m346J14398
37172D73792j7920l46110m11061j03677J38993O0056n4016M6396J54207M1338
37162a8002j31302j34815m6090l2903o0903l8103N277M7436J37083K12532J26584
37151F6794o8920j58913j40598k18330l56553k35007K10141N76934N20794J80871
37141C77213q8860j39972l3930J08849J25664q0844l39243l42773o5765J85642
37131b94019J90337L7488r0919j01124N9581L48998N22078L64590K6726j66657
$$ plain form
37121 897079 712571 484344 203895 63070 178388 350176 343043 214996 142726 134698
37111 134698 155703 298965 559981 677253 506687 327634 441579 684693 707393 538510
37101 538510 467309 528032 527783 465672 490859 527290 376019 146178 153917 397575 540793
37090 540793 432175 252662 131648 24336 17524 325502 845800 1101874 829051 335229
37080 335229 92469 194139 377767 389866 172049 -162799 -406025 -415697 -291018 -285477
37070 -285477 -497068 -749342 -811244 -633623 -354496 -166768 -177057 -310207 -381188 -321861
37060 -321861 -242538 -197901 -74757 133094 163850 -122601 -382252 -186378 314877 538844
37050 538844 273019 -81874 -144518 -25743 -4958 -88735 -137671 -174160 -288775 -400397
$$ packed form
37121H97079j84508k28227k80449j40825J15318J71788p133j28047p2270q028
37111A34698K1005J43262K61016J17272j70566j79053J13945K43114K2700j68883
37101E38510p1201O0723k49o2111K5187L6431j51271k29841P739K43658J43218
37090E40793j08618j79513j21014j07312o812L07978N20298K56074k72823m93822
37080C35229k42760J01670J83628J2099k17817l34848k43226r672J24679N541
37070b85477k11591k52274o1902J77621K79127J87728j0289j33150p0981N9327
37060c21861P9323M4637J23144K07851L0756k86451k59651J95874N01255K23967
37050E38844k65825l54893o2644J18775K0785q3777m8936l6489j14615j11622
$$ plain form
37040 -400397 -365525 -233857 -170523 -174793 -80785 167534 419083 528876 530276 530951 542634
37029 542634 509451 441259 395786 341513 180197 -49139 -138381 5258 175608 136002 -36651
37018 -36651 -92732 -14874 -12621 -142993 -243132 -268144 -366092 -529183 -514654 -272739 -119584
37007 -119584 -254146 -401489 -223404 159976 377065 348416 294257 324055 343073 308976
36997 308976 300363 349961 420235 501250 556111 458669 184256 -33743 36664 274848 331254
36986 331254 65592 -312563 -496033 -337158 57144 347242 200594 -322455 -741441 -678026
36976 -678026 -270751 87827 234523 239608 138853 -31914 -80384 134638 426003 518520
36966 518520 488026 628509 923068 1004815 690987 249546 44099 149709 400684 606916
$$ packed form
37040d00397L4872J31668O3334m270R4008K48319K51549J09793J400O75J1683
37029E42634l3183o8192m5473n4273j61316k29336q9242J43639J70350l9606j72653
37018c6651n6081P7858K253j30372j00139k5012r7948j63091J4529K41915J53155
37007a19584j34562j47343J78085L83380K17089k8649n4159K9798J9018l4097
36997C08976q613M9598P0274Q1015N4861r7442k74413k17999P0407K38184N6406
36986C31254k65662l78155j83470J58875L94302K90098j46648n23049m18986O3415
36976f78026M07275L58578J46696N085j00755j70767m8470K15022K91365R2517
36966E18520l0494J40483K94559Q1747l13828m41441k05447J05610K50975K06232
$$ plain form
36956 606916 626253 393153 -7537 -374291 -550311 -510330 -318929 -92395 28715 -30422
36946 -30422 -221077 -443343 -616984 -656873 -515149 -322158 -323164 -548746 -700259 -518177
36936 -518177 -129915 136566 164640 95763 63401 63952 41724 -31673 -120588 -106498 89366
36925 89366 321653 333838 127814 5843 130637 278923 197310 -20676 -117926 -53161
36915 -53161 6419 -65908 -272855 -523806 -644413 -524218 -317736 -271727 -323405 -200493
36905 -200493 33233 -17968 -393142 -603483 -400149 -177195 -251858 -292816 37877 375366
36895 375366 209108 -238126 -369430 -175295 -137946 -355643 -460404 -325131 -193747 -129812
36885 -129812 51778 298253 345345 251479 344975 603758 642731 374639 132702 58272
$$ packed form
36956F06916J9337k33100m00690l66754j76020L9981J91401K26534J21110n9137
36946c0422j90655k22266j73641l9889J41724J92991j006k25582j51513J82082
36936e18177L88262K66481K8074o8877l2362N51k2228p3397q8915J4090J95864
36925H9366K32287J2185k06024j21971J24794J48286q1613k17986r7250O4765
36915e3161N9580p2327k06947k50951j20607J20195K06482M6009n1678J22912
36905b00493K33726n1201l75174k10341K03334K22954p4663m0958L30693L37489
36895C75366j66258m47234j31304J94135L7349k17697j04761J35273J31384O3935
36885a29812J81590K46475M7092r3866R3496K58783L8973k68092k41937p4430
$$ plain form
36875 58272 -76962 -325189 -401954 -246291 -205582 -429976 -574377 -382216 -126265 -141423
36865 -141423 -278393 -178068 163019 438069 485345 414315 350004 258846 30274 -343418
36855 -343418 -672508 -717662 -510508 -396938 -592627 -847406 -798957 -507584 -316021 -304357
36845 -304357 -271210 -178108 -182781 -246907 -153740 47370 61745 -101027 -55985 315463 586672
36834 586672 401917 17943 -78476 148337 297698 101066 -292640 -566201 -576133 -415039
36824 -415039 -234056 -83610 43607 85984 -18438 -145764 -96495 53893 6686 -236752
36814 -236752 -268497 77591 375165 267548 78218 247499 507215 285427 -262596 -376966
36804 -376966 151671 657453 581333 173211 -16923 142793 413930 572748 511827 243139
$$ packed form
36875E8272j35234k48227p6765J55663M0709k24394j44401J92161K55951j5158
36865a41423j36970J00325L41087K75050M7276p1030o4311r1158k28572l73692
36855c43418l29090m5154K07154J13570j95689k54779M8449K91373J91563J1664
36845c04357L3147R3102m673o4126R3167K01110J4375j62772M5042L71448K71209
36834E86672j84755l83974r6419K26813J49361j96632l93706k73561r932J61094
36824d15039J80983J50446J27217M2377j04422j27326M9269J50388m7207k43438
36814b36752l1745L46088K97574j07617j89330J69281K59716k21788n48023j14370
36804c76966N28637N05782p6120m08122j90134J59716K71137J58818o0921k68688
$$ plain form
36794 243139 -33311 -99659 -29339 -68090 -202817 -181307 18887 108982 -58880 -293062
36784 -293062 -375611 -271164 -13572 294202 391465 131683 -192068 -184571 44368 61168
36774 61168 -155080 -188962 86972 333402 375525 444850 646888 743043 655633 658517 839372
36763 839372 882139 634346 395145 361372 271642 -76812 -405563 -402521 -201590 -72900
36753 -72900 -1634 84040 30835 -218657 -353808 -148014 90786 -70699 -546014 -882481
36743 -882481 -885811 -715225 -489570 -176792 173349 402742 455402 397950 252891 453
36733 453 -269727 -374756 -236656 11260 136170 29689 -158012 -167674 28312 161047
36723 161047 64809 -41229 95932 312318 267573 13204 -78735 95653 263964 256697
$$ packed form
36794B43139k76450o6348P0320l8751j34727K1510K00194R0095j67862k34182
36784b93062q2549J04447K57592L07774R7263k59782l23751P497K28939J6800
36774F1168k16248l3882K75934K46430M2123O9325K02038R6155q7410K884J80855
36763H39372M2767k47793k39201l3773q9730l48454l28751L042K00931J28690
36753g2900P1266Q5674n3205k49492j35151K05794K38800j61485m75315l36467
36743h82481l330J70586K25655L12778L50141K29393N2660n7452j45059k52438
36733D53k70180j05029J38100K47916J24910j06481j87701r662J95986J32735
36723A61047r6238j06038J37161K16386m4745k54369r1939J74388J68311p267
$$ plain form
36713 256697 192324 157859 101663 88563 267486 525701 562515 373534 282562 431472 618980
36702 618980 694491 713644 659597 436889 201850 267854 626754 1001445 1380842 1968981
36692 1968981 2562384 2609322 2056076 1521432 1391788 1330038 966424 496001 231370 89677
36682 89677 -73152 -80373 197976 493525 546700 498223 515228 420287 94495 -124536 92155
36671 92155 489337 574048 332989 183812 342259 595798 645324 432608 178100 188624
36661 188624 501505 730729 530958 171323 224594 669980 849159 453440 -29614 -113159
36651 -113159 14565 -27162 -163756 -130053 26784 132580 235295 392604 433476 273193
36641 273193 136371 148918 69805 -241811 -476807 -356688 -91610 17393 63092 220607
$$ packed form
36713B56697o4373l4465n6196j3100J78923K58215L6814j88981r0972J48910J87508
36702F18980P5511J9153n4047k22708k35039O6004L58900L74691L79397N88139
36692A968981N93403M6938n53246n34644j29644o1750l63614m70423k64631j41693
36682H9677j62829p221K78349K95549N3175m8477J7005r4941l25792k19031K16691
36671I2155L97182Q4711k41059j49177J58447K53539M9526k12716k54508J0524
36661A88624L12881K29224j99771l59635N3271M45386J79179l95719m83054q3545
36651a13159J27724m1727j36594L3703J56837J05796J02715J57309M0872j60283
36641B73193j36822J2547p9113l11616k34996J20119K65078J09003M5699J57515
$$ plain form
36631 220607 314090 134011 -118547 -137234 -5548 -1518 -150215 -309320 -444357 -518916
36621 -518916 -402221 -163994 -125516 -348671 -465595 -291092 -139187 -209340 -190370 110052
36611 110052 294840 53560 -214402 -48192 273542 224954 -89511 -224000 -187586 -254089
36601 -254089 -304753 -86108 152699 18922 -257911 -162807 199376 300930 141037 202576
36591 202576 535747 687801 563003 580256 878503 1076649 962929 771596 624766 327680
36581 327680 -97904 -276061 -101426 36099 -101799 -218452 -14483 323979 453253 340598
36571 340598 145601 -69742 -270117 -328493 -196340 -16766 80894 146658 286681 534297
36561 534297 881731 1265291 1518938 1553095 1571569 1864846 2367776 2668759 2508166 2053775
$$ packed form
36631B20607R3483j80079k52558j8687J31686M030j48697j59105j35037p4559
36621e18916J16695K38227L8478k23155j16924J74503J51905p0153J8970L00422
36611A10052J84788k41280k67962J66210L21734m8588l14465j34489L6414o6503
36601b54089n0664K18645K38807j33777k76833R5104L62183J01554j59893O1539
36591B02576L33171J52054j24798J7253K98247J98146j13720j91333j46830k97086
36581C27680m25584j78157J74635J37525j37898j16653K03969L38462J29274j12655
36571C40598j94997k15343k00375n8376J32153J79574R7660O5764J40023K47616
36561E34297L47434L83560K53647L4157J8474K93277N02930L00983j60593m54391
$$ plain form
36551 2053775 1628156 1348973 1102584 747627 305706 -842 35823 308156 461841 351759
36541 351759 208008 210343 191433 6794 -115591 30711 143785 -207347 -853015 -1163970
36531 -1163970 -903963 -493925 -365993 -444983 -401230 -124046 216043 408751 392882 271770
36521 271770 162324 21265 -267753 -606513 -705402 -507265 -328126 -394231 -514701 -455510
36511 -455510 -352397 -429963 -556804 -454930 -175191 7896 45561 110032 243966 332301
36501 332301 332549 260568 67130 -216889 -374577 -309280 -264697 -446349 -637183 -530592 -246613
36490 -246613 -143244 -276543 -413403 -428575 -336431 -99697 221487 308044 -27818 -448658
36480 -448658 -494831 -222305 -13664 71400 253850 462012 362260 -24195 -248785 -81278
$$ packed form
36551B053775m25619k79183k46389l54957m41921l06548L6665K72333J53685j10082
36541C51759j43751K335j8910j84639j22385J46302J13074l51132o45668l10955
36531a163970K60007M10038J27932p8990M3753K77184L40089J92708j5869j21112
36521B71770j09446j41059k89018l38760r8889J98137J79139o6105j20470N9191
36511d55510J03113p7566j26841J01874K79739J83087L7665O4471J33934Q8335
36501C32301K48p1981j93438k84019j57688O5297M4583j81652j90834J06591K83979
36490b46613J03369j33299j36860j5172R2144K36734L21184Q6557l35862m20840
36480d48658m6173K72526K08641Q5064J82450K08162r9752l86455k24590J67507
$$ plain form
36470 -81278 188238 210724 -1578 -231582 -348118 -321215 -157729 71151 244582 261203
36460 261203 59088 -328404 -685834 -779128 -690320 -735148 -948848 -1002119 -787056 -652741
36450 -652741 -787552 -830669 -486089 -81678 -40096 -192488 -155827 -28139 -106124 -226171
36440 -226171 -52205 212901 96343 -310946 -472391 -275717 -117509 -143868 -60789 245626
36430 245626 494799 518445 480010 505373 538081 602666 781559 912772 733756 328066
36420 328066 23723 -108950 -229624 -281407 -76042 212213 171034 -200997 -469523 -439007
36410 -439007 -369899 -447348 -496211 -345410 -89938 114695 204168 123892 -88509 -164814 104041
36399 104041 479784 539770 279502 81464 139256 294538 389091 395311 259421 -8939
$$ packed form
36470h1278K69516K2486k12302k30004j16536K6903J63486K28880J73431J6621
36460B61203k02115l87492l57430r3294Q8808m4828k13700n3271K15063J34315
36450f52741j34811m3117L44580M04411M1582j52392L6661J27688p7985j20047
36440b26171J73966K65106j16558m07289j61445J96674J58208k6359Q3079L06415
36430B45626K49173K3646l8435K5363L2708O4585J78893J31213j79016m05690
36420C28066l04343j32673j20674n1783K05365K88255m1179l72031k68526L0516
36410d39007O9108p7449m8863J50801K55472K04633Q9473q0276k12401p6305K68855
36399A04041L75743N9986k60268j98038N7792J55282R4553O220j35890k68360
$$ plain form
36389 -8939 -174964 -74723 59611 -39970 -184744 -64068 137244 24542 -264080 -234334
36379 -234334 128192 351030 285191 264617 411469 435440 246025 154198 290782 370970
36369 370970 230494 110131 219205 449191 674579 918122 1084956 968896 691023 737093
36359 737093 1375221 2344341 3217491 3743058 3765277 3210345 2315296 1558801 1196026 1058723
36349 1058723 877149 601163 381303 399145 675208 921135 757385 246163 -71583 82254
36339 82254 304865 190770 8039 176344 456980 334071 -65089 -163359 101405 236706
36329 236706 64424 -76144 -11044 39148 -20801 213 140043 194774 118328 53528 -10337
36318 -10337 -146073 -141319 236280 712306 794831 516879 331114 344341 252348 -9695 -154347
$$ packed form
36389h939j66025J00241J34334r9581j44774J20676K01312j12702k88622K9746
36379b34334L62526K22838o5839k0574J46852K3971j89415r1827J36584Q0188
36369C70970j40476j20363J09074K29986K25388K43543J66834j16060k77873M6070
36359G37093O38128R69120Q73150N25567K2219n54932q95049p56495l62775j37303
36349A058723j81574k75986k19860J7842K76063K45927j63750n11222l17746J53837
36339H2254K22611j14095j82731J68305K80636j22909l99160r8270K64764J35301
36329B36706j72282j40568O5100N0192n9949K1014J39830N4731p6446o4800o3865
36318a0337j35736M754L77599M76026Q2525k77952j85765J3227r1993k62043j44652
$$ plain form
36307 -154347 -78882 29303 103553 207070 206831 -45176 -313257 -277922 -71452 23502 162419
36296 162419 585628 942261 724911 177423 -33455 111385 84788 -150657 -123840 169821
36286 169821 206817 -92656 -218387 -4931 126925 -2030 -58656 93493 163568 63019
36276 63019 72157 259523 385988 440922 625160 817526 746409 622647 846897 1179713
36266 1179713 1039688 557724 440005 812934 1125826 1185578 1314576 1457499 1162794 573441
36256 573441 427948 891476 1326885 1387352 1390411 1449477 1212368 679578 350993 342625 239724
36245 239724 -23953 -58130 102005 -16670 -337471 -260765 181377 271953 -107815 -251405
36235 -251405 76650 238208 -77012 -340300 -224839 -115043 -224573 -211692 -2073 -1949
$$ packed form
36307a54347P5465J08185P4250J03517k39k52007k68081L5335K06470R4954J38917
36296A62419M23209L56633k17350n47488k10878J44840k6597k35445K6817K93661
36286A69821L6996k99473j25731K13456J31856j28955n6626J52149P0075j00549
36276F3019R138J87366J26465N4934J84238J92366p1117j23762K24250L32816
36266A179713j40025m81964j17719L72929L12892N9752J28998J42923k94705n89353
36256E73441j45493M63528M35409O0467L059N9066k37109n32790l28585q368j02901
36245B39724k63677l4177J60135j18675l20801P6706M42142R0576l79768j43590
36235b51405L28055J61558l15220k63288J15461J09796j09530J2881K09619J24
$$ plain form
36225 -1949 -197612 -50344 442507 612865 290150 44416 61311 -90071 -374993 -217067
36215 -217067 258327 216696 -347311 -430786 239989 696026 411508 84564 189353 174311
36205 174311 -250375 -416810 -13507 227129 -99772 -294062 98592 420277 170128 -89270
36195 -89270 100053 205843 -199829 -596007 -538621 -417107 -469719 -198818 525398 973999
36185 973999 880773 1009325 1658332 1896526 1134871 220837 73403 372786 451110 376764
36175 376764 366570 209987 -18796 224051 844357 1003837 601906 528405 994553 1120558
36165 1120558 665261 515990 916285 966265 471501 400082 857557 657601 -324050 -553456
36155 -553456 465562 1142474 545948 -62606 326666 761487 418881 174445 650647
$$ packed form
36225a949j95663J47268M92851J70358l22715k45734J6895j51382k84922J57926
36215b17067M75394m1631n64007q3475O70775M56037k84518l26944J04789j5042
36205A74311m24686j66435M03303K40636l26901j94290L92654L21685k50149k59398
36195h9270J89323J05790m05672l96178N7386J21514n2612K70901P24216M48601
36185I73999r3226J28552O49007K38194p61655r14034j47434K99383P8324p4346
36175C76764j0194j56583k28783K42847O20306J59480m01931p3501M66148J26005
36165A120558m55297j49271M00295M9980m94764p1419M57475j99956r81651k29406
36155e53456J019018O76912n96526o08554L89272M34821l42606k44436M76202
$$ plain form
36146 650647 887186 385470 267723 1004478 1303575 645520 437369 1219093 1426903 486822
36136 486822 233026 1516015 2455209 1964630 1802926 3048387 3927567 3399534 3305002
36127 3305002 4521646 4861602 3478554 3167159 5265386 6814174 6180192 6531991 9838345
36118 9838345 12882572 13762790 16284922 22588145 28317730 31604356 38790901 52996163
36110 52996163 67093750 80752221 113257890 177614034 245687609 265025297 217846593
36103 217846593 143295570 91034637 70682915 60094539 45829808 33978386 29280492
36096 29280492 25827241 19700552 15056570 14301467 13449603 10239500 7881546 8083606
36088 8083606 7912968 5932886 4814179 5685536 5835610 4066611 2932686 3714137 4135038
$$ packed form
36146F50647K36539n01716j17747P36755K99097o58055k08151P81724K07810r40081
36136D86822k53796J282989R39194m90579j61704J245461Q79180n28033r4532
36127C305002J216644L39956j383048l11395K098227J548788o33982L51799L306354
36118I838345L044227Q80218K522132O303223N729585L286626P186545J4205262
36110E2996163J4097587J3658471L2505669O4356144O8073575J9337688m7178704
36103B17846593p4551023n2260933k0351722j0588376j4264731j1851422m697894
36096B9280492l453251o126689m643982p55103q51864l210103k357954K02060
36088H083606j70638j980082j118707Q71357J50074j768999j133925P81451M20901
$$ plain form
36079 4135038 2970001 2295205 3234100 3733951 2543796 1518952 2006072 2469045 1642110
36070 1642110 833463 1203812 1650661 1203617 898181 1560659 2112754 1672126 1173296
36061 1173296 1453560 1741375 1367166 1080681 1444187 1682304 1237692 822987 967180
36052 967180 1096927 868744 838395 1117378 970445 368315 301138 963072 1282695 815036
36042 815036 422570 543545 506450 112343 140222 690339 791778 283017 297811 1190803
36032 1190803 1773845 1413921 1147934 1808417 2668900 2899173 2855089 2975282 2819833 2157291
36022 2157291 1696203 1834178 1907604 1490037 1194945 1412539 1512358 1100030 819565 1087140
36012 1087140 1248514 841951 521996 855378 1302026 1250346 1015010 976904 765267 139214
$$ packed form
36079D135038j165037o74796R38895M99851j190155j024844M87120M62973q26935
36070A642110q08647L70349M46849m47044l05436O62478N52095m40628m98830
36061A173296K80264K87815l74209k86485L63506K38117m44612m14705J44193
36052I67180J29747k28183l0349K78983j46933o02130o7177O61934L19623m67659
36042H15036l92466J20975l7095l94107K7879N50117J01439n08761J4794Q92992
36032A190803N83042l59924k65987O60483Q60483K30273m4084J20193j55449o62542
36022B157291m61088J37975P3426m17567k95092K17594R9819m12328k80465K67575
36012A087140J61374m06563l19955L33382M46648n1680k35336l8106k11637o26053
$$ [...]
##END NTUPLES=NMR SPECTRUM
##END=
