##TITLE=31Pdec_PR195_rm
 CDCl3, 124 sc
 6.04.2021
##JCAMPDX= 6.0         $$ Bruker NMR JCAMP-DX V2.0
##DATA TYPE= NMR SPECTRUM
##DATA CLASS= NTUPLES
##ORIGIN= UXNMR, Bruker Analytische Messtechnik GmbH
##OWNER= root
$$ XWIN-NMR		Version 3.5
$$ Tue Apr  6 12:44:34 2021 Russian Standard Time (UT+4h)  she@DPX200
##.OBSERVE FREQUENCY= 81.013821
##.OBSERVE NUCLEUS= ^31P
##.ACQUISITION MODE= SIMULTANEOUS
##.ACQUISITION SCHEME= undefined
##.AVERAGES= 124
##.DIGITISER RES= 16
##SPECTROMETER/DATA SYSTEM= spect
##.PULSE SEQUENCE= zgpg30
##.SOLVENT NAME= CDCl3
##.SHIFT REFERENCE= (INTERNAL, CDCl3, 0, 248.564)
##AUDIT TRAIL= $$ (NUMBER, WHEN, WHO, WHERE, WHAT)
$$ ##TITLE= Audit trail, XWIN-NMR		Version 3.5
$$ ##JCAMPDX= 5.01
$$ ##ORIGIN= Bruker BioSpin GmbH
$$ ##OWNER= she
$$ F:/spectra/data/she/nmr/P31/1/pdata/1/auditp.txt
$$ ##AUDIT TRAIL=  $$ (NUMBER, WHEN, WHO, WHERE, WHAT)
(   1,<2021-04-06 12:43:31.09 +0400>,<she>,<DPX200>,
      <continue with go, POWCHK disabled, PULCHK disabled
       configuration hash MD5:
       00 E9 B6 7A A2 85 ED C7 34 08 36 98 17 FE 4E 26
       data hash MD5: 32K
       B3 65 B9 95 CC 36 AA 84 CA 28 7F 9B E9 3A 78 DC>)
(   2,<2021-04-06 12:43:38.39 +0400>,<she>,<DPX200>,
      <Start of raw data processing
       efp BC_mod = 2 LB = 1 FT_mod = 6 PKNL = 1 PHC0 = -5402.124 PHC1 = 1574.402 SI = 64K 
       data hash MD5: 64K
       DC 23 9F 1C 3B 1F C5 24 95 2B 6F A6 A1 39 68 BB>)
(   3,<2021-04-06 12:44:03.50 +0400>,<she>,<DPX200>,
      <pk PHC0 = 0.8419304 PHC1 = 42.60001 
       data hash MD5: 64K
       B6 20 A9 64 F4 22 81 8C C9 E4 D4 15 C5 CF 3A 02>)
(   4,<2021-04-06 12:44:06.92 +0400>,<she>,<DPX200>,
      <abs ABSG = 5 
       data hash MD5: 64K
       35 43 67 C6 EA 08 36 B0 30 05 98 2B 61 13 2D 36>)
$$ ##END=
$$ 
$$ hash MD5
$$ EA E2 61 11 04 5A A7 0F F8 F9 4A AB A2 EA 87 5B
##$RELAX= 
##$RELAX= 
##$RELAX= 
##$RELAX= 
##$RELAX= 
##$RELAX= 
##$RELAX= 
##$RELAX= 
$$ Bruker specific parameters
$$ --------------------------
##$DU= <F:/spectra>
##$EXPNO= 1
##$NAME= <P31>
##$PROCNO= 1
##$TYPE= <nmr>
##$USER= <she>
##$AMP= (0..31)
100 100 100 100 100 100 100 100 100 100 100 100 100 100 100 100 100 100 
100 100 100 100 100 100 100 100 100 100 100 100 100 100 
##$AQSEQ= 0
##$AQ_mod= 1
##$AUNM= <au_zg>
##$AUTOPOS= <>
##$BF1= 81.014009
##$BF2= 200.13
##$BF3= 200.13
##$BF4= 200.13
##$BF5= 200.13
##$BF6= 200.13
##$BF7= 200.13
##$BF8= 200.13
##$BYTORDA= 1
##$CFDGTYP= 0
##$CFRGTYP= 5
##$CHEMSTR= <none>
##$CNST= (0..31)
1 1 145 1 1 1 1 1 1 1 1 1 1 1 1 1 1 1 1 1 1 1 1 1 1 1 1 1 1 1 1 1 
##$CPDPRG= <waltz16>
##$CPDPRG1= <>
##$CPDPRG2= <waltz16>
##$CPDPRG3= <>
##$CPDPRG4= <mlev>
##$CPDPRG5= <mlev>
##$CPDPRG6= <mlev>
##$CPDPRG7= <mlev>
##$CPDPRG8= <mlev>
##$CPDPRGB= <>
##$CPDPRGT= <>
##$D= (0..31)
0 1 0 0 0 0 0 0 0 0 0 0.03 2e-05 3e-06 0 0 0 0 0 0 0 0 0 0 0 0 0 0 0 0 
0 0 
##$DATE= 1617698424
##$DBL= (0..7)
120 120 120 11 120 120 24 19 
##$DBP= (0..7)
150 150 150 150 150 150 150 150 
##$DBP07= 0
##$DBPNAM0= <>
##$DBPNAM1= <>
$$ [...]
##$SUBNAM3= <"">
##$SUBNAM4= <"">
##$SUBNAM5= <"">
##$SUBNAM6= <"">
##$SUBNAM7= <"">
##$SUBNAM8= <"">
##$SUBNAM9= <"">
##$SW= 501.771253377433
##$SWIBOX= (0..15)
0 1 3 0 0 0 0 0 0 0 0 0 0 0 0 0 
##$SW_h= 40650.406504065
##$TD= 32768
##$TD0= 1
##$TE= 0
##$TE2= 300
##$TE3= 300
##$TEG= 300
##$TL= (0..7)
0 120 53 12 22 120 120 120 
##$TP= (0..7)
150 150 150 150 150 150 150 150 
##$TP07= 0
##$TPNAME0= <>
##$TPNAME1= <>
##$TPNAME2= <>
##$TPNAME3= <>
##$TPNAME4= <>
##$TPNAME5= <>
##$TPNAME6= <>
##$TPNAME7= <>
##$TPOAL= (0..7)
0.5 0.5 0.5 0.5 0.5 0.5 0.5 0.5 
##$TPOFFS= (0..7)
0 0 0 0 0 0 0 0 
##$TUNHIN= 0
##$TUNHOUT= 0
##$TUNXOUT= 0
##$USERA1= <user>
##$USERA2= <user>
##$USERA3= <user>
##$USERA4= <user>
##$USERA5= <user>
##$V9= 5
##$VALIST= <valist>
##$VCLIST= <CCCCCCCCCCCCCCC>
##$VD= 0
##$VDLIST= <DDDDDDDDDDDDDDD>
##$VPLIST= <PPPPPPPPPPPPPPP>
##$VTLIST= <TTTTTTTTTTTTTTT>
##$WBST= 1024
##$WBSW= 4
##$XGAIN= (0..3)
0 0 0 0 
##$XL= 0
##$YL= 0
##$YMAX_a= 4684
##$YMIN_a= -4741
##$ZGOPTNS= <>
##$ZL1= 120
##$ZL2= 120
##$ZL3= 120
##$ZL4= 120
##$ABSF1= 248.5645
##$ABSF2= -253.2056
##$ABSG= 5
##$ABSL= 3
##$ALPHA= 0
##$AQORDER= 0
##$ASSFAC= 0
##$ASSFACI= 0
##$ASSFACX= 0
##$ASSWID= 0
##$AUNMP= <proc_1d>
##$AZFE= 0.1
##$AZFW= 0.5
##$BCFW= 0
##$BC_mod= 2
##$BYTORDP= 0
##$COROFFS= 0
##$CY= -3
##$DATMOD= 1
##$DC= 0
##$DFILT= <>
##$DTYPP= 0
##$F1P= 0
##$F2P= 0
##$FCOR= 1
##$FTSIZE= 65536
##$FT_mod= 6
##$GAMMA= 0
##$GB= 0
##$INTBC= 1
##$INTSCL= 5.30512e-09
##$ISEN= 30
##$LB= 1
##$LEV0= 0
##$LPBIN= 0
##$MAXI= 10000
##$MC2= 0
##$MEAN= 0
##$ME_mod= 0
##$MI= 50
##$NCOEF= 0
##$NC_proc= -8
##$NLEV= 6
##$NOISF1= 182.463
##$NOISF2= 159.3651
##$NSP= 0
##$NTH_PI= 0
##$NZP= 0
##$OFFSET= 248.5645
##$PC= 4
##$PHC0= -5401.282
##$PHC1= 1617.002
##$PH_mod= 1
##$PKNL= yes
##$PPARMOD= 0
##$PSCAL= 0
##$PSIGN= 0
##$REVERSE= no
##$SF= 81.014009
##$SI= 65536
##$SIGF1= 159.3651
##$SIGF2= -187.1042
##$SINO= 113.3802
##$SIOLD= 16384
##$SREGLST= <1H.CDCl3>
##$SSB= 0
##$STSI= 65536
##$STSR= 0
##$SW_p= 40650.406504065
##$SYMM= 0
##$S_DEV= 0
##$TDeff= 32768
##$TDoff= 0
##$TI= <>
##$TILT= no
##$TM1= 0
##$TM2= 0
##$TOPLEV= 0
##$USERP1= <user>
##$USERP2= <user>
##$USERP3= <user>
##$USERP4= <user>
##$USERP5= <user>
##$WDW= 1
##$XDIM= 65536
##$YMAX_p= 382167894
##$YMIN_p= -106479888
$$ End of Bruker specific parameters
$$ ---------------------------------
##NTUPLES= NMR SPECTRUM
##VAR_NAME=  FREQUENCY,     SPECTRUM/REAL,   SPECTRUM/IMAG
##SYMBOL=    X,             R,               I
##VAR_TYPE=  INDEPENDENT,   DEPENDENT,       DEPENDENT
##VAR_FORM=  AFFN,          ASDF,            ASDF
##VAR_DIM=   65536,         65536,           65536
##UNITS=     HZ,            ARBITRARY UNITS, ARBITRARY UNITS
##FACTOR=    0.620285442955139, 1,           1
##FIRST=     20137.2065510759, 0,            0
##LAST=      -20513.1999529892, 0,           0
##MIN=       -20513.1999529892, -106479888,  0
##MAX=       20137.2065510759, 382167894,    0
$$ Real data points
##PAGE= N=1
##DATA TABLE= (X++(R..R)), XYDATA
$$ [...]
12775E643395J3155589j3776421l0554914j6674307Q228079J5798621O702822
12768a1477136k681304q373846j0736639o57890J9437595K1924390p100791l3776653
12760c3442274j8266813K3012546L8231792J6047728m273657k07113L553010j3844558
12752A0810661l0192764j7698911J0838283K2471941J1712912P29084K951835
12745A1623041R506896P355110n140421j8330184j8684960k095183J5942054J4942209
12737A5118562j472415p831381M560192J2584800q76061j6394700q580183J0370434
12729G479248Q243777j4660876k4158438n562916J3336336N344253j5350324j5971691
12721d1300631O280066K2322883J4560579N0487K418477J5805838J3219287j2292402
$$ plain form
12775 5643395 18798984 5022563 -25532351 -42206658 -33978579 -18179958 -11477136
12768 -11477136 -14158440 -22532286 -33268925 -33926815 -14489220 7435170 334379 -33442274
12760 -33442274 -51709087 -28696541 9535251 25582979 21309322 21102209 24655219 10810661
12752 10810661 -19382103 -37081014 -26242731 -3770790 7942122 8671206 11623041
12745 11623041 21129937 28485047 23344626 5014442 -13670518 -15765701 176353 15118562
12737 15118562 13646147 5814766 10374958 22959758 22083697 5688997 -2891186 7479248
12729 7479248 15723025 1062149 -23096289 -28659205 -15322869 -9978616 -25328940 -41300631
12721 -41300631 -35020565 -12697682 1862897 1913384 4331861 20137699 33356986 21064584
12713B1064584l2643207k0214090J3293710L0026587J4989286o740155p046211
12706A2730504Q303053J2809369k168085j8964934k0148827q085571L690768P000761
12698d832962K935186k845773m321460P76599P914084R790795N137517M48548
12690A5002534J031282L266572l15995q632068j0162506J470472J3572093O715514
12682B1947898j6501228k8244629j1021582J5513059J9975685K998684o580444
12675a912557L682240J4918046J1151267K401283K040959L978977j766566r620963
12667B4872686j1310555j1102070j1267847n30119K2547299L2700707J0384138
12660E6294239k3157779l2154918j7305931q945314j5245777j2439308J0193683
$$ plain form
12713 21064584 -11578623 -31792713 -18499003 11527584 26516870 19776715 12730504
12706 12730504 21033557 33842926 31674841 12709907 -7438920 -15524491 -11833723 -4832962
12698 -4832962 -1897776 -4743549 -9065009 -8288410 -374326 9416469 14553986 15002534
12690 15002534 16033816 19300388 18984393 10352325 189819 1660291 15232384 21947898
12682 21947898 5446670 -22797959 -33819541 -18306482 1669203 4667887 -1912557
12675 -1912557 1769683 16687729 27838996 30240279 32281238 36260215 34493649 24872686
12667 24872686 13562131 2460061 -8807786 -9337905 13209394 45910101 56294239
12660 56294239 33136460 981542 -16324389 -25269703 -40515480 -52954788 -42761105
12653d2761105K8958911K1392960j605815j3492108n349444R810241J4473179
12646A1426819J896264j6717841j9849940j224193J6885363J0982865j0392559
12639f993222k1162370j6928123j2605356q080880R129378K8592958K3633524
12632d414091j672547j3124373l554898m536679k4418758k4084080J5622033M9315727
12624a0867666L2496503p063754j3751767R630593J6091057m563919j8454503
12617C516544j3121928j1049511j5993710l152045K6012448L2696163L869652
12610B2777613k0972714j0969538R964987P472187q871791r550532M426519J0707819
12602D984550N813448K814307K910435n25727j459107O829966J0696053l696316
$$ plain form
12653 -42761105 -13802194 7590766 5984951 -7507157 -12856601 -3046360 11426819
12646 11426819 13323083 -3394758 -23244698 -24468891 -7583528 3399337 -6993222
12639 -6993222 -28155592 -45083715 -57689071 -65769951 -56640573 -28047615 -4414091
12632 -4414091 -6086638 -19211011 -22765909 -27302588 -51721346 -75805426 -60183393 -10867666
12624 -10867666 21628837 14565083 813316 10443909 26534966 21971047 3516544
12617 3516544 -9605384 -20654895 -36648605 -39800650 -13788202 18907961 22777613
12610 22777613 1804899 -9164639 800348 8272535 -599256 -10149788 -5723269 4984550
12602 4984550 10797998 13612305 16522740 15997013 14537906 21367872 32063925 28367609
12594B8367609j9303774r216253J7655365K5792746O762782j0881888r674504
12587B9502083o172187j4143797j7878021k283176J6809072J6820825L422929
12580B6077728l914817n673987j3794301k0916550r609263J2099234J7100640
12573A368684L379069j290156J2337805J6155336p056694k8256938j4638191J6133492
12565a867593K0769164m374778k2565008j6301166o159577n701403O01260J9363015
12557a6236086K6371473O787666j3777324p341144J1832216J2418196l554873
12550A6500124j0278534m821286p052690j8466330j7570397J552181J8046109
12543b2090823J7181766P119484k413478j1652328j5066164j458191K0906707
$$ plain form
12594 28367609 9063835 -152418 17502947 43295693 50058475 39176587 29502083
12587 29502083 23329896 9186099 -8691922 -10975098 5833974 22654799 26077728
12580 26077728 22162911 16488924 2694623 -18221927 -27831190 -15731956 1368684
12573 1368684 4747753 3457597 15795402 31950738 24894044 -3362894 -18001085 -1867593
12565 -1867593 18901571 14526793 -8038215 -24339381 -30498958 -36200361 -35599101 -16236086
12557 -16236086 10135387 16923053 3145729 -4195415 7636801 20054997 16500124
12550 16500124 6221590 1400304 -5652386 -24118716 -41689113 -40136932 -22090823
12543 -22090823 -4909057 2210427 -203051 -11855379 -26921543 -28379734 -7473027
12536g473027K5355211M989944j4317766j2456837k605556l617214q048823O5469
12528a8108599J3657955J4164980L149152k661089j568747p499825k1047664k3015657
12520d2929494l534009J9372855K1346430L107400j0822115l289729J4807079
12513a941583J9986593P047032o044956n293331N60808l035417j3317458j8285174
12505b0323486j7317371j5401221o246648J5308540L0887014J7692600j1353664
12498f754236j8827188J821419J6700847P095985k688068Q001313J8113771K745613
12490B6209456k0685525j9653125Q72209R889092Q47268n515433r84204J825918
12482g194344k068733l968466k922356o022293q977390k364619O018202K446157
$$ plain form
12536 -7473027 17882184 22872128 8554362 -3902475 -6508031 -10125245 -18174068 -18108599
12528 -18108599 -4450644 9714336 12863488 10202399 8633652 1133827 -19913837 -42929494
12520 -42929494 -46463503 -27090648 -5744218 -2636818 -13458933 -16748662 -1941583
12513 -1941583 18045010 25092042 19047086 13753755 14314563 11279146 -2038312 -20323486
12505 -20323486 -37640857 -53042078 -59288726 -43980186 -13093172 4599428 -6754236
12498 -6754236 -25581424 -23760005 -7059158 36827 -2651241 5350072 23463843 26209456
12490 26209456 5523931 -14129194 -13256985 -3367893 -2520625 -8036058 -9020262 -7194344
12482 -7194344 -9263077 -13231543 -16153899 -22176192 -31153582 -33518201 -27499999 -25053842
12474b5053842l443547P630098K3991502J3497370k0705517l4740831q570892
12467d7395659K1497087J7629333m690307p015664J1213867J8153548L206672
12460A2598877j0821592p603456K141906N815323Q537429J5861212J6738991K46969
12452D3515659k1798149k5998720q051877J1393244J2275484m195106k2245481
12445a5104946k8455750j8111311M273283K3246831K1505113J436993j1500616
12438b2710403j99322J8495460J7105480k141784j3860560j0972309r881890j3514484
12430c7679812l590772K0654435L1036366J5099536q23470M267641J1636957J498380
12422D2099261o057172J2895388L5802974K4840339r738733k5548588j5913288
$$ plain form
12474 -25053842 -28497389 -20867291 3124211 16621581 -4083936 -38824767 -47395659
12467 -47395659 -25898572 -8269239 -12959546 -19975210 -8761343 9392205 12598877
12460 12598877 1777285 -5826171 -3684265 2131058 10668487 26529699 43268690 43515659
12452 43515659 21717510 -4281210 -12333087 -939843 11335641 7140535 -15104946
12445 -15104946 -43560696 -61672007 -57398724 -34151893 -12646780 -11209787 -22710403
12438 -22710403 -22909725 -4414265 12691215 10549431 -3311129 -14283438 -24165328 -37679812
12430 -37679812 -41270584 -20616149 10420217 25519753 24696283 28963924 40600881 42099261
12422 42099261 36042089 48937477 84740451 109580790 99842057 74293469 58380181
12415E8380181j1810482k1322532j9370017q15968P689031j044230r84727J4160449
12407B4881705J2425048j9032685m2338009k4947292R331589J8878754M668363
12400a6132527k392975P565577J8789199K1029004J5528280J524738j7673085
12393B8238211k5792593j3730526J748296O53216r477353o718415J0563616K3200265
12385H684717J9144489L842836j2210884k1441931j9625916r714267l5375O887439
12377b4468892J3479951J3181028l276012k2754941j7210205J2073851K7054957
12370a920263Q400679j2106062j441922K1481696J8726149l531549q685467N833759
12362B6757020N183905k0849701l7011183j7482635J3460470J7407058l856372
$$ plain form
12415 58380181 46569699 25247167 5877150 5061182 12750213 11705983 10721256 24881705
12407 24881705 37306753 18274068 -24063941 -49011233 -39679644 -20800890 -16132527
12400 -16132527 -18525502 -10959925 7829274 28858278 44386558 45911296 28238211
12393 28238211 2445618 -11284908 -9536612 -8883396 -18360749 -25079164 -14515548 8684717
12385 8684717 27829206 31672042 19461158 -1980773 -21606689 -31320956 -31356331 -24468892
12377 -24468892 -10988941 2192087 -1083925 -23838866 -41049071 -28975220 -1920263
12370 -1920263 6480416 -5625646 -7067568 14414128 33140277 29608728 20923261 26757020
12362 26757020 31940925 11091224 -25919959 -43402594 -29942124 -12535066 -16391438
12355a6391438j4117504N429632L0675700K5846339r412388l6108421k3193805
12348c7271885J2348349K7909288J1247574r124941r795661n43959J801437j052628
12340d482426l820102j1050394j8439055p862287J9376254L2351221J5619549
12333B1692760n041767o571503m767121j5706219j7731300O904464K7194574J0627558
12325A6601446j5052249n573383J9975758J0655269k2075001j8445318K4231344
12318A0317866M0864465O284070k4926932j3554609K856269j5139687l7027153
12311c0325711j9028748J6283496J6656980j5008674k9753745r005741J8341100
12304e1841043K6649249J9054963N996204o977286j1220613k322766O749725K313320
$$ plain form
12355 -16391438 -30508942 -25079310 5596390 31442729 22030341 -14078080 -37271885
12348 -37271885 -24923536 2985752 14233326 5108385 -4687276 -5231235 -3429798 -4482426
12340 -4482426 -8302528 -19352922 -37791977 -45654264 -26278010 6073211 21692760
12333 21692760 16650993 10079490 5312369 -10393850 -28125150 -21220686 5973888 16601446
12325 16601446 1549197 -4024186 15951572 26606841 4531840 -13913478 10317866
12318 10317866 51182331 57466401 32539469 18984860 21841129 6701442 -30325711
12311 -30325711 -49354459 -33070963 -16413983 -31422657 -61176402 -70182143 -51841043
12304 -51841043 -25191794 -6136831 -140627 -7117913 -18338526 -20661292 -13911567 -11598247
12296a1598247n599548K069037J9791620K2346067K083676k0001250k3138821
12289a4047466j0517617K02896p86521p936773j0764961p115901k595961K492190
12281e1070114J4787138K9312962K4505816o625874l4288465k6400121M950246
12274d4828412K1492841J4529366O933727N647521m581892j9260600j3094128
12267c3161577J0723438J7369481n31967q740802P127834J6546382K461402p809502
12259C984689J648142K590723j8808622k5169473N975391L2178755J5246196r401160
12251H244641N635344L4006473K2906239j1283559j3909871Q549424M629620k2733783
12243C6044528k1381445R166805J1675791k3961406l7219740j664380K8029580
$$ plain form
12296 -11598247 -17197795 -15128758 4662862 27008929 29092605 9091355 -14047466
12289 -14047466 -24565083 -24362187 -25148708 -33085481 -43850442 -50966343 -53562304 -51070114
12281 -51070114 -36282976 -6970014 17535802 10909928 -23378537 -49778658 -44828412
12274 -44828412 -23335571 -8806205 -1872478 3775043 -806849 -20067449 -33161577
12267 -33161577 -22438139 -5068658 -5600625 -14341427 -7213593 9332789 11794191 3984689
12259 3984689 5632831 8223554 -10585068 -35754541 -29779150 2399605 17645801 8244641
12251 8244641 13879985 47886458 70792697 59509138 45599267 54148691 58778311 36044528
12243 36044528 14663083 23829888 35505679 11544273 -25675467 -27339847 689733
12236F89733Q674389k3583513k0840204K312306R497379O722762J6144513K5904550
12228B5521915J5121459j783433q06246O673447l544639k1714511j9756163J134430
12220H46259J3523618M454079j3973823k5015171j8745562L238352K0131362R381816
12212f159070j5203625j2145233K3591468M2024389J1497158k7686526k2995186
12205g076625R753306J5474400j2479597k8402166r702041J5645164J9624942
12198B837383P818548m984625j5502669j8883655o518942J3093814J7711025M054902
12190c74219o153339N75758J2679069J6045604J1625087M147876o087581j3300278
12182A9157977p490237P060938J2282114K482847o702878l139460L748499r44828
$$ plain form
12236 689733 9364122 -14219391 -35059595 -32747289 -23249910 -16527148 -382635 25521915
12228 25521915 40643374 38859941 38053695 44727142 41182503 19467992 -288171 846259
12220 846259 14369877 18823956 4850133 -20165038 -38910600 -35672248 -15540886 -6159070
12212 -6159070 -21362695 -33507928 -9916460 32107929 43605087 15918561 -7076625
12205 -7076625 2676681 18151081 5671484 -22730682 -32432723 -16787559 2837383
12198 2837383 10655931 5671306 -9831363 -28715018 -35233960 -22140146 -4429121 -374219
12190 -374219 -6527558 -5951800 6727269 22772873 34397960 38545836 32458255 19157977
12182 19157977 11667740 18728678 31010792 33493639 26790761 23651301 27399800 26454972
12174B6454972j5467708k4321657j6118971O022696K6188243K7986715J2170357
12167D2914647j736176l79943M395147m351093j8055414j3406911R771267K4877837
12159D4029361J4762536r582232k9330906l5659217k4178337M567130L1708027
12152c683638L0885889L971775j5307510o337777J0903350R441087m362212o359917
12144A9151047N076266J0635923M297927q4371M162561O044415j919699j1088929
12136C6275140j3132029j3707533j8877318j9180154j870597K4720203L3820650
12129B8048362J1991976k1014869l2655724j4044086J2957710K4131392J7579132
12122B6993893O543500j109002o835005j2086516j5977138j8550769j7251282
$$ plain form
12174 26454972 10987264 -13334393 -29453364 -23430668 2757575 30744290 42914647
12167 42914647 41178471 40798528 45193675 40842582 22787168 9380257 19151524 44029361
12159 44029361 58791897 49209665 19878759 -15780458 -39958795 -35391665 -3683638
12152 -3683638 27202251 31174026 15866516 9528739 20432089 29873176 25510964 19151047
12144 19151047 24227313 34863236 39161163 39076792 43239353 49283768 47364069 36275140
12136 36275140 23143111 9435578 -9441740 -28621894 -30492491 -5772288 28048362
12129 28048362 40040338 19025469 -13630255 -27674341 -14716631 9414761 26993893
12122 26993893 33537393 32428391 25593386 13506870 -2470268 -21021037 -38272319
12115c8272319n039001J7229931L1948153K2742014j014541j3206770m864425
12108I523042O660677M948519n047705r665255n524925K206350R808664J5385792
12100B8295159J6754307J4111762Q696113j737216j7049709k6151923j8115420
12093D803073j361221M602044k910515q706701o974896o403022n832788O167911
12085a6616115K0239091R184200k2585705l0344949L629059L1471596P984912
12078B962089l4373784l0737277J6125059M1128620J7371118j0911218o793137
12071e228530O835958r53137j4429367n112368J5040778J4602756m863367j4516309
12063h623586m377107P729631P273878j582077q186624n776739N317448J3430514
$$ plain form
12115 -38272319 -43311320 -26081389 5866764 28608778 27594237 14387467 9523042
12108 9523042 16183719 21132238 16084533 6419278 894353 3100703 12909367 28295159
12100 28295159 45049466 59161228 67857341 66120125 49070416 22918493 4803073
12093 4803073 3441852 8043896 5133381 -3573320 -10548216 -16951238 -22784026 -16616115
12085 -16616115 3622976 12807176 -9778529 -40123478 -36494419 -5022823 2962089
12078 2962089 -31411695 -62148972 -46023913 -4895293 12475825 1564607 -5228530
12071 -5228530 1607428 654291 -13775076 -18887444 -3846666 10756090 5892723 -8623586
12063 -8623586 -13000693 -5271062 2002816 420739 -7765885 -13542624 -8225176 5205338
12055E205338M434773j5802059k2899053p649464J1273272J8877140K2423891
12048A5863838K4015200P251573k4974198l4759617n955930J7674300l516265
12041d401099l4338847j6604205L1216508L7169789q252900l6055721r937995
12034d1204470K1849650J4077773n291999M084946K1814713Q784767k0098824
12027D016556k2870971j783644P944408J471660L196028J4024950J0664522o637143
12019A0026366j1634998K142320J3339836J1664234P641206K711264j2706151
12012B3184077k8140528j8399279J2056558K6183043P795525j4731367j2952986
12005e004957K892750P755738L57872k333654O581756J8045871J9741922N380414
$$ plain form
12055 5205338 9640111 -6161948 -29061001 -36710465 -25437193 -6560053 15863838
12048 15863838 39879038 47130611 22156413 -12603204 -18559134 -884834 -4401099
12041 -4401099 -38739946 -55344151 -24127643 13042146 4789246 -31266475 -41204470
12034 -41204470 -19354820 -5277047 -10569046 -6484100 15330613 24115380 4016556
12027 4016556 -18854415 -20638059 -12693651 -11221991 -8025963 5998987 16663509 10026366
12019 10026366 -1608632 533688 13873524 25537758 33178964 35890228 23184077
12012 23184077 -4956451 -23355730 -11299172 14883871 22679396 7948029 -5004957
12005 -5004957 -2112207 5643531 6001403 3667749 10249505 28295376 48037298 53417712
11997E3417712j8548219l1291843j6975584J1634537K4358658J1339171p857779
11990B6076653j4955717j2286408p372189l59809N780846L196381m440333k825849
11982g186425Q217464J1002230j249481j2882739j1781740n477639j957509L122651
11974a8193188R255467M801834q656171r469049J0027071K5183179J4169146q535446
11966A8582843j4881271k870633P726676O023961k969402j1034670j0672961K237917
11958g857540J7224038J5026870m164526j6383490r210256J096336J490869L935622
11950A157923J5954092J8626420K16184j5940729q042137N845774Q32061r093268
11942I556320P40802J4929794L253628k0397783j6920134R675143J7431646k192634
$$ plain form
11997 53417712 34869493 3577650 -13397934 -1763397 22595261 33934432 26076653
11990 26076653 11120936 -1165472 -8537661 -8897470 -3116624 79757 -4360576 -7186425
11982 -7186425 1031039 12033269 10783788 -2098951 -13880691 -19358330 -21315839 -18193188
11974 -18193188 -8937721 -4135887 -12792058 -22261107 -12234036 12949143 27118289 18582843
11966 18582843 3701572 830939 8557615 14581576 11612174 577504 -10095457 -7857540
11958 -7857540 9366498 24393368 20228842 3845352 -5364904 -4268568 -2777699 1157923
11950 1157923 17112015 35738435 35954619 20013890 11971753 17817527 18649588 9556320
11942 9556320 10297122 25226916 28480544 8082761 -8837373 837770 18269416 16076782
11934A6076782j3143694J91699J0617555J707029p740264p727077j5326820l0314180
11926d5658970k2806714J0615118K7564465O260153j6274983p381790P271905
11919d0410816l288946j3329503J2476762M5362589L1628460j5388316l1631692
11912a4581462m066451J3173619p648724k4702576j204851L3453728L3909049
11905B8332332Q472055l267010M881950O103745q275575j7724015j0811286k544681
11897E167515p446078j7831797j7811158n113269R245559J5798192J5151514J3654810
11889A0815288J2707370M849720j4207673l1401903k6528903r28322J8536224
11882b6158199J4365107K835980P471459K1235729J8960692N00339p683152L504019
$$ plain form
11934 16076782 2933088 3124787 13742342 15449371 7709107 -17970 -15344790 -45658970
11926 -45658970 -68465684 -57850566 -30286101 -24025948 -40300931 -47682721 -40410816
11919 -40410816 -43699762 -57029265 -44552503 810086 32438546 17050230 -14581462
11912 -14581462 -18647913 -5474294 -13123018 -37825594 -39030445 -5576717 28332332
11905 28332332 36804387 33537377 38419327 44523072 36247497 18523482 7712196 5167515
11897 5167515 -2278563 -20110360 -37921518 -43034787 -33789228 -17991036 -2839522 10815288
11889 10815288 23522658 28372378 14164705 -17237198 -43766101 -44694423 -26158199
11882 -26158199 -11793092 -8957112 -1485653 19750076 38710768 39211107 31527955 35031974
11874C5031974J0175247m355095k0982132j6137075L07665L694172m981464o178756
11866c425464J022239O94591n263523J657563J8036409J6557828o754734j7949626
11858D575283L221768K8366213K3332290m22652r623915l610899o741614j8764024
11850B0332450j5063872M959375J1601028m394063j3062472N446117K5401319
11843C5219882J4424425j5672486k6217472p086423J3808315J3184175l15688
11836B7344728o239661j611533J09250r014370k0509936k0768965p787725P665929
11828c0812283J6273868J8411492J5545219L731956j4498013k1363124l952288
11821a6663173K1178692K3803654J792208j3961159l004554J6630261J6068690
$$ plain form
11874 35031974 45207221 40852126 19869994 3732919 4040584 7734756 2753292 -3425464
11866 -3425464 -2403225 -1708634 -6972157 -5314594 12721815 29279643 22524909 4575283
11858 4575283 7797051 36163264 59495554 59072902 49448987 45838088 39096474 20332450
11850 20332450 5268578 10227953 21828981 17434918 4372446 9818563 35219882
11843 35219882 49644307 33971821 7754349 667926 14476241 27660416 27344728
11836 27344728 21105067 19493534 19602784 10588414 -9921522 -30690487 -38478212 -30812283
11828 -30812283 -14538415 3873077 19418296 23150252 8652239 -12710885 -16663173
11821 -16663173 4515519 28319173 30111381 16150222 13145668 29775929 45844619
11814D5844619n357736k4333093k5528282j3695949q28057N013889K371204j587446
11806a8100851L747323J6995597K1687105Q228240r000452r089603O535315J6490917
11798C7493591Q299485q001859j5368541q315141N238331J2380681M634486j3759196
11790B2601837k6416591k0536901k682945Q069648L946132k523601K222270J1727040
11782c593111P870843j0647119k0935005n681714J9123994K2833154L842406p484390
11774E329058L867526J2591451n508211k9279341k0600981J4941925L2561402
11767A3902829J3160867j2533998j3470126J203900O696631j93737p956245j2832986
11759a2022865j4669483p395693Q445809J8373038J4194116O402818L637975j561325
$$ plain form
11814 45844619 40486883 16153790 -9374492 -23070441 -23898498 -18884609 -16513405 -18100851
11806 -18100851 -14353528 2642069 24329174 32557414 23556962 14467359 21002674 37493591
11798 37493591 45793076 37791217 22422676 14107535 19345866 31726547 36361033 22601837
11790 22601837 -3814754 -24351655 -27034600 -18964952 -15018820 -17542421 -15320151 -3593111
11782 -3593111 4277732 -6369387 -27304392 -32986106 -13862112 8971042 12813448 5329058
11774 5329058 9196584 21788035 16279824 -12999517 -33600498 -18658573 13902829
11767 13902829 27063696 14529698 1059572 2263472 8960103 8766366 810121 -12022865
11759 -12022865 -26692348 -34088041 -25642232 -7269194 6924922 13327740 16965715 15404390
11751A5404390j2281050j3897817N33551J2176602M249352j1291758j5539362
11744b0646092j0723047m860718Q342981K8340079L1285315O479328j4739374
11737B3478472l599914J5709538M198979k3718969k2593457O300510J7598005
11730A7373164r17700j3679020n553196l926393j7834509j5199066J4286664K9960427
11722D510371P364039j6118666k986493K1569958J4765604j2695376k0835445
11715d426008p424405N38605R69694J0378471J8722260L456568j9854388j3849084
11707a1488287J5615488K3165579k251248j8899297j769788J7392507L452982
11700B5217936k7466868l5815136j3804899J4722143K9788445K6633820P883272
$$ plain form
11751 15404390 3123340 -10774477 -10240926 1935676 6185028 -5106730 -20646092
11744 -20646092 -31369139 -36229857 -27886876 453203 31738518 38217846 23478472
11737 23478472 19878558 35588096 39787075 16068106 -6525351 -224841 17373164
11730 17373164 16455464 2776444 -2776752 -6703145 -24537654 -39736720 -25450056 4510371
11722 4510371 11874410 -4244256 -7230749 14339209 29104813 16409437 -4426008
11715 -4426008 -11850413 -11311808 -10342114 36357 18758617 22215185 2360797 -11488287
11707 -11488287 4127201 27292780 25041532 6142235 4372447 21764954 25217936
11700 25217936 -2248932 -38064068 -51868967 -37146824 -7358379 19275441 27158713
11693B7158713j3639890j7366333N81938J7284173J3801459J930805J800852P717687
11685C9269404N06006j5973206j7946182L95411J7285646J5793077M530303j743207
11677D2117252l931184r092620j2866654p189097J165416l275192j9258968k5249124
11669c7580171r176049J0829743J0308945m104773k812000J8925043K7127687
11662A3518425p86563l4637432k9220622R196022L0397259J3518404o458257K302456
11654b170308K0732686J5374209p186267j6018317o656635j56003k332557k33257
11646A353551N340526Q427j0757646m666454J4820752J5649364j0148989k6719328
11638a5119797q360926J8644342J6542948o967069j6062071l738484N366767J103606
$$ plain form
11693 27158713 13518823 -3847510 -3265572 14018601 27820060 29750865 31551717 39269404
11685 39269404 39775410 23802204 5856022 6251433 23537079 39330156 43860459 42117252
11677 42117252 38186068 29093448 16226794 9037697 10203113 6927921 -12331047 -37580171
11669 -37580171 -46756220 -35926477 -25617532 -29722305 -32534305 -13609262 13518425
11662 13518425 12731862 -21905570 -51126192 -41930170 -11532911 1985493 -4472764 -2170308
11654 -2170308 18562378 33936587 26750320 10732003 4075368 3919365 1586808 1353551
11646 1353551 6694077 6702504 -4055142 -8721596 6099156 21748520 11599531 -15119797
11638 -15119797 -23480723 -4836381 11706567 4739498 -11322573 -15061057 -9694290 -8590684
11630h590684J4188R944627J5126009N061581p759883j0011389o517935n502781
11622h236267k553079P526076J6378995J3149006R90276q702714j1713091j1020159
11614d180957p202471J644138J3039393K0076637J7619188O228130p632044j5071828
11606B4520186j3045039q758698r878858j1851138m008377J1870039K0250861
11599I098976J1998174m357393j5444923j7425085j2670010j837025J2902263
11592a7735023K2798147J8865655K543623j3324076j4938534j418059J0678574
11585G470307L734355j5581557j8915373M884189K7176367J5875386j6154664
11578H489010k6653947m422389J7033389J1049169p725158j2288375l22114J2747854
$$ plain form
11630 -8590684 -8576496 1368131 16494140 21555721 13795838 3784449 -2733486 -8236267
11622 -8236267 -10789346 -3263270 13115725 26264731 27255007 18552293 6839202 -4180957
11614 -4180957 -11383428 -9739290 3300103 23376740 40995928 47224058 39592014 24520186
11606 24520186 11475147 2716449 -7162409 -19013547 -23021924 -11151885 9098976
11599 9098976 21097150 16739757 1294834 -16130251 -28800261 -30637286 -17735023
11592 -17735023 5063124 23928779 26472402 13148326 -1790208 -3208267 7470307
11585 7470307 11204662 -4376895 -23292268 -18408079 8768288 24643674 8489010
11578 8489010 -18164937 -22587326 -5553937 5495232 -2229926 -14518301 -14840415 -2092561
11570b092561J6401912P411743j0727129k0839635p339500J3323877P282002k0333254
11562a6912545k1719442J8967161M8956359K1544095k9109758l6908050j766705
11555a6948885J7950993j134789k0315148q314362J5161602K0077762Q471613
11548A4948786k034456n901877m983269n33789l53938j1446887k0615740q092901
11540c9014071J5912473J8310527o659986k5722090j5553219O617364J4675981
11533c1433021Q357408J638854L48548M796270J3696455J6378657L251252j1242337
11525E792086l741773J6269926J4773194r635116j8480241K291884J6202922j489440
11517B1983442k0920768j1105755N876052k453255j7924460m500793K4248378
$$ plain form
11570 -2092561 14309351 21721094 10993965 -9845670 -17185170 -3861293 3420709 -16912545
11562 -16912545 -38631987 -19664826 29291533 50835628 21725870 -15182180 -16948885
11555 -16948885 1002108 -132681 -20447829 -28762191 -13600589 6477173 14948786
11548 14948786 12914330 7012453 2029184 1495395 1141457 -10305430 -30921170 -39014071
11540 -39014071 -23101598 -4791071 -11451057 -37173147 -52726366 -46109002 -31433021
11533 -31433021 -23075613 -21436759 -21088211 -16291941 -2595486 13783171 17034423 5792086
11525 5792086 2050313 18320239 33093433 23458317 4978076 7269960 23472882 21983442
11517 21983442 1062674 -10043081 -4167029 -6620284 -24544744 -29045537 -4797159
11510d797159K5935043J649641q900806K181709J815696j9376667k7365923m454332
11502c3312798J8051075R994311j1226841j1509809Q429373K0194281J1345499
11495A1965091k875372n573525K527419R794835Q662338J356015n308953p795485
11487A2752363o599115j976611L394219l67503j7775138k9706381r930564L1728847
11479a8479883M9158113K0434926j7888141k2172465j640056O680917j23084K370912
11471A8341239J1895261K371431k1943029k5231623j23636J7429444O407017r003835
11463A42269n045368N352892L709276k437568l419417r954016k4917714k3512293
11455f0081939P249009L6042380K8840633J548204n607572J0114499J6762537
$$ plain form
11510 -4797159 21137884 22787525 13886719 16068428 17884124 -1492543 -28858466 -33312798
11502 -33312798 -15261723 -5267412 -16494253 -28004062 -19574689 619592 11965091
11495 11965091 9089719 3516194 6043613 15838448 24500786 25856801 20547848 12752363
11487 12752363 6153248 4176637 7570856 7203353 -10571785 -40278166 -50208730 -18479883
11479 -18479883 30678230 51113156 33225015 11052550 9412494 16093411 15970327 18341239
11471 18341239 30236500 32607931 10664902 -14566721 -14690357 2739087 9146104 142269
11463 142269 -4903099 449793 4159069 1721501 -1697916 -11651932 -36569646 -60081939
11455 -60081939 -52832930 -16790550 12050083 13598287 7990715 18105214 34867751
11448C4867751K754191j0495416r628847o206547p581874l735767P126389Q525429
11440A5625309m999866j2840352k47607J3772368K483147k5711552l4473990q827086
11432e5219629K3967394L0247833J0518466r005677j4048462j1821463o857524
11425c2219062P346201K4735250K0779475r635829k9821022o950642L3987132
11418H221503L9671098O640212j4200690J904517J6451829n685625l6237146k8945940
11410a2180242O061657K0053380J365280j4301040n107458J0030107J1390712
11403A7312396O180066M183000j462538j3229713j6005492k925201P567919n67660
11395A052777j4212324j2129342J350273N527427k280879l874359R438530K2600896
$$ plain form
11448 34867751 37621942 27126526 17497679 11291132 3709258 -26509 7099880 15625309
11440 15625309 10625443 -2214909 -2462516 11309852 13792999 -11918553 -46392543 -55219629
11432 -55219629 -31252235 -1004402 9514064 508387 -13540075 -25361538 -32219062
11425 -32219062 -24872861 -137611 20641864 11006035 -18814987 -25765629 8221503
11418 8221503 47892601 54532813 40332123 42236640 58688469 53002844 16765698 -12180242
11410 -12180242 -6118585 13934795 15300075 999035 -4108423 5921684 17312396
11403 17312396 23492462 27675462 26212924 12983211 -3022281 -5947482 1620437 1052777
11395 1052777 -13159547 -25288889 -23938616 -18411189 -20692068 -24566427 -15127897 7472999
11387G472999J8048377r84097j5381015j2914903o58408M492792m822929j8292126
11379b3039310k0147065p532201O886349R810637P81742q734759o088230J0917868
11371c7144969K8667708K7490596L829051k0853153k2860492n285230P454833
11364a8701656K458423q857784j2032477p064383Q84953J1786259K1988800J9898620
11356A0360755L563661r012510j955260J4566513J7672695K890191j3058695j6058502
11348H968848o562044P999195J6993442O606390k4812708n1499959m1319232K302840
11340h1323228L8650207L8833866J8247897O950895N852495n460692k7220905
11333e469465l3173420r563827K1568881L0159833J5596757J739483J580254L844637
$$ plain form
11387 7472999 25521376 24537279 9156264 -3758639 -4417047 75745 -4747184 -23039310
11379 -23039310 -43186375 -50718576 -43832227 -34021590 -33239848 -41974607 -48062837 -37144969
11371 -37144969 -8477261 19013335 22842386 1989233 -20871259 -26156489 -18701656
11364 -18701656 -16243233 -25101017 -37133494 -44197877 -43312924 -31526665 -9537865 10360755
11356 10360755 13924416 4911906 2956646 17523159 35195854 38086045 25027350 8968848
11348 8968848 2406804 10405999 27399441 34005831 9193123 -42306836 -83626068 -81323228
11340 -81323228 -42673021 -3839155 14408742 21359637 27212132 21751440 -5469465
11333 -5469465 -38642885 -48206712 -26637831 3522002 19118759 20858242 22438496 26283133
11325B6283133l726760j3466884j0457755K921409R622292L586530k093440K743217
11317A5411742Q784768L003805r221729j1507219o54749J0406843J1574135M836585
11309C2634181l640904q342403l621090Q555305J3433537K010630r696530j268582
11301C0064144J5447492R115613j8582246k7590614o490K8669899K1994040m948479
11293E4163359j6146030j0711872j0854016j4847418n115966R620555N443436
11286A1552048r568599n030395J5792436J7504328m386093j1649539J0683327
11279B4897513K4925924K133916k9295724k8157116m52673J8208235J4394697
11272B6654772k29348j5863450k5126898j6376953O570363J7849927P302488N88337
$$ plain form
11325 26283133 22556373 9089489 -1368266 1553143 11175435 14761965 12668525 15411742
11317 15411742 24196510 27200315 17978586 6471367 5816618 16223461 27797596 32634181
11309 32634181 28993277 20650874 17029784 25585089 39018626 41029256 31332726 30064144
11301 30064144 45511636 54627249 36045003 8454389 8447899 37117798 59111838 54163359
11293 54163359 38017329 27305457 16451441 1604023 -3511943 6108612 11552048
11286 11552048 1983449 -3046946 12745490 30249818 25863725 14214186 24897513
11279 24897513 49823437 51957353 22661629 -5495487 -5948160 12260075 26654772
11272 26654772 26425424 10561974 -14564924 -30941877 -24371514 -6521587 780901 1369238
11264A369238J4413136K1060647n485028l5759231k4423726J5250928K8611502
11257A5037466K655394k0547974j3856590J778030L123395r21441M216336J3374696
11249D859312J7454937J6496378P783047j1826131k7039123j8124172K829772
11242g565980M048994j3757645j7056667J730069J0729526j595620k642160K2384052
11234c725431L3259396j098303m1370688l0117402K1032853M8406364K7115394
11227E3502183n060605j2104126k431067P48628m946356r402504r450037o692627
11219D163489j296259L876889M215487J553522R15510q4734o112759j0322382
11211c091237r95555J7185968K3790959R168738j1544547j7284927o269589M481444
$$ plain form
11264 1369238 15782374 36843021 31357993 -4401238 -28824964 -13574036 15037466
11257 15037466 17692860 -2855114 -16711704 -14933674 -11810279 -12731720 -8515384 4859312
11249 4859312 22314249 38810627 46593674 34767543 7728420 -10395752 -7565980
11242 -7565980 -3516986 -17274631 -34331298 -32601229 -21871703 -23467323 -26109483 -3725431
11234 -3725431 29533965 28435662 -12935026 -43052428 -22019575 26386789 53502183
11227 53502183 48441578 36337452 33906385 34655013 29708657 20306153 10856116 4163489
11219 4163489 2867230 6744119 10959606 12513128 13428638 13343904 7231145 -3091237
11211 -3091237 -4086792 13099176 36890135 46058873 34514326 17229399 10959810 15441254
11203A5441254K189435n332495r14116J5428490K1722864M870504j4646660q712379
11195C0046897J3293389J3254169j7923309m2684395l1521819n491727j08750
11188d1135545j1343897q974075J1774522K5634556J8484886L225594m977500
11181g311459m598594J720021J1241422J4996980O031777o731459r486014m974024
11173H88650n210902q302225l762037L707266J82639r637617o732101Q621198
11165b0245129J4336471K643277p868537m604570R58226k25941M133065K2011815
11157A1138677L4277301K0558227o826608j8995208j1977367p888645j7194502
11150C091875k3466919j1355045Q967315J6737056Q902845K84357k63818k92662
$$ plain form
11203 15441254 17630689 12298194 11384078 26812568 48535432 53405936 38759276 30046897
11195 30046897 43340286 56594455 38671146 -4013249 -35535068 -41026795 -41135545
11188 -41135545 -52479442 -61453517 -49678995 -24044439 -5559553 -2333959 -7311459
11181 -7311459 -11910053 -10190032 1051390 16048370 22080147 15348688 5862674 888650
11173 888650 -4322252 -12624477 -16386514 -12679248 -12496609 -22134226 -28866327 -20245129
11165 -20245129 -5908658 -3265381 -11133918 -15738488 -14780262 -15006203 -10873138 11138677
11157 11138677 45415978 65974205 59147597 40152389 28175022 20286377 3091875
11150 3091875 -20375044 -31730089 -22762774 -6025718 2877127 3161484 2897666 2605004
11142B605004p544529j4762941j0266026K205714O939608n00851o532058o70488
11134b8526567Q699086Q187455n57488n224994o36172Q009117J4217337J3104368
11126A7272142J421956j4828937j9272789m151058J4881171J6834739M096084
11119A6253308k851355K257590K752232j2661527k8942738k3140006M232062K7573681
11111a4526753K5656884N496416p632328j933073P252449J138069j3522331j3665354
11103a1736021M815571K0150045J6493128K859540p067611j3276221j6493800
11096d255369q727056P538440J1858318l169433j4017424j731255J5470847J1811612
11088A4778680m076773q491815n231059j1525105j7127379p85224K2355344J7274142
$$ plain form
11142 2605004 -4939525 -19702466 -29968492 -27762778 -20823170 -21324021 -27856079 -28526567
11134 -28526567 -19827481 -11640026 -12197514 -17422508 -18058680 -10049563 4167774 17272142
11126 17272142 18694098 3865161 -15407628 -19558686 -4677515 12157224 16253308
11119 16253308 13401953 15659543 18411775 5750248 -23192490 -46332496 -42100434 -14526753
11111 -14526753 11130131 16626547 8994219 7061146 14313595 15451664 1929333 -11736021
11103 -11736021 -6920450 13229595 29722723 32582263 25514652 12238431 -4255369
11096 -4255369 -12982425 -5443985 6414333 3244900 -10772524 -12503779 2967068 14778680
11088 14778680 10701907 2210092 -3020967 -14546072 -31673451 -32458675 -10103331 7170811
11080G170811r992238j7137335N505163K1264477J1644578K702988J0011222R229409
11072D0399075j2134110k2477809m35821K1514838Q818373j6082760j2198487
11065G403299J1653747J6462180J6289p076380J93872j813658j4653326j4178712
11057a992689m08814k465627k3023669k3896762J2233927M4779516K9474712j6971810
11049A7728784l8703040j3513093K5297813L5925362J3255040j6241501k8072627
11042d323262j9451828k679930J1018726J7425254J4199425M76324j4713175j4826434
11034a2874900K636361J5486191L173286k0892458k2398162O737610L3585597
11027E453525K5562829q179526k9751651j8366075J0383325K7876622K2333592
$$ plain form
11080 7170811 -2821427 -19958762 -14453599 6810878 18455456 21158444 31169666 40399075
11072 40399075 28264965 5787156 5351335 26866173 35684546 19601786 7403299
11065 7403299 19057046 35519226 35535515 28459135 28653007 26839349 12186023 -1992689
11057 -1992689 -2401503 -4867130 -27890799 -51787561 -39553634 5225882 34700594 17728784
11049 17728784 -20974256 -34487349 -9189536 26735826 39990866 23749365 -4323262
11042 -4323262 -23775090 -26455020 -15436294 1988960 16188385 16664709 1951534 -12874900
11034 -12874900 -10238539 5247652 8420938 -12471520 -34869682 -28132072 5453525
11027 5453525 31016354 22836828 -6914823 -25280898 -14897573 12979049 35312641
11020C5312641L078165j5101620k4183840k2662514j2001510K195856J0265106
11013b3097716P342983J599003N670952J8164637K2503060Q876329j1352387k0719748
11005H987113j7519354j2496957r769033m276665L819852O706565L745218N680354
10997a5122907J7180178K5515864J6677023l463364j5330987j0568859O33477
10990A5520425P444862J0609651J1561730L233725j5211176k4823562q038585
10983B97070J9778492K3624813j541288j9791657o344178J4324469O749480j8779325
10975A8317876k1553624N995200K7104635J6403862p057148j3974195l827317
10968B1409289N720511O136573j223188j3352336k0331300r512547J1696394J6624288
$$ plain form
11020 35312641 38390806 23289186 -894654 -23557168 -35558678 -33362822 -23097716
11013 -23097716 -15754733 -14155730 -8484778 9679859 32182919 41059248 29706861 8987113
11005 8987113 -8532241 -21029198 -30798231 -35074896 -31255044 -24548479 -20803261 -15122907
10997 -15122907 2057271 27573135 44250158 40786794 25455807 14886948 15520425
10990 15520425 22965287 33574938 45136668 48370393 33159217 8335655 297070
10983 297070 20075562 43700375 42159087 22367430 16023252 30347721 37097201 18317876
10975 18317876 -3235748 2759452 29864087 46267949 39210801 25236606 21409289
10968 21409289 27129800 33266373 32043185 18690849 -1640451 -11152998 543396 17167684
10960A7167684k186370j6690195m657143J4684538J1806863n573796q036092N265465
10952A1780954P729352p413313j6817633q043642K088274L88100o35164J0702796
10944b20276K0783718J3047168k308690l430726Q278745J0935849k993404j5711654
10936B8380730j1922841p3086L921589J253838L737234R140553J606631k0324214
10928A5720434l3801064k0991108M651458J6651717J0675434L329375K659586
10921a104168J933134K96481M714064R018230k370308k2838146k3878653L04129
10913c3925237J7144701L967504j5621710j0094552R268313R668274q177317j4332655
10905d2102679q18367R915440P105494N339249J0386815O406500j0062013j4250429
$$ plain form
10960 17167684 14981314 -1708881 -6366024 8318514 20125377 14551581 6515489 11780954
10952 11780954 19510306 12096993 -4720640 -12764282 -10676008 -10287908 -10923072 -220276
10944 -220276 20563442 33610610 31301920 27871194 36149939 47085788 44092384 28380730
10936 28380730 16457889 16384803 20306392 21560230 25297464 34438017 36044648 15720434
10928 15720434 -18080630 -39071738 -34420280 -17768563 -7093129 -3763754 -1104168
10921 -1104168 828966 1125447 5839511 14857741 12487433 -10350713 -34229366 -33925237
10913 -33925237 -16780536 -12813032 -28434742 -38529294 -29260981 -19592707 -27770024 -42102679
10905 -42102679 -42921046 -33005606 -25900112 -20560863 -10174048 -3767548 -13829561 -28079990
10897b8079990R230332L5715421K9945472o516826l6933270l2660747r12282K7295520
10889b916370K7460908K377715k1580385k1059347O6305J7635534J6894463N861697
10881B4740520j617634m259594q778406j5050719j4036971J31564J9002302K3640973
10873B3772035N037112j9511180k1665826J397316K0152123J2687360n477109
10866A6391831q979040k359565n238089j1302000J977032K6833356K8532276J795640
10858D7651441j5785274k684486J1809569k622732k5417251j8435764J1124842
10851E640345K2185272M623958q706559K288853J4712725K560240k1748393k7304862
10843e748421r154164R867426J3963381R390004M514464n300557k3618289l6823084
$$ plain form
10897 -28079990 -18849658 16865763 46811235 40294409 3361139 -29299608 -30211890 -2916370
10889 -2916370 24544538 26922253 5341868 -15717479 -15651174 1984360 18878823 24740520
10881 24740520 23122886 18863292 10084886 -4965833 -19002804 -18871240 131062 23772035
10873 23772035 28809147 9297967 -12367859 -10970543 9181580 21868940 16391831
10866 16391831 7412791 5053226 -184863 -11486863 -9509831 17323525 45855801 47651441
10858 47651441 31866167 29181681 40991250 38368518 12951267 -5484497 5640345
10851 5640345 27825617 32449575 23743016 26031869 40744594 43304834 21556441 -5748421
10843 -5748421 -14902585 -5035159 8928222 18318226 22832690 17532133 -6086156 -42909240
10835d2909240k6994726K363259K6719958K8538053J4231232k0690p666795j0033112
10827a5772061o643940R77480L845322k915409q866496k665504P670899N860994
10819a8508715m541102l504196J2524022K2759315J4363996J753571R45230K826774
10811B8618895r534525k8974976l1051492r090589J6495002K5483433J9270504
10804A1216252J0870232O048491J871426l761156r483591j4275879j7333329j5198138
10796c0045692m921613Q856236J5112405Q212694m441884j0557587o960936j108793
10788b5855170K7477k877514n347693m626532p71652L105075K367801k335405
10780c6313613k795102M688224R988772M141143j916374P603693K2567697J7027543
$$ plain form
10835 -42909240 -69903966 -67540707 -40820749 -12282696 1948536 1927846 -5738949 -15772061
10827 -15772061 -22416001 -21438521 -17593199 -20508608 -29375104 -32040608 -24369709 -18508715
10819 -18508715 -23049817 -26554013 -14029991 8729324 23093320 24846891 25792121 28618895
10811 28618895 19084370 -9890606 -40942098 -50032687 -33537685 -8054252 11216252
10804 11216252 22086484 28134975 30006401 26245245 16761654 2485775 -14847554 -30045692
10796 -30045692 -34967305 -26111069 -10998664 -2785970 -7227854 -17785441 -24746377 -25855170
10788 -25855170 -25827693 -28705207 -34052900 -38679432 -39451084 -36346009 -33978208 -36313613
10780 -36313613 -39108715 -34420491 -24431719 -20290576 -22206950 -14603257 7964440 24991983
10772B4991983o420338j3062776J0238653K9318623J3504388j6254786k1297617
10765B1018130m772308K67305j2254522j7312440o340641Q56330n575129j0451292
10757c4564567l506777N468785Q635465J0862810J2448490N933969m848478o389909
10749e960212R11874M851574O653208J6106316K3178769Q590108j6255647j8661822
10741A9414168R83502O740152j1018958j7874459K583938J7186720J416832j6487758
10733B944137o063126J1420613K957611j6172069j1160150R097611R012764j0046534
10725h009143j4281873K954129J4480816R233610L832447L549845n494216k0532517
10717a4266902j8411676M023305K0788268J6881801N950222L5222o875126j5764597
$$ plain form
10772 24991983 18571645 5508869 15747522 45066145 58570533 42315747 21018130
10765 21018130 16245822 16513127 4258605 -13053835 -19394476 -18538146 -24113275 -34564567
10757 -34564567 -38071344 -32602559 -23967094 -13104284 -655794 5278175 429697 -5960212
10749 -5960212 -5048338 -196764 6456444 22562760 45741529 54331637 38075990 19414168
10741 19414168 20397670 27137822 16118864 -1755595 828343 18015063 19431895 2944137
10733 2944137 -3118989 8301624 11259235 -4912834 -16072984 -6975373 2037391 -8009143
10725 -8009143 -22291016 -19336887 -4856071 4377539 8209986 11759831 6265615 -14266902
10717 -14266902 -32678578 -28655273 -7867005 9014796 14965018 15000240 8125114 -7639483
10709g639483j3490289J746006J2855560J1934654R484539P406982o926550k8304011
10701a2932592k8319542l67418K1254432J0765308q737213l145070J8318845K1565982
10693A8402732M727325k110587R874494J3060634j0323729l6716995l2648752
10686c5734878K32416K8824865K9048476Q384084j0062177j4740608j2375335
10679f423157j2347177j2771589p169687J49489k751703j4623425j6362460L660746
10671f8638963K9705637L7141919K4091502R180127J642166p188540k0409436
10664E524412k4025282r267287R575126J4033072O786383K680513M065796L517001
10656A2889734M210394J5364142K8986662K4801985K032501j6673913j9489334
$$ plain form
10709 -7639483 -21129772 -19383766 -6528206 5406448 14890987 22297969 15371419 -12932592
10701 -12932592 -41252134 -41619552 -20365120 -9599812 -18337025 -21482095 -3163250 18402732
10693 18402732 23130057 21019470 30893964 43954598 33630869 -3086126 -35734878
10686 -35734878 -35502462 -6677597 22370879 30754963 20692786 5952178 -6423157
10679 -6423157 -18770334 -31541923 -38711610 -38562121 -41313824 -55937249 -72299709 -68638963
10671 -68638963 -38933326 -1791407 22300095 31480222 33122388 25933848 5524412
10664 5524412 -18500870 -27768157 -18193031 -4159959 2626424 5306937 9372733 12889734
10656 12889734 17100128 32464270 61450932 86252917 88285418 71611505 52122171
10649E2122171j9271946k2956939j4343387J3520466L3793018K0745607r161230
10642E4447760k0988345j2244668p728872j3340853j0981858L227151J1326599
10635C716914P228121N310910R816965O785510o194881j2218809n599847j251345
10627G593538n114045m841008J387029j317257j1661389p642584J1809833J7546317
10619G760434N6292j0143941M997565J7860471M455539j1379521m71272J9038570
10611C2174137J4502134m220217p023533L64548p946623k3726059j7920852K373694
10603a1422771K855619j5761834j6469491R546799K6627948J3676134m476636
10596D575768q44632J4518961J6785266O50342k1623890l4838775k6078549L151542
$$ plain form
10649 52122171 32850225 9893286 -4450101 9070365 42863383 63608990 54447760
10642 54447760 33459415 21214747 13485875 145022 -10836836 -7609685 3716914
10635 3716914 10945035 16255945 26072910 32858420 26663539 14444730 8844883 7593538
10627 7593538 2479493 -2361515 -974486 -2291743 -13953132 -21595716 -9785883 7760434
10619 7760434 7816726 -2327215 2670350 20530821 24986360 13606839 13135567 32174137
10611 32174137 46676271 42456054 35432521 35797069 27850446 4124387 -13796465 -11422771
10603 -11422771 -8567152 -24328986 -40798477 -31251678 -4623730 9052404 4575768
10596 4575768 3731136 18250097 35035363 35685705 14061815 -20776960 -46855509 -43703967
10588d3703967K7102758K1521146j008247p966054L640935P590001k703287m777183
10580c03898P427395R511125q287342k0032570p239941J0446016R565511j268975
10572a82679k901393J961298J216402k807591l825267o816003j2361118n160726
10564c0877077J9498596L5557617J7961191j7415130l0940092j0430893J6934453
10557B88665K2373631O850232q143509q742178j354682J4198n649998n492665
10549A43694M433054P502936r024196k8362683k4142875o53242J1823983K325756
10541c5953573o095302O508580K8266702L4506125J8624662n200053j7776443
10534B2880698q950412J2330362K1914542P366914j3136348j5093609l408459
$$ plain form
10588 -43703967 -16601209 4919937 3911690 -4054364 -413429 7176572 4473285 -303898
10580 -303898 7123497 16634622 8347280 -11685290 -18925231 -8479215 1086296 -182679
10572 -182679 -3084072 -1122774 93628 -2713963 -6539230 -13355233 -25716351 -30877077
10564 -30877077 -11378481 24179136 42140327 24725197 -6214895 -16645788 288665
10557 288665 22662296 29512528 21369019 12626841 11272159 11286357 5636359 143694
10549 143694 4576748 12079684 3055488 -25307195 -49450070 -50103312 -38279329 -35953573
10541 -35953573 -42048875 -35540295 -7273593 27232532 45857194 40657141 22880698
10534 22880698 13930286 26260648 48175190 55542104 42405756 27312147 23903688
10527B3903688j556317j1861776j4155614j549975J0547214J1298645M556060
10520B1181925o102737j6929975j4372301N260334J5508896n871748l2170991
10513c3496597j9935194K1201984L9582087J9856954k243020m984313m434378
10506A5547523o968998L660673K0811747J4953927q533419j1778474M577298N74565
10498C2844842k0891949j0823044K7346746K7205470k0366206l7211623L882052
10491A986288K2485622j5950775r856575J03272904J89579043R0651387j16143555
10484B66024339k01187685j00476432K0830368L0086045j4476853j1919156K2911335
10477A1791961K7018981N939811k426575n314289k1703088k8914079o286816J5903700
$$ plain form
10527 23903688 22347371 10485595 -3670019 -5219994 5327220 16625865 21181925
10520 21181925 15079188 -1850787 -16223088 -10962754 4546142 -1325606 -33496597
10513 -33496597 -53431791 -32229807 7352280 27209234 24966214 19981901 15547523
10506 15547523 8578525 12239198 33050945 48004872 39471453 27692979 32270277 32844842
10498 32844842 11952893 1129849 28476595 55682065 35315859 -1895764 1986288
10491 1986288 24471910 8521135 -1335440 101937464 291516507 382167894 266024339
10484 266024339 64836654 -35639778 -14809410 15276635 799782 -11119374 11791961
10477 11791961 38810942 44750753 42324178 37009889 15306801 -13607278 -19894094 -3990394
10469c990394O083002j3256976p898351J1398257J8129627J6254879J6881563
10462D3601607Q204936j3035551j9688769o27897J1645362l670731j5941990J897767
10454A2384734K2714480J3640751o902909q075356k583337j3017151j9925249
10447a764037R52144K2637023P553287k2528977j8759327J2584654K2633649J891627
10439B5200043j2194174m236629J852930m047645l122731P634389N347984j3306597
10431C127570k0191140j984319J8589235J9803603P484770m765980j2656301j1477561
10423b070123K503685J5319199P421621j3494847j9735911o355583L616474L36704
10415a2458781M16574J1048543J4247382P73954r763951m31180J4952071J3663647
$$ plain form
10469 -3990394 2092608 -11164368 -19062719 -7664462 10465165 26720044 43601607
10462 43601607 51806543 38770992 19082223 18454326 30099688 26428957 10486967 12384734
10454 12384734 35099214 48739965 41837056 33761700 31178363 18161212 -1764037
10447 -1764037 -811893 21825130 29378417 6849440 -11909887 674767 23308416 25200043
10439 25200043 13005869 8769240 10622170 6574525 3451794 11086183 16434167 3127570
10431 3127570 -17063570 -19047889 -458654 19344949 26829719 22063739 9407438 -2070123
10423 -2070123 433562 15752761 23174382 9679535 -10056376 -16411959 -12795485 -12458781
10415 -12458781 -12042207 -993664 13253718 14027672 4263721 3832541 18784612 32448259
10407C2448259l384856j7219672j6187013l502524J0273584J4323267O437805
10400B3188850k126937j047040K133054m996175j4382712q191594O695292L397939
10392D670677k0278684l1465491r728580K0664762K3975434n90616k3942156k4814774
10384f1509428o356190J4727372K2942029J6169445J0177089K0057948L3971194
10377E0179459K3755606j1588823l5903588k3410854N210261J3892576M61480
10370B2596117q971562k575736O462146P301011N540258P840769J0398543P330123
10362E5921669o40438q505972j1031432n727330K360747L490083k599895k906641
10354C0360791R296961J9957742J2158368q582277k1744338j9439330j0761797
$$ plain form
10407 32448259 29063403 11843731 -4343282 -7845806 2427778 16751045 23188850
10400 23188850 21061913 20014873 22147927 17151752 2769040 -5422554 1272738 4670677
10392 4670677 -15608007 -47073498 -56802078 -36137316 -12161882 -12752498 -36694654 -61509428
10384 -61509428 -67865618 -53138246 -30196217 -14026772 -3849683 16208265 50179459
10377 50179459 73935065 62346242 26442654 3031800 8242061 22134637 22596117
10370 22596117 13624555 11048819 17510965 24811976 30352234 38193003 48591546 55921669
10362 55921669 55281231 46775259 35743827 30016497 32377244 35867327 33267432 30360791
10354 30360791 39657752 59615494 71773862 63191585 41447247 22007917 11246120
10347A1246120k035971R346194K0572135K0289589N386703j1827645j9008407
10340C3968718j6822121j2372375q555486m646623o97476K386893K860872j627285
10332e504883q579444q826402J077585Q760202R33976j4490230j7156480m892727
10324d8678403L050252k820120p860573Q23846J2984991J3489995O376775M264826
10316a8368411N959412K629256k318898J909567J3567533K0180826J7537304J2024975
10308E3121564O563421j736550j1908461j9705543k4935652k6952468j8943478
10301d4497167k7439J4937808J4051679Q106204J1944755J6130494L177951j5961195
10293G863090j4073686O104473J3813726J519148m624106N022672M456861j8378268
$$ plain form
10347 11246120 9210149 18556343 39128478 59418067 64804770 52977125 33968718
10340 33968718 17146597 4774222 -3781264 -8427887 -9125363 -6738470 -3877598 -5504883
10332 -5504883 -14084327 -22910729 -21833144 -13072942 -12138966 -26629196 -43785676 -48678403
10324 -48678403 -45628151 -48448271 -56308844 -55484998 -42500007 -29010012 -22633237 -18368411
10316 -18368411 -12408999 -9779743 -12098641 -10189074 3378459 23559285 41096589 53121564
10308 53121564 59684985 57948435 46039974 26334431 1398779 -25553689 -44497167
10301 -44497167 -44524606 -29586798 -15535119 -7428915 4515840 20646334 23824285 7863090
10293 7863090 -6210596 -106123 13707603 15226751 10602645 15625317 20082178 1703910
10285A703910l3462867j7504430N405522N334668l357067P451604K5720706K0285472
10277A1577518k919822j1532403j773134K356553k656834K216761J5231705J3517643
10269B6017987k428472p448178J067186j690255j8597490k0977229l26502J3914993
10261a0467960M881146m993198K143494Q729585j199496j1185586n618756j19578
10253a7830349r616559j7000134m483193J1934933J1405200N500610J2909105
10246g180387K0960692Q640754j2134178j5264961m201744r50152n722940l059515
10238a8912431M809085N860784O687510J7270513K1062383n09780k6139427k0639258
10230a0510621O330892J4300401p13657m119988J1154029J1698470j1861259k1957235
$$ plain form
10285 1703910 -31758957 -49263387 -43857865 -38523197 -41880264 -34428660 -8707954 11577518
10277 11577518 8657696 -2874707 -4647841 -2291288 -4948122 -2731361 12500344 26017987
10269 26017987 23589515 16141337 17208523 15518268 -3079222 -24056451 -24382953 -10467960
10261 -10467960 -5586814 -10580012 -8436518 293067 -906429 -12092015 -17710771 -17830349
10253 -17830349 -27446908 -44447042 -48930235 -36995302 -25590102 -20089492 -7180387
10246 -7180387 13780305 22421059 10286881 -4978080 -9179824 -10129976 -15852916 -18912431
10238 -18912431 -14103346 -8242562 -1555052 15715461 36777844 36268064 10128637 -10510621
10230 -10510621 -4179729 10120672 9407015 5287027 16441056 28139526 16278267 -5678968
10222e678968J913612K5184249J4393242j0114430j2504509J852713O051484P59909
10214B1857302L265444P003376o538136k6593132k3719706J763904J7955706R825185
10206D819943k796797j807784L575121r38535j0246500j2182033p811075m928310
10198c2315970k949748J878962M665546n08100n963968J738863J9249098K5832796
10190A1627479J0798241r875690j3874867j504469Q316545O378745J743820K055493
10182A5665297L019567K417646O009813J0193585q30849k4847476k9925058J618826
10174a6678649L5036951K3782023k0579071m0102681j4122446J3200838M518236
10167a4944799j4815766l971028K3955845K3750976p361044k4005494k337554
$$ plain form
10222 -5678968 -3765356 21418893 35812135 25697705 13193196 15045909 21097393 21857302
10214 21857302 25122746 32126122 25587986 -1005146 -24724852 -22960948 -5005242 4819943
10206 4819943 2023146 215362 3790483 2851948 -7394552 -19576585 -27387660 -32315970
10198 -32315970 -35265718 -33386756 -28721210 -29229310 -35193278 -33454415 -14205317 11627479
10190 11627479 22425720 12550030 -1324837 -2829306 5487239 11865984 13609804 15665297
10182 15665297 18684864 21102510 27112323 37305908 36475059 11627583 -18297475 -16678649
10174 -16678649 18358302 42140325 21561254 -18541427 -32663873 -19463035 -14944799
10167 -14944799 -29760565 -33731593 -9775748 13975228 6614184 -17391310 -19728864
10160a9728864K5922159K2499575n892445k5002054k0579325n922025N648037
10153b3054942J2895267J4867560P136198o505016j2602644m532172Q181557J2397157
10145H782965O730645n18361l219800j912214p00377m032825j2023072j5590921
10137b2483960l880274J7840723K7844338J5655452q23235j333164M552784n441276
10129C1931388k4101285k1312697M557784J7032005k670124k3708757j3739122
10122c2010808R660727Q753714j3115611j8796311K192602J8848749Q072636j2482055
10114b8876357j1952664J3316425L7408038L3312311Q29936k9034283k4423405
10107i419999O633878K1924234K724013j8768412j1705844K655250r841591l0823861
$$ plain form
10160 -19728864 6193295 28692870 22800425 -2201629 -22780954 -28702979 -23054942
10153 -23054942 -10159675 4707885 11844083 5339067 -7263577 -11795749 -3614192 8782965
10145 8782965 15513610 14995249 11775449 9863235 9162858 5130033 -6893039 -22483960
10137 -22483960 -26364234 -8523511 19320827 34976279 34153044 32819880 37372664 31931388
10129 31931388 7830103 -13482594 -8924810 8107195 5437071 -18271686 -32010808
10122 -32010808 -22350081 -13596367 -26711978 -45508289 -43315687 -24466938 -16394302 -28876357
10114 -28876357 -40829021 -27512596 9895442 43207753 44037689 15003406 -9419999
10107 -9419999 -2786121 19138113 21862126 3093714 -8612130 -5956880 -15798471 -46622332
10099d6622332j5244182K8795688M4364659J2854881k0019563j8300367j654124
10092a5825340L640468P798108K1725751K3754826r64433k4125179j5534083Q449912
10084H920030J4673013N549634L890336P249436l112566k2265990k7168876j3391843
10076b5656826L063519J1552853J0599530p31812j3061361o465907J6486794K0810571
10068A6597361r008823l3612248j2976263K7976935L3947792K352319j8990394
10061F286679q831277N384986L388736n40452M065849K893918j0277097j6732872
10053a4361530n510481P677600R155109P382848J0333503Q521621m334060j5498150
10045C366460j2499036j078910O929173Q613615N794102K28856l172639k034068
$$ plain form
10099 -46622332 -61866514 -33070826 11293833 24148714 4129151 -14171216 -15825340
10092 -15825340 -12184872 -4386764 17338987 41093813 40129380 16004201 470118 8920030
10084 8920030 23593043 29142677 33033013 40282449 37169883 14903893 -12264983 -25656826
10076 -25656826 -22593307 -11040454 -440924 -1172736 -14234097 -20700004 -4213210 16597361
10068 16597361 7588538 -26023710 -38999973 -11023038 22924754 25277073 6286679
10061 6286679 -2544598 2840388 6229124 5688672 9754521 12648439 2371342 -14361530
10053 -14361530 -19872011 -12194411 -3039302 4343546 14677049 23198670 18864610 3366460
10045 3366460 -9132576 -10211486 -3282313 5331302 11125404 11354260 8181621 6147553
10037F147553m060709j3079574j4099178N570198K7849127K4825007K496702q760428
10029B6888698l344434k774812j0029519m498303J1918958R761204j3274067j8718812
10021d071087R751019L3507557J8272991j2922986k1123751j1860159j3165907
10014a612323j9333890l055554K9220191L8852539J2020935k0157683k4875668
10007A1058547o033539Q463047K077910j4846490j9317823l879238J1833283O798922
9999c845381q294866m080893K0615116L2613667J3770993j3019337k2008076j8784022
9991c032799j6263536o969846J3491546K2583968L435217k0038564j5176909R145338
9983a2825585J9262342R482267J297835L57263o929289j8100299j4052807M225891
$$ plain form
10037 6147553 2086844 -10992730 -25091908 -19521710 8327417 33152424 35649126 26888698
10029 26888698 23544264 20769452 10739933 6241630 18160588 27921792 14647725 -4071087
10021 -4071087 5679932 39187489 57460480 44537494 23413743 11553584 -1612323
10014 -1612323 -20946213 -24001767 5218424 44070963 56091898 35934215 11058547
10007 11058547 5025008 13488055 15565965 719475 -18598348 -22477586 -10644303 -3845381
9999 -3845381 -12140247 -16221140 4393976 37007643 50778636 37759299 15751223 -3032799
9991 -3032799 -19296335 -26266181 -12774635 9809333 13244550 -6794014 -21970923 -12825585
9983 -12825585 6436757 15919024 17216859 17574122 10644833 -7455466 -21508273 -17282382
9975a7282382J2353108J617687q279863l090823N276570J622498r524510j4076526
9967c1384241p769486K120807O270790K335676j097335N256736J3824396P021316
9959c421341j1306745j3101819J0501867K8445358J5783837n399045k846214J2050176
9951C0706074P406458j0883831j0839355O197560P472341j2007476k1300620r103056
9943a2351905l94118p657018r915714N044943J8075596J5402524J1355314J6174325
9935C5733947J4830060k511554j8759712j7671858p238747M46419O985332J2157244
9927B3971131P676774j614780Q19046R932611L73720k6363165l3241799m384270
9919b2830732K6520283K7085854J0191662J749637j257927j1342364j9536846
$$ plain form
9975 -17282382 -4929274 -3311587 -11591450 -14682273 -9405703 -7783205 -17307715 -31384241
9967 -31384241 -39153727 -37032920 -30762130 -28426454 -29523789 -24267053 -10442657 -3421341
9959 -3421341 -14728086 -27829905 -17328038 11117320 26901157 21502112 18655898 30706074
9951 30706074 38112532 27228701 16389346 22586906 30059247 18051771 -3248849 -12351905
9943 -12351905 -12746023 -20403041 -30318755 -25273812 -7198216 8204308 19559622 35733947
9935 35733947 50564007 48052453 29292741 11620883 4382136 4828555 11813887 23971131
9927 23971131 31647905 30033125 30852171 40784782 41158502 14795337 -18446462 -22830732
9919 -22830732 3689551 30775405 40967067 42716704 41458777 30116413 10579567
9912A0579567j4406853o380766n865794k607416Q699182J1206311q37450m332851
9904c946070R923911J3303725r448124k4078364j845790K7023227K1234485m763858
9896B7403142j2369390m743100o124798o021736J4844210L0317707P883586k1093622
9888C0095999l918177L8238077L8859236N40049p586089L0004061N0334780K4594889
9880B01162825J910726P697791r024433p4445881j19285122p9172550j495714
9873g2652358K4611543k203034j4487230Q245035K2806926P348069r588909n647554
9865d1567512P637660J7799925K5427224K3235702K620680j8565958j3548259
9858C039462Q851205J4795707j018055j0975177l787512J567143m442538o461064
$$ plain form
9912 10579567 -3827286 -10208052 -16073846 -18681262 -9982080 1224231 386781 -3946070
9904 -3946070 5977841 19281566 9833442 -14244922 -16090712 10932515 32167000 27403142
9896 27403142 15033752 10290652 4165854 -1855882 12988328 43306035 51189621 30095999
9888 30095999 26177822 64415899 103275135 103815184 96229095 126233156 176567936 201162825
9880 201162825 203073551 210771342 201746909 127301028 8015906 -71156644 -72652358
9873 -72652358 -48040815 -50243849 -64731079 -56486044 -33679118 -26331049 -35919958 -41567512
9865 -41567512 -33929852 -16129927 9297297 32532999 35153679 16587721 3039462
9858 3039462 11890667 26686374 25668319 14693142 10905630 12472773 8030235 1569171
9850A569171K603344P034742j989804j1427122j1776416j1163650j4095556j0790042
9842e0035333K004956J1496749R451677K796672k677825q917802j1074995R87617
9834d5968284K0269886K4819362J0340942k084346L46811M272362k896911j1516270
9826b416448r800644m334072l800901r22887J0678001J7548251N545466j2963361
9818d66595j2857157P241156K1310580R909318j5350770k5051354m328847K9318441
9810I724772M0876545J4819267k4319818l7738800j8024406M844113N449624o835217
9802a1203920q800862J733000P625116k37905j2778162j6513191o563660J1397897
9794c5341687K4131763J9430652q55784j9538022k1320430p630546Q862040J7571623
$$ plain form
9850 1569171 4172515 11207257 9217453 -2209669 -13986085 -25149735 -39245291 -50035333
9842 -50035333 -48030377 -36533628 -27081951 -24285279 -26963104 -35880906 -46955901 -45968284
9834 -45968284 -25698398 -879036 9461906 7377560 7724371 11996733 9099822 -2416448
9826 -2416448 -12217092 -16551164 -20352065 -21274952 -10596951 6951300 12496766 -466595
9818 -466595 -13323752 -6082596 15227984 25137302 9786532 -15264822 -19593669 9724772
9810 9724772 50601317 65420584 41100766 3361966 -14662440 -9818327 -4368703 -11203920
9802 -11203920 -20004782 -18271782 -10646666 -10884571 -23662733 -40175924 -46739584 -35341687
9794 -35341687 -11209924 8220728 7364944 -12173078 -33493508 -41124054 -32262014 -14690391
9786a4690391J4006574m7628j3537891j2357670K955454J3698339O247757q961014
9778a2686470j2343238k303317N316509J557844m849295k064754R148082J7637043
9770e87596J5106085M900580j740088R11834N148237Q43092p306861m278425J1482445
9761B4479303K1637768J1891443r254177k3698916k4349714j3914051L486615
9754i721729J7541021J2886488q278782j7740583L492882L2217519L0894726J466238
9746F2757780j8834554j4077753p523007j5308067j8658629k467839J0140856
9739c971213p007998l4750723l1936944K621418K8367571K2624672O526610L704717
9731a3821890O418467l40204q328055k835298R053881J1651201Q736281J2996619
$$ plain form
9786 -14690391 -683817 -731445 -14269336 -26627006 -23671552 -9973213 -3725456 -12686470
9778 -12686470 -25029708 -27333025 -22016516 -20458672 -25307967 -27372721 -18224639 -587596
9770 -587596 14518489 19419069 17678981 18590815 23739052 24582144 17275283 12996858 24479303
9761 24479303 46117071 58008514 48754337 25055421 705707 -13208344 -9721729
9754 -9721729 7819292 20705780 12426998 -5313585 -1820703 30396816 61291542 62757780
9746 62757780 43923226 29845473 22322466 7014399 -11644230 -14112069 -3971213
9739 -3971213 -10979211 -45729934 -77666878 -75045460 -46677889 -24053217 -17526607 -13821890
9731 -13821890 -7403423 -7743627 -16071682 -18906980 -9853099 1798102 10534383 23531002
9723B3531002J6973686K691531k3046246l1803819j5160876L647811O935404N132665
9715a1098842J0185030J2091154J006805q697962p89147J1928780O390443j0500528
9707A0515733j0039082J1581678K3948619O727023k0761115k6735326p417080
9700a2179550J3132743J4498334K95240r539630j877497J3013374J1388148j1940884
9692A6790278l0295471j8237299R770795J6265920n431157k1408546p772712J6276119
9684b4042073K1019889Q317141j41191P26239n81891n521312l413984O743358
9676C106176J2690725P792999j741712q555445j0148659m579067O871223J3946175
9668A9382415P199235p189234j4609375j2559480j0382486r564359r40522J5088779
$$ plain form
9723 23531002 40504688 43196219 20149973 -11653846 -26814722 -23166911 -16231507 -11098842
9715 -11098842 -913812 11177342 12184147 3486185 2697038 14625818 21016261 10515733
9707 10515733 476651 12058329 36006948 42733971 21972856 -4762470 -12179550
9700 -12179550 953193 15451527 15746767 6207137 4329640 17343014 28731162 16790278
9692 16790278 -13505193 -31742492 -21971697 -5705777 -11136934 -32545480 -40318192 -24042073
9684 -24042073 -3022184 5294957 5153766 5880005 5298114 -223198 -3637182 3106176
9676 3106176 15796901 23589900 21848188 13292743 3144084 -1434983 5436240 19382415
9668 19382415 26581650 19392416 4783041 -7776439 -18158925 -27723284 -28663806 -13575027
9660a3575027K2259950J1154310m613577o497109L123157O215995l479183j2095626
9652B492890p179090M417033Q778347P293140J2733761K3674021K0230053n170151
9644F7270004k8114770k1698080L567582J2953077k250305j5291586r402776k216442
9636D816704r781428j5255212N93801J9757442J1264534j6738975k4895713j141932
9628c1380779K2318426J7369617l730829j3492311q011075l348243o676160q090877
9620c5042231K547387K0343685K7297783R798518k2084038l8165439k1055121
9613e6359456R921992K1876232J0403168k52467L759195J0226748P317086J285098
9605H177596q49057l871528q183030k567706J2334158J4083648r011888l3028284
$$ plain form
9660 -13575027 8684923 19839233 15225656 8728547 11851704 18067699 14588516 2492890
9652 2492890 -4686200 -269167 8509180 15802320 28536081 52210102 72440155 67270004
9644 67270004 39155234 17457154 21024736 33977813 31727508 16435922 7033146 4816704
9636 4816704 -4964724 -20219936 -19626135 131307 11395841 -5343134 -30238847 -31380779
9628 -31380779 -9062353 8307264 4576435 -8915876 -16926951 -20275194 -26951354 -35042231
9620 -35042231 -32494844 -12151159 15146624 24945142 2861104 -35304335 -56359456
9613 -56359456 -46437464 -24561232 -14158064 -14410531 -10651336 -424588 6892498 8177596
9605 8177596 7328539 3457011 -4726019 -7293725 5040433 19124081 10112193 -22916091
9597b2916091k8547316k543803J3673674Q965768n86477l922797o964026j0412953
9589e3254021j674813K1044333L6158266K4363897m200300k1261812j3399754
9582a2224204O158009J6202806J0062803j618559o342282m012908l338048o250652
9574a363035m182924O180339J2708172L795500j1210599j1447213O094534K0530251
9566B1105025J4445230m336038j5181467j0323140L1213L165148l358022j2406726
9558f858777j5173933r069024p64294L58618n952403q649394J442616J8802918
9550b5863673K7799547J9357134J92972j3939013j2439642J166706J2490678J0083802
9542A8848511k499959j0740547o435915L215963O462164J531779m855525q161114
$$ plain form
9597 -22916091 -51463407 -54007210 -40333536 -31367768 -31954245 -35877042 -42841068 -53254021
9589 -53254021 -54928834 -33884501 2273765 26637662 22437362 1175550 -12224204
9582 -12224204 -6066195 10136611 20199414 18580855 12238573 8225665 4887617 -1363035
9574 -1363035 -5545959 634380 13342552 17138052 5927453 -5519760 574774 21105025
9566 21105025 35550255 31214217 16032750 5709610 5740823 8905971 5547949 -6858777
9558 -6858777 -22032710 -31101734 -31866028 -31507410 -37459813 -46109207 -44666591 -25863673
9550 -25863673 1935874 21293008 21485980 7546967 -4892675 -3725969 8764709 18848511
9542 18848511 16348552 5608005 -827910 2388053 8850217 10381996 5526471 -2634643
9534b634643p342068l237J2863478J9505597Q251662j2752731k1006101r750520
9526a2868563K346064J15784n397941K183778J4566295J0415980r861449k2858905
9518b1358957j4710957M323449J8211022J9885829P507153j4195351k7342733
9511b7680545j6821322M592110J0001125J76268L032000K3956462L0950313O921544
9503C5127955j7579047j1713058N685942n19296k1957659k2552176J13869J3501624
9495a9891846M952159m584473k503503p28904n390665o722596m768200j0054907
9487d9692935j3938405L650294L0414917K8293678m041292k0697844q2929J9873215
9479f221301O760919j2165329j451284J7193239K836488k9643440l0316631L998300
$$ plain form
9534 -2634643 -9976711 -9979948 2883530 22389127 30640789 17888058 -3118043 -12868563
9526 -12868563 -10522499 -10406715 -15804656 -13620878 945417 11361397 1499948 -21358957
9518 -21358957 -36069914 -31746465 -13535443 6350386 13857539 -337812 -27680545
9511 -27680545 -44501867 -39909757 -29908632 -29732364 -26700364 -2743902 28206411 35127955
9503 35127955 17548908 5835850 11521792 11002496 -10955163 -33507339 -33393470 -19891846
9495 -19891846 -14939687 -19524160 -22027663 -22756567 -28147232 -34869828 -39638028 -49692935
9487 -49692935 -63631340 -59981046 -29566129 -1272451 -5313743 -26011587 -26094516 -6221301
9479 -6221301 539618 -11625711 -13076995 4116244 6952732 -22690708 -53007339 -49009039
9471d9009039K6073719J4302876j584396J828665Q008843R45242l617111Q673599
9463E622398J9614079P865165j3710022j7443847k816333O297684j169656j0730957
9455f471489n635676J2508509K8017930K6979455Q152207j5795146k7273243j7955655
9447B526892M148280K1542298K1648091P180831o539330p802844k071928k985978
9439C7646312j0523397j0816177j056531K629901p738335j5225401m970135Q829447
9431a224316N460634o663062m766145P120812M095292j4600640k0396162j346395
9423c2319982J8027024J5116956R42149k181817O495447J2276202Q110834k968163
9415B3498650j5369874j9541686o919634J3192558J6710929l798721k5701176
$$ plain form
9471 -49009039 -22935320 -8632444 -10216840 -8388175 -379332 565910 -3051201 5622398
9463 5622398 25236477 33101642 19391620 1947773 -868560 5429124 4259468 -6471489
9455 -6471489 -12107165 401344 28419274 55398729 63550936 47755790 20482547 2526892
9447 2526892 6675172 28217470 49865561 57046392 50507062 42704218 40632290 37646312
9439 37646312 27122915 16306738 15250207 17880108 10141773 -5083628 -10053763 -1224316
9431 -1224316 4236318 -2426744 -7192889 -72077 4023215 -10577425 -30973587 -32319982
9423 -32319982 -14292958 823998 1766147 -415670 6079777 18355979 26466813 23498650
9415 23498650 8128776 -11412910 -18332544 -5139986 11570943 7772222 -17928954
9408a7928954k6257955j0667405K903611R988418J5013790J4504502M653604m832348
9400a2622737l695551J90867o347357j7382446j5681943l17011J2548879J4228841
9392b9078458J1035318Q179380L519582j458671l14660N912808Q293697M356305
9384A0445301N98885p84407m707191j0589169j0556231m160797j659033o946397
9376b8359039r817671k828387N624161M882719o01962J045192J0300276J6790825
9368b963886J4867178P304877l734711j6578471k1261534o002560K1954601L5393162
9360B8978656J7687926j4469079l0655493k2459724o309115M065656J0135978
9353a3025195J3492447Q356262l014164m832755R221774K0407866Q031133j9702536
$$ plain form
9408 -17928954 -44186909 -54854314 -51950703 -41962285 -26948495 -12443993 -7790389 -12622737
9400 -12622737 -16318288 -16127421 -22474778 -39857224 -55539167 -55856178 -43307299 -29078458
9392 -29078458 -18043140 -9863760 -6344178 -7802849 -8117509 -2204701 6088996 10445301
9384 10445301 11044186 10259779 5552588 -5036581 -15592812 -19753609 -21412642 -28359039
9376 -28359039 -38176710 -41005097 -35380936 -30498217 -31100179 -30054987 -19754711 -2963886
9368 -2963886 11903292 19208169 15473458 -1105013 -22366547 -28369107 -6414506 28978656
9360 28978656 46666582 32197503 1542010 -20917714 -27226829 -23161173 -13025195
9353 -13025195 467252 8823514 5809350 976595 10198369 30606235 38637368 18934832
9345A8934832l3549527j8287952J2785046L5239373L4317892J2410880j2835929
9338D9014615k1093950r595090L872783N467149J807031J240459m821757k1883590
9330D007650k9741309q948007K0699546K2582324o58740j2013223k049233k029354
9322h150346k3859218l3020765o237637K4964347K3371722N384135Q710776K5342756
9314A6505770J6425358j6916921k9197614j663404K7681968K1203269p025237
9307B7013189j9663698j0012418n28490j977807k173757O103228R670452l030107
9299E400592j8754252j4106774R730272K3833027R978504j2539674j3550300N260809
9291d747796J5625401N630282p791959r911610n015951K166097J2936389J5052000
$$ plain form
9345 18934832 -14614695 -32902647 -20117601 15121772 49439664 61850544 49014615
9338 49014615 27920665 18325575 22198358 27665507 29472538 30712997 25891240 4007650
9330 4007650 -25733659 -34681666 -13982120 8600204 7941464 -4071759 -6120992 -8150346
9322 -8150346 -32009564 -65030329 -71267966 -46303619 -22931897 -17547762 -8836986 16505770
9314 16505770 32931128 16014207 -13183407 -14846811 12835157 34038426 27013189
9307 27013189 7349491 -2662927 -3191417 -5169224 -7342981 -1239753 8430699 5400592
9299 5400592 -13353660 -27460434 -17730162 6102865 16081369 3541695 -10008605 -4747796
9291 -4747796 10877605 16507887 8715928 -1195682 -6211633 -4045536 8890853 23942853
9283B3942853r890783m5725915m5591224J48592L7203040K1528147j5072256j6388629
9275d9846175J2052823K2145736P118195L867310J8453380J4030758j8535775
9268I286252l7853050j8831082R287996J5319359J0456557J3297246J2988443
9261A3951721j012518r142917L888943J6252799N748450q903140j330022J2987614
9253C2440930K984267k0448027j8936647R618394K6177778J0639011j2313572
9246C0162134j5225289l703213J530647n068212j3393736j2600631K23813J5645147
9238b429340J6641317j40544j3423404m354837J2831639J0413230p484961q614744
9230C438356J5463483L2066833J4367719k0041340l4971432k1025934K703590
$$ plain form
9283 23942853 14052070 -31673845 -77265069 -77116477 -39913437 -18385290 -33457546 -49846175
9275 -49846175 -37793352 -15647616 -8529421 -4662111 13791269 27822027 9286252
9268 9286252 -28566798 -47397880 -38109884 -22790525 -12333968 963278 13951721
9261 13951721 12939203 3796286 7685229 23938028 29686478 20783338 19453316 32440930
9253 32440930 35425197 14977170 -3959477 5658917 31836695 42475706 30162134
9246 30162134 14936845 11233632 12764279 7696067 -5697669 -18298300 -18074487 -2429340
9238 -2429340 14211977 14071433 648029 -3706808 9124831 19538061 12053100 3438356
9230 3438356 18901839 50968672 65336391 45295051 10323619 -10702315 -7998725
9223g998725J7296028J6222748J023619j6440207j6470271M864444K1892951R646434
9215C0037021j7006701j9060736J0214182L1222004J2237874k5266863l6194596
9208a3817815j1997460J3898284J5136247Q02062p927102n460875L003273J3853429
9200G490043K0319911J2466964m424160q032909Q656915K0883134Q638794q553667
9192E7445025k214459J4760544O389905k3960538l3599445r291001Q804136q832441
9184I501726l3440145k4663878O548261J9027029N032163o648402j496467N032005
9176b1107708K360711J591531J0176740J6226269Q953766l932158r768256q435035
9168c934140o956869o078893r69579Q875063J6033341J1820577k817005j3969174
$$ plain form
9223 -7998725 9297303 25520051 26543670 10103463 -6366808 -1502364 20390587 30037021
9215 30037021 13030320 -6030416 4183766 35405770 47643644 22376781 -13817815
9208 -13817815 -25815275 -11916991 3219256 4021318 -3905784 -9366659 -6363386 7490043
9200 7490043 27809954 40276918 35852758 27819849 36476764 57359898 65998692 57445025
9192 57445025 55230566 69991110 76381015 52420477 18821032 9530031 18334167 9501726
9184 9501726 -23938419 -48602297 -42054036 -23027007 -17994844 -24643246 -26139713 -21107708
9176 -21107708 -18746997 -17155466 -6978726 9247543 18201309 14269151 4500895 -3934140
9168 -3934140 -10891009 -16969902 -17939481 -9064418 6968923 18789500 15972495 2003321
9160B003321q534400P348785J3015199J32989j6364202j9805386j1382711p97108
9152c4383513Q045543J2054662N467763o179247n079330J1341563K0028090O922655
9144A8218186q171266m161745M731388m996397k1622460j6623037M435352J0294998
9136a7894981k075722m798971Q473743J1338460n268502j4117447J096794J7676681
9128e569945J3573580J210673j616781l434209j4482896j8223760L23970J9162737
9120i056631P981116k0603681k4984367L346918K5515954J0248824k2859356k9896850
9112f0308073O71208L3653179L0135039m176852k4042571j148471L7398576M2549721
9104E4731756P148718k7331310k7548465m993636J1446748J3200417Q239246K191719
$$ plain form
9160 2003321 -6531079 817706 13832905 13965894 -2398308 -22203694 -33586405 -34383513
9152 -34383513 -26337970 -14283308 -8815545 -14994792 -20074122 -8732559 11295531 18218186
9144 18218186 10046920 5885175 10616563 5620166 -16002294 -32625331 -28189979 -17894981
9136 -17894981 -19970703 -24769674 -16295931 -4957471 -10225973 -24343420 -23246626 -5569945
9128 -5569945 8003635 9214308 7597527 4163318 -10319578 -28543338 -28219368 -9056631
9120 -9056631 -1075515 -21679196 -46663563 -43316645 -17800691 -7551867 -30411223 -60308073
9112 -60308073 -59636865 -25983686 4151353 -25499 -24068070 -25216541 12182035 54731756
9104 54731756 61880474 34549164 7000699 2007063 13453811 26654228 34893474 37085193
9096C7085193J05819Q516769J9847198J3121867j3815410l2825571k4499568p462204
9088G4093o459242j2784824n092624Q825220N754128q781937p234944J1975729
9080a3724401J8796902j604257k6792273l0152201j1407798J3873049L3080566
9073a7930413L6485284J9118433o529549j6278380l316921J1350695O074101j5159145
9065A3814105l1035806k7624469q383182J2259847K0406977J4229567O060341
9058b72620P323181J3777607J4006579P410793J074762o085095j8988220k9020205
9050a0773218k1008880J127987J5653406J3495236P381920N571120r43103j4882145
9042d377677j8945290k416639J6493267J5276976J126810k053602P515360Q238974
$$ plain form
9096 37085193 37191012 45707781 65554979 78676846 64861436 32035865 7536297 74093
9088 74093 -6385149 -19169973 -24262597 -15437377 -9683249 -18465186 -25700130 -13724401
9080 -13724401 5072501 3468244 -23324029 -53476230 -64884028 -51010979 -17930413
9073 -17930413 18554871 37673304 31143755 14865375 11548454 22899149 28973250 13814105
9065 13814105 -17221701 -44846170 -53229352 -40969505 -20562528 -6332961 -272620
9058 -272620 7050561 20828168 34834747 42245540 43320302 37235207 18246987 -10773218
9050 -10773218 -31782098 -30654111 -15000705 -1505469 5876451 11447571 10504468 -4377677
9042 -4377677 -23322967 -25739606 -9246339 6030637 7157447 5103845 12619205 20858179
9034B0858179q028032k1721245j5349346J354488Q345078M461136M568484J3826876
9026H315618K0519717J4652171L39527j3562216k2988603k3441859q610948J4976015
9018i800578K4044994O059719j7284238j4379829J2113848K8567936J8610001
9011D7931853J888270k379469k866820j1901176j8931962j0330178L406260M475421
9003A1292199k661899k715140J799567j613522r310831q928314m163070n872196
8995b2173206o773354O204104K0999717J3879313q732813j5283154J763772J4476498
8987D360877L542466j6462284k4355992j7102409J072959K6537946M3757031L2701078
8979E4051672J96671k1883715j9773591j1871170j0470136k521638J6015272K1363851
$$ plain form
9034 20858179 12830147 -8891098 -24240444 -22885956 -14540878 -10079742 -5511258 8315618
9026 8315618 28835335 43487506 43827033 30264817 7276214 -16165645 -24776593 -9800578
9018 -9800578 14244416 20304135 3019897 -11359932 753916 29321852 47931853
9011 47931853 49820123 47440654 44573834 32672658 13740696 3410518 6816778 11292199
9003 11292199 8630300 5915160 7714727 6101205 -3209626 -12137940 -16301010 -22173206
8995 -22173206 -28946560 -22742456 -1742739 12136574 3403761 -11879393 -10115621 4360877
8987 4360877 7903343 -8558941 -32914933 -50017342 -48944383 -22406437 21350594 54051672
8979 54051672 54248343 32364628 12591037 719867 -9750269 -12271907 3743365 25107216
8971B5107216J120228j8204493j0587245Q623458J0937579O81327J23822P526060
8963B5327952M789423n989827p418940M92843L937526M124228J1332571J6289543
8955E2885319L86298k7156811l4641444j3569683R824198J3640503M440966l676573
8947B132773q490250r400702j112472J1335347J1317564l486704j1549185K643749
8939f609880K3872252K6505334R037021p630442j0767689q572840j1372330j3728801
8931G32625l992561J4099026K1441926Q843484q044377r709616j482691m499293
8923A7388523k0061930k4516154n632935J7151652K0860075Q785952k430783q128627
8915C415773j0685856n651035O669743J0044789m493042j6736812m022055J9906115
$$ plain form
8971 25107216 26227444 8022951 -2564294 6059164 16996743 17678070 17801892 25327952
8963 25327952 30117375 24127548 16708608 17201451 21138977 25263205 36595776 52885319
8955 52885319 53271617 26114806 -8526638 -22096321 -12272123 1368380 5809346 2132773
8947 2132773 -6357477 -15758179 -16870651 -5535304 5782260 2295556 -9253629 -6609880
8939 -6609880 17262372 43767706 52804727 45174285 34406596 25833756 14461426 732625
8931 732625 -3259936 10839090 32281016 41124500 33080123 23370507 21887816 17388523
8923 17388523 -2673407 -27189561 -32822496 -15670844 5189231 13975183 11544400 3415773
8915 3415773 -7270083 -12921118 -6251375 3793414 -699628 -17436440 -21458495 -1552380
8907a552380K1187858l407690k0841263q806168J6532257K5392078Q432987j8678481
8899A8259198l1523299j7518852Q944540J7793869J284777j2080467J084666K1069449
8891G313881J5393178q466075j5947502j471294P796108J002089m291721p67238
8883E61426j064828l670102Q902186K9385352K7113983K602436n623046J3106864
8875G1314271J8331786j1600598l6345548j9802255N824815o503837l6724203
8868a5505569k9597676J2624633L3039632R854039j7001172j5627320m184629
8861b6398062o262772j0057024K617335J9712352J8619659J674610j0942751j0321207
8853b1357860l273376K559449M988886N652657R470236J8366197K3148333J2836155
$$ plain form
8907 -1552380 19635478 16227788 -4613475 -13419643 3112614 28504692 36937679 18259198
8899 18259198 -13264101 -30782953 -21838413 -4044544 -2759767 -14840234 -13755568 7313881
8891 7313881 22707059 14240984 -1706518 -3177812 4618296 5620385 1328664 561426
8883 561426 -503402 -4173504 4728682 34114034 61228017 63830453 58207407 71314271
8875 71314271 89646057 78045459 41699911 21897656 27722471 21218634 -15505569
8868 -15505569 -45103245 -32478612 561020 10415059 -6586113 -22213433 -26398062
8861 -26398062 -32660834 -42717858 -40100523 -20388171 -1768512 -93902 -11036653 -21357860
8853 -21357860 -24631236 -22071787 -17082901 -11430244 -1960008 16406189 39554522 52390677
8845E2390677o381512j5630614r246609o40701Q56197J408477N473851N798491
8837C4028257o92416m696639k774306o135710j7891991j9317996K305941K6252409
8829A1077549K2224751n551119k2639398j2337041M404133L495641q592345r538651
8821a7456480L626136J1569044J553308j5777804k1981900j3187058k44991Q253926
8813d3645819J4586012K2646489K7197599J9010063k82473j5771670j6221463
8806G518738q665539q030260j3723810q465603J4177920L3330334K5632128o11326
8798D1162582j4892862p126440J324013m672582j0037610M01523J0510717j547035
8790A5122306k1609333j6964020J0351792K3821053R075478o291991j290237N370682
$$ plain form
8845 52390677 46009165 30378551 21131942 20491241 21347438 22755915 28229766 34028257
8837 34028257 33335841 28639202 25864896 19729186 1837195 -17480801 -15174860 11077549
8829 11077549 33302300 27751181 5111783 -7225258 -2821125 674516 -7917829 -17456480
8821 -17456480 -13830344 -2261300 -707992 -16485796 -38467696 -51654754 -51899745 -43645819
8813 -43645819 -29059807 -6413318 20784281 39794344 39511871 23740201 7518738
8806 7518738 -1146801 -9177061 -22900871 -31366474 -17188554 16141780 41773908 41162582
8798 41162582 26269720 19143280 20467293 15794711 5757101 6158624 16669341 15122306
8790 15122306 -6487027 -23451047 -13099255 10721798 19797276 13505285 12215048 17585730
8782A7585730p937958k5537171j9473342N558860K1500203J7601384N234326o333518
8774H198514j2914760n107615J7286831K9719005J1092292j9804611k7316593
8767A153063j2238487o311334j5954231j3587861Q076710J7782253M61593j1683173
8759c2301467P481578K9349351J4924584j7878921j8657925J5313697L3030196
8752C1261093P853502k4261592k2538445n992M545524j1442171j5677906M560100
8744b5705887K3932107K0243851O107833M244072J0616835M280304j4748448k2173714
8736F796953o522006J2630176J4343324O036110O192553J0838329J296810j9527169
8728C2085080k5590594p577815J0223780N370665j0572044j2565827M82190R276551
$$ plain form
8782 17585730 9647772 -15889399 -35362741 -29803881 -8303678 9297706 14532032 8198514
8774 8198514 -4716246 -9823861 7462970 37181975 48274267 28469656 1153063
8767 1153063 -11085424 -17396758 -33350989 -46938850 -38862140 -21079887 -20618294 -32301467
8759 -32301467 -24819889 4529462 19454046 1575125 -17082800 -1769103 31261093
8752 31261093 39114595 14853003 -7685442 -7691434 -3145910 -14588081 -30265987 -25705887
8744 -25705887 -1773780 18470071 24577904 28821976 39438811 43719115 28970667 6796953
8736 6796953 274947 12905123 27248447 33284557 39477110 50315439 51612249 32085080
8728 32085080 6494486 -1083329 9140451 14511116 3939072 -8626755 -8144565 1131986
8720A131986N316505k783026q753465j3255080j1401963K476121J6676297J1118729
8712E26104j0708606k0941530o593902J2664167J7531835J6003257J9273208J4912870
8704D2667403q016926k6257527j1424651J8254983J7169610j6578385l4369223
8697a8554716j2925156R462293j878519k0029528m521020K6275826K3486057j0425761
8689i110524k6206944r708964Q17529j1087814q977364K6765574N2063754K4583178
8681C9138425k3926200l1538679K577769K3969920Q150171j2747472r722017M572095
8673D74012Q483874L328781k949643j1955148j8214318n256369K2919477L2439438
8665B9270104M100151l3446713l9230109j2978992J1839839J5879196Q743653
$$ plain form
8720 1131986 6448491 3665465 -5088000 -18343080 -29745043 -27268922 -10592625 526104
8712 526104 -10182502 -31124032 -37717934 -25053767 -7521932 8481325 27754533 42667403
8704 42667403 34650477 8392950 -3031701 15223282 32392892 15814507 -18554716
8697 -18554716 -31479872 -22017579 -23896098 -43925626 -48446646 -22170820 1315237 -9110524
8689 -9110524 -35317468 -45026432 -44208903 -55296717 -64274081 -37508507 14555247 39138425
8681 39138425 15212225 -16326454 -13748685 10221235 18371406 5623934 -4098083 474012
8673 474012 8957886 12286667 9337024 -2618124 -20832442 -26088811 -3169334 29270104
8665 29270104 33370255 -76458 -39306567 -52285559 -40445720 -24566524 -15822871
8658a5822871K708964j719331l283242M055455J6909797K1242653J1758289n68568
8650C5281146n893833q413765j5327476k3235505k3473617j3930164R54894J5445377
8642c8592943K2088884J4345631j863471p323898P252998K2836676J3500609j4776201
8634A7468285k6990284p612519J4855640Q422881j4739886j7415277M631239J6612291
8626d767630J060931j3038981M019503L3548778L3476316m18045k8431316k1305773
8618D143783M912048J5565963P73727j9090828k2225142r286696J421738j404230
8610b5189637p521903j519351J0436770O681944j3637657k2237314l557670J6835792
8602c9709026R223802j2831276j3560097P524530J6291795N48531j2528183l582111
$$ plain form
8658 -15822871 -13113907 -14833238 -18116480 -14061025 2848772 24091425 35849714 35281146
8650 35281146 29387313 20973548 5646072 -17589433 -41063050 -54993214 -54038320 -38592943
8642 -38592943 -16504059 -2158428 -4021899 -11345797 -4092799 18743877 32244486 17468285
8634 17468285 -9521999 -17134518 -2278878 6144003 -8595883 -26011160 -21379921 -4767630
8626 -4767630 -3706699 -16745680 -12726177 20822601 54298917 53880872 25449556 4143783
8618 4143783 9055831 24621794 25395521 6304693 -15920449 -25207145 -23785407 -25189637
8610 -25189637 -32711540 -34230891 -23794121 -17112177 -30749834 -52987148 -56544818 -39709026
8602 -39709026 -30485224 -43316500 -56876597 -49352067 -33060272 -32511741 -45039924 -48622035
8594d8622035R825067O733189m552302o426411k79974M800324J0645950J7666978
8586a0209214J3270005o481529k0888580j2324775N048609P065783l023996l271454
8578c0815151J0575894K2141440K1934391J4499619J866377j7513975l4046551
8571a1357956l1882344j0986571J1114058K0692658J8517775J1242545M832506
8564A2172671L862276N837129J281108r458892r388788R611185K5910866J4496742
8556E4324297j4164305k6528817j2556995O065318J1914688Q280361j118700j9116335
8548G099512l5577125k9461910j212957K1629980K2142521J3407074R399478L517628
8540A0944201p880207p885649J1569175K5068223O414760k8961261m2083401k1459002
$$ plain form
8594 -48622035 -38796968 -32063779 -36616081 -43042492 -43322466 -38522142 -27876192 -10209214
8586 -10209214 3060791 -3420738 -24309318 -36634093 -31585484 -24519701 -27543697 -30815151
8578 -30815151 -20239257 1902183 23836574 38336193 40202570 22688595 -11357956
8571 -11357956 -43240300 -54226871 -43112813 -22420155 -3902380 7340165 12172671
8564 12172671 16034947 21872076 23153184 13694292 4305504 13916689 39827555 54324297
8556 54324297 40159992 13631175 1074180 7139498 19054186 27334547 26215847 7099512
8548 7099512 -28477613 -57939523 -59152480 -37522500 -15379979 -1972905 7426573 10944201
8540 10944201 3063994 -4821655 6747520 31815743 38230503 9269242 -32814159 -54273161
8532e4273161R237804K6762421K6693575J2387409q390251j7944936m505832J5912719
8524E879748J6128871l070402j3584715j928362J3856010J4703850M018209p719061
8516B8284148j8467554k3517531j1886383J0922820J7934774k390473k3098770
8509b2218969j5173640R160798J6390817K959074m744336L346767Q341577k19938
8501b157850o646642k42600M383589m803913j3488337o372008M321901J305297
8493b3700563l600130J0885832L1692260K4054347j0769769k7948615k929871
8486b316509K9730197K5012552r401575k8887646j6417038K519291O234893M081573
8478A0555738Q782223J0600283k575358j8973475j8909799o228570j430256p831102
$$ plain form
8532 -54273161 -45035357 -18272936 8420639 20808048 12417797 -5527139 -10032971 5879748
8524 5879748 22008619 18938217 5353502 3425140 17281150 31985000 36003209 28284148
8516 28284148 9816594 -13700937 -25587320 -14664500 3270274 879801 -22218969
8509 -22218969 -37392609 -28231811 -11840994 -8881920 -13626256 -10279489 -1937912 -2157850
8501 -2157850 -8804492 -9047092 -4663503 -9467416 -22955753 -29327761 -25005860 -23700563
8493 -23700563 -27300693 -16414861 15277399 39331746 28561977 613362 -2316509
8486 -2316509 27413688 52426240 43024665 14137019 -2280019 239272 6474165 10555738
8478 10555738 19337961 29938244 27362886 8389411 -10520388 -16748958 -18179214 -26010316
8470b6010316p307747P648730J9253901J2063780j677655l08267J3843112J8138420
8462C5643958L931670j1511682j1402608j661950K253680j563073m091101l268931
8454H329963m693829p090885j630368J1932265K0666496J5439985L465879k441039
8446D3978467l30658J945246p33532o339289j0874054j1737069p777043j271602
8438F860466J751725j940489p351306p000286p08727M996945N887979L606669
8430F102976J491992J817571N786467J0764392R331894j759510j3019395j1805117
8422H711270p94425M158674k563045p952539k312101M154618n72011p631363j459972
8413f260894J0698672O981750j1872866j9275795m088016J0312919L342590r452203
$$ plain form
8470 -26010316 -33318063 -25669333 -6415432 5648348 3970693 3662426 17505538 35643958
8462 35643958 39575628 28063946 16661338 14999388 17253068 15689995 11598894 8329963
8454 8329963 3636134 -3454751 -5085119 6847146 27513642 42953627 46419506 43978467
8446 43978467 43647809 45593055 44859523 38520234 27646180 15909111 8132068 6860466
8438 6860466 8612191 6671702 -679604 -7679890 -8388617 -3391672 2496307 6102976
8430 6102976 7594968 9412539 15199006 25963398 35295292 33535782 20516387 8711270
8422 8711270 7916845 12075519 9512474 1559935 -752166 3402452 2830441 -4800922 -6260894
8413 -6260894 4437778 11419528 -453338 -19729133 -23817149 -13504230 -10161640 -19613843
8405a9613843k969764J5263521J7692219J083082j2074912j2427767j2911962
8398b5959426j7693131j3503471P89148O387180j835209l033036J2627584K3215087
8390a9005274J1805870l141482p9161P582015k773072j9399661j4792462N961935
8382c3841292J4045018O099624M729273J2713855Q411424q947787j0970746J0879699
8374C119068K6039832J2292006j1007697j8211969j5937435k1177278k5795375
8367e0678848j1911431J3511696K6889909K1378679R921197K585528o68356j448293
8359I580081k242675o959386j0971620k162607J6757560K2592423L549219j9145371
8351A0997624j9948290m419698M808849L538299L386222M483024k591900j2804213
$$ plain form
8405 -19613843 -22583607 -7320086 10372133 11455215 -619697 -13047464 -25959426
8398 -25959426 -43652557 -57156028 -56366880 -49979700 -51814909 -54847945 -42220361 -19005274
8390 -19005274 -7199404 -10340886 -10420047 -2838032 -5611104 -25010765 -39803227 -33841292
8382 -33841292 -19796274 -13696650 -8967377 3746478 12157902 3210115 -7760631 3119068
8374 3119068 29158900 41450906 30443209 12231240 -3706195 -24883473 -50678848
8367 -50678848 -62590279 -49078583 -22188674 -809995 9111202 11696730 11028374 9580081
8359 9580081 7337406 378020 -10593600 -12756207 4001353 26593776 30142995 10997624
8351 10997624 -8950666 -13370364 -8561515 -5023216 -1636994 2846030 254130 -12550083
8343a2550083j0174738M956377J3541517M407123j3033626k2692401j5470123
8336e1015954P285139L0885495L3932035J2065486j1724272j4388234j125500
8329E914195Q101154P213714R43563j1411476k5577318k1419960Q094388L1191316
8321C049576J5745614j7460402k0839425O498941J8043863m489021k4515133j3636709
8313c7602696O027723O356346j449043L569728J1677509N735810k447277N323514
8305b808386J6307151Q392346p640824m752806J2374592J3477242p415459k3446241
8297D487615j7804011m289018o7829m036640q753465j1994997j0248738M81707
8289e2225376J2636739J3220310M703084J667460M992233Q22580j0749293j0133078
$$ plain form
8343 -12550083 -22724821 -17768444 -4226927 180196 -12853430 -35545831 -51015954
8336 -51015954 -43730815 -12845320 21086715 33152201 21427929 7039695 5914195
8329 5914195 14015349 21229063 22172626 10761150 -14816168 -36236128 -28141740 3049576
8321 3049576 18795190 1334788 -19504637 -13005696 5038167 549146 -23965987 -37602696
8313 -37602696 -31574973 -25218627 -26667670 -23097942 -11420433 -5684623 -8131900 -2808386
8305 -2808386 13498765 21891111 14250287 9497481 21872073 35349315 27933856 4487615
8297 4487615 -13316396 -17605414 -17673243 -21709883 -30463348 -42458345 -52707083 -52225376
8289 -52225376 -39588637 -26368327 -21665243 -19997783 -15005550 -14182970 -24932263 -35065341
8281c5065341R061984K4756352J8166058R51814o589373o885239j3530573k1916542
8273c1050860j6188564J143362J1182966Q722433O826334R498443M250519j0204336
8265a5819703j2842036P212324K6304836J6662576j0298005j7035476N838193
8258B2709K4576252R970968k1326023l0038798p118507J6742927J3753034o581100
8250A462j4837976l015851P469330M27489r280035N70163J9793563J5107908j6897611
8241f61558l4560314q022385L2268581L4755779M5128k2999275j0372119R894468
8233C48305J1024336N177046Q379639O878446j1399823k3136695m155479K4388888
8225A7504663K3422779m466418k1802016j4647934n678045j0367111j6376185
$$ plain form
8281 -35065341 -26003357 -1247005 16919053 17870867 11281494 4396255 -9134318 -31050860
8273 -31050860 -47239424 -46096062 -34913096 -26190663 -19364329 -9865886 -5615367 -15819703
8265 -15819703 -28661739 -21449415 4855421 21517997 11219992 -5815484 22709
8258 22709 24598961 34569929 13243906 -16794892 -23913399 -7170472 6582562 1462
8250 1462 -14836514 -17852365 -10383035 -9955546 -19235581 -18665418 1128145 16236053 -661558
8241 -661558 -35221872 -43244257 -10975676 23780103 23825231 825956 -9546163 348305
8233 348305 11372641 16549687 24929326 31807772 20407949 -2728746 -6884225 17504663
8225 17504663 40927442 36461024 14659008 11074 -5666971 -16034082 -32410267
8218c2410267j1017167J054213J2710942K1280182J8729308Q55261j3811557l119637
8210e728722K0196511K1283141k509143j5735658j877690J0978033j811892k1588618
8202C205962j8146751M548271J9294799J4168814j267210j4025681j5118050k316407
8194i656253J1883274R957180m060678p315519M300386P497353o716634j3072036
8186g182927N428092K4507569J6136502o204919j2319361m819116p554504j8904680
8178a0913344j5415963L955141J4407204O875149k74061L505036L670703j0918310
8170e108445k5572884j9638826N197119K7650967L0274423J3855379o493916j6310496
8162C853321j4569635j0245431p054099m19270Q909916J1959249P762344O958837
$$ plain form
8218 -32410267 -43427434 -42373221 -29662279 -8382097 10347211 11202472 -2609085 -5728722
8210 -5728722 14467789 35750930 33241787 17506129 15628439 26606472 24794580 3205962
8202 3205962 -14940789 -10392518 8902281 23071095 21803885 7778204 -7339846 -9656253
8194 -9656253 2227021 12184201 8123523 808004 5108390 12605743 5889109 -7182927
8186 -7182927 -1754835 22752734 38889236 32684317 20364956 15545840 7991336 -10913344
8178 -10913344 -26329307 -22374166 -7966962 -1091813 -1365874 2139162 5809865 -5108445
8170 -5108445 -30681329 -50320155 -45123036 -17472069 12802354 26657733 20163817 3853321
8162 3853321 -10716314 -20961745 -28015844 -28435114 -19525198 -7565949 196395 7155232
8154G155232J1200491O846122r438430j8480411p961213N243216J692395r596463
8146a3339061r159411M01107M803134O294448J4521880K1526948J3877442k76567
8138C8649920l900971q57203m532421p643887M195738J7884682Q299407j6120803
8130C5974462k1310294j491344J2666943M288367q204801q001321l104478j494894
8122I322640L692411J0789202K877481j9791665k9772784j2393932J0588086J5447142
$$ plain form
8154 7155232 18355723 25201845 15763415 -2716996 -10678209 -5434993 -3742598 -13339061
8146 -13339061 -22498472 -22097365 -17294231 -10999783 3522097 25049045 38926487 38649920
8138 38649920 34748949 33891746 29359325 21715438 25911176 43795858 52095265 35974462
8130 35974462 14664168 13172824 25839767 30128134 21923333 13922012 10817534 9322640
8122 9322640 13015051 23804253 26681734 6890069 -22882715 -35276647 -24688561 -9241419
$$ [...]
##END NTUPLES=NMR SPECTRUM
##END=
