##TITLE=31Pdec_PR195_k
 DMSO, 124 sc
 7.04.2021
##JCAMPDX= 6.0         $$ Bruker NMR JCAMP-DX V2.0
##DATA TYPE= NMR SPECTRUM
##DATA CLASS= NTUPLES
##ORIGIN= UXNMR, Bruker Analytische Messtechnik GmbH
##OWNER= root
$$ XWIN-NMR		Version 3.5
$$ Wed Apr  7 16:07:44 2021 Russian Standard Time (UT+4h)  she@DPX200
##.OBSERVE FREQUENCY= 81.013821
##.OBSERVE NUCLEUS= ^31P
##.ACQUISITION MODE= SIMULTANEOUS
##.ACQUISITION SCHEME= undefined
##.AVERAGES= 124
##.DIGITISER RES= 16
##SPECTROMETER/DATA SYSTEM= spect
##.PULSE SEQUENCE= zgpg30
##.SOLVENT NAME= CDCl3
##.SHIFT REFERENCE= (INTERNAL, CDCl3, 0, 248.564)
##AUDIT TRAIL= $$ (NUMBER, WHEN, WHO, WHERE, WHAT)
$$ ##TITLE= Audit trail, XWIN-NMR		Version 3.5
$$ ##JCAMPDX= 5.01
$$ ##ORIGIN= Bruker BioSpin GmbH
$$ ##OWNER= she
$$ F:/spectra/data/she/nmr/P31/1/pdata/1/auditp.txt
$$ ##AUDIT TRAIL=  $$ (NUMBER, WHEN, WHO, WHERE, WHAT)
(   1,<2021-04-07 16:06:10.00 +0400>,<she>,<DPX200>,
      <continue with go, POWCHK disabled, PULCHK disabled
       configuration hash MD5:
       00 E9 B6 7A A2 85 ED C7 34 08 36 98 17 FE 4E 26
       data hash MD5: 32K
       A3 77 FD 40 44 2D 2F 2B E9 59 83 9C 4F 2F 47 29>)
(   2,<2021-04-07 16:06:13.23 +0400>,<she>,<DPX200>,
      <Start of raw data processing
       efp BC_mod = 2 LB = 1 FT_mod = 6 PKNL = 1 PHC0 = -5353.486 PHC1 = 1617.002 SI = 64K 
       data hash MD5: 64K
       1E A2 24 B5 11 1F 29 2B 33 2A 63 49 9E EC 88 40>)
(   3,<2021-04-07 16:07:08.65 +0400>,<she>,<DPX200>,
      <pk PHC0 = -345.5653 PHC1 = 455.9999 
       data hash MD5: 64K
       81 FA 0F C8 67 E6 67 AA 77 31 49 2B D1 F5 60 FB>)
(   4,<2021-04-07 16:07:12.03 +0400>,<she>,<DPX200>,
      <abs ABSG = 5 
       data hash MD5: 64K
       30 39 5A 45 C9 DD 89 1D D6 75 0D E4 A6 BD 16 CE>)
$$ ##END=
$$ 
$$ hash MD5
$$ 89 F8 D8 AF 80 09 EF AC 1F 23 FF B4 78 05 27 08
##$RELAX= 
##$RELAX= 
##$RELAX= 
##$RELAX= 
##$RELAX= 
##$RELAX= 
##$RELAX= 
##$RELAX= 
$$ Bruker specific parameters
$$ --------------------------
##$DU= <F:/spectra>
##$EXPNO= 1
##$NAME= <P31>
##$PROCNO= 1
##$TYPE= <nmr>
##$USER= <she>
##$AMP= (0..31)
100 100 100 100 100 100 100 100 100 100 100 100 100 100 100 100 100 100 
100 100 100 100 100 100 100 100 100 100 100 100 100 100 
##$AQSEQ= 0
##$AQ_mod= 1
##$AUNM= <au_zg>
##$AUTOPOS= <>
##$BF1= 81.014009
##$BF2= 200.13
##$BF3= 200.13
##$BF4= 200.13
##$BF5= 200.13
##$BF6= 200.13
##$BF7= 200.13
##$BF8= 200.13
##$BYTORDA= 1
##$CFDGTYP= 0
##$CFRGTYP= 5
##$CHEMSTR= <none>
##$CNST= (0..31)
1 1 145 1 1 1 1 1 1 1 1 1 1 1 1 1 1 1 1 1 1 1 1 1 1 1 1 1 1 1 1 1 
##$CPDPRG= <waltz16>
##$CPDPRG1= <>
##$CPDPRG2= <waltz16>
##$CPDPRG3= <>
##$CPDPRG4= <mlev>
##$CPDPRG5= <mlev>
##$CPDPRG6= <mlev>
##$CPDPRG7= <mlev>
##$CPDPRG8= <mlev>
##$CPDPRGB= <>
##$CPDPRGT= <>
##$D= (0..31)
0 1 0 0 0 0 0 0 0 0 0 0.03 2e-05 3e-06 0 0 0 0 0 0 0 0 0 0 0 0 0 0 0 0 
0 0 
##$DATE= 1617796984
##$DBL= (0..7)
120 120 120 11 120 120 24 19 
##$DBP= (0..7)
150 150 150 150 150 150 150 150 
##$DBP07= 0
##$DBPNAM0= <>
##$DBPNAM1= <>
$$ [...]
##$SUBNAM3= <"">
##$SUBNAM4= <"">
##$SUBNAM5= <"">
##$SUBNAM6= <"">
##$SUBNAM7= <"">
##$SUBNAM8= <"">
##$SUBNAM9= <"">
##$SW= 501.771253377433
##$SWIBOX= (0..15)
0 1 3 0 0 0 0 0 0 0 0 0 0 0 0 0 
##$SW_h= 40650.406504065
##$TD= 32768
##$TD0= 1
##$TE= 0
##$TE2= 300
##$TE3= 300
##$TEG= 300
##$TL= (0..7)
0 120 53 12 22 120 120 120 
##$TP= (0..7)
150 150 150 150 150 150 150 150 
##$TP07= 0
##$TPNAME0= <>
##$TPNAME1= <>
##$TPNAME2= <>
##$TPNAME3= <>
##$TPNAME4= <>
##$TPNAME5= <>
##$TPNAME6= <>
##$TPNAME7= <>
##$TPOAL= (0..7)
0.5 0.5 0.5 0.5 0.5 0.5 0.5 0.5 
##$TPOFFS= (0..7)
0 0 0 0 0 0 0 0 
##$TUNHIN= 0
##$TUNHOUT= 0
##$TUNXOUT= 0
##$USERA1= <user>
##$USERA2= <user>
##$USERA3= <user>
##$USERA4= <user>
##$USERA5= <user>
##$V9= 5
##$VALIST= <valist>
##$VCLIST= <CCCCCCCCCCCCCCC>
##$VD= 0
##$VDLIST= <DDDDDDDDDDDDDDD>
##$VPLIST= <PPPPPPPPPPPPPPP>
##$VTLIST= <TTTTTTTTTTTTTTT>
##$WBST= 1024
##$WBSW= 4
##$XGAIN= (0..3)
0 0 0 0 
##$XL= 0
##$YL= 0
##$YMAX_a= 18603
##$YMIN_a= -9333
##$ZGOPTNS= <>
##$ZL1= 120
##$ZL2= 120
##$ZL3= 120
##$ZL4= 120
##$ABSF1= 248.5645
##$ABSF2= -253.2056
##$ABSG= 5
##$ABSL= 3
##$ALPHA= 0
##$AQORDER= 0
##$ASSFAC= 0
##$ASSFACI= 0
##$ASSFACX= 0
##$ASSWID= 0
##$AUNMP= <proc_1d>
##$AZFE= 0.1
##$AZFW= 0.5
##$BCFW= 0
##$BC_mod= 2
##$BYTORDP= 0
##$COROFFS= 0
##$CY= -3
##$DATMOD= 1
##$DC= 0
##$DFILT= <>
##$DTYPP= 0
##$F1P= 0
##$F2P= 0
##$FCOR= 1
##$FTSIZE= 65536
##$FT_mod= 6
##$GAMMA= 0
##$GB= 0
##$INTBC= 1
##$INTSCL= 5.30512e-09
##$ISEN= 30
##$LB= 1
##$LEV0= 0
##$LPBIN= 0
##$MAXI= 10000
##$MC2= 0
##$MEAN= 0
##$ME_mod= 0
##$MI= 50
##$NCOEF= 0
##$NC_proc= -5
##$NLEV= 6
##$NOISF1= 182.463
##$NOISF2= 159.3651
##$NSP= 0
##$NTH_PI= 0
##$NZP= 0
##$OFFSET= 248.5645
##$PC= 4
##$PHC0= -5699.051
##$PHC1= 2073.002
##$PH_mod= 1
##$PKNL= yes
##$PPARMOD= 0
##$PSCAL= 0
##$PSIGN= 0
##$REVERSE= no
##$SF= 81.014009
##$SI= 65536
##$SIGF1= 159.3651
##$SIGF2= -187.1042
##$SINO= 113.3802
##$SIOLD= 16384
##$SREGLST= <1H.CDCl3>
##$SSB= 0
##$STSI= 65536
##$STSR= 0
##$SW_p= 40650.406504065
##$SYMM= 0
##$S_DEV= 0
##$TDeff= 32768
##$TDoff= 0
##$TI= <>
##$TILT= no
##$TM1= 0
##$TM2= 0
##$TOPLEV= 0
##$USERP1= <user>
##$USERP2= <user>
##$USERP3= <user>
##$USERP4= <user>
##$USERP5= <user>
##$WDW= 1
##$XDIM= 65536
##$YMAX_p= 345841561
##$YMIN_p= -36443980
$$ End of Bruker specific parameters
$$ ---------------------------------
##NTUPLES= NMR SPECTRUM
##VAR_NAME=  FREQUENCY,     SPECTRUM/REAL,   SPECTRUM/IMAG
##SYMBOL=    X,             R,               I
##VAR_TYPE=  INDEPENDENT,   DEPENDENT,       DEPENDENT
##VAR_FORM=  AFFN,          ASDF,            ASDF
##VAR_DIM=   65536,         65536,           65536
##UNITS=     HZ,            ARBITRARY UNITS, ARBITRARY UNITS
##FACTOR=    0.620285442955139, 1,           1
##FIRST=     20137.2065510759, 0,            0
##LAST=      -20513.1999529892, 0,           0
##MIN=       -20513.1999529892, -36443980,   0
##MAX=       20137.2065510759, 345841561,    0
$$ Real data points
##PAGE= N=1
##DATA TABLE= (X++(R..R)), XYDATA
$$ [...]
13098e69063Q70909K625669K63777k654820k016562P98697J928632P46608o20868
$$ -569063 301846 2927515 3191292 536472 -1480090 -681393 1247239 1993847 1372979
13089A372979j030267p17290K10077J322674J419836L27182l76476J83517P97651
$$ 1372979 342712 -374578 -164501 1158173 2578009 2905191 2528715 2712232 3509883
13080C509883N29293K99002O13298Q5816j800612k761811j031689J326113J278248
$$ 3509883 4039176 4338178 4951476 5037292 3236680 474869 -556820 769293 2047541
13071B047541m71590p81738P53687J277135n73279k445412j829676M41544J694810
$$ 2047541 1575951 794213 1547900 2825035 2251756 -193656 -2023332 -1581788 113022
13062A13022J009114j90431m94700j03178Q7644J11418R03823K641088L846856
$$ 113022 1122136 931705 437005 333827 421471 532889 1436712 4077800 7924656
13053G924656K923111K93639j993926k823127k935920k973611k095831L89626
$$ 7924656 10847767 11141406 9147480 6324353 3388433 414822 -1681009 -1291383
13045a291383L168258M083643K552593k73060k958355m155804k602455J228350
$$ -1291383 1876875 5960518 8513111 8240051 5281696 1125892 -1476563 -248213
13037b48213M056230K812309j169236l399197k104479j41356l1321k40498J252940
$$ -248213 3808017 6620326 5451090 2051893 -52586 -193942 -225263 -465761 787179
13028G87179K529728O24404k757969k851488R75364L942386K687094o16131k552831
$$ 787179 3316907 3941311 1183342 -1668146 -692782 3249604 5936698 5320567 2767736
13019B767736k994507k881521j144066K601020N054357L111660r69470k393361
$$ 2767736 -226771 -3108292 -4252358 -1651338 3403019 6514679 5545209 3151848
13011C151848o18655Q44972N19819K18543M55137m62666k031133j089961K620153
$$ 3151848 2533193 3378165 3897984 4116527 4571664 4108998 2077865 987904 3608057
13002C608057M840087K895446n04670j946628j979470k277119j824695M45571
$$ 3608057 8448144 11343590 10838920 8892292 6912822 4635703 2811008 3256579
12994C256579K223529J076895j063309p56151J244207J293026j135834k877856
$$ 3256579 5480108 6557003 5493694 4737543 5981750 7274776 6138942 3261086
12986C261086k266043j092270r84991j043232L0490J729439K516503J452896j056265
$$ 3261086 995043 -97227 -1082218 -2125450 -2094960 -365521 2150982 3603878 2547613
12977B547613l107612k566270K43845K202432J253865q29357j372526o85326n63450
$$ 2547613 -559999 -3126269 -2882424 -679992 573873 -255484 -1628010 -2313336 -2876786
12968b876786p48293k2630O96574m0768p08686J106757L829670L445170r6777
$$ -2876786 -3625079 -3647709 -2951135 -2991903 -3700589 -2593832 1235838 4681008 4584231
12959D584231k390585j107268J135982J511188O46603N5671m70525j019863k90240
$$ 4584231 2193646 1086378 2222360 3733548 4380151 4435822 3965297 2945434 2655194
12950B655194J757042K672891J024293j181194j520262n37019k48457j098683
$$ 2655194 4412236 7085127 8109420 6928226 5407964 4870945 4622488 3523805
12942C523805k123311k584186k069000n00931R74783R16680J02856P80554K629821
$$ 3523805 1400494 -1183692 -3252692 -3753623 -2778840 -1862160 -1759304 -978750 1651071
12933A651071K481860n15784k714987j212587J691865K130476K31925j184655
$$ 1651071 4132931 3617147 902160 -310427 1381438 3511914 3743839 2559184
12925B559184j433855j897359k488569j832983l46986K16313L2901Q68329K468052
$$ 2559184 1125329 -772030 -3260599 -5093582 -5440568 -5224255 -5191354 -4323025 -1854973
12916a854973K431723K59588j352527m04197J518056J708919Q4480j143106o64325
$$ -1854973 576750 836338 -516189 -920386 597670 2306589 2391069 1247963 583638
12907E83638N10510P11621k67100j063638n19293Q54850J502122O90000q46792
$$ 583638 1094148 1805769 1538669 475031 -44262 810588 2312710 3002710 2155918
12898B155918k003344k158830r88047J266966L002642K243001p28773l021884
$$ 2155918 152574 -2006256 -2994303 -1727337 1275305 3518306 2789533 -232351
12890b32351k421568J10948K131812K560213J708316K553j691878j788745L4943
$$ -232351 -2653919 -2542971 -411159 2149054 3857370 3859923 2168045 379300 414243
12881D14243J594229R77724l71967K37303K228025K235681p46569l609522l504242
$$ 414243 2008472 2986196 2614229 2851532 5079557 7315238 6568669 2959147 -545095
12872e45095j523964m73431q45989r57279M7402J326452K091780K489201K601517
$$ -545095 -2069059 -2542490 -3388479 -4345758 -4298356 -2971904 -880124 1609077 4210594
12863D210594J934024L86319j130504j618347j086458l18574J04211J52581j0311
$$ 4210594 6144618 6530937 5400433 3782086 2695628 2377054 2481265 2633846 2623535
12854B623535k53630l89801k66317l2788n7727n09859j165235j535885j038892
$$ 2623535 2369905 1980104 1713787 1680999 1623272 1113413 -51822 -1587707 -2626599
12845b626599N61218K372551K561442M07780k032898j800474J123582L389941
$$ -2626599 -2065381 307170 2868612 3276392 1243494 -556980 566602 3956543
12837C956543K436111m51071k302399k184832j230003k59655O50574J011031K96624
$$ 3956543 6392654 5941583 3639184 1454352 224349 -35306 615268 1626299 1922923
12828A922923q24756j187486o61343K34264J340193K075306J044579j551780k670238
$$ 1922923 1098167 -89319 -750662 -516398 823795 2899101 3943680 2391900 -278338
12819b78338l34849K597762K034946r98594j729941R28430K853014J257089j714237
$$ -278338 -613187 1984575 4019521 3020927 1290986 2219416 5072430 6329519 4615282
12810D615282l273394l586511l240723j288595J745220K759472Q22151n23865
$$ 4615282 1341888 -2244623 -5485346 -6773941 -5028721 -2269249 -1447098 -1970963
12802a970963J184246K936249J132907k225577k608920J9026J767387R78607m93861
$$ -1970963 -786717 2149532 3282439 1056862 -1552058 -1533032 234355 1212962 719101
12793G19101j259239j591312j205877M29022J938022J609467O09690J205679K451859
$$ 719101 -540138 -2131450 -3337327 -2908305 -970283 639184 1248874 2454553 4906412
12784D906412J509267j110734j858550K2385J222115j22775j620278q75450R06503
$$ 4906412 6415679 5304945 3446395 3468780 4690895 4568120 2947842 2072392 2978895
12775B978895J475513Q76337K88133j89567p90743j027412r16725j512989k890008
$$ 2978895 4454408 5330745 5618878 5429311 4638568 3611156 2694431 1181442 -1708566
12766a708566l344311j882670K07709J469322K169477K823434K682200J261144
$$ -1708566 -5052877 -6935547 -6727838 -5258516 -3089039 -265605 2416595 3677739
12758C677739k11428n05284k16228l73136n64369r3983K61255m42563j203478
$$ 3677739 3466311 2961027 2744799 2371663 1807294 1713311 1974566 1532003 328525
12749C28525l70042J375752J458821q78749l046799k175743J254384L906708L470470
$$ 328525 -41517 1334235 2793056 1914307 -1132492 -3308235 -2053851 1852857 5323327
12740E323327J056573p19587j167008j663993k579167k169071L34762K513025
$$ 5323327 6379900 5660313 4493305 2829312 250145 -1918926 -1584164 928861
12732I28861J803688n65653j348269j47780N86766J24388L66309J574435J035292
$$ 928861 2732549 2166896 818627 670847 1257613 1382001 1748310 3322745 4358037
12723D358037k189783m578256k928794P41867K182017R06963j28842L42405O87412
$$ 4358037 2168254 -2410002 -5338796 -4596929 -2414912 -1507949 -1636791 -1294386 -606974
12714f06974L9968j74725R76481K249944K256800J225752l8469j199837j662904
$$ -606974 -567006 -741731 234750 2484694 4741494 5967246 5928777 4728940 3066036
12705C066036n77293J425144K071304K70640k123992k651424j309931N1146M75147
$$ 3066036 2488743 3913887 5985191 6255831 4131839 1480415 170484 221630 696777
12696F96777L83810q5194j242720k247344j312627J588550L728810K728188k18703
$$ 696777 1080587 995393 -247327 -2494671 -3807298 -2218748 1510062 4238250 4019547
12687D019547j770652p27473Q01569P24412l05995n41679j49550p62010k437761
$$ 4019547 2248895 1521422 2322991 3047403 2741408 2199729 2050179 1288169 -1149592
12678a149592l042301j261400J273350K055273J003420K37291Q52364J527158
$$ -1149592 -4191893 -5453293 -4179943 -2124670 -1121250 -883959 -31595 1495563
12670A495563Q10980n65497p80328M23603J478093J203470P1903q94714j385678
$$ 1495563 2306543 1741046 960718 1384321 2862414 4065884 4137787 3243073 1857395
12661A857395j530770j266655n46405L95628J295155J755129R60755j258292l000425
$$ 1857395 326625 -940030 -1486435 -1090807 204348 1959477 2920232 1661940 -1338485
12652a338485j866359J258589K272585n93840l530484k142018K045199L596057
$$ -1338485 -3204844 -1946255 326330 -267510 -3797994 -5940012 -3894813 -298756
12644b98756Q57561k270078k401998o20704O36942J031718R86905L0633j470056
$$ -298756 558805 -1711273 -4113271 -4733975 -4097033 -3065315 -2078410 -2047777 -3517833
12635c517833j535516L39103J661083O46174q54445n03115O96876N52469k29062
$$ -3517833 -5053349 -4714246 -3053163 -2406989 -3261434 -3764549 -3067673 -2515204 -2744266
12626b744266O47395K816428L547455J864048l78984j419104j329543q87220n25489
$$ -2744266 -2096871 719557 4267012 6131060 5752076 4332972 3003429 2116209 1590720
12617A590720l65894p0304Q16693J508066L22658k415614l724827j978422M69641
$$ 1590720 1224826 1154522 1971215 3479281 3801939 1386325 -2338502 -4316924 -3847283
12608c847283Q87031K24961P97703J988849J644196O3227r82860j713338k994168
$$ -3847283 -2960252 -2735291 -1937588 51261 1695457 1758684 775824 -937514 -3931682
12599c931682l009294K81079M310662M333751M21991k650666k516344j393463
$$ -3931682 -6940976 -6659897 -2349235 1984516 2406507 -244159 -2760503 -4153966
12591d153966r00438R8183J459525Q16085j557460j850153J012383K818033O12901
$$ -4153966 -5054404 -4956221 -3496696 -2680611 -4238071 -6088224 -5075841 -2257808 -1644907
12582a644907k389366j766708J670839L805282K890967K88212k109027k604398
$$ -1644907 -4034273 -5800981 -4130142 -324860 2566107 2854319 745292 -1859106
12574a859106l32755K503771J842108k384608m785579j770031L089352M431633
$$ -1859106 -2191861 311910 2154018 -230590 -5016169 -6786200 -3696848 734785
12566G34785K541643J173297Q94780k88725j661427o66250J732883J801692p82859
$$ 734785 3276428 4449725 5344505 5055780 3394353 2728103 4460986 6262678 5479819
12557E479819k277911r77263M81646K2518p52842j09739O13307l32456j697075
$$ 5479819 3201908 2224645 2706291 2728809 1975967 1866228 2479535 2147079 450004
12548D50004j005430J524302K958112J289335k113881l932183k539451P3336P31137
$$ 450004 -555426 968876 3926988 5216323 3102442 -829741 -3369192 -3295856 -2564719
12539b564719o80962j165924N59627J776443L02077j339485K24842L088893K381901
$$ -2564719 -3245681 -4411605 -3851978 -2075535 -1773458 -3112943 -2888101 200792 2582693
12530B582693j852221m077003j465825K031208J957516l44216q10814R37020J955548
$$ 2582693 730472 -3346531 -4812356 -2781148 -823632 -1167848 -1978662 -1041642 913906
12521I13906J076091L6050M8883K84869q6632o85249j092799j387133j157138
$$ 913906 1989997 2026047 2074930 2359799 2273167 1587918 495119 -892014 -2049152
12512b049152L61458K639136L704894K334228m79746k645074k809249r94592J533707
$$ -2049152 -1687694 951442 4656336 6990564 6510818 3865744 1056495 61903 1595610
12503A595610K816383J846777Q5707j280J528563J751245q06564l459929l083906
$$ 1595610 4411993 6258770 6344477 6343197 7871760 9623005 8816441 5356512 2272606
12494B272606q51743j68087r16970J34379K976705L099048j388252n642879m590093
$$ 2272606 1420863 1252776 335806 470185 3446890 6545938 5157686 -485193 -5075286
12485e075286k53415J716979M59409j90466J065064J400150k49317j056086M39494
$$ -5075286 -5328701 -3611722 -3152313 -3342779 -2277715 -877565 -1126882 -2182968 -1743474
12476a743474J576018L35545j038081N6064K159270K254782M52409p07785j37330
$$ -1743474 -167456 168089 -869992 -813928 1345342 3600124 4052533 3344748 3207418
12467C207418J023565J430054N81558j066123j906466o19559J403613J295776
$$ 3207418 4230983 5661037 6242595 5176472 3270006 2650447 4054060 5349836
12459E349836p47668j161139J259064K831267P58390k008116j321713J462987
$$ 5349836 4602168 3441029 4700093 7531360 8289750 6281634 4959921 6422908
12451F422908J703130j275620l618171l029615j302668n69137m93065Q1518J167989
$$ 6422908 8126038 6850418 3232247 202632 -1100036 -1669173 -2162238 -2080720 -912731
12442i12731J958868J573663l65262k632455k857686o60412J134980L95997j036120
$$ -912731 1046137 2619800 2254538 -377917 -3235603 -3896015 -2761035 -2365038 -3401158
12433c401158n37701Q39080N17904p30214k43198J275923N98851k116536k964203
$$ -3401158 -3938859 -3099779 -2581875 -3312089 -3555287 -2279364 -1680513 -3797049 -6761252
12424f761252n52709J768637J350139r548K98515J575126J658498N26314k06670
$$ -6761252 -7313961 -5545324 -4195185 -4204733 -3906218 -2331092 -672594 -146280 -352950
12415c52950Q2308O03460M26321p16593j995242j735830N47754K666571K241646
$$ -352950 -270642 332818 759139 42546 -1952696 -3688526 -3140772 -474201 1767445
12406A767445L37642R3488J808898K389321K08198k488656l082118j825453m30347
$$ 1767445 2105087 2198575 4007473 6396794 6604992 4116336 1034218 -791235 -1221582
12397a221582J82269l71910k042810l105283j331866K334164L884318J612175
$$ -1221582 -1039313 -1411223 -3454033 -6559316 -7891182 -5557018 -1672700 -60525
12389f0525j176454q09174J708705K698324J079473r42664j383862l32552J106522
$$ -60525 -1236979 -2046153 -337448 2360876 3440349 2497685 1113823 781271 1887793
12380A887793J793307Q92685j146996k282534r87832J470523K128487j37543l020988
$$ 1887793 3681100 4573785 3426789 1144255 156423 1626946 3755433 3617890 596902
12371E96902l186894j10707K934655K409341j011393k893730p43149K588758L006576
$$ 596902 -2589992 -2700699 233956 2643297 1631904 -1261826 -2004975 583783 3590359
12362C590359Q70821l35355K00786J209j666867k246181m50279J276890O54783
$$ 3590359 4461180 4125825 4326611 4327820 2660953 414772 -35507 1241383 1896166
12353A896166j000940j202998K02828J789379K716836K457506L80488k636072
$$ 1896166 895226 -307772 -104944 1684435 4401271 6858777 7239265 4603193
12345D603193l977560k341466N31409K378758K809113K096764k799k635117l442173
$$ 4603193 625633 -1715833 -1184424 1194334 4003447 6100211 6097412 3462295 20122
12336B0122j772164j69934o14376j408627j81786J992852K263248M16134j100454
$$ 20122 -1752042 -1921976 -2536352 -3944979 -4126765 -2133913 129335 545469 -554985
12327e54985p83362N77410J581123J468315L34984n95452N9262J536960J242231
$$ -554985 -1338347 -760937 820186 2288501 2623485 2028033 2087295 3624255 4866486
12318D866486j348746l195612j942319M93482R03400n93333j537992j045473L8158
$$ 4866486 3517740 322128 -1620191 -1126709 -223309 -816642 -2354634 -3400107 -3361949
12309c361949J421606K969911L277626J454538p66638j306322p65987n44216J94871
$$ -3361949 -1940343 1029568 4307194 5761732 4995094 3688772 2922785 2378569 2573440
12300B573440K305292L337876P37596k989490l192497m75985J95168k066204k430881
$$ 2573440 4878732 8216608 8954204 5964714 2772217 2296232 2491400 425196 -2005685
12291b005685J289746M436191K751435j020656j897369l21149l24939k405201
$$ -2005685 -715939 3720252 6471687 5451031 3553662 3232513 2907574 502373
12283E02373l207910j458749L40341L94019J2697O16285J365652J118649M90918
$$ 502373 -2705537 -4164286 -3823945 -3429926 -3417229 -2800944 -1435292 -316643 174275
12274A74275M91578P24401L95727n3416K53118R58235R49630Q1375p96680j285653
$$ 174275 665853 1390254 1785981 1732565 1985683 2943918 3893548 3974923 3178243 1892590
12264A892590j695960j886417j145413L85531J333354Q40396k12553n02984N0664
$$ 1892590 196630 -1689787 -2835200 -2449669 -1116315 -275919 -488472 -991456 -940792
12255i40792P67072J422144J795616R42414j382254l211156k343666L57377J819901
$$ -940792 -173720 1248424 3044040 3986454 2604200 -606956 -2950622 -2593245 -773344
12246g73344R85616k07360m26514p20367j586700j194471J348377L349672J919701
$$ -773344 212272 4912 -421602 -1141969 -2728669 -3923140 -2574763 774909 2694610
12237B694610j593318l423940k548391j032580Q9162J901920M281342M724041
$$ 2694610 1101292 -2322648 -4871039 -5903619 -5814457 -3912537 368805 5092846
12229E092846J945515j598855k591926r89297L84155k44301j609087j491286K43519
$$ 5092846 7038361 5439506 2847580 1858283 2242438 1998137 389050 -1102236 -858717
12220h58717J459964N13114j539864k169662n41536J545941K039298Q70134o52873
$$ -858717 601247 1114361 -425503 -2595165 -3136701 -1590760 448538 1318672 665799
12211F65799j621104j901738j553848p31833L05217J546138K935227L534185K164726
$$ 665799 -955305 -2857043 -4410891 -5142724 -4837507 -3291369 -356142 3178043 5342769
12202E342769o01712k409043j857244q9481J083669J287824R74631K28212o75313
$$ 5342769 4741057 2332014 474770 385289 1468958 2756782 3731413 3959625 3284312
12193C284312q70929k24915J97683q3316k21823L2454l89820j530433j574170
$$ 3284312 2413383 2188468 2386151 2302835 2081012 2113466 1723646 193213 -1380957
12184a380957N7972J114498l0390j636212j532530m28601K03903R91388K385691
$$ -1380957 -1322985 -208487 -238877 -1875089 -3407619 -3836220 -3632317 -2640929 -255238
12175b55238K196610q02475l171940j198323K815405L570322Q42626p49870N23205
$$ -255238 1941372 1138897 -2033043 -3231366 -415961 3154361 3996987 3247117 3770322
12166C770322J571601N79495m33225k15908l74912j352666j063769O72519Q66952
$$ 3770322 5341923 5921418 5488193 5272285 4897373 3544707 2480938 3153457 4020409
12157D020409j421690k927250j520322M30424N03274n1574K44632l588j592707
$$ 4020409 2598719 -328531 -1848853 -1418429 -915155 -966729 -722097 -725685 -2318392
12148b318392k082984j67276J151910k38497r96787K128311N568932L773016j438432
$$ -2318392 -4401376 -4568652 -3416742 -3655239 -4652026 -2523715 3045217 6818233 5379801
12139E379801l034190L64403K579984j30235l494656k367879J536616K865626
$$ 5379801 2345611 2710014 5289998 5159763 1665107 -702772 833844 3699470
12131C699470L77338k477017l041795j949408o77414L68544R87464O10968n79042
$$ 3699470 4076808 1599791 -1442004 -3391412 -4068826 -3700282 -2712818 -2101850 -2680892
12122b680892j334186r41686j53548K85664J046421K808753M101539K590284j181093
$$ -2680892 -4015078 -4956764 -5110312 -4824648 -3778227 -969474 3132065 5722349 4541256
12113D541256l550818k443387k10367J42677n62476O8480J097037j29271k218812
$$ 4541256 990438 -1452949 -1663316 -1520639 -2083115 -2014635 -917598 -1046869 -3265681
12104c265681p98410L839323N574072J437989l219813k471882J388447J908176
$$ -3265681 -4064091 -224768 5349304 6787293 3567480 1095598 2484045 4392221
12096D392221j421337l034141l89352K526008J690275j490709k979691j288458
$$ 4392221 2970884 -63257 -452609 2073399 3763674 2272965 -706726 -1995184
12088a995184J805377L667230K815047Q3305j750334r69390O77325M96096q56367
$$ -1995184 -189807 3477423 6292470 6375775 4625441 3656051 4333376 4829472 3973105
12079C973105m44601J809314K580520M21003j957413k143270j442205j697989
$$ 3973105 3528504 5337818 7918338 8339341 6381928 4238658 2796453 1098464
12071A098464j717414J74568K228584J382830j801597l609886k309482Q5213J365396
$$ 1098464 -618950 -444382 1784202 3167032 1365435 -2244451 -4553933 -4468720 -3103324
12062c103324J723247J992508J639769R748j864978k288726j109278L03232R31700
$$ -3103324 -1380077 612431 2252200 2261948 396970 -1891756 -3001034 -2697802 -1766102
12053a766102R51618Q35237N42995j50829j014534j302861l14503J776395L501526
$$ -1766102 -814484 20753 563748 412919 -601615 -1904476 -2218979 -442584 3058942
12044C058942L069319L83922k312897k683992r32448P96203J329167J250001P85388
$$ 3058942 6128261 6512183 4199286 1515294 582846 1379049 2708216 3958217 4743605
12035D743605q84524l229291l518902l97255L277652L639005Q72625j528571j866782
$$ 4743605 3859081 629790 -2889112 -3286367 -8715 3630290 4502915 2974344 1107562
12026A107562j608837j813275j455267l1095J066077Q83079J89569n06184j682133
$$ 1107562 -501275 -2314550 -3769817 -3800912 -2734835 -1851756 -1662187 -2168371 -3850504
12017c850504k598799j280205J914110L695242K599303J257994J747605J992439
$$ -3850504 -6449303 -7729508 -5815398 -2120156 479147 1737141 3484746 5477185
12009E477185j92787k651232k337467n80509m56024j034779O30245L127010K059405
$$ 5477185 5284398 2633166 295699 -284810 -740834 -1775613 -1145368 1981642 4041047
12000D041047k240822m158138j208104K262411J998751j75614l50880J237679
$$ 4041047 1800225 -2357913 -3566017 -1303606 695145 519531 168651 1406330
11992A406330J681875O13121J15793O44420M40979j127606k226589j052557J743699
$$ 1406330 3088205 3701326 3817119 4461539 4902518 3774912 1548323 495766 2239465
11983B239465L623931K708001k55739k529383k426066j223052j032355j591782
$$ 2239465 5863396 8571397 8315658 5786275 3360209 2137157 1104802 -486980
11975d86980j125305J89223L55078p58934r36050M58087J235922L76825J4264
$$ -486980 -1612285 -1423062 -1067984 -1826918 -2762968 -2304881 -1068959 -692134 -677870
11966f77870J458621K356721N44146j960292k096505p44580q16582j880920r19821
$$ -677870 780751 3137472 3681618 1721326 -375179 -1119759 -1936341 -3817261 -4737082
11957d737082K004480L113382O74668k247373k275526q9828J490160J573124J254988
$$ -4737082 -2732602 380780 1055448 -1191925 -3467451 -3557279 -2067119 -493995 760993
11948G60993J075149N86062j58711n19825n43922q53234j175072l60846J591532
$$ 760993 1836142 2422204 2263493 1743668 1199746 346512 -828560 -1189406 402126
11939D02126K691237J219497j713587l157314j854181M92271J795265J957574
$$ 402126 3093363 4312860 2599273 -558041 -2412222 -1919951 -124686 1832888
11931A832888J801318J176983k03475j182755n38889O49205K67746j477953k319305
$$ 1832888 3634206 4811189 4607714 3424959 2886070 3535275 3803021 2325068 5763
11922E763j446825k57477M84605J392731K025176R34063j054206j133910O04477
$$ 5763 -1441062 -1698539 -1213934 178797 2203973 3138036 2083830 949920 1554397
11913A554397N28579k203288k987126J036376N130410L288179k390021m452170
$$ 1554397 2082976 -120312 -3107438 -2071062 3059348 6347527 3957506 -494664
11905d94664q78654K870796K583576L01083o26933l86242m39048m87168j26849
$$ -494664 -1373318 1497478 4081054 4382137 3755204 3368962 2929914 2442746 2315897
11896B315897l85248j395938j306598M44851J430318l5039j928500j594059L86248
$$ 2315897 1930649 534711 -771887 -327036 1103282 1068243 -860257 -2454316 -2068068
11887b068068J722920J853288J444091K41066j973866l574108k751274j81768
$$ -2068068 -345148 1508140 2952231 3193297 1219431 -2354677 -5105951 -5287719
11879e287719J901817K353637J273455q97555k550485j169759K903619M870464
$$ -5287719 -3385902 -1032265 241190 -656365 -3206850 -4376609 -1472990 3397474
11871C397474J184964m438319m989336J49802M072633J895973k969835m394139
$$ 3397474 4582438 144119 -4845217 -4695415 -622782 1273191 -1696644 -6090783
11863f090783j675147J286701K446221L069124L594876K286853j023108l140194
$$ -6090783 -7765930 -6479229 -4033008 -963884 2630992 4917845 3894737 754543
11855G54543j572443J583304K318845L43449p43779Q87671K361467N34234k829534
$$ 754543 -817900 765404 3084249 3427698 2683919 3571590 5933057 6467291 3637757
11846C637757l292465l02493J969240R30431p61834J42213K035254R88901k779217
$$ 3637757 345292 42799 2012039 2942470 2180636 2322849 4358103 5347004 2567787
11837B567787m787100k607633J107236K752897J975197L76401j322314k726043
$$ 2567787 -2219313 -4826946 -3719710 -966813 1008384 1384785 62471 -2663572
11829b663572k416322J51094K481199J588290j487418k402645O28600M068952
$$ -2663572 -5079894 -4928800 -2447601 -859311 -2346729 -4749374 -4120774 -51822
11821e1822L589372l13405l206277k439608J94473J684255J585887J336700J209393
$$ -51822 3537550 3224145 17868 -2421740 -2227267 -543012 1042875 2379575 3588968
11812C588968Q0313j863461k314555Q4152L137982L273393J1216l283589l374093
$$ 3588968 3669281 1805820 -508735 -424583 2713399 5986792 5998008 2714419 -659674
11803f59674n89423K199963K843259J326941j004321k426374j721071N29210J861325
$$ -659674 -1249097 950866 3794125 5121066 4116745 1690371 -30700 498510 2359835
11794B359835N24792k044093k846427j268457N13801J185579J782608K617958
$$ 2359835 2884627 840534 -2005893 -3274350 -2760549 -1574970 207638 2825596
11786B825596J739100j312523l002323n62484K852142K275438j048180j291715
$$ 2825596 4564696 3252173 249850 -312634 2539508 4814946 3766766 2475051
11778B475051K255533L545415j78341l310552j065574K233313K72523m397675
$$ 2475051 4730584 8275999 8097658 4787106 3721532 5954845 6227368 1829693
11770A829693m396175K13217K262132m24858j999874Q26381L413547J678168j230678
$$ 1829693 -2566482 -2353265 -91133 -515991 -2515865 -1689484 1724063 3402231 2171553
11761B171553j127321M02558L78655M02196K701222M504772K342507j327989j792274
$$ 2171553 1044232 1446790 1825445 2227641 4928863 9433635 11776142 10448153 8655879
11752H655879J94400L14853j736831k648293j961003k060011k648754j307680
$$ 8655879 8850279 9165132 7428301 4780008 2819005 758994 -1889760 -3197440
11744c197440Q95718M18657k109675k236535Q36343K962173K054255O29490K47285
$$ -3197440 -2301722 -1883065 -3992740 -6229275 -5392932 -2430759 -376504 252986 500271
11735E00271p98403k688648k693721n22889M35938p13383n63233J954010L040253
$$ 500271 -298132 -2986780 -5680501 -6203390 -5767452 -6480835 -7044068 -5090058 -2049805
11726b049805J037514j52996J686676K600591j64650k281408L68468L803826K113229
$$ -2049805 -1012291 -1165287 521389 3121980 2957330 675922 1044390 4848216 6961445
11717F961445k628793l850268r06895J256179Q11860K37232Q1676j400710k950732
$$ 6961445 4332652 482384 -424511 831668 1643528 1880760 1962436 561726 -2389006
11708b389006j404906J916730K342712l85228j782668m83968J30779q58433L2303
$$ -2389006 -3793912 -1877182 465530 80302 -1702366 -2186334 -2055555 -2913988 -2881685
11699b881685L361360M180579M9426m219397l789320q07307K09229k11260J309856
$$ -2881685 479675 4660254 4709680 490283 -3299037 -4106344 -3897115 -4108375 -2798519
11690b798519M294900N002910K378134q25344k293792k243852j601656p33151
$$ -2798519 1496381 6499291 8877425 8052081 5758289 3514437 1912781 1179630
11682A179630P8771O62096J200313J413613M54965j355962k085926p84400Q61059
$$ 1179630 1258401 1920497 3120810 4534423 4989388 3633426 1547500 763100 1624159
11673A624159R09289r7266l34725M32859P59172l21986k187401l298847k519670
$$ 1624159 2533448 2436182 2101457 2534316 3293488 2971502 784101 -2514746 -5034416
11664e034416l42163J271955J229560Q79491J620555J958456k12312l056518k443844
$$ -5034416 -5376579 -4104624 -2875064 -1995573 -375018 1583438 1371126 -1685392 -4129236
11655d129236J473287L596130J215065k130645k338352m30588L69441l7206L58823
$$ -4129236 -2655949 940181 2155246 24601 -2313751 -2744339 -2374898 -2412104 -2053281
11646b053281J725180K663356K613399J439380j282552m198513m027435k54341
$$ -2053281 -328101 2335255 4948654 6388034 5105482 906969 -3120466 -3374807
11638c374807K808558J856027m05532J14895K148059J688096q78933j696048l26135
$$ -3374807 -566249 1289778 884246 999141 3147200 4835296 3956363 2260315 1934180
11629A934180j95214k233436l210863j189476J673907K802004K180394Q93897
$$ 1934180 1738966 -494470 -3705333 -4894809 -3220902 -418898 1761496 2655393
11621B655393k85130m58770M84031P68833n71412j007229J623152L941153J065411
$$ 2655393 2370263 1911493 2395524 3164357 2592945 1585716 3208868 7150021 8215432
11612H215432m757582n974277j006949L068942J446677j548204m88102K302182
$$ 8215432 3457850 -2516427 -3523376 -454434 992243 -555961 -1044063 1258119
11604A258119J498365k034167l114807p39857J377897J490005J418127J793055
$$ 1258119 2756484 722317 -2392490 -3132347 -1754450 -264445 1153682 2946737
11596B946737Q31330j492197k392166o73086J173140P43388r14837j204012M63529
$$ 2946737 3778067 2285870 -106296 -779382 393758 1137146 222309 -981703 -518174
11587e18174K287545K344554N30991j317104j333505k6661J15106j817907l473136
$$ -518174 1769371 4113925 4644916 3327812 1994307 1967646 2082752 264845 -3208291
11578c208291k617365n85512k9020n55245L31014K567535L288530J592042K03402
$$ -3208291 -5825656 -6411168 -6440188 -6995433 -6664419 -4096884 -808354 783688 987090
11569I87090J101987K304858J000208k033913l421178j754733P92244J431509
$$ 987090 2089077 4393935 5394143 3360230 -60948 -1815681 -1023437 408072
11561D08072N4451r65350O5010J784909J363308j425794l179871j240278K213344
$$ 408072 462523 -502827 -437817 1347092 2710400 1284606 -1895265 -3135543 -922199
11552i22199K773418n4520k202233r48406J451628J484434o74626k047275j158002
$$ -922199 1851219 1796699 -405534 -1353940 97688 1582122 907496 -1139779 -2297781
11543b297781P44780J982214K026096J108178k13009j125228j134036m05637P86223
$$ -2297781 -1553001 429213 2455309 3563487 3350478 2225250 1091214 685577 1471800
11534A471800K084540K241159R019l263522m110595j717832J74313j218106k774864
$$ 1471800 3556340 5797499 5806518 2542996 -1567599 -3285431 -3111118 -4329224 -7104088
11525g104088j32632M482230M645427j43641k961093M0489L716124K272324j820438
$$ -7104088 -7236720 -2754490 1890937 1747296 -1213797 -1173308 2542816 4815140 2994702
11516B994702k679564o85569n75699k255820j068417L072665M353491M80928l362174
$$ 2994702 315138 -370431 -946130 -3201950 -4270367 -1197702 3155789 3636717 274543
11507B74543k870348q44742j100979j568483J183102M561153L373989j429700
$$ 274543 -2595805 -3440547 -4541526 -6110009 -4926907 -365754 3008235 1578535
11499A578535l579529o12716L121247L116548L4498k619621k783162q03332J419981
$$ 1578535 -2000994 -2613710 507537 3624085 3658583 1038962 -1744200 -2547532 -1127551
11490a127551J788299M20593J44927K305266L567061N00396m023903l967435O42058
$$ -1127551 660748 1081341 1226268 3531534 7098595 7598991 3575088 -392347 249711
11481B49711L212917L92473l239286k661287M57600J546717L6215j371476j405384
$$ 249711 3462628 3855101 615815 -2045472 -1587872 -41155 -4940 -1376416 -2781800
11472b781800o09251O86990J704635P84232j608662k029355Q61167L227366J526716
$$ -2781800 -3391051 -2704061 -999426 -215194 -1823856 -3853211 -2992044 235322 1762038
11463A762038j807680k181060K47732J939223J979134J792544P98828k168101
$$ 1762038 -45642 -2226702 -1978970 -39747 1939387 3731931 4530759 2362658
11455B362658m430655k347494J971645K904492K73486l89085K558368L806500
$$ 2362658 -2067997 -4415491 -2443846 460646 734132 345047 2903415 6709915
11447F709915O2997m228496l886686n72946R41198N5600n76641j73697K92898
$$ 6709915 6772912 2544416 -1342270 -1915216 -974018 -918418 -1495059 -1668756 -1375858
11438a375858J006782K163091J950759o09970k730769j496844J264428J583875
$$ -1375858 -369076 1794015 3744774 3134804 404035 -1092809 171619 1755494
11430A755494o04628j947892j172674j48321J0320J34185M19274N1957n45194
$$ 1755494 1150866 -797026 -1969700 -2118021 -2107701 -1973516 -1554242 -1502285 -2047479
11421b047479j21168Q16970P24855Q4039O48663J788011R36416k006025l930754
$$ -2047479 -2168647 -1351677 -626822 -542783 105880 1893891 2830307 824282 -3106472
11412c106472k801458R7464K627782L793247L034637N03166j614736j100970O52563
$$ -3106472 -5907930 -5810466 -3182684 610563 3645200 4148366 2533630 1432660 2085223
11403B085223L08876j877951k214740J9620J003708r94425k258912M7064K615434
$$ 2085223 2394099 516148 -1698592 -1678972 -675264 -1669689 -3928601 -3881537 -1266103
11394a266103J264233j974016j982190J379476L400414J766663r44501j859729
$$ -1266103 -1870 -1975886 -3958076 -2578600 821814 2588477 1643976 -215753
11386b15753q96581R01448K579287K594771K48922j980441r20741K102719K242853
$$ -215753 -1112334 -210886 2368401 4963172 5212094 3231653 2310912 4413631 6656484
11377F656484j703970m885510l138221J088002K362273l63468l129139k655244
$$ 6656484 4952514 67004 -3071217 -1983215 379058 15590 -3113549 -5768793
11369e768793K08212K597383K894223J392359o41597j719701q96747J211361K433065
$$ -5768793 -5560581 -2963198 -68975 1323384 681787 -1037914 -1934661 -723300 1709765
11360A709765J037296j914135l068702o41938K848515L404664Q97671q99361k30318
$$ 1709765 2747061 832926 -2235776 -2877714 -29199 3375465 4273136 3373775 3143457
11351C143457k2754k489851m431847j938498K576458L335079K87285p57134K171709
$$ 3143457 3120703 630852 -3800995 -5739493 -3163035 172044 459329 -297805 1873904
11342A873904L665945j46036m788686m036746Q10050L535446K231178L89528J53194
$$ 1873904 5539849 5393813 605127 -3431619 -2621569 913877 3145055 3534583 3687777
11333C687777n546r20458j020604J43721P40257R4381k41533J51111l52907j773640
$$ 3687777 3682231 2761773 1741169 1884890 2625147 2719528 2477995 2629106 2276199 502559
11323E02559j583272Q60504K425292J031661q39560k66349J382593J242576R1612
$$ 502559 -1080713 -220209 2205083 3236744 2397184 2130835 3513428 4756004 4847616
11314D847616O26585K097384J133221k376043m510341l096578n00706N46726N26629
$$ 4847616 5474201 7571585 8704806 6328763 1818422 -1278156 -1778862 -1232136 -705507
11305g05507Q30763Q95793p7993q56098j22009R56557N31710q44173j278048n75610
$$ -705507 125256 1021049 943056 86958 -35051 921506 1453216 609043 -669005 -1244615
11295a244615J12271O35219J305819R97858j231487l218352j789279K153275M124636
$$ -1244615 -1132344 -497125 808694 1806552 575065 -2643287 -4432566 -2279291 1845345
11286A845345K265376m22650j106955p25061p86157k97420J360342J784474o75654
$$ 1845345 4110721 3688071 2581116 1856055 1069898 772478 2132820 3917294 3241640
11277C241640l109675k020093Q82570J245384r37957j701301P3666J245874K94720
$$ 3241640 131965 -1888128 -1005558 239826 -698131 -2399432 -2325766 -1079892 -785172
11268g85172k83435J102904K181986Q72529j313235k147752j884876j472270n13660
$$ -785172 -1068607 34297 2216283 3088812 1775577 -372175 -2257051 -3729321 -4242981
11259d242981Q68515J049905n6563k3540J711917J910899j061180l455020j694193
$$ -4242981 -3374466 -2324561 -2381124 -2404664 -692747 1218152 156972 -3298048 -4992241
11250d992241J520698J492312p09180m60833K049286K055888j294928l085864
$$ -4992241 -3471543 -1979231 -2688411 -3149244 -1099958 955930 -338998 -3424862
11242c424862o78649K104251J372033j044672j412617N3260P55780M71199R12241
$$ -3424862 -4103511 -1999260 -627227 -1671899 -3084516 -3031256 -2275476 -1804277 -892036
11233h92036K082301K226460P14688j299743k561576k519499j243388K86830Q19899
$$ -892036 1190265 3416725 4131413 2831670 270094 -2249405 -3492793 -3205963 -2386064
11224b386064N88376R57654J671967P30089j823811k761346l86146K286840J857655
$$ -2386064 -1797688 -840034 831933 1562022 -261789 -3023135 -3409281 -1122441 735214
11215G35214l21582p37472N17805O28037n35312m15255J057630R13948j455134
$$ 735214 413632 -323840 193965 822002 286690 -128565 929065 1843013 387879
11206C87879k687991q70995J270341Q40595q42511j033444l0197K09984r5692
$$ 387879 -2300112 -3171107 -1900766 -1060171 -1902682 -2936126 -2966323 -2756339 -2852031
11197b852031O27772J949453K039656Q85295P804m42713j418876k234744j208289
$$ -2852031 -2224259 -274806 1764850 2650145 2657949 2215236 796360 -1438384 -2646673
11188b646673R65025J662049N40603P2244J140522J562473L60014p7681J657520
$$ -2646673 -1681648 -19599 521004 593248 1733770 3296243 3656257 3578576 5236096
11179E236096K836912Q92360j950815k105033m76306n42050k081601j766056M90235
$$ 5236096 8073008 8965368 7014553 4909520 4433214 3891164 1809563 43507 533742
11170E33742J045360r25529j640898P06768K504289P49121j813499j396890N63221
$$ 533742 1579102 653573 -987325 -280557 2223732 2972853 1159354 -237536 325685
11161C25685M41091r31227O7124K870238K990012n53627l258076k048414K87031
$$ 325685 766776 -164451 -97327 2772911 5762923 5209296 1951220 -97194 189837
11152A89837j4779j886398j716111P49629K256173J095920o98386o98735N06312
$$ 189837 175058 -1711340 -3427451 -2677822 -421649 674271 -24115 -722850 -216538
11143b16538N35020j033465j681602O55094M097771M365226K13752m375952m900279
$$ -216538 318482 -714983 -2396585 -1741491 2356280 6721506 6935258 2559306 -2340973
11134b340973j872311N44992O15487P20443K562770L816860J593563k656763m357173
$$ -2340973 -4213284 -3668292 -3052805 -2332362 230408 4047268 5640831 2984068 -1373105
11125a373105j609991K310325K916521k32093l256780k650611Q25988L520312
$$ -1373105 -2983096 -672771 2243750 2011657 -1245123 -3895734 -3069746 450566
11117D50566L364259J597786J77311o16182j210044j307391r35710j265321k461524
$$ 450566 3814825 5412611 5589922 4973740 3763696 2456305 1520595 255274 -2206250
11108b206250k326829M28146L040220K082003r69029j465382J281196K982729
$$ -2206250 -4533079 -4104933 -1064713 1017290 48261 -1417121 -135925 2846804
11100B846804J352290m28671O65835K523517J727237q38053j962708j406622j265822
$$ 2846804 4199094 3770423 4436258 6959775 8687012 7848959 5886251 4479629 3213807
11091C213807j586965o95973Q65756P79807p42502r53785O49928J295340k31420
$$ 3213807 1626842 930869 1796625 2576432 1833930 880145 1530073 2825413 2593993
11082B593993j342950j39186J110435k59717k518886j982508J036077K393356
$$ 2593993 1251043 1111857 2222292 1962575 -556311 -2538819 -1502742 890614
11074H90614K55556k227241j455499J905011M318642L777323J110941j869976
$$ 890614 1146170 -1081071 -2536570 -631559 3687083 7464406 8575347 6705371
11066F705371l678655l293789r22040J442550J761110L14165r60372j279692j478741
$$ 6705371 3026716 -267073 -1189113 253437 2014547 2328712 1368340 88648 -1390093
11057a390093j702614q23413J149304K205508J172352l55263m49482L49802M15645
$$ -1390093 -3092707 -3916120 -2766816 -561308 611044 255781 -193701 156101 571746
11048E71746j98088m08459l64379p73530q21656P20384K696744K443158l53937
$$ 571746 373658 -34801 -399180 -1172710 -1994366 -1273982 1422762 3865920 3511983
11039C511983k895859k796309n80494J617441K188586P34573j673344k752628
$$ 3511983 616124 -2180185 -2760679 -1143238 1045348 1779921 106577 -2646051
11031b646051j156737J554197K627385J539707p6535j332642k405897k358798
$$ -2646051 -3802788 -2248591 378794 1918501 1841966 509324 -1896573 -4255371
11023d255371J26906L400065L574073j25481l669186l462076o70030J410257J769977
$$ -4255371 -4128465 -728400 2845673 2720192 -948994 -4411070 -5081100 -3670843 -1900866
11014a900866J339859M31016r24723j545800m41098J313019J975102J573641J231152
$$ -1900866 -561007 -129991 -1054714 -2600514 -3041612 -1728593 246509 1820150 3051302
11005C051302R61919n0489j565138k284896j481997L98761K279864K877805J441017
$$ 3051302 4013221 3962732 2397594 112698 -1369299 -970538 1309326 4187131 5628148
10996E628148j124249k697301k186343n08924R07199J318254K99749j828496k852920
$$ 5628148 4503899 1806598 -379745 -888669 18530 1336784 1636533 -191963 -3044883
10987c044883m53975L891051N465837K344067j709892k389157m40795M46384p48816
$$ -3044883 -3498858 392193 5858030 8202097 6492205 4103048 3662253 4108637 3359821
10978C359821j980144k038925j696405j366673l04282J681334L472452L770759
$$ 3359821 1379677 -659248 -2355653 -3722326 -4026608 -2345274 1127178 4897937
10970D897937K120585p03092k798266k749857j572976j349278j656431j12439
$$ 4897937 7018522 6315430 3517164 767307 -805669 -2154947 -3811378 -3923817
10962c923817K766228L035057l38577k656143l39427L139322K606236o74668j601383
$$ -3923817 -1157589 1877468 1538891 -1117252 -1456679 1682643 4288879 3614211 2012828
10953B012828K09342N51537j540536k301764j12986J745475O69672j616578k634474
$$ 2012828 2222170 2773707 1233171 -1068593 -1181579 563896 1233568 -383010 -3017484
10944c017484k333292j160564J188913L440773K849870m91678k798297j850824
$$ -3017484 -5350776 -6511340 -5322427 -1881654 968216 476538 -2321759 -4172583
10936d172583J17698N48021J76639M69848P66830L82463M82961J387135J086082
$$ -4172583 -4054885 -3506864 -3330225 -2860377 -2093547 -1711084 -1228123 159012 1245094
10927A245094q65064j279791J488507L537429Q92858l562358l762337L29590K651743
$$ 1245094 380030 -899761 588746 4126175 5019033 1456675 -2305662 -1976072 675671
10918F75671J94301l007217k389146R65995K920160J989534R5450m73072R82422
$$ 675671 869972 -2137245 -4526391 -3560396 -640236 1349298 1444748 971676 1954098
10909A954098L226149L566524L62302l973524m615538m10230L891387L510788
$$ 1954098 5180247 8746771 9109073 5135549 520011 109781 4001168 7511956
10901G511956k57414k470919j503026k16240o98006j439069o49940N28289o9707
$$ 7511956 7254542 4783623 3280597 3064357 2366351 927282 277342 805631 735924
10892G35924k168791l227800j428317K451491N607829N322806J469350k773367
$$ 735924 -1432867 -4660667 -6088984 -3637493 1970336 7293142 8762492 5989125
10884E989125l837245j650922P36710J472015J700551K423112K175705l47044
$$ 5989125 2151880 500958 1237668 2709683 4410234 6833346 9009051 8662007
10876H662007l405507m243882k696784o97861O51659J486049J724192J279765
$$ 8662007 5256500 1012618 -1684166 -2382027 -1730368 -244319 1479873 2759638
10868B759638Q49265P45316P6515j308800j786298p93118m79954j969820k515117
$$ 2759638 3608903 4354219 4430734 3121934 1335636 542518 62564 -1907256 -4422373
10859d422373J59393L202354K677039L0348n86203M56037k77467j961093o35008
$$ -4422373 -4262980 -1060626 1616413 1646761 1060558 1516595 1239128 -721965 -1356973
10850a356973K668528K545132j164757k321404R13098K615277l45656k530181
$$ -1356973 1311555 3856687 2691930 370526 1283624 3898901 3553245 1023064
10842A023064K06344K785397l61100n093361m148900Q39773K535315N4864q09767
$$ 1023064 1229408 4014805 3653705 -1439656 -5588556 -4748783 -2213468 -2158604 -2968371
10833b968371J747083L004390L35266k674414k301924M06155K392676K366148
$$ -2968371 -1221288 1783102 2118368 -556046 -2857970 -2451815 -59139 2307009
10825B307009P83622r64846j106696L38699P19186j411668l310338k005601Q41344
$$ 2307009 3090631 2125785 1019089 1357788 2076974 665306 -2645032 -4650633 -3809289
10816c809289J755558R32751O91809O98583m95610j304549K17853J564526n35747
$$ -3809289 -2053731 -1120980 -429171 269412 -226198 -1530747 -1312894 251632 -284115
10807b84115l429121k079772K003113K618737p91568k356608N7355J766748K21697
$$ -284115 -3713236 -5793008 -3789895 -1171158 -1962726 -4319334 -4261979 -2495231 -2273534
10798b273534o50779J733781L403769Q21009k565764j758713J893111L149748
$$ -2273534 -2924313 -1190532 2213237 3034246 468482 -1290231 602880 3752628
10790C752628N38799k680251l449466j507278J584870L555760K836770N48771
$$ 3752628 4291427 1611176 -1838290 -3345568 -1760698 1795062 4631832 5180603
10782E180603l98575P23822J425164m5349k102567k506003j345457K9412R79382
$$ 5180603 4782028 5505850 6931014 6885665 4783098 2277095 931638 961050 1940432
10773A940432J230514N08133m27415k17211Q74500J079458m1113r89997r77334
$$ 1940432 3170946 3679079 3251664 3034453 3908953 4988411 4947298 3957301 2979967
10764B979967r01351j229903j211178p18856o72352j121894r67730M8388R40752
$$ 2979967 2078616 848713 -362465 -1081321 -1753673 -2875567 -3843297 -3794909 -2854157
10755b854157J158756R50406L74293l51616l18965M63383L03553j267055j823489
$$ -2854157 -1695401 -744995 -370702 -722318 -1041283 -577900 -274347 -1541402 -3364891
10746c364891M6358J612233K76028j610511n77792J730527J340044r85896j184919
$$ -3364891 -3318533 -1706300 -1430272 -3040783 -3618575 -1888048 -548004 -1533900 -2718819
10737b718819R17954J760115N56813j67319J9076p23699j805508j033246N21466
$$ -2718819 -1800865 -40750 516063 348744 367820 -355879 -2161387 -3194633 -2673167
10728b673167K41287m95498J292262L602739K266627r76028j039008J056958J16405
$$ -2673167 -2431880 -2927378 -1635116 1967623 4234250 3258222 2219214 3276172 3392577
10719C392577k653034j090828L624633L269912k871054n232052L82842N415463
$$ 3392577 739543 -351285 3273348 6543260 3672206 -1559846 -1177004 4238459
10711D238459K412558l613727m380304n36546K309928K786234K276085K38404
$$ 4238459 6651017 3037290 -1343014 -1879560 430368 3216602 5492687 5731091
10703E731091k904923l561930q19728R09217n82125j331043R57506K132472m63683
$$ 5731091 2826168 -735762 -1555490 -646273 -1228398 -2559441 -1601935 530537 66854
10694F6854k551853q67880P40631r21500j890413J174319L857609J702747j676530
$$ 66854 -2484999 -3352879 -2612248 -3533748 -5424161 -4249842 -392233 1310514 -366016
10685c66016j451540j4441j109638k011788N58331K916541R86458j544367M6083
$$ -366016 -1817556 -1831997 -2941635 -4953423 -4395092 -1478551 -492093 -2036460 -1990377
10676a990377K509315R87133j484427l5564K111967l62067m096924k658321J553012
$$ -1990377 518938 1506071 21644 -13920 2098047 1735980 -2360944 -5019265 -3466253
10667c466253J734524q34540J53839L587667K963727j140991j927916J295985
$$ -3466253 -1731729 -2566269 -2412430 1175237 4138964 2997973 1070057 2366042
10659B366042K472765J47482q64571O21069M03515k243210l040827r50766L64138
$$ 2366042 4838807 4986289 4121718 4742787 5146302 2903092 -137735 -1088501 -724363
10650g24363j3026P17646K204827J017011j973974k013586J219411L085662K012602
$$ -724363 -737389 -19743 2185084 3202095 1228121 -785465 433946 3519608 5532210
10641E532210P87841k0530k314136m283118j984155K686564L658578P26533l15995
$$ 5532210 6320051 6299521 3985385 -297733 -2281888 404676 4063254 4789787 4473792
10632D473792J780369J783079j834639l507428k38325L183279K228651p16706
$$ 4473792 6254161 8037240 6202601 2695173 2456848 5640127 7868778 7152072
10624G152072j547279q20440j160464k434114k815654j820802j66131J222124
$$ 7152072 5604793 4784353 3623889 1189775 -1625879 -3446681 -3612812 -2390688
10616b390688J268689j01634j139363o67827J5382j51746J32466J233701O92665
$$ -2390688 -1121999 -1223633 -2362996 -3030823 -3015441 -3167187 -3034721 -1801020 -1108355
10607a108355j835244k148187J408774L441866J4937l579009r49057M335350M474754
$$ -1108355 -2943599 -5091786 -3683012 -241146 -226209 -3805218 -4754275 -418925 4055829
10598D055829K40751j421498L51809L46644k224185k838810n15583J153853J155702
$$ 4055829 4296580 2875082 3226891 3573535 1349350 -1489460 -2005043 -851190 304512
10589C04512J368293R97434j605490l456508j167736J749750J16185l275447k292002
$$ 304512 1672805 2670239 1064749 -2391759 -3559495 -1809745 -1693560 -4969007 -7261009
10580g261009J330772J323611j403905r67384K005122K081022J14250J293629
$$ -7261009 -5930237 -4606626 -6010531 -6977915 -4972793 -2891771 -2777521 -1483892
10572a483892L939167J973168k878912l337469J58839O19093k088008j602525
$$ -1483892 2455275 4428443 1549531 -1787938 -1629099 -1010006 -3098014 -4700539
10564d700539J819207J556519k147789k272281J450673K156868o46043m62742
$$ -4700539 -2881332 -1324813 -3472602 -5744883 -4294210 -2137342 -2783385 -3246127
10556c246127K794989K369982j577544j573418K675677L347561n63311j541852
$$ -3246127 -451138 1918844 341300 -1232118 1443559 4791120 4227809 2685957
10548B685957J581925J486754k840078l633514P84996K856099Q2077j404134K33655
$$ 2685957 4267882 5754636 2914558 -718956 66040 2922139 3004216 1600082 1833737
10539A833737k5219k031097k33045L382024J218288m313252l246679L248004L949901
$$ 1833737 1808518 -222579 -455624 2926400 4144688 -168564 -3415243 -167239 3782662
10530C782662j825688l202968J462723K254020k133925k214445K268912J383832
$$ 3782662 1956974 -1245994 216729 2470749 336824 -1877621 391291 1775123
10522A775123l802759j657797O022916M743140m922062o347635K308121M161492
$$ 1775123 -2027636 -3685433 2337483 7080623 2158561 -4189074 -1880953 2280539
10514B280539m145573n892995K954031N519332k651082m372589M762519O549025
$$ 2280539 -1865034 -7758029 -4803998 715334 -1935748 -6308337 -1545818 5003207
10506E003207l516762n691997N018400P241951m483982o780882O151329Q078797
$$ 5003207 1486445 -4205552 812848 8054799 3570817 -3210065 2941264 11020061
10498A1020061p200973r223679R204026J1658199j1010271j3599713J7169958
$$ 11020061 3819088 -5404591 3799435 15457634 4447363 -9152350 8017608
10491H017608K2794414j7971532j9100550P8460663J68818274J04822684p2532364
$$ 8017608 30812022 12840490 -6260060 72200603 241018877 345841561 273309197
10484B73309197j68048097r9178468Q154397K3529417j9371387k4345786P659788
$$ 273309197 105261100 6082632 14237029 37766446 18395059 -5950727 1709061
10477A709061J4028935p717938j1217265O278525Q334218o503291p266549O776116
$$ 1709061 15737996 8020058 -3197207 3081318 11415536 4912245 -2354304 4421812
10469D421812P998079m592749o471280L417509L458552o374790n677514N075904
$$ 4421812 12419891 7827142 1355862 4773371 8231923 1857133 -3820381 1255523
10461A255523N682249m277955n673776K515313K461859o529144o433958M446992
$$ 1255523 6937772 2659817 -3013959 -498646 1963213 -4565931 -10999889 -6552897
10453f552897Q103753N30922k439070L823624N398747k081551n520043k2553K777552
$$ -6552897 1550856 2081778 -357292 3466332 8865079 6783528 1263485 1240932 4018484
10444D018484k010520m193192M86572K562585j672319k903178K630295N729846
$$ 4018484 2007964 -2185228 -1698656 863929 -808390 -3711568 -1081273 4648573
10436D648573J687815j809443j48785O67364k395178l136761R53913L140076N9531
$$ 4648573 6336388 4526945 4378160 5045524 2650346 -486415 467498 3607574 3667105
10427C667105k510617j053055J37982j326229j622640O45756J783475J190785
$$ 3667105 1156488 103433 241415 -1084814 -2707454 -2061698 -278223 912562
10419I12562K166273L407566K49355m980190m917399j2027J968099l46901o88582
$$ 912562 3078835 6486401 6735756 1755566 -3161833 -3173860 -1205761 -1552662 -2241244
10410b241244J805774J007937l275441l602512J417718M088213J339553m06012
$$ -2241244 -435470 572467 -2702974 -6305486 -4887768 -799555 539998 133986
10402A33986K287094L897683Q02902k236183j133225R99683P48408j47110Q6568
$$ 133986 2421080 6318763 7121665 4885482 3752257 4751940 5500348 5353238 5439806
10393E439806r0340r68565n13977M50447r94398l172263j653779J838825J057222
$$ 5439806 5349466 4380901 3866924 4317371 3322973 150710 -1503069 335756 1392978
10384A392978l601218m852089p07078K593777J695987P16605K173295K445030
$$ 1392978 -2208240 -7060329 -7767407 -5173630 -3477643 -2761038 -587743 1857287
10376A857287m31656k571800j229833J008068J669372J618666J165001o20590
$$ 1857287 1425631 -1146169 -2376002 -1367934 301438 1920104 3085105 2464515
10368B464515j866883N2848K383865M02608l496966k767343J664687K571970n89927
$$ 2464515 597632 650480 3034345 3436953 -60013 -2827356 -1162669 1409301 819374
10359H19374p60098L320312M253357n63323l913643j464630J087129j140241l839513
$$ 819374 59276 3379588 7632945 7069622 3155979 1691349 2778478 1638237 -2201276
10350b201276k023941J385784J673319N7474l60386k49833p00748L8813K181513
$$ -2201276 -4225217 -2839433 -1166114 -1108640 -1469026 -1718859 -2419607 -2380794 -199281
10341a99281K353611m05561k267187j268146k14989k96904J248320M190638L618014
$$ -199281 2154330 1748769 -518418 -1786564 -2001553 -2298457 -1050137 3140501 6758515
10332F758515j226218m084189j736049P90821m14541j473915J145069L421691
$$ 6758515 5532297 1448108 -287941 502880 88339 -1385576 -240507 3181184
10324C181184J139114k192802j585163R53250J023267o8877J220628L170566J625108
$$ 3181184 4320298 2127496 542333 1495583 2518850 2449973 3670601 6841167 8466275
10315H466275k529461m741835l515736r21481J394893K618325J601777j073403
$$ 8466275 5936814 1194979 -2320757 -3242238 -1847345 770980 2372757 1299354
10307A299354k361351j049492J30510p66017j658115n79251Q96592J179072J539813
$$ 1299354 -1061997 -2111489 -1980979 -2746996 -4405111 -4984362 -4087770 -2908698 -1368885
10298a368885K641592K406217J70720j363546r84621j052848k194604j387273
$$ -1368885 1272707 3678924 3849644 2486098 1501477 448629 -1745975 -3133248
10290c133248J678582K397550q11005k671228J72125K846757M31241l419005k703453
$$ -3133248 -1454666 942884 131879 -2539349 -2367224 479533 910774 -2508231 -5211684
10281e211684R92395K022374L13764J29786J904160K343702R27270M753k46182
$$ -5211684 -4219289 -2196915 -1883151 -1753365 150795 2494497 3421767 3426520 3180338
10272C180338j376111k519758j812946m55048m86581l27238K361720N216296M163838
$$ 3180338 1804227 -715531 -2528477 -2983525 -3470106 -3797344 -1435624 3780672 7944510
10263G944510N23364o96354J058384J244329k022178m925316l879593l29455J832867
$$ 7944510 8467874 7771520 8829904 10074233 8052055 3126739 -752854 -1082309 750558
10254G50558P92438k125024l836931j916831K524280N122817L438438M08052K1668
$$ 750558 1542996 -582028 -4418959 -6335790 -3811510 1311307 4749745 5157797 5179465
10245E179465J356990O26120k088582k693550J76231K602470J031041k754542
$$ 5179465 6536455 7162575 5073993 2380443 2556674 5159144 6190185 3435643
10237C435643m341663k367552N72598J771710J302635Q73049J042026P67880l60123
$$ 3435643 -906020 -3273572 -2700974 -929264 373371 1246420 2288446 3056326 2696203
10228B696203r85035j71092N77944o05237k715648l051521j160250R22086K091103
$$ 2696203 1711168 1540076 2118020 1512783 -1202865 -4254386 -5414636 -4492550 -2401447
10219b401447K991365L406966J977408q57569k497119j649393J77558J165610
$$ -2401447 589918 3996884 5974292 5116723 2619604 970211 1147769 2313379
10211B313379R13248m01307k109191k501234q57032N87336k35148j283647L92372
$$ 2313379 3226627 2825320 716129 -1785105 -2642137 -2054801 -2289949 -3573596 -3181224
10202c181224K814342J706562j736348j955409J739481L680505J044620k017988
$$ -3181224 -366882 1339680 -396668 -2352077 -612596 3067909 4112529 2094541
10194B094541j811615m29762o46923j172704l98541J70249m87834n57492M97835
$$ 2094541 282926 -146836 -793759 -1966463 -2365004 -2194755 -2682589 -3240081 -2742246
10185b742246K99938j344983j047135J718116K644738K65328p82873J913102L608507
$$ -2742246 -2442308 -3787291 -4834426 -3116310 -471572 -206244 -989117 923985 4532492
10176D532492P29822k413060j194495J116659m68674l581173l028425q6166M01527
$$ 4532492 5262314 2849254 1654759 2771418 2302744 -1278429 -4306854 -4393020 -3991493
10167c991493j178486q80443R65113R31480n00447p8838J690354J675834K95726
$$ -3991493 -5169979 -6050422 -5085309 -4153829 -4654276 -4733114 -3042760 -1366926 -1071200
10158a071200L42781J172360K17431j263899k58200J641879M79507k576473k664087
$$ -1071200 -728419 443941 661372 -602527 -860727 781152 1260659 -1315814 -3979901
10149c979901M70002K233417J101990K95741J263939J743785J007684J099519
$$ -3979901 -3509899 -1276482 -174492 121249 1385188 3128973 4136657 5236176
10141E236176J826557K04674l653769n328451k614684J197847K406494J412702
$$ 5236176 7062733 7267407 3613638 -1714813 -4329497 -3131650 -725156 687546
10133F87546M55285K13914L72397Q92989J341263R10431k12459j131740j725038
$$ 687546 1142831 1356745 1729142 2622131 3963394 4873825 4661366 3529626 1804588
10124A804588k153630j744568l53152M10076m34654j192707l01827P72538K86148
$$ 1804588 -349042 -2093610 -2446762 -2036686 -2471340 -3664047 -3965874 -3193336 -2907188
10115b907188l88733N49618J599193P11792n48638J64964J246222j11359k452052
$$ -2907188 -3295921 -2746303 -1147110 -435318 -983956 -818992 427230 315871 -2136181
10106b136181k332832l26949L88442j05188O33997J975663J241045q01061r78654
$$ -2136181 -4469013 -4795962 -4407520 -4512708 -3878711 -1903048 -662003 -1463064 -2441718
10097b441718N11357P85905j22822R1613P21817o24118k273388o19527K484391
$$ -2441718 -1930361 -1144456 -1267278 -1175665 -453848 -1077966 -3351354 -3970881 -1486490
10088a486490J617059k653336l674299M41085L440391J099535k199135r40817
$$ -1486490 130569 -2522767 -6197066 -5755981 -2315590 -1216055 -3415190 -4356007
10080d356007L136342M587067K143985j085847k550361k056989o07263K78579
$$ -4356007 -1219665 3367402 5511387 4425540 1875179 -181810 -789073 -510494
10072e10494l27764j196285l75122J486560J792966J06305j320720j212188m72248
$$ -510494 -838258 -2034543 -2409665 -923105 869861 976166 -344554 -1556742 -2028990
10063b028990J39483M42662m97043k705167l253452P5962M121350L946956J34397
$$ -2028990 -1889507 -1446845 -1943888 -4649055 -7902507 -7826545 -3705195 241761 376158
10054C76158k548945k643587k410496j835848R89295L878681K361578k036918
$$ 376158 -2172787 -4816374 -7226870 -9062718 -8073423 -4194742 -1833164 -3870082
10046c870082k960003L09720J630817r63076j707447K175945M854315J853228
$$ -3870082 -6830085 -6520365 -4889548 -5852624 -7560071 -5384126 -529811 1323417
10038A323417k070478j009997K547695K712444l62690k390222k284014j688228
$$ 1323417 -747061 -1757058 790637 3503081 3140391 750169 -1533845 -3222073
10030c222073n64966J348997J745513o43984k616452j239268J177121J365338
$$ -3222073 -3787039 -2438042 -692529 -1336513 -3952965 -5192233 -4015112 -2649774
10022b649774Q05648K114144L227720R76170k327357k017663J037018J750726
$$ -2649774 -1844126 270018 3497738 4473908 2146551 128888 1165906 2916632
10014B916632r08828k672014r39149J936996K882284J753027J44188o34598j45652
$$ 2916632 2007804 -664210 -1603359 333637 3215921 4968948 5113136 4478538 4332886
10005D332886O57688N1472j763605k134349N4038K054248J306990o11133j024898
$$ 4332886 4990574 5042046 3278441 1144092 1198130 3252378 4559368 3948235 2923337
9996B923337p13215j847412l361085k359264R67717L464046L391013J694651l59507
$$ 2923337 2210122 362710 -2998375 -5357639 -4389922 -925876 2465137 4159788 3800281
9987C800281k062450k490942j349003K4134L64283K27543N40681R79299J259879
$$ 3800281 1737831 -753111 -2102114 -2077980 -1713697 -1486154 -945473 33826 1293705
9978A293705J995186K693403J411587j755876l623165k417291l54019M48111J140927
$$ 1293705 3288891 5982294 7393881 5638005 2014840 -402451 -756470 -308359 832568
9969H32568K604839K591028j77699k711635k342291j028089j104589o69652K042534
$$ 832568 3437407 6028435 5850736 3139101 796810 -231279 -1335868 -2005520 37014
9960C7014L652109P85158l141357k727117N16385J004772j190363r63220K299801
$$ 37014 3689123 4474281 1332924 -1394193 -877808 126964 -1063399 -2026619 273182
9951B73182L461659N16319k221403j373541R43471J699216J147492N89692J5659
$$ 273182 3734841 4251160 2029757 656216 1599687 3298903 4446395 5036087 5051746
9942E051746n28568n45734o60043j393366q54323K362507M890775K346063l105934
$$ 5051746 4523178 3977444 3317401 1924035 1069712 3432219 8322994 10669057 7563123
9933G563123m791890j389099J475771M44859j301577r71942p83168k359851k426588
$$ 7563123 2771233 1382134 2857905 3302764 2001187 1029245 246077 -2113774 -4540362
9924d540362J462856N452355M488322j79685l086805k089026J20493P47149j59141
$$ -4540362 -3077506 2374849 6863171 6683486 3596681 1507655 1628148 2375297 2216156
9915B216156r66225m36245J296550K701703K435851J106481K09033k88149j293886
$$ 2216156 1249931 813686 2110236 4811939 7247790 8354271 8563304 8275155 6981269
9906F981269k163316j634799o22638q96639j565938n30871J194239Q65569q00717
$$ 6981269 4817953 3183154 2560516 1663877 97939 -432932 761307 1626876 826159
9897H26159o20502J236795J716422Q49227J244365J860214o33856m062137k576005
$$ 826159 205657 1442452 3158874 4008101 5252466 7112680 6478824 2416687 -159318
9888a59318K641690L861336J22921o01178L728941M425032j373999k720484N779333
$$ -159318 2482372 6343708 6466629 5865451 9594392 14019424 12645425 9924941 15704274
9879A5704274R437562n622735k6142191k6037955l782935J4707624J2337925P34318
$$ 15704274 25141836 19519101 -6623090 -32661045 -36443980 -21736356 -9398431 -8664113
9871h664113k335423K040844K555986j677300k808247N37516K391612P68552l02434
$$ -8664113 -10999536 -8958692 -6402706 -8080006 -10888253 -10350737 -7959125 -7190573 -7493007
9862g493007J041301K178970J559308N50143n3882p49344j033870q7360J090623
$$ -7493007 -6451706 -4272736 -2713428 -2163285 -2217167 -2966511 -4000381 -4087741 -2997118
9853b997118J174750P79294P88827N27572j05364M27467J726353N43374l352788
$$ -2997118 -1822368 -1043074 -254247 273325 167961 595428 2321781 2865155 -487633
9844d87633m719919n83943L924944K975962p51376r27397J677107J181530k541634
$$ -487633 -5207552 -5791495 -1866551 1109411 358035 -569362 1107745 2289275 -252359
9835b52359l513382j20379K274027O25980j306993j76206J771314J654788N26589
$$ -252359 -3765741 -3886120 -1612093 -986113 -2293106 -2469312 -697998 956790 1483379
9826A483379m8801j001473k382427j733365J116710K275205J06404j324777J013789
$$ 1483379 1434578 433105 -1949322 -3682687 -2565977 -290772 -184368 -1509145 -495356
9817d95356L462471J484467k690064l651709j224578M12653J63522O46578K071434
$$ -495356 2967115 4451582 1761518 -1890191 -3114769 -2702116 -2538594 -1892016 179418
9808A79418J381036j713361l058551m22328K510469J284477k801670m406921j331554
$$ 179418 1560454 -152907 -3211458 -3633786 -1123317 161160 -2640510 -7047431 -8378985
9799h378985K819817L545929J007676q31940K00508J969064J763192L09369j9334
$$ -8378985 -5559168 -2013239 -1005563 -1837503 -1636995 332069 2095261 2404630 2385296
9790B385296O66613M46470n15095k90077P99249L52992j498074j730870L14859
$$ 2385296 3051909 3498379 2983284 2693207 3492456 3845448 2347374 616504 931363
9781I31363J492518J52530j362735j385346j566832k489305j493973J890797L291435
$$ 931363 2423881 2576411 1213676 -171670 -1738502 -4227807 -5721780 -3830983 -539548
9772e39548M01216k194363r5617L424522K834308o50214j990679r70609q17874
$$ -539548 -138332 -2332695 -2428312 996210 3830518 3180304 1189625 219016 -598858
9763e98858q90114J495943L824315J342512l549945l531015J727576M565572J589428
$$ -598858 -1488972 6971 3831286 5173798 1623853 -1907162 -179586 4385986 5975414
9754E975414j716681j066231L41400p75409j810186k31432J235945K54253l77179
$$ 5975414 4258733 3192502 3533902 2758493 948307 716875 1952820 2207073 1829894
9745A829894J372362J916326j388171m241694k090518J926321K276922J88505
$$ 1829894 3202256 5118582 3730411 -511283 -2601801 -675480 1601442 1789947
9737A789947M62880K448742J730014j309875k198871n81585l38417j739086p89577
$$ 1789947 2252827 4701569 6431583 5121708 2922837 2341252 2002835 263749 -525828
9728e25828K750211L727002N1062l376742k167198J201886J982950Q7270j315595
$$ -525828 2224383 5951385 6002447 2625705 458507 1660393 3643343 3730613 2415018
9719B415018j195457q93755p67205j4728J019163J092734J79252p35909j489091
$$ 2415018 1219561 325806 -441399 -456127 563036 1655770 1835022 1099113 -389978
9710c89978k442888k779333j242748J250298J873880k86880k399950j481098J326811
$$ -389978 -2832866 -5612199 -6854947 -5604649 -3730769 -4017649 -6417599 -7898697 -6571886
9701f571886K289493N22277q64786J95315J538800P59955k85091J465812M339961
$$ -6571886 -4282393 -3760116 -4624902 -4429587 -2890787 -2130832 -2415923 -950111 3389850
9692C389850L589242j049473m076062j895638K255187L294866R22278j481340
$$ 3389850 6979092 5929619 1853557 -42081 2213106 5507972 6430250 4948910
9684D948910k043961j494516p00733Q0245L59233o5570m19474j80128K2763j66234
$$ 4948910 2904949 1410433 709700 789945 1149178 1083608 664134 484006 506769 340535
9674C40535K2753P32892O38476p20394j561016m48289J385913J923239R92309
$$ 340535 363288 1096180 1734656 1014262 -546754 -995043 390870 2314109 3306418
9665C306418m39820j915583k945018k540125p71009Q25046J500332K051272K501945
$$ 3306418 2866598 951015 -1994003 -4534128 -5305137 -4480091 -2979759 -928487 1573458
9656A573458J644213n3645j97761J375431J575585q97979l054808k486421j049278
$$ 1573458 3217671 3164026 2966265 4341696 5917281 5019302 1964494 -521927 -1571205
9647a571205r32344q72926M31764R93582n32845j284856J107776L725542K942604
$$ -1571205 -2503549 -3376475 -2944711 -1951129 -2483974 -3768830 -2661054 1064488 4007092
9638D007092M85199j29986P9182j550443l178760j594051R59161l3557l072681
$$ 4007092 4492291 4362305 4441487 2891044 -287716 -1881767 -922606 -956163 -4028844
9629d028844k715153J067531K915180J224898j3315R99717J374445m8447n63229
$$ -4028844 -6743997 -5676466 -2761286 -1536388 -1549703 -549986 824459 776012 212783
9620B12783N18317K65904j715480j733414J198275L003615J512393K2719R92054
$$ 212783 731100 997004 -718476 -2451890 -1253615 1750000 3262393 3285112 4277166
9611D277166J658006o04109l380426l336607j252469L85713J292706J956893J616589
$$ 4277166 5935172 5331063 1950637 -1385970 -2638439 -2252726 -960020 996873 2613462
9602B613462K29176o18260o17738j169622j720273n1316K528814J686578k318611
$$ 2613462 2842638 2224378 1606640 437018 -1283255 -1334571 1194243 2880821 562210
9593E62210l599035r4921K455096J33942k175999P67448M988729L459967k279156
$$ 562210 -3036825 -3131746 -676650 -542708 -2718707 -1951259 3037470 6497437 4218281
9584D218281m498951j017342K823554K966537Q48827j047327k182152k235675
$$ 4218281 -280670 -1298012 1525542 4492079 5340906 4293579 2111427 -124248
9576a24248j070803m69449j841379k747072m540M379483N139712J502819j765367
$$ -124248 -1195051 -1664500 -3505879 -6252951 -6257491 -1878008 3261704 4764523 2999156
9567B999156j522894J16376L56520k62289j22866M59731L71261l32152r43571
$$ 2999156 1476262 1592638 1949158 1686869 1564003 2023734 2394995 2062843 1119272
9558A119272j046959l35429J050774J929019J366100K85647J09376L91026k21246
$$ 1119272 72313 -263116 787658 2716677 4082777 4368424 4477800 4868826 4647580
9549D647580j340621j394070k72783P69550J267173J424718O98501j095714k178909
$$ 4647580 3306959 1912889 1640106 2409656 3676829 5101547 5800048 4704334 2525425
9540B525425r86092R26206R84205l20969n98399J29909o1178q10733N4756J834312
$$ 2525425 1539333 2465539 3449744 3128775 2530376 2660285 2599107 1788374 1843130 3677442
9530C677442J090795k635781n246436l653900M21834L598239M578580L401828
$$ 3677442 4768237 2132456 -3113980 -6767880 -6346046 -2747807 1830773 5232601
9522E232601L01267k822289k839333M70932L207987K356569l47954j639799j375070
$$ 5232601 5533868 2711579 -127754 343178 3551165 5907734 5559780 3919981 2544911
9513B544911j437615k086977k279200k153479k327466j768046P38594L588852
$$ 2544911 1107296 -979681 -3258881 -5412360 -7739826 -9507872 -8769278 -5180426
9505e180426L745310J149602q92715k52538J443382J741254Q23950M21633O06568
$$ -5180426 -1435116 -285514 -1178229 -1430767 12615 1753869 2577819 2999452 3606020
9496C606020j54158j919408k388349j60225K557193K368812o42385k843622k047670
$$ 3606020 3451862 1532454 -855895 -1016120 1541073 3909885 3267500 423878 -1623792
9487a623792k66265j49641r40210m01669R03438N71650j111678j295494M98557
$$ -1623792 -1890057 -2039698 -2979908 -3381577 -2478139 -1906489 -3018167 -4313661 -3815104
9478c815104J345165J6906o72993J116665K424199J38484l202619k710225J146222
$$ -3815104 -2469939 -2453033 -3126026 -2009361 414838 553322 -2649297 -5359522 -4213300
9469d213300K993726O90780j865673j326906L21829J04572p85156J50576J648594
$$ -4213300 -1219574 -528794 -2394467 -3721373 -3399544 -3294972 -4080128 -3929552 -2280958
9460b280958R55281o44426M60836L522808L635912n67828m297430l544360k98278
$$ -2280958 -1325677 -1970103 -1509267 2013541 5649453 5081625 784195 -2760165 -3058443
9451c058443J697730K326037K900238K284336n41760k880509j950185O3846m95354
$$ -3058443 -1360713 965324 3865562 6149898 5608138 2727629 777444 841290 345936
9442C45936k124382o77962K747027K939803m53218j946588M90263K003221n95989
$$ 345936 -1778446 -2456408 290619 3230422 2777204 830616 1320879 3324100 2728111
9433B728111l250516j617235J768259K001632o55767k431532j929185j47748K231564
$$ 2728111 -522405 -2139640 -371381 1630251 974484 -1457048 -3386233 -3533981 -1302417
9424a302417L720241J747921k509320l244853J324873M265409P7196n406596l572828
$$ -1302417 2417824 4165745 1656425 -1588428 -263555 4001854 4079050 -1327546 -4900374
9415d900374K509300K589369l599033n429466J102193O675453L759780j989525
$$ -4900374 -2391074 198295 -3400738 -8830204 -7728011 -1052558 2707222 717697
9407G17697k080934J538593J794980j037368j227074J556842K129132p03194k369057
$$ 717697 -1363237 175356 1970336 932968 -294106 1262736 3391868 2688674 319617
9398C19617o18471J172397P5458k205111k894366j906494m59501R18884J653546
$$ 319617 -298854 873543 949001 -1256110 -4150476 -6056970 -6516471 -5597587 -3944041
9389c944041R92447l12686m40251O73844J179929N14711K69832J082227J244580
$$ -3944041 -2951594 -3264280 -3704531 -3030687 -1850758 -1336047 -1066215 16012 1260592
9380A260592k73098j716775j192251L69003P92320p7595o64125l83675p6155j9183
$$ 1260592 987494 -729281 -1921532 -1552529 -760209 -837804 -1501929 -1885604 -1961759 -1980942
9370a980942N30568J540931J669655L15931j096609r85201J74964Q21778Q20694
$$ -1980942 -1450374 90557 1760212 2076143 979534 -5667 169297 991075 1811769
9361A811769J266580J948692J160869j261853k819646j754450J74088L62462o16523
$$ 1811769 3078349 5027041 6187910 4926057 2106411 351961 526049 888511 271988
9352B71988l21265J106978J012990j158876k544962j143739J355134K424898J977739
$$ 271988 -49277 1057701 2070691 911815 -1633147 -2776886 -1421752 1003146 2980885
9343B980885J159701J00466j131674j218857M47170J874529Q91173j504047k441508
$$ 2980885 4140586 4241052 3109378 1890521 2337691 4212220 5103393 3599346 1157838
9334A157838j113904O86062J306732M35529j740763m196118m395724p53612M113701
$$ 1157838 43934 729996 2036728 2472257 731494 -3464624 -7860348 -8613960 -4500259
9325d500259N392071K062737j672801k054077l09244K20282p75713j001941J29098
$$ -4500259 891812 2954549 1281748 -772329 -1081573 -861291 -1637004 -2638945 -2509847
9316b509847O73895l51655j355548q92022J06246J38138m03805k32013M56857
$$ -2509847 -1835952 -2187607 -3543155 -4435177 -4328931 -4190793 -4594598 -4826611 -4369754
9307d369754N05112J15920N54073J584963J467406M2366n11591P33536J371719
$$ -4369754 -3864642 -3748722 -3194649 -1609686 -142280 -99914 -611505 122031 1493750
9298A493750p20287l491025l310472m70565J183199P2633j014098L88232K624580
$$ 1493750 773463 -2717562 -6028034 -6498599 -5315400 -5242767 -6256865 -5868633 -3244053
9289c244053K658873M78930j374715j401761l11668O60459R83362P53824M95038
$$ -3244053 -585180 -106250 -1480965 -2882726 -3194394 -2533935 -1550573 -796749 -301711
9280c01711O50370P08034k78081j753483j679022N18225K557014K307811P05925
$$ -301711 348659 1056693 778612 -974871 -2653893 -2135668 421346 2729157 3435082
9271C435082j82549o25563k258835m370241l988250j06279M358002N716805L315822
$$ 3435082 3252533 2626970 368135 -4002106 -7990356 -8096635 -3738633 1978172 5293994
9262E293994m27348k743934k714766j432720m27506O5495Q27608J650950J080295
$$ 5293994 4866646 2122712 -592054 -2024774 -2452280 -2386785 -1559177 91773 1172068
9253A172068r57321k044558o14342J204746O18491j264532j150330R04408J547314
$$ 1172068 214747 -1829811 -2444153 -1239407 -620916 -1885448 -3035778 -2131370 -584056
9244e84056j95232j506087r97496r21145k194949j738198J925342M494200J915437
$$ -584056 -779288 -2285375 -3282871 -4204016 -6398965 -8137163 -6211821 -1717621 197816
9235A97816k580610l008226l7470N78339j834054j632377K911988N537027J751935
$$ 197816 -2382794 -5391020 -5428490 -4850151 -6684205 -8316582 -5404594 132433 1884368
9226A884368l652125m040653q33248L45072m53438R93531L837623K864115j490816
$$ 1884368 -1767757 -5808410 -6641658 -6296586 -6750024 -5756493 -1918870 945245 -545571
9217e45571k358414K109037M585520R7912n454772m368058R67131K668014k8517
$$ -545571 -2903985 -794948 3790572 3888484 -1566288 -5934346 -4967215 -2299201 -2327718
9208b327718j113210J082864J821598o57720j918974L80710K258713P52865q57948
$$ -2327718 -3440928 -2358064 -536466 -1194186 -3113160 -2732450 -473737 279128 -578820
9199e78820O61275K491207R51130j826019j810744j0439K13300l09699J046011
$$ -578820 82455 2573662 3524792 1698773 -111971 -122410 90890 -218809 827202
9190H27202K134234j034092n853545n201080J411028O103504M104689R6616k03747
$$ 827202 2961436 1927344 -3926201 -9127281 -7716253 -1612749 2491940 2588556 2384809
9181B384809J495046P35263j661861j991253o23787o46184j703673r91961Q17398
$$ 2384809 3879855 4615118 2953257 962004 338217 -307967 -2011640 -3003601 -2186203
9172b186203L50722k069549k318598O34165K837944J692444m57314q84778m38093
$$ -2186203 -1835481 -3905030 -6223628 -5589463 -2751519 -1059075 -1516389 -2401167 -2839260
9163b839260o44850o07917N31181J226471M00114j91637P58762J379596K49564
$$ -2839260 -3484110 -4092027 -3560846 -2334375 -1934261 -2125898 -1367136 12460 262024
9154B62024l22401J516901K677210k57815m227839l428639J250273L015331k71807
$$ 262024 -60377 1456524 4133734 3875919 -351920 -3780559 -2530286 485045 213238
9145B13238k961180q88832K503954K565321M64197m03111m86979j649164k254116
$$ 213238 -2747942 -3636774 -1132820 1432501 1896698 1493587 1006608 -642556 -2896672
9136b896672r1416K400273J418994j462901j513816J334507K747786J594234J035212
$$ -2896672 -2988088 -587815 831179 -631722 -2145538 -811031 1936755 3530989 4566201
9127D566201J540605n26686n313060o867152j874074M201707M441508J37191k024323
$$ 4566201 6106806 5580120 267060 -6600092 -8474166 -4272459 169049 306240 -1718083
9118a718083R5537K350626J459891j125294k728133k744002j587867M85451K413369
$$ -1718083 -1622546 728080 2187971 1062677 -1665456 -4409458 -5997325 -5511874 -3098505
9109c098505K520853P42749r56531j032967O5178J013386R85974j41559j615938
$$ -3098505 -577652 165097 -791434 -1824401 -1759223 -745837 240137 98578 -1517360
9100a517360j887632k91746J489177J247762n32523j113194N88354K366670J722914
$$ -1517360 -3404992 -3696738 -2207561 -959799 -1492322 -2605516 -2017162 349508 2072422
9091B072422r58741l104388k876004p57860J105977Q68049j066956k085689k50748
$$ 2072422 1113681 -1990707 -4866711 -5624571 -4518594 -3650545 -4717501 -6803190 -7053938
9082g053938L069817M694969L596062J753648Q97546L38865j048143k404511k038270
$$ -7053938 -3984121 710848 4306910 6060558 6958104 7296969 6248826 3844315 1806045
9073A806045j02445J490445J616552J061734Q46980N02217j118773l595481m627644
$$ 1806045 1703600 3194045 4810597 5872331 6719311 7221528 6102755 2507274 -2120370
9064b120370k728527L95863J553187J79770r71592M0680J488359Q96905q68369
$$ -2120370 -4848897 -4453034 -2899847 -2720077 -3691669 -3650989 -2162630 -1265725 -2134094
9055b134094r68796Q71553K066630J282160L3250k86589l29745q07116q86551
$$ -2134094 -3102890 -2231337 -164707 1117453 1150703 864114 534369 -272747 -1159298
9046a159298J48321J405702J696981R02192o60425k527171l237553j407178J548913
$$ -1159298 -1010977 394725 2091706 2993898 2333473 -193698 -3431251 -4838429 -3289516
9037c289516K292249L22629r45792M67829J818742K99819j989514j396984J177216
$$ -3289516 -997267 -674638 -1620430 -1152601 666141 965960 -1023554 -2420538 -1243322
9028a243322J808623o6430j252508m09757L39983j55606k10265J007374J620746
$$ -1243322 565301 498871 -753637 -1163394 -823411 -979017 -1189282 -181908 1438838
9019A438838N00821n75778l7797R06153O76052o5870j15369N9530k91589m71536
$$ 1438838 1939659 1363881 1326084 2232237 2908289 2842419 2727050 2786580 2494991 2023455
9009B023455J65701P26927M93023K71029L43064o99689k854317k836618J448211
$$ 2023455 2189156 2916083 3409106 3680135 4023199 3323510 469193 -2367425 -919214
9000i19214O271920N815469L4087m943844m664051j239878O84956l1851r80567
$$ -919214 5352706 11168175 11202262 6258418 1594367 354489 1039445 1007594 27027
8991B7027m05282P78228Q53880l08638j234162p77484M73456J068730O06305q4830
$$ 27027 -378255 399973 1253853 945215 -288947 -1066431 -592975 475755 1082060 997230
8981I97230n04943r08286j062370l19282O03013l820j780780k004388K28393K125309
$$ 997230 492287 -415999 -1478369 -1797651 -1194638 -1198458 -2979238 -4983626 -4755233 -2629924
8971b629924J525588L09625P19422J148838o05735k429549r95272J998110K107075
$$ -2629924 -1104336 -794711 -75289 1073549 467814 -1961735 -2957007 -958897 1148178
8962A148178k88801n86171J935472K859983N03868j299658l96564q2769k444212
$$ 1148178 859377 273206 2208678 5068661 5572529 4272871 3876307 3793538 1349326
8953A349326l753089r27504K381659J424186j785554j920623J064014K552725
$$ 1349326 -2403763 -3331267 -949608 474578 -1310976 -3231599 -2167585 385140
8945C85140Q62778j238515j820709j651828j054502O58449K533863K596595J189335
$$ 385140 1247918 9403 -1811306 -3463134 -4517636 -3859187 -1325324 1271271 2460606
8936B460606L54919K00019p06801j803680j199175L45567O9805j913975k298147
$$ 2460606 2815525 3015544 2308743 505063 -694112 -348545 -278740 -2192715 -4490862
8927d490862J92943K834887L054933J326140r35252l192026m468396l200459K59500
$$ -4490862 -4297919 -1463032 1591901 2918041 1982789 -1209237 -5677633 -8878092 -8618592
8918h618592L318083M278567L741152K515837O13994j297502k054770k041570
$$ -8618592 -5300509 -1021942 2719210 5235047 5849041 4551539 2496769 455199
8910D55199k514987k773745j014014J812041K506053O13204p62988j25201K66029
$$ 455199 -2059788 -4833533 -5847547 -4035506 -1529453 -916249 -1679237 -1804438 -1538409
8901a538409j061770j890330j83555K356129L039132J860324K47385j314105k318230
$$ -1538409 -2600179 -4490509 -4674064 -2317935 721197 2581521 2828906 1514801 -803429
8892h03429j483399Q44617K003246Q71265j82251N28227Q14037j388635l524182
$$ -803429 -2286828 -1442211 561035 1432300 1250049 1778276 2592313 1203678 -2320504
8883b320504j827732K376169L862491O81041l256414l298943N23977L977726L397285
$$ -2320504 -4148236 -1772067 2090424 2771465 -484949 -3783892 -3259915 717811 4115096
8874D115096m79727l348768k278244Q18444K022650P78380l09789m42491j389157
$$ 4115096 3635369 286601 -1991643 -1173199 849451 1627831 1318042 875551 -513606
8865e13606k877852j921304J608110L490074J780985J60474J308749J865057j351924
$$ -513606 -3391458 -5312762 -3704652 -214578 1566407 1726881 3035630 4900687 3548763
8856C548763m617418k800479J782195K740442k59819j711665L33391K068613J336503
$$ 3548763 -1068655 -3869134 -2086939 653503 393684 -1317981 -984590 1084023 2420526
8847B420526N51164J035885N67039j538430k393608r19618k26783j914915k664666
$$ 2420526 2971690 4007575 4574614 3036184 642576 -277042 -503825 -2418740 -5083406
8838e083406J53321L493461L157326K85508p42927J028734K421757J157857j536646
$$ -5083406 -4930085 -1436624 1720702 2006210 1263283 2292017 4713774 5871631 4334985
8829D334985l063215k033823Q57864L035826K051194j133353k266545Q22964M449885
$$ 4334985 1271770 -762053 95811 3131637 5182831 4049478 1782933 2605897 7055782
8820G055782L456686j431583m080867j327097K508531J663917k897805m888340
$$ 7055782 10512468 9080885 5000018 3672921 6181452 7845369 4947564 59224
8812E9224j724258J845011Q26399k687813k930332O43004K717439N73957j894342
$$ 59224 -1665034 179977 1006376 -1681437 -4611769 -3968765 -1251326 -677369 -2571711
8803b571711p67913J783945J640626m19353o22710J161686J682584K91055k72547
$$ -2571711 -3339624 -1555679 84947 -334406 -957116 204570 1887154 2178209 1905662
8794A905662Q63634J313457Q9686o45176J74450M64007r82698j977423p84253
$$ 1905662 2769296 4082753 4172439 3527263 3701713 4165720 3183022 1205599 421346
8785D21346N83835k77047j877735j081587J763301L105869J273838j402300k035481
$$ 421346 1005181 728134 -1149601 -2231188 -467887 2637982 3911820 2509520 474039
8776D74039q28333k11239j286442k436218j684938M81574J668826O63454j310253
$$ 474039 -354294 -565533 -1851975 -4288193 -5973131 -5491557 -3822731 -3159277 -4469530
8767d469530k472261k061216J52859L703984O074567M336632k67122k453866j4493
$$ -4469530 -6941791 -9003007 -8850148 -5146164 928403 5265035 4997913 2544047 2529554
8758B529554K510777P13674k557901j943344J335555J544630j726871k964941
$$ 2529554 5040331 5754005 3196104 1252760 2588315 4132945 2406074 -558867
8750e58867l17860J438560n40531k403016o72930J785281J120689r20616n23026
$$ -558867 -876727 561833 21302 -2381714 -3054644 -1269363 -148674 -1069290 -1592316
8741a592316J586988J824424l28739k322334k706210j730498M58672K896950K937262
$$ -1592316 -5328 1819096 1490357 -831977 -3538187 -5268685 -4810013 -1913063 1024199
8732A024199k36942k939586j411423K504057L790072J274438j535326k002561
$$ 1024199 787257 -2152329 -3563752 -1059695 2730377 4004815 2469489 466928
8724D66928r90547M2999J060433J881668J453665k90092j807148k009947j510712
$$ 466928 -523619 -480620 579813 2461481 3915146 3625054 1817906 -192041 -1702753
8715a702753j271509j241106q57896r8639L91958l540r75797j210444P9713J721027
$$ -1702753 -2974262 -4215368 -5073264 -5171903 -4779945 -4783485 -5759282 -6969726 -6890013 -5168986
8705e168986J945919J083394J054046K057231K158009Q27303J51588J131400J472967
$$ -5168986 -3223067 -2139673 -1085627 971604 3129613 3956916 4108504 5239904 6712871
8696F712871q26397l871027m249205j544729J601209K720984J241902j559490
$$ 6712871 5886474 2015447 -2233758 -3778487 -2177278 543706 1785608 226118
8688B26118k970693j063745K160823K238043j480131l906294j097046L819397
$$ 226118 -2744575 -3808320 -1647497 590546 -889585 -4795879 -5892925 -2073528
8680b073528M996236J847885j248422j685246r02878n47379k61523L86688P36695
$$ -2073528 2922708 4770593 3522171 1836925 934047 386668 125145 511833 1248528
8671A248528K85552q01180k225277l063243j825442J075309K456860M78050k004074
$$ 1248528 1534080 732900 -1492377 -4555620 -6381062 -5305753 -2848893 -2370843 -4374917
8662d374917j267451J584345K469907P98238j89407O81896P92195j187928k583204
$$ -4374917 -5642368 -4058023 -1588116 -789878 -979285 -297389 494806 -693122 -3276326
8653c276326j007709J710562K230930L57449j225960q25451N38743J023206K60014
$$ -3276326 -4284035 -2573473 -342543 14906 -1211054 -2036505 -1497762 -474556 -214542
8644b14542o23522p47211m56357k05588N92538K265921L194256J665408q70280
$$ -214542 -838064 -1585275 -2041632 -2247220 -1654682 611239 3805495 5470903 4600623
8635D600623j286466K97505N62827j327308k223659o95773L42086q08961j266820
$$ 4600623 3314157 3611662 4174489 2847181 623522 -72251 269835 -539126 -1805946
8626a805946P50472J790246o76108k719403l71899K746621J208945k376031j436855
$$ -1805946 -1055474 734772 58664 -2660739 -3032638 -286017 922928 -1453103 -2889958
8617b889958K958097L511619r62389l673303j229514J732217J388518K73850J000142
$$ -2889958 68139 3579758 2617369 -1055934 -2285448 -553231 835287 1109137 2109279
8608B109279J494317L0185j042971o3184Q13791K14470m6939K91597j278055l829025
$$ 2109279 3603596 3633781 2590810 2527626 3341417 3555887 3508948 3800545 2522490 -1306535
8598a306535k347513L136336N075869M0871m480963j491975M029101L282325k125869
$$ -1306535 -3654048 -517712 4558157 4599028 118065 -1373910 2655191 5937516 3811647
8589C811647l673900j68872J687170l48187j226632J118418K032349p89729k619397
$$ 3811647 137747 -31125 1656045 1307858 81226 1199644 3231993 2442264 -177133
8580a77133O6726L278092K089120j510615k351413j47711J196980K72136n75573
$$ -177133 -110407 3167685 5256805 3746190 1394777 1247066 2444046 2716182 2140609
8571B140609N1182O25935k13588j512045j770280j005116j93370J81366L02056
$$ 2140609 2191791 2817726 2604138 1092093 -678187 -1683303 -1876673 -1695307 -1393251
8562a393251M02910N13870M79405l426r65679j598979p70783J259656K273883
$$ -1393251 -990341 -476471 2934 -492 -966171 -2565150 -3335933 -2076277 197606
8553A97606N37141k323068k654421L52705L064668K175194p26381j720648l27735
$$ 197606 734747 -1588321 -4242742 -3890037 -825369 1349825 623444 -1097204 -1424939
8544a424939M57019n45254q84237J266532M004735M293256J679404j776607l825109
$$ -1424939 -967920 -1513174 -2397411 -1130879 2873856 7167112 8846516 7069909 3244800
8535C244800l578833k063114j387250k051467j776400R64563L544516K594986
$$ 3244800 -334033 -2397147 -3784397 -5835864 -7612264 -6647701 -3103185 -508199
8527e08199l29283r20214O80840L63174j989759j558496K500549M078117k22353
$$ -508199 -837482 -1757696 -1076856 -713682 -2703441 -4261937 -1761388 2316729 2094376
8518B094376m793205l567680N97146J327280q75460p91529J934317K916473J341410
$$ 2094376 -2698829 -6266509 -5669363 -4342083 -5217543 -6009072 -4074755 -1158282 183128
8509A83128Q61107K294597K161916o29443k572314j526004J47569J06317o70963
$$ 183128 1044235 3338832 5500748 4871305 2298991 772987 920556 1026873 355910
8500C55910q41579j075500j631664r41599J438183L191602K343129j44205k157450
$$ 355910 -485669 -1561169 -3192833 -4134432 -2696249 495353 2838482 2694277 536827
8491E36827k814164k041019J94773L035558M587930L611889O32293k622868m122690
$$ 536827 -2277337 -4318356 -4123583 -1088025 3499905 7111794 7744087 5121219 998529
8482I98529k717083K93929J853080Q01149p04247q97972j013903j861143j043198
$$ 998529 -1718554 -1424625 428455 1229604 525357 -372615 -1386518 -3247661 -4290859
8473d290859K591916M868995J871637k825405k737437J271015K393195q44760
$$ -4290859 -1698943 3170052 5041689 2216284 -521153 749862 3143057 2298297
8465B298297k475777M57802L051069J123768k158203k336138o52634l77007p79671
$$ 2298297 -177480 280322 3331391 4455159 2296956 -39182 -691816 -1068823 -1848494
8456a848494L47024J750319J069560o03375q30330j65866m48145r81587l11507
$$ -1848494 -1501470 248849 1318409 715034 -115296 -281162 -729307 -1710894 -2022401
8447b022401K53284j127063k763067j592935J773963L845279L201242J363491
$$ -2022401 -1769117 -2896180 -5659247 -7252182 -5478219 -1632940 1568302 2931793
8439B931793m29109k092267k975481k286122q87374k02018J10512J123796K156394
$$ 2931793 2502684 410417 -2565064 -4851186 -5738560 -5940578 -5830066 -4706270 -2549876
8430b549876J717476J51988r75241j320699j380015p15336J001532K183309J193931
$$ -2549876 -832400 -680412 -1655653 -2976352 -4356367 -5071703 -4070171 -1886862 -692931
8421f92931p57021j176509n1200N63708J19450J5127P42428J181276P84665K92879
$$ -692931 -1449952 -2626461 -2677661 -2113953 -1994503 -1979376 -1236948 -55672 728993 1021872
8411A021872K12381K90128K48996l18108j858579l198629j704324K623093N238757
$$ 1021872 1234253 1524381 1773377 1455269 -403310 -3601939 -5306263 -2683170 2555587
8402B555587K597284k056783k690408O59162K027824j175096m297011k809711
$$ 2555587 5152871 3096088 405680 1064842 3092666 1917570 -2379441 -5189152
8394e189152J075965K412240Q36027l566J370284K462189J044666j689250k995531
$$ -5189152 -4113187 -1700947 -864920 -868486 501798 2963987 4008653 2319403 -676128
8385f76128j982837k27477M13777r6155k57722P97599K120934K344515J447311
$$ -676128 -2658965 -2886442 -2472665 -2568820 -2826542 -2028943 91991 2436506 3883817
8376C883817K32226j094585k442297k707077j030571J160243J476012k4299q74822
$$ 3883817 4116043 3021458 579161 -2127916 -3158487 -1998244 -522232 -546531 -1421353
8367a421353M4601J051507O83819m8976K95020J153980J151334L85082p6387p3644
$$ -1421353 -1376752 -325245 358574 309598 604618 1758598 2909932 3295014 3218627 3144983
8357C144983k47604o47710p34795m03192R533L94839P28120O45329k9752o87754
$$ 3144983 2897379 2249669 1514874 1111682 1121215 1516054 2244174 2889503 2859751 2171997
8347B171997o60615k86346m43598j089819j042175M47410K294225K370942K0561
$$ 2171997 1511382 1225036 781438 -308381 -1350556 -903146 1391079 3762021 3782582
8338C782582k623384k754951m46510J203976K36245j345241n83303J791893K306413
$$ 3782582 1159198 -1595753 -2042263 -838287 -602042 -1947283 -2530586 -738693 1567720
8329A567720O093k158939j890338o41985n80016q70116N65311L077850L834238
$$ 1567720 1573813 -585126 -2475464 -3117449 -3697465 -4567581 -4002270 -924420 2909818
8320B909818J907730n54063j413223q34179m3778M90022P78113M39132p69307
$$ 2909818 4817548 4263485 2850262 2016083 1972305 2462327 3240440 3679572 2910265
8311B910265k074186k258023j064642M18905Q23794j48823j329724j112634P83151
$$ 2910265 836079 -1421944 -2486586 -2067681 -1243887 -1392710 -2722434 -3835068 -3051917
8302c051917K626088K275782l50362k933738l225450j389696O18029J513269J604177
$$ -3051917 -425829 1849953 1499591 -1434147 -4659597 -6049293 -5431264 -3917995 -2313818
8293b313818J426052P36096n43410j417193r47762K38470P44713M37413M31170
$$ -2313818 -887766 -151670 -695080 -2112273 -3060035 -2821565 -2076852 -1639439 -1208269
8284a208269J097203J511991J194738R30602J181601J040276k36826j806768k492829
$$ -1208269 -111066 1400925 2595663 3526265 4707866 5748142 5511316 3704548 1211719
8275A211719k437808k265105j625745j42152J075095P50056k22754K05481K034933
$$ 1211719 -1226089 -3491194 -5116939 -5259091 -4183996 -3433940 -3656694 -3451213 -1416280
8266a416280L099804K306188Q76516r7917j125825k370711k402504n26229J324693
$$ -1416280 1683524 3989712 4866228 4768311 3642486 1271775 -1130729 -1656958 -332265
8257c32265J020135n80376r95259P9358P02449K15769K59741J610982K400270
$$ -332265 687870 107494 -887765 -808407 -105958 109811 369552 1980534 4380804
8248D380804R82672j231630j816229r71201p56326j344594q85879O61136O89439
$$ 4380804 5363476 4131846 2315617 1344416 588090 -756504 -1642383 -981247 -291808
8239b91808j628762k959398m57429L344790L735549P16600j241956j54312J031753
$$ -291808 -1920570 -4879968 -5337397 -1992607 1742942 2459542 1217586 1063274 2095027
8230B095027m4309j362004n12140J034930P40850n73539n34441N03247N31724
$$ 2095027 2050718 688714 176574 1211504 1952354 1378815 844374 1347621 1879345
8221A879345j81977J19616R83872N51046o18927l91154O43370j09693k110188
$$ 1879345 1697368 1816984 2800856 3351902 2732975 2341821 2985191 2875498 765310
8212G65310j805105J198029K741024P55005j217946J3971J886574N11020k634587
$$ 765310 -1039795 158234 2899258 3654263 2436317 2450288 4336862 4847882 2213295
8203B213295l027407k48949J842660J311047Q4074l52247r93877k099857j678011
$$ 2213295 -814112 -1063061 779599 2090646 2174720 1822473 828596 -1271261 -2949272
8194b949272R58452K953560J570080j666280k810314o43957K026831K071603m50002
$$ -2949272 -1990820 962740 2532820 866540 -1943774 -2587731 -560900 1510703 1060701
8185A060701k740103k385983L01941K787032K995411J380600P907j55553q7748
$$ 1060701 -1679402 -4065385 -3763444 -976412 2018999 3399599 3407506 3251953 3164205
8176C164205o52836r92899o3417J138129N96547j585431k907253j926034k71766
$$ 3164205 2511369 1518470 1455053 2593182 3189729 1604298 -1302955 -3228989 -3500755
8167c500755J8129l61932N17857K204310K318034M70607r97373p66716l31043
$$ -3500755 -3482626 -3844558 -3326701 -1122391 1195643 1666250 668877 -97839 -428882
8158d28882q47137q63556Q32201K376203J401906j158309k481563j834346n71437
$$ -428882 -1276019 -2139575 -1307374 1068829 2470735 1312426 -1169137 -3003483 -3574920
8149c574920O21710J670915J447959o24993k175144n96676K399675K743028K10147
$$ -3574920 -2953210 -1282295 165664 -459329 -2634473 -3231149 -831474 1911554 2121701
8140B121701j511326j069020j026880k284469j977732R13016K592878K71894k904726
$$ 2121701 610375 -458645 -1485525 -3769994 -5747726 -4834710 -2241832 -1969938 -4874664
8131d874664k368968J412910M536999N137602L731180M80391l959350o549478
$$ -4874664 -7243632 -5830722 -1293723 3843879 7575059 8055450 4096100 -2453378
8123b453378m723953k53730K851337L266375K383708R37135j062155k145089o68085
$$ -2453378 -7177331 -7431061 -4579724 -1313349 1070359 2007494 945339 -1199750 -1867835
8114a867835K123680L210117J653435q59950k469707k149920J78441K342848Q77494
$$ -1867835 255845 3465962 5119397 4259447 1789740 -360180 -181739 2161109 3038603
8105C038603l979984o772956l709277J647238L648225K547250K027910J688126
$$ 3038603 -941381 -7714337 -11423614 -9776376 -6128151 -3580901 -1552991 135135
8097A35135j208384m319040k445356L033978M971469J706551n38711J383021K441854
$$ 135135 -1073249 -5392289 -7837645 -4803667 167802 1874353 1335642 2718663 5160517
8088E160517r89046m234724k356272J422397J577802o02167m47070J531797J400478
$$ 5160517 4171471 -63253 -2419525 -997128 580674 -21493 -468563 1063234 2463712
8079B463712n87044q22313Q80674J473173N08624J12619L6195j664222l606532
$$ 2463712 1876668 1054355 1935029 3408202 3916826 4029445 4065640 2401418 -1205114
8070a205114k412592R78456J903779n66022k154470n03595J383114O81356q82255
$$ -1205114 -3617706 -2639250 -735471 -1301493 -3455963 -3959558 -2576444 -1895088 -2777343
8061b777343o58316P12955J397794J673473K470667K905267J715487m92677k289470
$$ -2777343 -3435659 -2722704 -1324910 348563 2819230 5724497 7439984 6947307 4657837
8052D657837l146276k753800o01478K191681K742933J38376k505848j991656M55224
$$ 4657837 1511561 -1242239 -1843717 347964 3090897 3229273 723425 -1268231 -813007
8043h13007J204640l30782j291016k69892N05206r35102k694487j566589J951599
$$ -813007 391633 60851 -1230165 -1500057 -994851 -1929953 -4624440 -6191029 -4239430
8034d239430L874660K177814n05766j009789k01084p73778k010777p01131K681083
$$ -4239430 -364770 1813044 1307278 297489 96405 -677373 -2688150 -3389281 -708198
8025g08198L228552j061093n261625m157300K56480K128354M04438p67352P00510
$$ -708198 2520354 1459261 -3802364 -7959664 -7703184 -5574830 -5170392 -5937744 -5237234
8016e237234K296064J977234J096472J007285P15345m19167r52204r5735O14181
$$ -5237234 -2941170 -963936 132536 1139821 1855166 1435999 483795 388060 1002241
8007A002241L4862p03858m77494R5234L93813P03059L84064j757255m081596k849214
$$ 1002241 1037103 333245 -144249 -49015 344798 1047857 1431921 -325334 -4406930 -7256144
7997g256144J691098L964733Q01652l321040k705540J223047K844103J144183
$$ -7256144 -5565046 -1600313 -798661 -4119701 -6825241 -5602194 -2758091 -1613908
7989a613908Q633Q88813J000000q37249j884519m86543R87779K44805j302671
$$ -1613908 -1605275 -716462 283538 -553711 -2438230 -2924773 -1936994 -1692189 -2994860
7980b994860j195060L64141J519013J535052Q28678j94053r47287p09058J57327
$$ -2994860 -4189920 -3825779 -2306766 -771714 56964 -137089 -1084376 -1793434 -1636107
7971a636107M53952K09375O56132J610471J213098p87045k026079j146887J42138
$$ -1636107 -1182155 -972780 -316648 1293823 2506921 1719876 -306203 -1453090 -1310952
7962a310952K97690M78818J577143J512171j280164l940055k752123P91032J861672
$$ -1310952 -1013262 -534444 1042699 2554870 1274706 -2665349 -5417472 -4626440 -2764768
7953b764768l01190j494370M19082K217394Q57404j719124k091336o19248P1111
$$ -2764768 -3065958 -4560328 -4141246 -1923852 -1066448 -2785572 -4876908 -5496156 -5425045
7944e425045k30846L38416J776555K020239N55875o45240j90275J028741J753095
$$ -5425045 -5655891 -5317475 -3540920 -1520681 -964806 -1610046 -1800321 -771580 981515
7935I81515K056386K371376K300052J212758q65197l335134n172154n035378k422416
$$ 981515 3037901 5409277 7709329 8922087 8056890 4721756 -450398 -5485776 -7908192
7926g908192J149319L227367K805404P37198j732587l404331k796228K58840K858397
$$ -7908192 -6758873 -3531506 -726102 11096 -1721491 -5125822 -7922050 -7663210 -4804813
7917d804813J707589j992613l433710j005349J304214L60440r62823J286304M954195
$$ -4804813 -3097224 -5089837 -8523547 -9528896 -8224682 -7864242 -8827065 -7540761 -2586566
7908b586566M510724k42149l507282k023971O54767K76447j824138j558457J470397
$$ -2586566 1924158 1682009 -1825273 -3849244 -3194477 -2918030 -4742168 -6300625 -4830228
7899d830228L716014K735172k86421k701693l015455j395953P97666J819160R92064
$$ -4830228 -1114214 1620958 1334537 -1367156 -4382611 -5778564 -4980898 -3161738 -2169674
7890b169674m18286m96337J060948K496282J955218l38832k078949j302347J169624
$$ -2169674 -2587960 -3084297 -2023349 472933 2428151 2089319 10370 -1291977 -122353
7881a22353K446248J191491n29781k21596J288078J093820j284594l117126k433680
$$ -122353 2323895 3515386 2985605 2764009 4052087 5145907 3861313 744187 -1689493
7872a689493l95461R86950J267481P69518m38649j572964j183793M85240J180387
$$ -1689493 -2084954 -1098004 169477 938995 500346 -1072618 -2256411 -1771171 -590784
7863e90784Q9131n78819P54026K096740J051153j088848j376710J00186Q18754
$$ -590784 -501653 -1080472 -326446 1770294 2821447 1732599 355889 456075 1274829
7854A274829J83889j36015J01696p55503k593353k763143k05343K427535K449635
$$ 1274829 1458718 1322703 1424399 668896 -1924457 -4687600 -4892943 -2465408 -15773
7845a5773Q33589L11693J243104J486801j04460j907109j686281M32415K007690
$$ -15773 817816 1129509 2372613 3859414 3754954 1847845 161564 593979 2601669
7836B601669J352690k25602k49038J217737J498364m80950k104089r24693J270591
$$ 2601669 3954359 3728757 3479719 4697456 6195820 5714870 3610781 2686088 3956679
7827C956679Q97315k035353l942550k713727J29493K325685L059806K001999p89238
$$ 3956679 4853994 2818641 -1123909 -3837636 -3708143 -1382458 1677348 3679347 2890109
7818B890109l219507k423700J012293K877963J050802j299325m58603K252720
$$ 2890109 -329398 -2753098 -1740805 1137158 2187960 888635 430032 2682752
7810B682752K670170J40748j668907k83367K064920J499385k382934n709907m606387
$$ 2682752 5352922 5493670 3824763 3541396 5606316 7105701 4722767 -987140 -5593527
$$ [...]
##END NTUPLES=NMR SPECTRUM
##END=
