##TITLE=31Pdec_PR195_T2
 , 24 sc
 1.04.2021
##JCAMPDX= 6.0         $$ Bruker NMR JCAMP-DX V2.0
##DATA TYPE= NMR SPECTRUM
##DATA CLASS= NTUPLES
##ORIGIN= UXNMR, Bruker Analytische Messtechnik GmbH
##OWNER= root
$$ XWIN-NMR		Version 3.5
$$ Thu Apr  1 13:48:21 2021 Russian Standard Time (UT+4h)  she@DPX200
##.OBSERVE FREQUENCY= 81.013821
##.OBSERVE NUCLEUS= ^31P
##.ACQUISITION MODE= SIMULTANEOUS
##.ACQUISITION SCHEME= undefined
##.AVERAGES= 24
##.DIGITISER RES= 16
##SPECTROMETER/DATA SYSTEM= spect
##.PULSE SEQUENCE= zgpg30
##.SOLVENT NAME= CD3CN
##.SHIFT REFERENCE= (INTERNAL, CD3CN, 0, 248.564)
##AUDIT TRAIL= $$ (NUMBER, WHEN, WHO, WHERE, WHAT)
$$ ##TITLE= Audit trail, XWIN-NMR		Version 3.5
$$ ##JCAMPDX= 5.01
$$ ##ORIGIN= Bruker BioSpin GmbH
$$ ##OWNER= she
$$ F:/spectra/data/she/nmr/P31/1/pdata/1/auditp.txt
$$ ##AUDIT TRAIL=  $$ (NUMBER, WHEN, WHO, WHERE, WHAT)
(   1,<2021-04-01 13:46:42.35 +0400>,<she>,<DPX200>,
      <created by zg, POWCHK disabled, PULCHK disabled
       configuration hash MD5:
       00 E9 B6 7A A2 85 ED C7 34 08 36 98 17 FE 4E 26
       data hash MD5: 32K
       48 49 7D 39 CA BC 4B DB 8F D7 01 63 1E 2C 5F 5B>)
(   2,<2021-04-01 13:47:03.95 +0400>,<she>,<DPX200>,
      <Start of raw data processing
       efp BC_mod = 2 LB = 1 FT_mod = 6 PKNL = 1 PHC0 = -4384.105 PHC1 = -9.598907 SI = 64K 
       data hash MD5: 64K
       72 BB 9E 1F D0 41 BC B4 C2 2B 1A 95 9E 68 59 3E>)
(   3,<2021-04-01 13:47:33.39 +0400>,<she>,<DPX200>,
      <pk PHC0 = 21.3646 PHC1 = 7.599999 
       data hash MD5: 64K
       2B 84 76 A3 60 1D 18 2F 93 A5 E1 4F D1 72 95 37>)
(   4,<2021-04-01 13:47:36.26 +0400>,<she>,<DPX200>,
      <abs ABSG = 5 
       data hash MD5: 64K
       17 13 D5 01 70 39 51 BB 56 60 99 87 83 76 F3 15>)
$$ ##END=
$$ 
$$ hash MD5
$$ 02 DA 0B CE 4A B7 1B 89 52 4C CC 73 5A 8B 25 7E
##$RELAX= 
##$RELAX= 
##$RELAX= 
##$RELAX= 
##$RELAX= 
##$RELAX= 
##$RELAX= 
##$RELAX= 
$$ Bruker specific parameters
$$ --------------------------
##$DU= <F:/spectra>
##$EXPNO= 1
##$NAME= <P31>
##$PROCNO= 1
##$TYPE= <nmr>
##$USER= <she>
##$AMP= (0..31)
100 100 100 100 100 100 100 100 100 100 100 100 100 100 100 100 100 100 
100 100 100 100 100 100 100 100 100 100 100 100 100 100 
##$AQSEQ= 0
##$AQ_mod= 1
##$AUNM= <au_zg>
##$AUTOPOS= <>
##$BF1= 81.014009
##$BF2= 200.13
##$BF3= 200.13
##$BF4= 200.13
##$BF5= 200.13
##$BF6= 200.13
##$BF7= 200.13
##$BF8= 200.13
##$BYTORDA= 1
##$CFDGTYP= 0
##$CFRGTYP= 5
##$CHEMSTR= <none>
##$CNST= (0..31)
1 1 145 1 1 1 1 1 1 1 1 1 1 1 1 1 1 1 1 1 1 1 1 1 1 1 1 1 1 1 1 1 
##$CPDPRG= <waltz16>
##$CPDPRG1= <>
##$CPDPRG2= <waltz16>
##$CPDPRG3= <>
##$CPDPRG4= <mlev>
##$CPDPRG5= <mlev>
##$CPDPRG6= <mlev>
##$CPDPRG7= <mlev>
##$CPDPRG8= <mlev>
##$CPDPRGB= <>
##$CPDPRGT= <>
##$D= (0..31)
0 1 0 0 0 0 0 0 0 0 0 0.03 2e-05 3e-06 0 0 0 0 0 0 0 0 0 0 0 0 0 0 0 0 
0 0 
##$DATE= 1617270401
##$DBL= (0..7)
120 120 120 11 120 120 24 19 
##$DBP= (0..7)
150 150 150 150 150 150 150 150 
##$DBP07= 0
##$DBPNAM0= <>
##$DBPNAM1= <>
##$DBPNAM2= <>
$$ [...]
##$SUBNAM3= <"">
##$SUBNAM4= <"">
##$SUBNAM5= <"">
##$SUBNAM6= <"">
##$SUBNAM7= <"">
##$SUBNAM8= <"">
##$SUBNAM9= <"">
##$SW= 501.771253377433
##$SWIBOX= (0..15)
0 1 3 0 0 0 0 0 0 0 0 0 0 0 0 0 
##$SW_h= 40650.406504065
##$TD= 32768
##$TD0= 1
##$TE= 0
##$TE2= 300
##$TE3= 300
##$TEG= 300
##$TL= (0..7)
0 120 53 12 22 120 120 120 
##$TP= (0..7)
150 150 150 150 150 150 150 150 
##$TP07= 0
##$TPNAME0= <>
##$TPNAME1= <>
##$TPNAME2= <>
##$TPNAME3= <>
##$TPNAME4= <>
##$TPNAME5= <>
##$TPNAME6= <>
##$TPNAME7= <>
##$TPOAL= (0..7)
0.5 0.5 0.5 0.5 0.5 0.5 0.5 0.5 
##$TPOFFS= (0..7)
0 0 0 0 0 0 0 0 
##$TUNHIN= 0
##$TUNHOUT= 0
##$TUNXOUT= 0
##$USERA1= <user>
##$USERA2= <user>
##$USERA3= <user>
##$USERA4= <user>
##$USERA5= <user>
##$V9= 5
##$VALIST= <valist>
##$VCLIST= <CCCCCCCCCCCCCCC>
##$VD= 0
##$VDLIST= <DDDDDDDDDDDDDDD>
##$VPLIST= <PPPPPPPPPPPPPPP>
##$VTLIST= <TTTTTTTTTTTTTTT>
##$WBST= 1024
##$WBSW= 4
##$XGAIN= (0..3)
0 0 0 0 
##$XL= 0
##$YL= 0
##$YMAX_a= 33171
##$YMIN_a= -40346
##$ZGOPTNS= <>
##$ZL1= 120
##$ZL2= 120
##$ZL3= 120
##$ZL4= 120
##$ABSF1= 248.5645
##$ABSF2= -253.2056
##$ABSG= 5
##$ABSL= 3
##$ALPHA= 0
##$AQORDER= 0
##$ASSFAC= 0
##$ASSFACI= 0
##$ASSFACX= 0
##$ASSWID= 0
##$AUNMP= <proc_1d>
##$AZFE= 0.1
##$AZFW= 0.5
##$BCFW= 0
##$BC_mod= 2
##$BYTORDP= 0
##$COROFFS= 0
##$CY= -3
##$DATMOD= 1
##$DC= 0
##$DFILT= <>
##$DTYPP= 0
##$F1P= 0
##$F2P= 0
##$FCOR= 1
##$FTSIZE= 65536
##$FT_mod= 6
##$GAMMA= 0
##$GB= 0
##$INTBC= 1
##$INTSCL= 5.30512e-09
##$ISEN= 30
##$LB= 1
##$LEV0= 0
##$LPBIN= 0
##$MAXI= 10000
##$MC2= 0
##$MEAN= 0
##$ME_mod= 0
##$MI= 50
##$NCOEF= 0
##$NC_proc= -3
##$NLEV= 6
##$NOISF1= 182.463
##$NOISF2= 159.3651
##$NSP= 0
##$NTH_PI= 0
##$NZP= 0
##$OFFSET= 248.5645
##$PC= 4
##$PHC0= -4362.74
##$PHC1= -1.998909
##$PH_mod= 1
##$PKNL= yes
##$PPARMOD= 0
##$PSCAL= 0
##$PSIGN= 0
##$REVERSE= no
##$SF= 81.014009
##$SI= 65536
##$SIGF1= 159.3651
##$SIGF2= -187.1042
##$SINO= 113.3802
##$SIOLD= 16384
##$SREGLST= <1H.CDCl3>
##$SSB= 0
##$STSI= 65536
##$STSR= 0
##$SW_p= 40650.406504065
##$SYMM= 0
##$S_DEV= 0
##$TDeff= 32768
##$TDoff= 0
##$TI= <>
##$TILT= no
##$TM1= 0
##$TM2= 0
##$TOPLEV= 0
##$USERP1= <user>
##$USERP2= <user>
##$USERP3= <user>
##$USERP4= <user>
##$USERP5= <user>
##$WDW= 1
##$XDIM= 65536
##$YMAX_p= 496804261
##$YMIN_p= -7349207
$$ End of Bruker specific parameters
$$ ---------------------------------
##NTUPLES= NMR SPECTRUM
##VAR_NAME=  FREQUENCY,     SPECTRUM/REAL,   SPECTRUM/IMAG
##SYMBOL=    X,             R,               I
##VAR_TYPE=  INDEPENDENT,   DEPENDENT,       DEPENDENT
##VAR_FORM=  AFFN,          ASDF,            ASDF
##VAR_DIM=   65536,         65536,           65536
##UNITS=     HZ,            ARBITRARY UNITS, ARBITRARY UNITS
##FACTOR=    0.620285442955139, 1,           1
##FIRST=     20137.2065510759, 0,            0
##LAST=      -20513.1999529892, 0,           0
##MIN=       -20513.1999529892, -7349207,    0
##MAX=       20137.2065510759, 496804261,    0
$$ Real data points
##PAGE= N=1
##DATA TABLE= (X++(R..R)), XYDATA
$$ [...]
37518A22322k19125j29584o1546k9448M2087J33337J34983K3190q2565n5073J09931
37507a1491K89866L10332P5850k84532m62629k91304K9374J78688J31857J17356
37497H3367J90022J41680r0766k36786r4419J31830J36008l9683j29343p2014
37487A9896k2397k5340J7400R3526Q3421Q710P38K5169o2515j73565m9818K44547
37475A59772K78305r9847m23044k29740K36943L42397o2645m82333m79752j67924
37465i27868R3513J79218J95579K08106J92880J70298J91658K01998P1272j89876
37455C86778l55695k26900R1772K72485J50226q6278j72116j20515j35722k41166
37445d37131k31633k8574J56319J34513K6306O5468K49467L59931K57225J4687
$$ y = [122322, -96803, -226387, -287933, -317381, -275294, -141957, -6974, 16216, -66349, -121422, -11491, 278375, 588707, 664557, 380025, -82604, -373908, -344534, -165846, -33989, 83367, 273389, 415069, 324303, 87517, -6902, 124928, 260936, 221253, 91910, 19896, -2501, -27841, -10441, 83085, 166506, 175216, 175954, 201123, 138608, -34957, -84775, 159772, 438077, 338230, -84814, -314554, -77611, 264786, 202141, -280192, -759944, -927868, -834355, -655137, -459558, -251452, -58572, 111726, 303384, 505382, 576654, 386778, 31083, -195817, -104045, 168440, 318666, 232388, 60272, -60243, -195965, -437131, -668764, -697338, -541019, -406506, -380200, -314732, -65265, 294666, 551891, 566578]
37435E66578j81623j72869M1691K35741J56303j18877k18512k372K00321R3789
37425F00170j14654q3085O2677n2688l66942m28141j25006J42671J16234J5390
37415b33374O2314J29929Q9968Q3597J72128J21874j43650k67402j9411K32037
37405B28010P6054k31706j75828J32770J30046k23468l34670M5065L89536K21552
37395B57361j77290k70163o4146N1074j6081l5493K0993o9879k87549k72051J11610
37384g51614M58341L36984q9632k70060j8074K61632J77706j04181j50371P9270
37374f9999J88586l5464k94742k32340M4609J56621J5999j04756k4329J29788
37364b26027J99278K15392K25711J36060r0086k38174p6348K79947M48286K38428
$$ y = [566578, 384955, 212086, 253777, 489518, 645821, 526944, 308432, 306060, 506381, 600170, 485516, 402431, 465108, 412420, 45478, -382663, -507669, -364998, -248764, -233374, -171060, -41131, 48837, 132434, 304562, 426436, 282786, 15384, -4027, 228010, 304064, 72358, -103470, 29300, 159346, -64122, -398792, -353727, 35809, 257361, 80071, -190092, -254238, -203164, -219245, -254738, -233745, -303624, -591173, -863224, -751614, -293273, 43711, -45921, -315981, -334055, -72423, 105283, 1102, -149269, -69999, 118587, 83123, -211619, -443959, -399350, -242729, -226730, -331486, -355815, -226027, -26749, 188643, 414354, 550414, 460328, 222154, 145806, 425753, 874039, 1112467]
37354A112467j31909l28107k71092j34563p3216q5869j13506j27968r2601L3306
37344b13058J75659J55051n9646k14075o5920K46900L55306J54466r6389j86066
37334B52228j79844j59538m7078J48156J99907J3142j56197q9826L5392j6999
37324f57j03074K2339K05682J34629p8773p5246P7794k8862l69249m09233L3020
37313e91630M42214L86535J12115K2846N6205n087k6836J72975L41754J50106
37303A061197j93112k24350K2567R5551j10416k22683o6833N6179p5156k23945
37293A18999j16862R3940Q5844j17434j73656Q3153L77653K83757k56853p63716
37283c85175o74287j0333N77850N59790J27236j61776j34817o3454j07819j32366
$$ y = [1112467, 980558, 652451, 381359, 246796, 173580, 87711, -25795, -153763, -246364, -213058, -37399, 117652, 58006, -156069, -221989, 24911, 380217, 534683, 438294, 252228, 72384, -87154, -134232, 13924, 213831, 226973, 70776, -19050, 16342, -657, -103731, -81392, 124290, 258919, 180146, 104900, 182694, 153832, -215417, -624650, -591630, -149416, 237119, 349234, 372080, 428285, 423198, 396362, 569337, 911091, 1061197, 868085, 643735, 666302, 761853, 651437, 428754, 361921, 418100, 342944, 118999, 2137, 96077, 181921, 64487, -109169, -26016, 351637, 635394, 378541, -385175, -1059462, -1069795, -491945, 67845, 195081, 33305, -101512, -164966, -272785, -405151]
37273d05151p0852n3570q6093J5135K37198K83629M7827j63270r4828P5868Q2688
37262a31419J5286J05896K80617K69657N0924j36763j68818j41703j30467r7612
37252h4402n2066p3708j46286j48583m6835N5219Q2604O8103M9552K3519J7489
37241b55394P0642J21785O6102l7018J1535K14122K38308j67378o96995p21903
37231a156194r9803N15974M35458j59378m42750p1134L81204L17776o846L6243
37221b49450M08267M64243n987m44722l84078o5445P4600M3876N1688L9894j00457
37210a67571j60852N6706K77611J21321k34936k84888L956J64707Q674j29798
37200c45070l5186M0768j00596k07044k4041K21691J68065r2527j58097P1182
$$ y = [-405151, -476003, -529573, -615666, -600531, -363333, -79704, -31877, -195147, -289975, -214107, -131419, -116133, -10237, 270380, 540037, 590961, 454198, 285380, 143677, 13210, -84402, -136468, -210176, -356462, -505045, -551880, -496661, -414057, -345954, -296402, -272883, -255394, -184752, -62967, 3135, -33883, -22348, 191774, 430082, 262704, -434291, -1156194, -1255997, -740023, -304565, -463943, -906693, -977827, -596623, -278847, -285693, -249450, 158817, 623060, 617073, 172351, -211727, -277172, -202572, -158696, -107008, -67114, -167571, -328423, -271717, 5894, 127215, -107721, -392609, -388653, -223946, -215272, -345070, -380256, -339488, -440084, -647128, -671169, -449478, -281413, -373940, -532037, -460855]
37190d60855K83114K29706J9373j05588o6063N0287J42756J78941J81470J69690
37180F22831J05546o3365k71995l24582j12933J85900K54495J1625k57169k36381
37170h6028R619J14519p6556k68951j59058O5669m585k98897k84512J81410N01206
37159c06164J84131l55569l59664J66147N02440K84401r6542k14864j43316q5337
37149d24337o410J03115N0645j68878k02044J15274L99735K73445n0823j44878
37139e5156m1904o9645k11218j51279J15146K24331L9850j29047l1736J54817
37129a55841J45911j9967r3717k2430j8761k16212m09577k72739J71009M70313
37119d22011K87462j21190k36342m170J47238L1557l2865J46459K40130k8089
$$ y = [-460855, -177741, 51965, 71338, -34250, -100313, -50026, 92730, 271671, 453141, 622831, 728377, 665012, 393017, 68435, -44498, 141402, 395897, 407522, 150353, -86028, -76409, 38110, -38446, -307397, -466455, -400786, -405371, -704268, -988780, -807370, -306164, -122033, -477602, -837266, -671119, -168679, 115722, 19180, -195684, -339000, -424337, -430747, -327632, -276987, -445865, -647909, -532635, -132900, 140545, 89722, -55156, -97060, -166705, -377923, -529202, -414056, -189725, -149875, -278922, -310658, -155841, -9930, -29897, -123614, -146044, -164805, -381017, -790594, -1063333, -892324, -422011, -134549, -255739, -492081, -496251, -349013, -317456, -350321, -203862, 36268, 8179]
37109H179l37411k55204N7536J32179m7983j07221M6218J38165O7926L2668J10888
37098a54060J57421J21950Q5432J2233j45978j82477P8359L20242R7502l86304
37088D320m68593l4691L08364J95070k1051J1037Q8778k0994r3801P3836J88944
37077B31219m2637l39939k71808M9892J97610J07180M8985J01428J09543M8160
37067B39633K2723L124r3983j62357o9411N4031R24j53939j83251o6431O6976
37056c41961J95354L07067K31270q8095l28840j84871J29495J70704p5532k48283
37046b33692k02010r3818J9957J90965K48129j7949l46861k33206K68307N08570
37036A08392J68512k96653l57857q7691J38007J99459J75965P1558o9539m4042
$$ y = [8179, -329232, -584436, -526900, -394721, -442704, -549925, -503707, -365542, -297616, -264948, -154060, 3361, 125311, 210743, 222976, 76998, -105479, -27120, 293122, 390624, 4320, -464273, -498964, -190600, 4470, -16581, -5544, 83234, 62240, -31561, 42275, 231219, 188582, -151357, -423165, -373273, -175663, -68483, -19498, 81930, 191473, 239633, 262356, 265480, 171497, 9140, -60271, -6240, -5316, -159255, -342506, -408937, -341961, -146607, 160460, 391730, 303635, -25205, -210076, -80581, 90123, 14591, -233692, -435702, -529520, -509563, -318598, -70469, -88418, -435279, -668485, -400178, 108392, 276904, -19749, -377606, -465297, -327290, -127831, 48134, 119692, 50153, 6111]
37026F111J94989L29707Q9896l15637m70909k95714m3767R6915J31267J00765
37016a76377N3497P8608J54817Q1386k12829m23651k17096K57808M99164K86192
37006C81519q5161k35816j37154k7755o7288j81333j80624J8399K72973L44586
36996A02346J83245n772m7297j9737o3147j04252J2169K05089K32262P1905l4356
36985E32455K7461O2401j00862l06081k82234l4864J68084J52849J5143o2636
36975A71716l1142L7664R0653J36365J62051Q7784j29097l59443l74401j19709
36965c27559J60931J96058L6522k0942J40387K98496K31154K3168j07859j29705
36955E00651j33928p9350J28038L39126K59891q4387k80879q5517K10641K03360
$$ y = [6111, 201100, 530807, 620703, 305066, -165843, -461557, -505324, -408409, -277142, -176377, -122880, -44272, 110545, 191931, -20898, -444549, -661645, -403837, 95327, 381519, 296358, 60542, -76612, -104367, -171655, -352988, -533612, -515213, -242240, 102346, 285591, 279819, 232522, 212785, 149638, 45386, 57555, 262644, 494906, 566811, 532455, 559916, 622317, 521455, 215374, -66860, -101724, 66360, 219209, 234352, 171716, 140574, 178238, 268891, 405256, 567307, 655091, 525994, 166551, -207850, -327559, -166628, 29430, 65952, 45010, 185397, 483893, 715047, 738215, 630356, 500651, 366723, 287373, 415411, 754537, 1014428, 930041, 649162, 563645, 774286, 977646]
36945I77646n1087j93154j45022j51250k61371j97705J28558L52978J74249j50358
36935D83484j70202P8228J54754p8921k61429j25179J04189J14121r656j5159
36925B74230L1166j11105l39688k89102M2925K08743J5436j33830Q7448L29597
36915A15820J20904k86457k56882J75842L19160m4660k89982j107L24278J26569
36905C03485k67420k14387J73944K89286O7537l3607N7954j9731k30582j17912
36895H567K76526L24001j21865l96169j18131J83773J3291k84189k41232r7558
36885d52986k07340k45358J69413N75189L23370k42664k63557K11665L30576r8625
36875I9683l36199m0318J94574k9635k13939Q4940M20759K23271k34269l26105
$$ y = [977646, 926559, 733405, 588383, 437133, 175762, -21943, 106615, 459593, 633842, 483484, 313282, 391510, 546264, 467343, 205914, 80735, 184924, 299045, 289389, 274230, 305396, 194291, -145397, -434499, -391574, -182831, -167395, -301225, -213777, 115820, 236724, -49733, -306615, -130773, 188387, 143727, -146255, -147362, 176916, 303485, 36065, -178322, -4378, 284908, 352445, 318838, 376792, 357061, 126479, 8567, 285093, 609094, 487229, 91060, -27071, 156702, 169993, -114196, -355428, -452986, -660326, -905684, -736271, -161082, 162288, -80376, -343933, -132268, 198308, 99683, -236516, -276834, -82260, -111895, -325834, -240894, 179865, 403136, 168867, -157238]
36865a57238p1234N1865l4106r106J58795J62032n6318j83604m1206J86803K62864
36854B69547J37663j07179l02900k35347R9385L55163K23342j17111k31553m7544
36844D3466Q9992k7603k04741j99781n6441M8835O6841M3807n154n5249k2763
36833b78791J16647K37440K05929P0234M495O6300J05648k5295k28591k50440
36823B3576m5383R9248n4553l06568k54424J13418L58997K06262q8725j54854
36813a03006k2645M4203K6907J10828K54673J74480j85695m71611l53519M6418
36803d78967L13241K21937o1773k11995q6220J50799K15927K4291k15171k64635
36793c92566j51178p9134r5519l2290J75301L13010J80195p4106j18026R6820
$$ y = [-157238, -228472, -176607, -210713, -219819, -61024, 101008, 44690, -138914, -180120, 6683, 269547, 407210, 300031, -2869, -238216, -138831, 216332, 439674, 322563, 91010, 43466, 133458, 105855, -98886, -298667, -355108, -306273, -239432, -195625, -200779, -256028, -278791, -162144, 75296, 281225, 351459, 355954, 422254, 527902, 502607, 274016, 23576, -21807, 77441, 22888, -283680, -538104, -424686, -65689, 140573, 51848, -103006, -125651, -81448, -54541, 56287, 310960, 485440, 299745, -171866, -525385, -478967, -165726, 56211, -5562, -217557, -303777, -152978, 62949, 87240, -127931, -392566, -543744, -622878, -718397, -750687, -575386, -262376, -82181, -156287, -274313, -177493]
36783a77493K56275J25606j26850j85015k2716J08338O4253l2829l6816K3747
36773c500O4005R1909J28645J07401k5627j94390k76000k24989n4595J82802L25589
36762A21250J89827j39431k87230n7076K42571J93010j37461k93764p9577K14598
36752c3283K62024R6004m2801m7107r605n8765j99609k74672j18371J86633L23255
36741H3703J38731j20214j63392p8493j22322k45777j87361M3360J67022J03557
36731c81186O0133J32500J85088J55950J15809Q585k63450m77452k86769J44083
36721f06709K24702j73098m47400j54513L39182M47490J64972j25296k61902k85149
36711h77721j28581K04926M03696K34573k8980M071K16118K00530m4378j35717
$$ y = [-177493, 78782, 204388, 77538, -107477, -130193, -21855, 42398, 9569, -27247, -3500, 60505, 152414, 281059, 388460, 362833, 168443, -107557, -332546, -387141, -204339, 121250, 311077, 171646, -115584, -172660, 69911, 262921, 125460, -168304, -247881, -33283, 228741, 324745, 281944, 234837, 225232, 166467, -33142, -307814, -426185, -239552, 83703, 222434, 102220, -61172, -139665, -261987, -507764, -695125, -651765, -484743, -381186, -321053, -188553, -3465, 152485, 268294, 276879, 13429, -464023, -750792, -606709, -382007, -555105, -1002505, -1157018, -817836, -370346, -205374, -330670, -592572, -877721, -1006302, -801376, -397680, -163107, -192087, -188016, 28102, 228632, 184254, 48537]
36701D8537L8305J63305L7610j46869j62315n8890K607m222j4552j0140j7940
36690a24564l7804j6618R5088K22666J70839r9893k86512j14498J68581Q5138
36680F2423k85868l60230p300J94197m5183j76956K22258O12357L42066k12666
36670C45098k47208J28783J41033k69429l79240J423K03109j00328l40681p9924
36660e97364K76967K73297J53270K59901L20047k4107m57824m42433q6483P7235
36650b47494m1718p0795J01815J79562L9030n8594N3958J61253K1893k57459l84304
36639e02853k69183r7853n4636q1329K0654K58863L61109J49258j32120j17027
36629d65117J27033J91494j6326j18350J02754L32516K34041l3924j33311q0587
$$ y = [48537, 86842, 250147, 287757, 140888, -21427, -80317, -77710, -81932, -96484, -106624, -124564, -162368, -178986, -83898, 138768, 309607, 209714, -76798, -191296, -22715, 62423, -223445, -583675, -590975, -396778, -441961, -618917, -396659, 215698, 557764, 345098, 97890, 226673, 367706, 98277, -280963, -279540, -76431, -176759, -517440, -597364, -320397, -47100, 106170, 366071, 686118, 662011, 204187, -238246, -324729, -247494, -289212, -360007, -258192, -78630, -39600, -98194, -44236, 117017, 138910, -118549, -502853, -772036, -869889, -924525, -1005854, -985200, -726337, -365228, -215970, -348090, -465117, -338084, -146590, -162916, -281266, -178512, 154004, 388045, 354121, 220810, 140223]
36619A40223q4563q8683Q6762K89353J93904j06129j29402K65950N87958L63817
36609A519190k01068n03985l31013n2420m2721j99705j96233j5979M3748j21685
36599a01871k28872n7711J73600J49497k8639k8156J27837R2022j82361l10748
36589c95402j05103J09053M1292j00785k9742Q7284n7218l06771k46519R6422
36579i07489K63895R6522k9447J60917L91536K91022q434p8669J44940K74034
36569E98827N1438k80509l38741j26340K0868n8686j48288k0653K00872K23031
36559A21819Q265j92452k01259j02673m5252m0682l1033p791K0584O7019J03171
36548c00284O5607j7560k3778P5707J49695J09368M9915Q2391J34672N6192j40974
$$ y = [140223, 55660, -33023, 53739, 343092, 536996, 430867, 301465, 567415, 1155373, 1519190, 1318122, 814137, 483124, 430704, 387983, 188278, -7955, -23934, 19814, -101871, -330743, -388454, -214854, -65357, -93996, -122152, 5685, 97707, -84654, -395402, -500505, -391452, -350160, -450945, -480687, -393403, -450621, -757392, -1003911, -907489, -643594, -547072, -576519, -415602, -24066, 266956, 258522, 179853, 324793, 598827, 650265, 369756, 31015, -95325, -74457, -133143, -281431, -302084, -101212, 121819, 130084, -62368, -263627, -366300, -411552, -452234, -483267, -491058, -470474, -403455, -300284, -234677, -252237, -276015, -200308, -50613, 58755, 108670, 191061, 325733, 381925, 240951]
36537B40951k74900k12851j1767J57802J81116R4334J9678R36m5974j64680k27931
36526b43286j09807P8568J16323R239k3185Q8972J60388P1813m8797p2883o4435
36515c7090r1957p6613P283M972j44816k23708o5316J21707N7143j35246r7069
36504f80710J94946L80578K43313l2969j83241j50114J2288K39072L59894J84776
36494E67833j68299k96296n3545J79469K4008l22581l78472r5152J23980Q7379
36484c31676N3095J95934K63697K1990k88378k81615p62J97416J90578J51777
36474A72056J46840O6500n2180l2326P1985L635k16324k43414J4925J99030Q3113
36463B13840n6231N1432J91193P1788j26736o4365J53413J59404n3024j60134
$$ y = [240951, -33949, -246800, -258567, -100765, 80351, 174685, 194363, 195299, 149325, -15355, -243286, -353093, -274525, -158202, -148963, -172148, -83176, 77212, 149025, 100228, 27345, -37090, -129047, -205660, -198377, -193405, -338221, -561929, -627245, -505538, -448395, -583641, -680710, -485764, -105186, 138127, 105158, -78083, -228197, -215909, 23163, 383057, 567833, 399534, 103238, 49693, 229162, 253170, -69411, -447883, -543035, -419055, -331676, -278581, -82647, 181050, 203040, -85338, -366953, -367715, -170299, 20279, 172056, 318896, 385396, 333216, 300890, 372875, 376510, 160186, -83228, -68303, 130727, 213840, 157609, 209041, 400234, 472022, 345286, 280921, 434334, 593738, 540714, 380580]
36453C80580o0924L3878N688o2203j15348j31404j1675J92134J45089k56140m85509
36442c65834o8662N49989N23560j13600m72425j68762J81418N5732j96131p9551
36432a54266K24587K83271J30884M3792P063r9129j22767P7852K56027J17586
36422G64900j93657l34402k64216j68723j07741n2114m0317l0465J30511L51822
36412E5598K73934j25702l34294p1137K10764N3890k32854j16381K42279K92107
36402B48204L1114p8501L9084L2917j34332j11534J42841K31737j0405k76379
36392A14746l27211k73897k13295n9570J39084J52401l5878j66451j27107o6553
36382h63731l7580P3267K10644J68240P675K6569K26355K61188K9791j41267o0517
$$ y = [380580, 319656, 353534, 359222, 297019, 181671, 50267, 38592, 230726, 375815, 119675, -365834, -434496, 115493, 639053, 525453, 53028, -115734, 65684, 121416, -74715, -154266, 70321, 353592, 484476, 528268, 535331, 436202, 313435, 391287, 647314, 764900, 571243, 236841, -27375, -196098, -303839, -355953, -396270, -426735, -296224, 55598, 329532, 203830, -130464, -201601, 9163, 63053, -169801, -286182, -43903, 248204, 279318, 200817, 239901, 272818, 138486, 26952, 169793, 401530, 391125, 114746, -212465, -486362, -699657, -759227, -620143, -467742, -503620, -670071, -797178, -863731, -901311, -828044, -617400, -449160, -441485, -414916, -188561, 72627, 102418, -38849, -99366]
36371i9366L6392l8992r1597O3838K43781K04744J1937j43572k27188k52681j64249
36360d56953k4115m2099k22243k63375j8035K39299K33982R8677R6293J92727
36350a65842J97939J21313Q5598N2197p2845j84828j18815L9746M9148j20117
36340a16506k40627j53848L7531J30841O3154m3825l9202O4464Q2562j00346l33037
36329f48839l60105j42399J26343K76708K71297J20755r1750j59599K0209K16695
36319c70685J46323o7988o6813J45487J91336m2192k10874r8218M6960k9441j84394
36308e40499j87773r0783k6375M8613J65015J91429R9058O6028J08886k0783l27679
36297e14863l84862J2598M26964M17034J91818J48224J52358j21433m45998l27308
$$ y = [-99366, -62974, -101966, -193563, -129725, 114056, 318800, 330737, 187165, -40023, -292704, -456953, -481068, -523167, -745410, -1008785, -1026820, -787521, -553539, -454862, -358569, -165842, 32097, 153410, 239008, 291205, 218360, 33532, -85283, -45537, 3611, -116506, -357133, -510981, -473450, -342609, -279455, -323280, -362482, -298018, -215456, -315802, -648839, -1008944, -1151343, -1025000, -748292, -476995, -356240, -447990, -607589, -587380, -370685, -224362, -292350, -359163, -213676, -22340, -64532, -275406, -373624, -326664, -356105, -540499, -728272, -819055, -845430, -796817, -631802, -440373, -341315, -275287, -166401, -187184, -514863, -899725, -887127, -460163, -43129, 148689, 296913, 449271, 327838, -118160, -445468]
36287d45468J24002K97066K4743k17216j03303J33494J93953J01356k8562j59852
36277g9787j74327M0779K68703J64519j56920k16838N9660K13153M4090m5873
36267A17159K08964M17002J64110k78930l75237j33040K493j26512k46343j45608
36257c95942P8014K39791K51347J18764l2136j5898J47352J78189n1777k56443
36247B61261j40751J34523K12271Q7052K9094R1765R2288J2781J2923N4585q2150
36236G65642l59525m41084j96650Q5413J26668J2481l3953J2202L1717k7760j29410
36225a54259j99628j31921J06980L34597L05909N5089j19098n9348P3028P9739
36215B91088m2723k08002l34068k78453M3405L99813M09614P5540j73860j08082
$$ y = [-445468, -321466, -24400, 343, -216873, -320176, -186682, 7271, 108627, 80065, -79787, -254114, -213335, 55368, 219887, 62967, -153871, -94211, 118942, 163032, 117159, 326123, 743125, 907235, 628305, 253068, 120028, 122521, -3991, -250334, -395942, -317928, -78137, 173210, 291974, 259838, 243940, 391292, 569481, 517704, 261261, 120510, 255033, 467304, 554356, 583450, 675215, 767503, 780284, 793207, 847792, 765642, 406117, -34967, -231617, -146204, -19536, -7055, -41008, -28806, 2911, -24849, -154259, -353887, -485808, -378828, -44231, 261678, 316767, 197669, 138321, 211349, 291088, 248365, 40363, -293705, -572158, -528753, -128940, 280674, 356214, 182354, 74272]
36205G4272O161p6539j60676p841K07228K13110J13032J30390J45885n5841k89940
36194B99241k23249J7216J1520k40104l01557k1120K38601J90850k340q4313m1123
36183a56378N9668K15722L29062K17418p5750k75137k81248k71484l01772j73314
36173g13213J50436L59246K44170J7102m5172K488l1526j27329j38252l8071J01627
36162b18494K09024J72726o9652l13370k49862M7581J58113k3251q5040J94580
36152a77645L96463J02047l92526m78129r4807K77018L19323J36646o6707j75427
36142a53744j16376M4765O7483j16046k02146J3451K11150K1265l07101k46306
36132g83605J43021K85757J2438k05699n0396J85658J59577J2679L1293J30967
$$ y = [74272, 80433, 3894, -156782, -164623, 42605, 255715, 368747, 499137, 645022, 589181, 299241, 75992, 93208, 104728, -135376, -436933, -458053, -219452, -28602, -30942, -115255, -156378, -96710, 119012, 448074, 665492, 589742, 314605, 33357, -238127, -539899, -713213, -562777, -203531, 40639, 57741, 12569, 15057, -16469, -143798, -282050, -320121, -218494, -9470, 163256, 93604, -219766, -469628, -422047, -263934, -287185, -372225, -177645, 218818, 320865, -71661, -549790, -644597, -367579, -48256, 88390, 21683, -153744, -270120, -225355, -157872, -273918, -476064, -462613, -251463, -230198, -537299, -783605, -640584, -354827, -342389, -548088, -598484, -412826, -253249, -240570, -209277, -78310]
36122g8310L1798k55590m30531l04635R981K75188L48904K46119O6100j02346
36112a93322j88988j08979J34654L07187J32959k70925m25489j38577J77315J12245
36102d61920j25959r4579J55572K28820Q1694K3248J00653M9167j34890j26974
36092c05168J23344K36237Q736k67403k77981r2360P7080J74264J96636J11879
36082a4736J8743R4284K79652L24069K01177J25989J09607o9498l53183l51991
36072C64113j325K11428l4979l73785l01602Q4137K84010J07221j74757k59464
36062i5003j20170N6094P6647n2587j01285P4825K58057J57326j08395j85139
36052c9630p7988r0904j91637k9886L27644L51146m4920k41522Q5503L88258J58912
$$ y = [-78310, -46512, -302102, -732633, -1037268, -1027287, -752099, -403195, -157076, -90976, -193322, -382310, -491289, -356635, -49448, 83511, -187414, -612903, -751480, -574165, -461920, -587879, -682458, -526886, -298066, -216372, -193124, -92471, -43304, -178194, -305168, -181824, 54413, 63149, -204254, -482235, -574595, -497515, -323251, -126615, -14736, 4007, 98291, 377943, 702012, 903189, 1029178, 1138785, 1069287, 716104, 364113, 362788, 574216, 539237, 165452, -136150, -52013, 231997, 339218, 164461, -95003, -215173, -159079, -82432, -135019, -236304, -161479, 96578, 253904, 145509, -39630, -117618, -208522, -400159, -430045, -102401, 248745, 203825, -37697, 47806, 436064, 594976]
36041E94976k12680j18898K48511K76355m7624k21936j00042K2896L5914P7432
36031E54904Q4428j09046l00446j43955J97812K19428j09244k76165m7289K00556
36021B70983J14661j37435k00965r077K46093L60294K34427m7651k37893k06411
36011C87026j27416j66435j55557R6564L62500K95823L1343m673K01499K65258
36001A185932R6182K1390J62931K36250R3659l4375K131M0083J062P3862L06375
35990B185482M36874L40535K51847L36160M16837L33244K08337J76805K17119
35981D903240M00138Q58258J338411J328992R09415Q88207J677932K608228K930329
35972A7843150K990501L665892N006555O311437P395235Q838240J0859176J2820136
$$ y = [594976, 382296, 263398, 511909, 788264, 740640, 518704, 418662, 441558, 477472, 554904, 639332, 530286, 229840, 85885, 283697, 503125, 393881, 117716, 70427, 270983, 385644, 248209, 47244, 38167, 284260, 644554, 878981, 831330, 593437, 387026, 259610, 93175, -62382, 34182, 396682, 692505, 723848, 719175, 920674, 1185932, 1282114, 1303504, 1466435, 1702685, 1796344, 1761969, 1764100, 1804183, 1805245, 1879107, 2185482, 2622356, 2962891, 3214738, 3550898, 3967735, 4300979, 4509316, 4686121, 4903240, 5303378, 6161636, 7500047, 8829039, 9738454, 10626661, 12304593, 14912821, 17843150, 20833651, 24499543, 29506098, 35817535, 43212770, 52051010, 62910186, 75730322]
35964G5730322J4205630J5319047J6372326J6372072J3740716Q112633J032234
35957A60884980n297257r718065j2506702j4380782j5471749j5346794j3816757
35950G4346874j1420513r027838p167292n900501n138144m733746m331361l550919
35942B3076560k490744j737087j642897j829787j681624j154451p49292p50624
35934A1040054q78684p82669n37364m29154m74004m41308k78240k18569m07605
35925F592457o34067n83119k54357L0679K5873j68608k82748k20570j15754q7031
35915D302755r2545p4524r9084k18368k96855j68898O4876J17766p4276k47731
35905C213116k06606r9033j37059k37181j75335K4044J14949N94j57522j97785
$$ y = [75730322, 89935952, 105254999, 121627325, 137999397, 151740113, 159852746, 160884980, 155587723, 145869658, 133362956, 118982174, 103510425, 88163631, 74346874, 62926361, 53898523, 46731231, 40830730, 35692586, 30958840, 26627479, 23076560, 20585816, 18848729, 17205832, 15376045, 13694421, 12539970, 11790678, 11040054, 10161370, 9378701, 8841337, 8412183, 7938179, 7496871, 7218631, 7000062, 6592457, 5958390, 5375271, 5120914, 5151593, 5177466, 5008858, 4726110, 4505540, 4389786, 4302755, 4210210, 4135686, 4036602, 3818234, 3521379, 3352481, 3417357, 3535123, 3460847, 3213116, 3006510, 2907477, 2770418, 2533237, 2357902, 2381946, 2496895, 2497489, 2339967, 2142182]
35895B142182j27600k8532L6627K2651m1597k3904J29385K45705J52964k4717
35885B483164m4471N0183P412j75224k20253l9657J17929Q3608j0477n0031j28330
35874B073853k49148j96645O4820J96884j1505k43070j02741K61070L75260J38829
35864B307607r5990r4157k4491j19987l20778l72020j57791J39588K16017J2908
35854A490906j56327j7588J93633Q282m99200o62880j64420M32408M48707Q388
35844A081909k65871j64565K7626J41158K35784K21286n3182l52901k61768J28181
35834G37657K78823M6520j01640J07351K92280Q3783k26798j50363K03235K84260
35824A555108o6862l97462k88405J11320L33194J81779r7905j98416j24265q6184
$$ y = [2142182, 2014582, 1986050, 2022677, 2045328, 2003731, 1979827, 2109212, 2354917, 2507881, 2483164, 2438693, 2488876, 2496288, 2321064, 2100811, 2061154, 2179083, 2262691, 2252214, 2202183, 2073853, 1824705, 1628060, 1692880, 1889764, 1878259, 1635189, 1532448, 1793518, 2168778, 2307607, 2211617, 2117460, 2092969, 1972982, 1652204, 1280184, 1122393, 1261981, 1477998, 1490906, 1334579, 1316991, 1510624, 1518906, 1019706, 356826, 192406, 624814, 1073521, 1081909, 816038, 651473, 679099, 820257, 1056041, 1277327, 1224145, 871244, 609476, 737657, 1016480, 1063000, 961360, 1068711, 1360991, 1444774, 1217976, 1067613, 1270848, 1555108, 1488246, 1090784, 802379, 913699, 1246893, 1428672, 1330767, 1132351, 1008086, 921902]
35814I21902j21824n0310J50304J87953j17708m62594m10993j0260K69109J70167
35804E25746q8956k01638j17328N6242K17827K51809Q0892j62818k19695l9555
35794C02526J44472J46060M5956R604N7458J00600P1257m0113j66833j75553k0189
35783D75245J34879J00750n9453j24394n2047o442n5963p8677k260P1383L7473
35772D40494p2963j56959j23475N8054K73381L15151J64033P4621J86916K51371
35762A410624K9843k39175j73271J17786K00297K5656m7488Q3668J28319j6209
35752A520050q8797J0239M3506n9103m3947J28323J23659j40633k51849Q37K10585
35741A452870K9084k30312j41113J04340N4405k23361k91204p7837O7929l0859
$$ y = [921902, 800078, 749768, 900072, 1088025, 970317, 507723, 96730, 86470, 355579, 525746, 436790, 235152, 117824, 174066, 391893, 643702, 724594, 561776, 342081, 302526, 446998, 593058, 639014, 648618, 706076, 806676, 877933, 837820, 670987, 495434, 475245, 610124, 710874, 651421, 527027, 474980, 468538, 412575, 333898, 331638, 403021, 440494, 367531, 210572, 87097, 145151, 418532, 733683, 897716, 972337, 1159253, 1410624, 1440467, 1201292, 1028021, 1145807, 1346104, 1371760, 1324272, 1407940, 1536259, 1520050, 1431253, 1441492, 1484998, 1425895, 1381948, 1510271, 1633930, 1493297, 1241448, 1242285, 1452870, 1481954, 1251642, 1110529, 1214869, 1269274, 1045913, 754709, 676872, 744801, 713942]
35731G13942j86547k02526o4844J62114L41357K78496M417j26292Q5164L14817
35721A320098J79707j50842k29176l1771Q4406M456n9994m4743r3519j58597l8556
35710G81469J55633P8494k23241k80423L9981K62231N4230k25876j23047J58211
35700F77662Q8017l14823m81835j50768K62907K97152O5714k1216Q4575N5856
35690E63241k14088l77334j48753K19552K67686r601j73318M31K27906J91452
35680E47174j9516j40071j33886j11794n7643P5493J49792K7616j36735j00188
35670A00242N5013M6718j07567r6235J30620K02563r2635l95652k29874L16055
35660g0752O71927N01011N7443k11497j88449p7921l1665K190P6620J06081K4323
$$ y = [713942, 527395, 324869, 260025, 422139, 763496, 1041992, 1046409, 920117, 1005281, 1320098, 1499805, 1348963, 1119787, 1088016, 1172422, 1176878, 1116884, 1072141, 978622, 820025, 781469, 937102, 1015596, 792355, 511932, 551913, 814144, 868374, 642498, 519451, 677662, 765679, 450856, -30979, -181747, 81160, 378312, 444026, 422810, 507385, 563241, 349153, -28181, -176934, 42618, 310304, 300703, 127385, 127816, 355722, 547174, 527658, 387587, 253701, 141907, 84264, 159757, 309549, 337165, 200430, 100242, 155255, 201973, 94406, -1829, 128791, 331354, 238719, -156933, -386807, -70752, 601175, 1102186, 1159629, 948132, 759683, 681762, 650097, 652287, 728907, 834988, 859311]
35649H59311o7468m6599M4290J04881J60966K45430K03597j07504m76236n16040
35639D04628k09927N4742N7368n285M8406Q9338J1613j5617J03647J45278k1808
35628F62383j24188M0463J63322o9579l41752j59896K71593K99395j32059l85732
35618B23950j52891J26097P2541n3288O2115J88466J1706k41795j78600N7374
35608A15675J9356k60102k92277O7945L71019K53546o0696j63009l5584O1193
35598G7066O1239J20731K50163K41775K1498j84214j72479o6706j01019k27594
35588B0460j91019M0695J97380J23112O985N1528J46022R2304k9335o330J04973
35577E56775M8315j82210k86187j18494Q6487Q4666l4185n6716L533K383k2076
$$ y = [859311, 791843, 745244, 789534, 894415, 1055381, 1300811, 1504408, 1396904, 920668, 404628, 194701, 249443, 306811, 301526, 349932, 439270, 450883, 435266, 538913, 684191, 662383, 538195, 578658, 741980, 672401, 330649, 170753, 442346, 741741, 609682, 223950, 71059, 197156, 269697, 216409, 278524, 466990, 478696, 236901, 58301, 115675, 135031, -125071, -417348, -349403, 21616, 275162, 214466, 51457, 15873, 77066, 138305, 259036, 509199, 750974, 772472, 588258, 415779, 349073, 248054, 20460, -170559, -129864, 67516, 190628, 197613, 249141, 395163, 487467, 458132, 451802, 556775, 605090, 422880, 136693, 18199, 104686, 189352, 155167, 98451, 101984, 104367, 82291]
35566H2291Q9235K75896K60755k9957k87141k24349J0218O3547p5050o6961K03395
35555C01879L91955K22737m9004l2436J51769O0725l15950m93825k59356q70o7626
35544i0002k49610k05437j9664N3177Q1545K46705L77346J85108j70476k43215
35534c4523J9245K12099R8809j20887k13550j94146j29436n599J18008J18792
35524a31188M1561N1200J33237J24536L4883K1715O6148K9454m350J35867K60486
35513G63549K1926m02660m23171L3888L37352J38240j05000L5989K36539O7541
35503G04193j92622o2386K47665J79221k10892l80908k33729j64916k44910j14531
35493d73815K41740L54823Q6486q6439J24224L35048J65128j29970j22449J02719
$$ y = [82291, 171526, 447422, 708177, 678220, 391079, 166730, 176948, 240495, 165445, 98484, 301879, 693834, 916571, 867567, 835131, 986900, 1047625, 731675, 237850, -21506, -22376, -90002, -339612, -545049, -564713, -511536, -429991, -183286, 194060, 379168, 208692, -34523, -15278, 196821, 295630, 174743, -38807, -232953, -362389, -367988, -249980, -131188, -89627, -38427, 94810, 219346, 254229, 275944, 342092, 371546, 367196, 503063, 763549, 785475, 382815, -40356, -6468, 330884, 469124, 364124, 400113, 636652, 704193, 511571, 449185, 696850, 876071, 665179, 284271, 50542, -114374, -359284, -473815, -232075, 122748, 209234, 122795, 247019, 582067, 747195, 617225, 494776, 597495]
35483E97495J78675O3597k9644p9244j89571k41345m1973K51227K59991o5030
35473G04178l59778l41861j10872Q1690J18767L2005o2800j7369J69858K34399
35463D48217n2461m49873m25590J10766N60875L77477j74999l55762M3441M37284
35453E19375K94393j39983k64912q570J48985k2063j76058l5773J01223j19306
35443B97311m20706k69142K10496L18883j42467n05095k33037K56781K50945j75260
35433d11291l31459J5197L73700L51640J64286J42891K05034J03674j13645k02348
35423B97679r4234P5674J89059J97347P5996r8162j40760l354R2445m8982k70711
35412B71997k52312K6656K39997J51145r4663j89174n0108J07224N6011j52295
$$ y = [597495, 776170, 839767, 810123, 730879, 541308, 299963, 257990, 509217, 769208, 704178, 344400, 2539, -108333, -26643, 92124, 124129, 61329, 43960, 213818, 448217, 395756, -54117, -479707, -368941, 191934, 569411, 394412, 38650, 82091, 519375, 813768, 673785, 408873, 400303, 549288, 527225, 351167, 315394, 416617, 297311, -123395, -392537, -182041, 136842, -5625, -510720, -743757, -486976, -236031, -411291, -742750, -727553, -353853, -2213, 162073, 304964, 509998, 613672, 500027, 297679, 203445, 279119, 468178, 665525, 741521, 643359, 502599, 499245, 591690, 542708, 271997, 19685, 46341, 286338, 437483, 342820, 153646, 103538, 210762, 266773, 114478]
35402A14478k32492k0728K79820L24754P8595j38587j02320K7727Q484r3588m5514
35391B00629J33174J76654j1826k08050j92911k5988R9303J10189N1374m5002
35381B87546j50908j78225n9200J26324K08391J18739n0542j85957k63403k79740
35371d26975j65216J17869M10580M39643J37590k22249l15924j24409J11191K14283
35361A76383J98616J20752K115r5159j02456q7604j83394l35712l25021j07046
35351g38526Q3602Q1194K7952J06330K22336J69013j6179q2667P9851K89666K89288
35340E11860L6346k25145j99457R0830K48876m956l74399l31117J08574L69022
35330B30434J66572r9796l7701J35320M8226j75364j94108n8282l7011q0665J9665
$$ y = [114478, -118014, -138742, 141078, 465832, 544427, 405840, 303520, 331247, 339731, 246143, 200629, 333803, 510457, 498631, 290581, 97670, 71682, 170985, 281174, 332548, 287546, 136638, -41587, -100787, 25537, 233928, 352667, 302125, 116168, -147235, -426975, -592191, -474322, -63742, 375901, 513491, 291242, -24682, -149091, -37900, 176383, 374999, 495751, 497866, 402707, 300251, 212647, 29253, -306459, -631480, -738526, -654924, -573730, -545778, -439448, -217112, -48099, -64278, -146945, -67094, 222572, 511860, 548206, 323061, 123604, 214434, 463310, 458354, 83955, -247162, -138588, 230434, 397006, 297210, 259509, 394829, 443055, 267691, 73583, 15301, -21710, -102375, -82710]
35319h2710J30242j4983k39467j33585K32208L76872J72499k6191l0269k2444
35309C62172o0657M0694K28298J91887k5649J371L01817L32921j03132l98409
35299H71313o2453M30742L16147l08184o50031l77124J7880K8526k02525k18780
35289a54489O3378K63504P8612k71445k98904N7655K67707l6294m16317k06609
35279f53202M22602O18741J12946l68178k19146J89330K23659k4400p0276O8317
35269C00393R273j98147j31740K01261K83704q5976m47648l69101m3023Q5434
35259c95570k1617m0551J51025K85344J21652j75260k43149k5757J51061N5698
35249a37124j25477j08224N4151J25113J09473J72579K41494R7673j68145k29557
$$ y = [-82710, 47532, 32549, -206918, -340503, -108295, 268577, 441076, 414885, 384616, 362172, 301515, 342209, 570507, 762394, 736745, 738116, 1039933, 1372854, 1269722, 871313, 808860, 1239602, 1555749, 1247565, 597534, 220410, 238290, 266816, 64291, -154489, -91111, 172393, 251005, -20440, -319344, -261689, 6018, -30276, -446593, -653202, -230600, 388141, 501087, 132909, -86237, 103093, 326752, 302352, 232076, 300393, 309666, 111519, -20221, 181040, 464744, 378768, -68880, -437981, -481004, -395570, -417187, -457738, -306713, -21369, 100283, -74977, -318126, -343883, -192822, -137124, -262601, -370825, -316674, -191561, -82088, 90491, 331985, 429658, 261513, 31956]
35239C1956o8329N446p9047n0901J50549K39963J42462J41964K78557J73053k65993
35228F99680n33250k89767R6689J81009R7771J36488J58028m2819k30796j35813
35218A37220K0163n6620j65306k7118J16918n3863k61501p8773K43891J44561
35208A9572k65213l48324K0419L01166J77112o2797r1754N3762J99884K22519
35198B26346K9539k58985k56624J44589M20811J22255l65459m01570j22323j06076
35188e67497k61603N77N78316O81730J33142l19069k23016l1016j48735k59571
35178d16742n5509J36762n333j82617l6415K18196K38262J42066J50635R7397
35168B86702j86482l98690k07682J52499K30077L6499q0193j7850N3086O6595
$$ y = [31956, -36373, -30927, -109974, -160875, -10326, 229637, 372099, 514063, 792620, 965673, 699680, 166430, -123337, -26648, 154361, 252132, 388620, 546648, 503829, 273033, 137220, 157383, 100763, -64543, -91661, 25257, -28606, -290107, -368880, -124989, 19572, -245641, -593965, -573546, -272380, -95268, -158065, -249819, -196057, 3827, 226346, 255885, -3100, -259724, -115135, 305676, 427931, 62472, -339098, -461421, -567497, -829100, -828523, -250207, 431523, 564665, 245596, 22580, -8436, -157171, -416742, -472251, -335489, -340822, -523439, -559854, -341658, -103396, 38670, 189305, 286702, 100220, -298470, -506152, -353653, -123576, -87077, -167270, -185120, -132034, -65439]
35158f5439R0676J26581J63880K57681L27828J40946k71151m91331k99068l7094
35148e6491o3324j80932k5645K81185L39899J18334q1800j53042k19707k54752
35138b96275j11723J07405J37609k076l2856R6660J23012o8485k39711j80925
35128d67365j3226M1414k0871n4013L72Q9468J63209J85955J07484n5110j53838
35117a76521o3012J08651J07850j06506k53113j09844J41074J81564O3024R9912
35107f921K78083K14200j61354l60883p6418K86557K42440j650L8589K47136J21444
35096H21223k98089m37226j22806J89312K21409K36056L92218L77459M267l52710
35086A031113k94247J6907J52313m778k66454m51329m42771j92955J19674J83119
$$ y = [-65439, 25237, 151818, 315698, 573379, 901207, 1042153, 771002, 279671, -19397, -56491, -119815, -300747, -326392, -45207, 294692, 413026, 331226, 178184, -41523, -296275, -407998, -300593, -162984, -165060, -197916, -101256, 21756, -46729, -286440, -467365, -480591, -439177, -460048, -514061, -513689, -424221, -261012, -75057, 32427, -22683, -176521, -239533, -130882, -23032, -129538, -382651, -492495, -351421, -169857, -106833, -6921, 271162, 485362, 324008, -36875, -113293, 173264, 415704, 414054, 452643, 699779, 821223, 523134, 85908, -36898, 152414, 373823, 609879, 1002097, 1379556, 1383823, 1031113, 736866, 753773, 906086, 901308, 634854, 183525, -259246, -452201, -332527, -149408]
35076a49408k5222j61632l365K60679L52939K32762j1671k88432m18021k50999
35066d62370M0996J30680L8704O9989K19620J52362j36656k19126L0539J89126
35056E3864K1558j36040m0747J9067j57756k24229P5170L45165J63181k06035
35046h6802k79132j14524l2444K4403K40571L94953K15971l5264J8315J53301
35036D99348o8714m42316l93532L1260K21604J2153j22178M9442J59333l5524
35026h9124k06604j5587L53848N07644L36206r392l29245m07219j32441K66188
35016B74274L78030J21056j62005j98018q8044k3519N70M1773L7470n2292j18422
35005B10873o6636L7441R3851J06885J17673J21894J15331J07481N6252q8652
$$ y = [-149408, -174630, -336262, -339627, -78948, 273991, 506753, 495082, 206650, -211371, -462370, -421374, -290694, -251990, -182001, 37619, 189981, 53325, -165801, -135262, 53864, 75422, -60618, -101365, -82298, -240054, -464283, -389113, -43948, 119233, -86802, -365934, -480458, -512902, -488499, -247928, 147025, 362996, 327732, 346047, 499348, 430634, -11682, -405214, -373954, -152350, -140197, -262375, -212933, -53600, -89124, -295728, -311315, 42533, 550177, 886383, 876991, 547746, 140527, 8086, 274274, 652304, 773360, 611355, 413337, 325293, 301774, 302344, 344117, 381587, 329295, 210873, 144237, 181678, 275529, 382414, 500087, 621981, 737312, 844793, 901045, 812393]
34995H12393k54140k87917j68249n1114o8764j70658j94215m1484K06679L24252
34985A06783J56403j55813k84004j17229R6192J23015O7914J30637K28847J48598
34975E01343m2131n8957J35451K44388P2713k14132l64887l50283k60414q4370
34965d21279K08308M61796M31636J16896j69325j58857M5443J39215M6726k1719
34955F78840M6210P9297m9370j57200m9655J16900P5050r4415r7180O3143R3114
34944G04734q5630k23968j75161p4172l0704O960K5644n8570j30245J5522K40229
34933B14639J74552j51213k71917k4144J96787J25194L1561J40108J74306j04115
34923E05758l72152k49459N1381R2101p3778p8486Q7132J09338o4635j61989n2892
$$ y = [812393, 558253, 270336, 102087, 50973, -17791, -188449, -382664, -424148, -217469, 106783, 263186, 107373, -176631, -293860, -197668, -74653, -6739, 123898, 352745, 501343, 459212, 400255, 535706, 780094, 852807, 638675, 273788, -76495, -336909, -421279, -212971, 248825, 680461, 797357, 628032, 469175, 514618, 653833, 700559, 678840, 725050, 804347, 754977, 597777, 548122, 665022, 740072, 645657, 548477, 611620, 704734, 619104, 395136, 219975, 145803, 115099, 122059, 147703, 89133, -41112, -25590, 214639, 389191, 237978, -33939, -58083, 138704, 263898, 295459, 435567, 609873, 505758, 133606, -115853, -64472, 27629, -46149, -124635, -37503, 71835, 7200, -154789, -207681]
34912b07681J11348J90441J66294K9315j65021k24192o5160R8258O9171q660P0969
34901F5082J75372O0618j64971j89576l302J20585Q3910M5080P2069M6520p3698
34890B37689j70080j59369o1431J08859L17794M17425K74020k6128k57947l13356
34880C67476k53590j72182j26943j40214j64836j14697J6409J53405K58970L17818
34870A41616K43525J0193j80926j44791m7778j35390k17732O2149M77696L93861
34860F02423j86456m76481j02510K83311O3177l48885k30788K49352L41729p2849
34850A22023l56828j22215K96858M28425K20439p8845k48705k20378q4448k296
34840d5970k1705o3342j08710j83425j48035J45039M46814L23712j20757k76475
$$ y = [-207681, -96333, 94108, 260402, 289717, 124696, -99496, -164656, -66398, 2773, -5887, 65082, 240454, 301072, 136101, -53475, -56777, 63808, 147718, 192798, 264867, 311387, 237689, 67609, -91760, -153191, -44332, 273462, 690887, 964907, 938779, 680832, 367476, 113886, -58296, -185239, -325453, -490289, -604986, -588577, -435172, -176202, 141616, 385141, 395334, 214408, 69617, 21839, -113551, -331283, -269134, 208562, 602423, 415967, -60514, -163024, 120287, 183464, -165421, -396209, -146857, 194872, 122023, -234805, -357020, -60162, 368263, 588702, 509857, 261152, 40774, -43674, -45970, -67675, -131017, -239727, -423152, -571187, -426148, 20666, 344378, 223621, -52854]
34830e2854L8687K79910Q7294j56786p9278L5500j23361k29480P6039M34856L17279
34819F27806r7133k67001j58969r5258n4389J82351M34527L42497O248j83085
34809G37594j70497j66839j68032o0702K1505o0899j10333M9611J88033R8684
34799C58125K9151J77517K10541j35649m43483k58559J14131J65428O5967K15501
34789D98670L67938Q2194l46139l26907j7067J7536j31226K4736L20560K11759
34779G02054j08933J6969M42880L78869j78462l61490Q7068M13240K11130P3058
34769A676383M44199Q03696N45238q6479m82137m99565l50505j59933l6671j59336
34759A694890m64272n99985m09530j18308P5348K12823K98639K23147M4264l1983
$$ y = [-52854, -14167, 265743, 353037, 196251, 116973, 152473, 29112, -200368, -124329, 310527, 627806, 530673, 263672, 104703, 9445, -44944, 137407, 571934, 914431, 920679, 737594, 567097, 400258, 232226, 171524, 193029, 132130, 21797, 71408, 259441, 358125, 387276, 564793, 775334, 639685, 196202, -62357, 51774, 217202, 283169, 498670, 866608, 948802, 602663, 275756, 258689, 276225, 144999, 169735, 490295, 702054, 593121, 610090, 1052970, 1431839, 1253377, 891887, 978955, 1392195, 1603325, 1676383, 2120582, 2924278, 3469516, 3383037, 2900900, 2401335, 2050830, 1890897, 1854226, 1694890, 1230618, 630633, 221103, 102795, 178143, 390966, 689605, 912752, 957016, 925033]
34749I25033J0035K6579L1909J03827R1159j46762l58570k40869J7242N3158k1090
34738D91651J13868K96924J52030j49566j38345Q5429J9514k94970l15622L0030
34728B90943K31542J05619L5044J96839K90156J71500Q8531J39320J04948o2281
34718A592161j33259n4194m661j3834k271r9051l92901n43082k28551K17961K61845
34707F00163K2263r238J53346J49973N4172J75430L18876R6132k51222k21888
34697A088007q508j41553m21473k31097K74968L69553J8788j32900M4556P8817
34687I39158o8326J2706J97530l5337m92770m36816J05364L43413Q0407q2006
34677E63323M6556L868k55972k18621J32077K39351O6346J36368M06952K78520
$$ y = [925033, 935068, 961647, 993556, 1097383, 1188542, 1041780, 683210, 442341, 459583, 512741, 491651, 605519, 902443, 1054473, 904907, 766562, 851991, 871505, 576535, 260913, 290943, 522485, 628104, 663148, 859987, 1150143, 1321643, 1410174, 1549494, 1654442, 1592161, 1458902, 1404708, 1400047, 1386213, 1383942, 1284891, 891990, 348908, 120357, 338318, 600163, 622426, 613188, 766534, 916507, 970679, 1146109, 1464985, 1561117, 1309895, 1088007, 1079499, 937946, 516473, 285376, 560344, 929897, 948685, 815785, 860341, 939158, 870832, 883538, 1081068, 1045731, 552961, 116145, 221509, 564922, 645329, 563323, 609879, 613747, 357775, 139154, 271231, 510582, 576928, 713296, 1120248, 1398768]
34667A398768j92127k97706P226L7423k81540k84546R3983J64456j72695k44358
34657B28884O1640J13316j51628j03956K22635R7238l97707l32933L41454N91868
34647F70811J31548j34161J45403K05105k14059l34943N1058J03228l76824m40561
34637a93395J91860M99050M9488j70082L78880P64021L22034j89261j21224n3272
34627A478099m08618m89213Q1565M36443L1202l02526Q6115M83738K47074N166
34617A649045L31696O02040K98591J02073N31753Q11104K60679m25222m40673
34608C721086k07504l57486n55992l84700k26191l10916j11176M27881M09996
34599B404998l59046p09064o2801M86860J04408l80352j45896J46363j83791m52566
$$ y = [1398768, 1206641, 908935, 916161, 953584, 672044, 387498, 481481, 645937, 473242, 228884, 290524, 403840, 252212, 148256, 370891, 468129, 70422, -262511, 78943, 670811, 802359, 668198, 813601, 1018706, 804647, 469704, 520762, 623990, 247166, -193395, -1535, 497515, 547003, 376921, 755801, 1519822, 1841856, 1652595, 1531371, 1478099, 1069481, 580268, 661833, 1098276, 1129478, 826952, 913067, 1396805, 1643879, 1649045, 1980741, 2582781, 2881372, 2983445, 3515198, 4326302, 4586981, 4161759, 3721086, 3513582, 3156096, 2600104, 2215404, 1989213, 1678297, 1567121, 1995002, 2404998, 2045952, 1336888, 1274087, 1760947, 1865355, 1485003, 1339107, 1485470, 1301679, 849113]
34589H49113k0332L97885J41654j27983J61303L10755j59423l91830J43930M72180
34579A777252p0431m87341K0010N33857K04269j68159J64111L67531k20724n98446
34569A521929j2208M36923j62528p03161j10579N86749J81395m79898k01450L17143
34559A374315p778n12754k06578K54337r170k86963J88574N57162O0204l08416
34549A102933K40721N82402j56765p48239j65248M09508o2158l98891L57001Q40608
34539B001872J000o91786o7683M03110l92370p74113M28078J217853R6188q31159
34529A390990K82574J378652L36019r33681j78500Q44824l5459r46817L26299
34520B464901J690353O48103p01914L06560J578905M18647q65458O04389K291478
$$ y = [849113, 828781, 1226666, 1368320, 1240337, 1401640, 1712395, 1552972, 1161142, 1305072, 1777252, 1706821, 1219480, 1239490, 1773347, 1977616, 1809457, 1973568, 2341099, 2120375, 1521929, 1509721, 1946644, 1784116, 1080955, 970376, 1557125, 1738520, 1258622, 1057172, 1374315, 1366537, 853783, 647205, 901542, 892372, 605409, 793983, 1351145, 1411349, 1102933, 1343654, 1926056, 1769291, 1021052, 855804, 1265312, 1203154, 804263, 1161264, 2001872, 2002872, 1311086, 1243403, 1646513, 1254143, 480030, 908108, 2125961, 2222149, 1390990, 1673564, 3052216, 3388235, 2454554, 2276054, 3120878, 3085419, 2138602, 2464901, 4155254, 4803357, 4101443, 4408003, 5986908, 6405555, 5540097, 6144486, 8435964]
34511H435964J048210l85760J410116L412803J824234l4674K122637M839911L738182
34502B6411623L073404P712001J2366488J1646822J2906856K2935641L1168911
34495A28221746K8682899L5186703P3723284J17535251J02478060J0976318q9704707
34488D07099554j21374906q3777302l8945071k5836266k8820118k3756896j4087429
34481G0501566j1602643j2361817q186708l023108l327557n246754l120681l54574
34473B3277724j810571m139040k592994L9881o60700k482091j541725K67366m41108
34464I916742j911064j116632K70833m83503j702262p64233P33685K25609r17846
34455D251329l52715O65187L6658r54789l24769O27367l1822j010446l69114O79412
$$ y = [8435964, 9484174, 9098414, 10508530, 13921333, 15745567, 15710893, 17833530, 22673441, 26411623, 29485027, 37197028, 49563516, 61210338, 74117194, 97052835, 128221746, 156904645, 192091348, 265814632, 383349883, 485827943, 496804261, 407099554, 285724648, 201947346, 163002275, 137166009, 108345891, 84588995, 70501566, 58898923, 46537106, 38350398, 35327290, 31999733, 26752979, 23632298, 23277724, 21467153, 17328113, 14735119, 14775000, 14114300, 11632209, 10090484, 10357850, 9916742, 8005678, 6889046, 7159879, 6676376, 4974114, 4209881, 4943566, 5169175, 4251329, 3898614, 4563801, 4600459, 3645670, 3320901, 3948268, 3916446, 2906000, 2536886, 3216298]
34445C216298J97840p47461l05201N78963J87456o06958k53940L60685j55436
34436B472246p70038q4558P33945J01277q83439m78374M47974J74362o37512m05223
34426F70660L14889J06739m77035j48558M67882J11866n33285j47704O16817L74061
34416A356332l68095k79860K56642P9846m07095j48664L93034K24145j20886K92282
34406A277681P33869J11259p56424m45046M89010N11228j89044k52347L49846
34397A830032N33069J82227J9676O164l01298m85009p6175J96716l34058p45798
34387H25546n1744P98836M14858n56683n53665K02814L34329j31386p3065M34479
34377A644319L69282j29486m2179M84898M32002o0936J9055M98075K75176n16320
$$ y = [3216298, 3414138, 2666677, 2361476, 2940439, 3127895, 2520937, 2266997, 2627682, 2472246, 1702208, 1617650, 2351595, 2452872, 1569433, 1091059, 1539033, 1713395, 1075883, 670660, 985549, 1092288, 615253, 466695, 934577, 1046443, 513158, 365454, 982271, 1356332, 988237, 708377, 965019, 1044865, 637770, 489106, 882140, 1106285, 985399, 1277681, 2011550, 2122809, 1366385, 921339, 1410349, 1921577, 1732533, 1480186, 1830032, 2363101, 2545328, 2565004, 2571168, 2269870, 1784861, 1708686, 1905402, 1571344, 825546, 773802, 1572638, 1987496, 1430813, 877148, 1079962, 1414291, 1282905, 1209840, 1644319, 2013601, 1884115, 1841936, 2326834, 2758836, 2697900, 2716955, 3215030, 3490206, 2973886]
34367B973886o20071R4877M31162P54k58674J00841L79042J45715j55886k55521
34357B836125m01234n25553k78538P3761n3065m35611l72161K3647O3952j84193
34347G47130q0595K70963J97214k09236k43837N0049j1066l89590l88518j418
34337e8904J00649j16375l7789L20101K99382j11619k26378N9535J40071j01437
34327B67236j39232R7612J24360n8861L9250L32401K24468k09305k60558J20873
34317E38244K26739j07483k41035P0274L07101K10548J31501J72454l601l14376
34307I90366j98246L74440P56052O65237M75702L37643l9119n64029o79919l12606
34297A805521k8590o6618p4274N5442o750k29443j63663J37177Q6209l35412m19338
$$ y = [2973886, 2353815, 2448692, 2879854, 2880608, 2621934, 2722775, 3101817, 3247532, 3091646, 2836125, 2434891, 1909338, 1630800, 1704561, 1651496, 1215885, 843724, 867371, 931323, 747130, 666535, 937498, 1134712, 925476, 681639, 731688, 720622, 331032, -57486, -58904, 41745, -74630, -112419, 207682, 507064, 395445, 169067, 228602, 368673, 267236, 128004, 225616, 349976, 291115, 330365, 662766, 887234, 677929, 417371, 538244, 764983, 657500, 416465, 486739, 793840, 1004388, 1135889, 1308343, 1304742, 990366, 792120, 1166560, 1922612, 2587849, 3063551, 3401194, 3362075, 2798046, 2118127, 1805521, 1776931, 1710313, 1636039, 1691481, 1684731, 1455288, 1291625, 1428802, 1515011, 1179599, 760261]
34286G60261M2996L50139Q9797j86066K9762L54082K40152j35913k79548j30821
34276A134841P5703K47453L21859J46353j63089j43105L85695R38912R23768L20559
34266D188949l91824p50757o25811k55578m0279j18682k25872j68819j83732m56382
34256I71213o12329k45554L04746L77066J6633j43085O4029J67326m1347k01741
34246F56957r7431K1271n740P522J15378P9742j35512k35843j24697o4680j61209
34235E5758j63065O6084L07411L52567K33200K0676k27203l12054r4090J72620
34225D11904J29935j09263j40269N0542J12333n073Q413J99385K46124M9855j10675
34214H43211j02304j03077j64797j15444J8739o093j62578j42123P5726J51852
$$ y = [760261, 803257, 1153396, 1243193, 1057127, 1086889, 1440971, 1681123, 1545210, 1265662, 1134841, 1210544, 1457997, 1779856, 1926209, 1763120, 1620015, 2005710, 2944622, 3868390, 4188949, 3797125, 3046368, 2420557, 2164979, 2124700, 2006018, 1780146, 1611327, 1427595, 971213, 358884, 113330, 418076, 795142, 811775, 668690, 732719, 900045, 858698, 656957, 559526, 580797, 575057, 582579, 697957, 777699, 642187, 406344, 281647, 216967, 55758, -107307, -41223, 266188, 618755, 851955, 872631, 645428, 333374, 239284, 411904, 541839, 432576, 292307, 342849, 455182, 450109, 458522, 657907, 904031, 953886, 843211, 740907, 637830, 473033, 357589, 376328, 370235, 207657, 65534, 141260, 293112]
34204B93112L36m0524J83138L41758J50038k04549l74627k74416k8372K08732
34194B54626K60456M1307k39135k47956K2700K26794J29708j32184k79714j67575
34184a30973J49232M27979L84388K6699k67777k16462p172K6618j00671j49940
34174A41921p5956r864l13m9125j91962k93856o8782M06328N75611J74843k88118
34163C20727k71587N498M6186o9084L1716K13171N6981l21317l98550q2752K11545
34152b57466K52249J89587J46834J09760J18139J47190j360l02694l44181J905
34142E9963K00250r4092l33907M8855N91718M94066q0141l50380k06791j36368
34132A93173j67670L1816K31124o0958n05346l04147L87635N97575J16065k46707
$$ y = [293112, 293448, 252924, 436062, 777820, 927858, 723309, 348682, 74266, 45894, 254626, 515082, 556389, 317254, 69298, 91998, 318792, 448500, 316316, 36602, -130973, 18259, 446238, 830626, 857325, 589548, 373086, 365914, 392532, 291861, 141921, 65965, 56101, 55788, 6663, -185299, -479155, -547937, -141609, 434002, 608845, 320727, 49140, 54638, 100824, 31740, 63456, 276627, 333608, 12291, -386259, -469011, -257466, -5217, 184370, 331204, 440964, 559103, 706293, 704933, 402239, 58058, 59963, 260213, 166121, -167786, -118931, 472787, 966853, 886712, 536332, 329541, 193173, 25503, 57319, 288443, 227485, -277861, -582008, -194373, 403202, 519267, 272560]
34122B72560j02475K0438j41870j03263L03870M74898J12614k13105o2850J94084
34112G54901J53718L540n3863j99667m09016k65739K12979L67364n1266m12443
34102A00508k51648J9716l6110j16621J33116L79487K11729r5226q3904J02736
34092C63783N2817j93399k95180j68033L4416J99324K24225N1274q6086J03838
34082B86979L75629J81219l65097m98018j4680L48622J18308j97442r5287P1680
34072B11913j13163k69258N3126M31333K30451k78832l44294O1076L01472J33690
34062D17514q4254j24813j21922j03310Q9524L77519M36197J72103j56448l14861
34052E87249l03330k11029r4270K0651J49049K89327L16232J27100r1852n1486
$$ y = [272560, 170085, 190523, 48653, -54610, 249260, 724158, 836772, 623667, 560817, 754901, 908619, 912159, 858296, 658629, 249613, -16126, 196853, 564217, 512951, 100508, -151140, -131424, -167534, -284155, -151039, 228448, 440177, 344951, 261047, 363783, 416600, 223201, -71979, -240012, -205596, -6272, 217953, 269227, 183141, 286979, 662608, 843827, 478730, -19288, -33968, 314654, 432962, 235520, 140233, 211913, 98750, -170508, -117382, 313951, 544402, 265570, -78724, -17648, 283824, 417514, 333260, 208447, 86525, -16785, 72739, 450258, 886455, 1058558, 902110, 587249, 283919, 72890, -21380, -729, 148320, 437647, 753879, 880979, 789127, 737641]
34042G37641J54056J37703j36162k67031j07918j1234j63746k23177N2781L18801
34032D91714J87788j52234k82920j75029o9862l0227L2059J13123J75945K28394
34022E18751J79090q1313l45525k51631R5031J67639j40834l02425l6517K17325
34012A9591P6706j46567n7568J28139M2590j53077j11538O3875P8711J1519Q4445
34001C6826J65330K3273j69077r5104J44179J94436J4689j29529j04749n94Q7494
33990A67174J03974J4101p9993j6797J14847N0947j72500k33215j12643j49551
33980c13656l49097k57964K10303M86334K48174m4903K8006J49727o6951l21379
33970b31406j70887J77535K67374J40535O5396m4581l04387l76025R252M20337
$$ y = [737641, 891697, 1029400, 893238, 626207, 518289, 507055, 343309, 120132, 172913, 491714, 679502, 527268, 244348, 69319, -543, -30770, 1289, 114412, 290357, 518751, 697841, 616528, 271003, 19372, 114403, 282042, 141208, -161217, -197734, 19591, 96297, -50270, -107838, 20301, 62891, -90186, -201724, -137849, -59138, -47619, 36826, 202156, 225429, 56352, -38752, 105427, 299863, 314552, 185023, 80274, 79680, 167174, 271148, 285249, 205256, 188459, 303306, 354253, 181753, -51462, -164105, -313656, -662753, -920717, -710414, -224080, 24094, -20809, 7197, 156924, 89973, -231406, -402293, -224758, 42616, 183151, 248547, 203966, -100421, -476446, -467194, -46857]
33960d6857L04929j20777k32369L8620K55159K31400J10513o9504k88332k71909
33950h9127J08803M27822K60359j33627k42121r2784k7790m3779J5620k1389k73536
33939a11549l32107J02560N06200K63239k62432k86214J02025J91459n7020m9351
33929F6810K36026J97460k10277l35719j1746J65817l2093o8187L00523N09076
33919H17690J66974k74430l12681j30397o5586m521K00578K89847P5392j36479
33909F26387p6199k613j96547l99472k58074M2589J10117J4455R2902K84400K03527
33898D41472j69965l64530q6365L30648L48475o5559l87271k22297J58259J90846
33888A73713j63890l55005q1812K46436J83747m6246J3718K47572J86412j62269
$$ y = [-46857, 258072, 137295, -95074, -56454, 198705, 430105, 540618, 471114, 182782, -89127, 19676, 447498, 707857, 574230, 332109, 239325, 211535, 167756, 183376, 161987, -111549, -443656, -341096, 165104, 428343, 165911, -120303, -18278, 173181, 116161, 66810, 302836, 500296, 290019, -45700, -57446, 108371, 76278, 8091, 308614, 817690, 984664, 710234, 397553, 267156, 201570, 197049, 397627, 687474, 762866, 626387, 550188, 547575, 351028, -48444, -306518, -263929, -153812, -139357, -46455, 237945, 441472, 271507, -93023, -179388, 151260, 499735, 434176, 46905, -175392, -17133, 173713, 9823, -345182, -426994, -180558, 3189, -43057, -29339, 218233, 404645, 242376]
33878B42376l35624j90803n0941p3535m6623J27400K63649K78016K73994K25685
33868G13594M1866q5599P3468K45303k0586m96558m76489P7512L73637J5066l90637
33857G0577k35296J82814K69685P3745K4874J51486J43931n4735k13902k06385
33847B06794p4049J23014K51059J26028j63260k36529K2721K18459L8992k42708
33837B70521k21884J730N2517j02443j86098r3531M3999J50643K26729J94706
33827C36889J9661j37077j42620j17927j89937k13337k7213K03114K18746P4438
33817B4737m512q476n6222q3530K1735J10904k2324k38435k32379k3925J23938
33806c88489J86051L35254M75175L07058r9319k96621j35137K8874l9076j06577
$$ y = [242376, -93248, -284051, -334992, -408527, -455150, -327750, -64101, 213915, 487909, 713594, 755460, 669861, 743329, 988632, 968046, 471488, -5001, 72511, 446148, 461214, 70577, -164719, 18095, 287780, 361525, 386399, 537885, 681816, 627081, 413179, 206794, 132745, 255759, 506818, 632846, 469586, 233057, 255778, 474237, 513229, 270521, 48637, 50367, 102884, 441, -185657, -279188, -235189, -84546, 142183, 336889, 356550, 219473, 76853, -41074, -231011, -444348, -471561, -268447, -49701, 24737, 20225, 11749, -44473, -128003, -106268, 4636, -17688, -256123, -488502, -512427, -388489, -202438, 132816, 607991, 915049, 815730, 519109, 383972, 412846, 373770, 267193]
33796B67193l977k144k77197m33017p3129M58431M99260O7099j87195R87J76523
33785D92834j6677k90360k76512j23151j23569j51687N6441L33504K99068m784
33775A95107j73151n7310J12628J71822J59987N5269j85202l31980j06113K76199
33765A17256K85083j15454l68214j75127R7457R1252j0161O2283J72252J22943
33755B79570N3555R6427N3453j73832k50935L3482K91472J35823j38495o5080
33745C15440J62797N6909k45913j86918K30968M21910J63096j43156k06407j91382
33735C77344k21154j46530L8267Q8362l0954o1660M7144M0816j23182j56628J8438
33724a29737J02421l4437j09586O1280K40146J71696n6569k43594l24470k54660
$$ y = [267193, 263216, 261072, -16125, -449142, -522271, -63840, 435420, 502519, 315324, 316311, 492834, 476157, 185797, -90715, -213866, -337435, -489122, -432681, -99177, 199891, 195107, 21956, -35354, 77274, 249096, 409083, 464352, 279150, -52830, -158943, 117256, 402339, 286885, -81329, -256456, -158999, -67747, -77908, -15625, 156627, 279570, 333125, 429552, 483005, 309173, 58238, 91720, 383192, 519015, 380520, 315440, 478237, 535146, 289233, 102315, 333283, 755193, 918289, 775133, 568726, 377344, 156190, 9660, 47927, 136289, 105335, 43675, 90819, 131635, 8453, -148175, -129737, -27316, -61753, -171339, -110059, 130087, 301783, 245214, 1620, -322850, -577510]
33714e77510P350K91319L37790J94241J17897Q7946j10595l24885j59629K55578
33704A19502K96914j57799m44496j26733L55877M29394J67658q4766k82700m08890
33694a36039k08733K76238M56429N3480l22984j05920K56421N0456m37117l57712
33684d75481K55445N06786Q0461l21382j66387J59519J32780j05960j69992q9792
33674a94003q9700j06076K0419J57831R9678l6824l206J35911J03017j28488k93368
33663c34809k40058r3413J9235J42801K86940K61551o6966m47323m30302M8431
33653h53913M85852L93060p4299l18704q6909K47887K56739P120j40151n6921
33643a40239P6928R3568m641j39042k07481r5231J84551M00921L29245M5581j55983
$$ y = [-577510, -570160, -278841, 58949, 253190, 371087, 459033, 348438, 23553, -136076, 119502, 416416, 258617, -185879, -312612, 43265, 472659, 640317, 555551, 272851, -136039, -344772, -68534, 387895, 441375, 118391, 12471, 268892, 319348, -117769, -475481, -220036, 286750, 367211, 45829, -120558, 38961, 171741, 65781, -104211, -194003, -283703, -389779, -369360, -211529, -111851, -148675, -151881, -15970, 87047, -41441, -334809, -574867, -668280, -649045, -506244, -219304, 42247, -24719, -472042, -902344, -853913, -368061, 24999, -49300, -368004, -454913, -207026, 49713, 56833, -83318, -140239, -63311, 30257, 25616, -113426, -320907, -416138, -231587, 169334, 498579, 544160, 388177]
33632C88177j27466m731K2641n3805j02388n1948J1489l2216j32989q7288J51196
33621a9328K95981P5187l12972l90191n9944K58942K55722J19769J21809J69044
33611E14019P2571n2718j9148M5531o3552j94781p8972J31754M1652l08626m22048
33600c34318p8837L38519M00049J54190p9105j51077j18841m9594J5535K9628
33590A26149J15j6230k6648p9743j19207m3220P6172N5776q3150j15311J0805
33579b14492P9789M544Q721K26332M06633K81596k075j20973p0921r3467k20025
33568B85662k43404j11572j0339k2957j7392N8168O2005m4404o1310J16431K63818
33557B74706J44249j03576j47272N7382K10589Q6505j91133l30891j98244Q4646
$$ y = [388177, 260711, 255980, 278621, 224816, 122428, 70480, 81969, 49753, -83236, -170524, -19328, 276653, 351840, 38868, -351323, -411267, -152325, 103397, 223166, 344975, 514019, 586590, 533872, 514724, 560255, 496703, 301922, 222950, 354704, 396356, 87730, -334318, -413155, -74636, 325413, 479603, 400498, 249421, 130580, 80986, 96521, 126149, 126264, 110034, 83386, 3643, -115564, -158784, -82612, -26836, -109986, -225297, -214492, -134703, -130159, -121438, 104894, 511527, 793123, 791048, 670075, 599154, 505687, 285662, 42258, -69314, -79653, -102610, -120002, -61834, 171, -44233, -105543, 10888, 274706, 418955, 315379, 168107, 225489, 436078, 522583, 331450, 559, -197685, -113039]
33547a13039K80684K49918O0115j14549j97606k28876j80368N2764L72734M19821
33537F01598L2060m09071m13551o1431J26911l1114j61221K1224K77343K70561
33527B53309O3447q7561j38873j56778o0080J92966L54586J83348j43812k61760
33517A98792j49958q1651j27779r6444N5655J30851M7748m5354o8005j04703j44735
33506c85583m0885J80384K66459J15960n5932n2656M5927Q2552N1128P105l6458
33495A78001k1161J22983K61974J36124k19669m08783j99993J38350K37402J13155
33485C38383O354l5116j08669j51690j7057K12783K88249J60509L2562K6165K5220
33474G77693r2604k46487k58682p2920J84026L06720J80921r1068k58834j80887
$$ y = [-113039, 167645, 417563, 477678, 363129, 165523, -63353, -243721, -190957, 181777, 601598, 633658, 224587, -188964, -250395, -123484, -154598, -315819, -294595, -17252, 253309, 316756, 229195, 90322, -66456, -126536, 66430, 421016, 604364, 460552, 198792, 48834, -32817, -160596, -257040, -201385, -70534, -22786, -68140, -136145, -240848, -385583, -426468, -246084, 20375, 136335, 80403, 27747, 73674, 156226, 207354, 214459, 178001, 156840, 279823, 541797, 677921, 458252, 49469, -150524, -12174, 225228, 338383, 344737, 309621, 200952, 49262, 32205, 244988, 533237, 693746, 726308, 752473, 777693, 685089, 438602, 179920, 107000, 291026, 597746, 778667, 687599, 428765, 247878]
33464B47878K5839J58785J81421J90481J91066P2238j70036l36816k51864r643
33454B99349J18470K5724q9243M539K27085K62077n724k89919k58677K2549J79998
33443D96228J7403k74295m06701l17210j32757N0192K25091L59185L32597O2359
33433D12092l11120m49262j54720L26513N14954K60038r6492k05128j22446p8245
33423I6184p9281q060Q2194P9407O7675J55895J99038L3794j58349j19258k2j10544
33411B38673l03510j73481J72896J97825j35281k11059K14246N28624K19671k87575
33401D61029l01574Q5628K49415L7933j23127o908J31084O6864p3619j03122l6012
33390C87591K6920L4866l5619j52008j81514m6719J14167J09851l7609j47964
$$ y = [247878, 273717, 432502, 613923, 804404, 995470, 1067708, 897672, 560856, 308992, 299349, 417819, 443543, 354300, 358839, 585924, 848001, 842277, 552358, 293681, 316230, 496228, 513631, 239336, -167365, -484575, -617332, -567140, -342049, 17136, 349733, 412092, 100972, -348290, -503010, -176497, 338457, 598495, 502003, 296875, 174429, 96184, 16903, 8843, 91037, 170444, 238119, 394014, 593052, 626846, 468497, 349239, 349217, 238673, -64837, -238318, -65422, 132403, -2878, -213937, 309, 528933, 748604, 461029, 159455, 245083, 494498, 532431, 409304, 402396, 533480, 600344, 526725, 423603, 387591, 414511, 449377, 413758, 261750, 80236, 33517, 147684, 257535, 219926, 71962]
33380G1962j31383k9721J00394J93684J63952K8450o5307n6187o0417j27084j09293
33369b0950O2014K03330J69953Q4255O2927j0597j83592k06118N7289K78101J32603
33358F29215j41572j26719O7580K6563k03197j91814P6823J37321j41885l00050
33348a67735m5109K81314K83367Q3991r413j3860q2695j30725l1028N4709p5398
33337A47418k58813j88238P4714J72780m45j69224j16565M3509J14304Q8660N3107
33326c8793J2560m3024l5657P2968J41292J8350j85026j99847L257J43254N7540
33315e3126l3817R7308K62384J45913j10681o5463K73714L62653l7320m26255
33305D15310l08892N9788J32204o8833j10313M2792J8501k15781k43366O0978
$$ y = [71962, -59421, -89142, 11252, 204936, 368888, 397338, 332031, 275844, 215427, 88343, -20950, 41064, 244394, 414347, 498602, 561529, 550932, 367340, 161222, 218511, 496612, 629215, 487643, 360924, 428504, 455067, 251870, 60056, 136879, 274200, 132315, -167735, -212844, 68470, 351837, 435828, 426415, 412555, 329860, 199135, 168107, 222816, 147418, -111395, -299633, -224919, -52139, -52584, -221808, -338373, -294864, -180560, -91900, -38793, -26233, -69257, -104914, -31946, 109346, 127696, -57330, -257177, -253920, -110666, -53126, -86943, 10365, 272749, 418662, 307981, 242518, 516232, 878885, 841565, 415310, 106418, 166206, 298410, 229577, 119264, 162056, 180557, -35224, -278590, -217612]
33295b17612K70229J02760j34573r9263L1413o7095k75661k38451L9310K08294
33285c80649J06373o6016q3434N0511J89688J99892M0130j71959k27711q6548
33275d29723K5241p5675k35808j80668P0786K48124K34827J69088J37649M6447
33265A0288j23232j85837l7517J21726N7093j30356j35142Q9236K40181R9349
33255E789j50206j85236J5400J85825J74847J08205J11900R4647n4348k14731
33245I2092j89121k8348K1398j11496k25382j64345k7817M1833R2352K15390L05931
33234B2487J86278q2096k28327j33055K8457O4536K0201M2096J19575J13378j6136
33223A37394j55548j99886j45073k4065J19711J79444N4411j59269j88081P9850
$$ y = [-217612, 52617, 155377, 20804, -78459, -47046, -114141, -389802, -628253, -588943, -380649, -274276, -340292, -423726, -373215, -183527, 16365, 56495, -115464, -343175, -429723, -404482, -480157, -715965, -896633, -825847, -577723, -342896, -173808, -36159, 10288, -112944, -298781, -336298, -214572, -157479, -287835, -422977, -333741, -93560, 5789, -144417, -329653, -314253, -128428, 46419, 154624, 266524, 361171, 306823, 92092, -97029, -125377, -103979, -215475, -440857, -605202, -633019, -591186, -498834, -283444, 22487, 208765, 126669, -101658, -234713, -206256, -141720, -121519, -79423, 40152, 153530, 137394, -18154, -218040, -363113, -387178, -267467, -88023, -33612, -192881, -380962, -301112]
33213c01112L71084L11818q8984m11669l20999M9971K93837K06505m4368j81967
33203a15884j19669K8175J27517J30711N1430n8155r9916m183J48852J82951N9713
33192C31542n9976p6214j09572k30172k12352J31014M92793L82627r9576k96737
33182B53377M3252L54110J20346l22296l45925j5186J08247o8366q4781K17246
33172B60024M19788K42296m5964j43406j53973k41573k68074q7487J24151J39793
33162B45575L4677M558M9560P3149Q9448J18708P8802k8609m4740N0119K6380
33151F97627j88778k76054R483L79161L72890K0151k23322j17531J18361J83983
33141I75971L1584j99701l59228l56455k09747m2742N7153J31572K20167K40069
$$ y = [-301112, 69972, 381790, 292806, -118863, -439862, -389891, -96054, 110451, 66083, -115884, -235553, -207378, -79861, 50850, 102280, 44125, -55791, -59974, 88878, 271829, 331542, 271566, 195352, 85780, -144392, -356744, -225730, 267063, 649690, 550114, 253377, 296629, 650739, 771085, 448789, 102864, 87678, 195925, 127559, 42778, 260024, 679812, 922108, 876144, 732738, 578765, 337192, 69118, -18369, 105782, 245575, 280252, 284810, 334370, 407519, 496967, 615675, 694477, 665868, 621128, 671247, 697627, 508849, 232795, 242278, 621439, 994329, 1014480, 791158, 673627, 791988, 975971, 1007555, 807854, 448626, 92171, -117576, -160318, -103165, 28407, 248574, 488643]
33131D88643J25753j1197k4011L5239j0082j80901k88697j85363L1618J23043
33121A04045O141j10274J3662K60335K33544j55189m35858j96561K66243L24166
33111C10254p9208l81547k41015P6062K16516J67602L8596j29445j90079L1853
33101a80411L46191L32753Q507j39254N4528J65812o9015l23704k95753j62875
33091b63221r0106J10504M31774M13739q3525m62520k82746L7334N543r7906J28761
33080a52369L37703O5473k96604j14515L32125L07519r4903j69152J27828J90349
33070E33454o2919j02068J47764K02146J9181N9884K58490J6643n88291o98213
33060b13929r6684L47454R8490k29497m2298K34999N0540k32747k5651M07169
$$ y = [488643, 614396, 603199, 579188, 614427, 604345, 423444, 134747, -50616, -18998, 104045, 110186, -88, 13574, 273909, 507453, 352264, -83594, -280155, -13912, 310254, 231046, -150501, -391516, -315454, -98938, 68664, 107260, -22185, -212264, -180411, 165780, 498533, 507040, 367786, 422314, 588126, 519111, 195407, -100346, -263221, -353327, -242823, 188951, 602690, 519165, 56645, -226101, -188767, -183224, -281130, -152369, 185334, 250807, -45797, -160312, 171813, 479332, 384429, 215277, 343105, 533454, 470535, 368467, 516231, 718377, 737558, 797442, 1055932, 1072575, 484284, -213929, -310613, 36841, 135331, -94166, -136464, 98535, 149075, -83672, -109323, 297846]
33050B97846M07903l27k87302l03499k72445j97200L7409K06917M2704j97942
33040b65936p2546K77441L04580o4422l07797j03986K54247L58198K05502N6824
33030F42105K8826J5975p9598j75307j12172Q2825J61480j935j76065j07421N9761
33019C38474L3894q9602J324K08724J25535k17356l22859p3995L8172k25994m09105
33008e92788j27976K94338L97638K68571J91866R1770j68999l40350j65117J22490
32998b8557J74696R4348J40016J89766J8776j76338p5995J72515J94839J4713
32988G18779p8287q6345j94380k81430j02092J69259J39097j31294j98556L9836
32978e413K16708J12848p1297j16486m3896Q0739K40157L25961K25232M8477j8015
$$ y = [297846, 705749, 705422, 418120, 114621, -157824, -355024, -317615, -110698, -67994, -265936, -338482, -61041, 243539, 179117, -128680, -232666, 21581, 379779, 585281, 642105, 670931, 686906, 607308, 432001, 319829, 402654, 564134, 562199, 386134, 278713, 338474, 372368, 282766, 284090, 492814, 618349, 400993, 78134, 4139, 42311, -183683, -592788, -720764, -426426, -28788, 239783, 431649, 523419, 354420, 14070, -151047, -28557, 146139, 240487, 380503, 570269, 589045, 412707, 336712, 509227, 704066, 718779, 640492, 554147, 359767, 78337, -23755, 145504, 284601, 153307, -45249, -5413, 211295, 324143, 252846, 136360, 92464, 173203, 413360, 739321, 964553, 1013030, 995015]
32967I95015k5388j17664j85551m1103J62512J11455j28163j90820o185J35743
32957G09851J20552J53237L10421L86810K84819J62229R7344q482r9129O2889
32947B180541M48805O71552N30969L21241L90240O80126R27727J084545J292708
32938H528454J572914J723981J492839Q05292q8978p48065r77818j067696j363941
32929I876982j716353j693284j282880r32313q38395o87141k83853K9578q4599
32920B387742l70608l41460J6K18998J05397j24539k50594l03002l34000k48288
32910G39662r842J89843J49338n8150j74217r2558K9811J6580q9506j16380k8822
32899E55759K0276p6501k09159j92302j8079J26385Q4706r1680k06992j40765
$$ y = [995015, 969627, 851963, 666412, 625309, 787821, 899276, 771113, 580293, 574108, 709851, 830403, 983640, 1294061, 1680871, 1965690, 2127919, 2225263, 2216781, 2117652, 2180541, 2629346, 3300898, 3831867, 4153108, 4543348, 5223474, 6151201, 7235746, 8528454, 10101368, 11825349, 13318188, 14123480, 14034502, 13286437, 12308619, 11240923, 9876982, 8160629, 6467345, 5184465, 4252152, 3413757, 2726616, 2442763, 2472341, 2387742, 2017134, 1675674, 1675690, 1894688, 2000085, 1875546, 1624952, 1321950, 987950, 739662, 729820, 919663, 1069001, 1010851, 836634, 744076, 773887, 790467, 700961, 584581, 555759, 576035, 499534, 290375, 98073, 79994, 206379, 291085, 199405, -7587, -148352]
32889a48352P840K7971j21377k12779m6135K23332K54466J6864j34983K2965K50385
32878A40197K09845m1843j81056j02899n225l8596j25887j45966r7103l3735J8607
32867d03661M4348K7505j6324m9067l7528N3521K27300L76329L39682J02131j64557
32856D99679l11312l36644k61009o4164J64314K21219P2353n9733l7439j7611
32846a30347j37195k27754r2346J38540K10556J37301J01921J19151R1953O5032
32836B76812J13736J11285p2312k65943k31579p6866o2550j20262Q675K36385
32826h2619K13140n7299j80674j5257J32282P5318L3244J57158K18515L4935j75325
32815C53418j58242k3295J6539J4317Q7087J03142q5341k94562k41849J0718J69502
$$ y = [-148352, -140512, -112541, -233918, -446697, -492832, -269500, -15034, 1830, -133153, -110188, 140197, 350042, 308199, 127143, 24244, 19019, -19577, -145464, -291430, -388533, -422268, -403661, -359313, -331808, -348132, -397199, -434727, -381206, -153906, 222423, 562105, 664236, 499679, 188367, -148277, -409286, -473450, -309136, -87917, -15564, -75297, -112736, -130347, -267542, -495296, -587642, -449102, -238546, -101245, 676, 119827, 211780, 276812, 390548, 501833, 429521, 163578, -68001, -144867, -207417, -327679, -319004, -82619, 130521, 73222, -107452, -122709, 9573, 84891, 118135, 275293, 493808, 528743, 353418, 195176, 171881, 188420, 202737, 289824, 392966, 307625, 13063, -228786, -218068, -48566]
32804d8566J58177J35966J43988N5547j34657k54670k14326j03376k1594N139
32794b78372l4996r2952o292K75852M72062K68662j67302l21305n5462J68479
32784B28374k0045l34932k81589Q1768K50171M0960j76528p3041J92267K69982
32774A77387Q9341j55847k84719k12070O9502L94434M55540J41265k56150l61108
32764E7575j57595O6618J19466M4999m9970q9836j2675J30026J25533j24615l63532
32753b54006k73938N9896K78887K69180K09921J49300m4806k77197k28521R5586
32743a5698K59109M9919j79002r9098O2439m8897k87111k55219L2251K00995J23752
32732a56560L2507N0317L1346o8745l9560K04758L72480J53318l04453n10571
$$ y = [-48566, 109611, 245577, 389565, 445112, 310455, 55785, -158541, -261917, -283511, -278372, -313368, -406320, -412612, -136760, 335302, 603964, 436662, 115357, 59895, 228374, 208329, -126603, -408192, -326424, -76253, -35293, -211821, -284862, -92595, 177387, 266728, 110881, -173838, -385908, -316406, 78028, 533568, 674833, 418683, 57575, -100020, -33402, 86064, 131063, 81093, -8743, -21418, 108608, 234141, 109526, -254006, -527944, -468048, -189161, 80019, 289940, 439240, 394434, 117237, -111284, -15698, 243411, 293330, 114328, 15230, 77669, 28772, -258339, -513558, -481307, -280312, -156560, -124053, -73736, -42390, -111135, -150695, 54063, 426543, 579861, 275408, -235163]
32722b35163k36348J72680K11561j34259l63484j40809K39619K90053K8499j08628
32712b76279M1761J87627J24449L6119J12631K34108K24975J20646L206j47597
32702F61646k80523k40463o4523q763j32339j88516q2837n4397j99672k27651
32692h18038M2703L31525L39109J64834l661k11763m21423l14443J76018N45698
32682a69441L88627J6765n9451R6571J05260m4539j19779j51084k61300k68491
32672d66862j8364J74696L797k10149j3157L51623L16407m3238j70941R306Q0474
32661A3592k3059L6894K38086J77620j42019k64445q7968Q127p8407k8654J81860
32650C1627J74283q4776j70952m104l964k44931k44317J32361L47477J29022l8561
$$ y = [-235163, -471511, -298831, -87270, -221529, -585013, -725822, -486203, -196150, -167651, -276279, -234518, -46891, 77558, 113677, 226308, 460416, 685391, 806037, 809243, 661646, 381123, 140660, 76137, 67374, -64965, -253481, -336318, -390715, -590387, -818038, -775335, -443810, -104701, 60133, 56472, -155291, -576714, -891157, -715139, -169441, 219186, 235951, 176500, 273071, 378331, 333792, 214013, 62929, -198371, -466862, -485226, -310530, -306733, -516882, -530039, -178416, 137991, 94753, -76188, -66882, 13592, -9467, 27427, 265513, 443133, 301114, 36669, -51299, -43172, -121579, -150233, 31627, 205910, 121134, -49818, -53922, -57886, -302817, -547134, -414773, -67296, 61726, 23165]
32639B3165J98611M13720J63358k41676l09052j59567j52035j85020Q043K40516
32629F3J63519r4427j43169J2743M4964j12581k03944r7583P2877J60990J34540
32618f2008J6844j11459j38311n5317N1507J54947K29253J14206k22729l87146
32608d10213k3589M69885L43900l23375o05562j07682M28567K93319j79377l10271
32598d24398j09949K6235Q8680K27821K27281r5709l59485j79606J10817K0928
32588d67385j79454Q3401N85019N64002j1922l48920p6164K48685J15322j84463
32578C28121j37965J98097L91439K62467l2363l08854m55726l80537r9662J76496
32568e8487K10159m596k09017j33924J90979M19977K79867p0940k50143j73958
$$ y = [23165, 221776, 635496, 798854, 557178, 248126, 88559, -63476, -248496, -240453, 63, 163582, 69155, -74014, -61271, -16307, -128888, -332832, -430415, -357538, -196548, -62008, -45164, -156623, -294934, -350251, -298744, -143797, 85456, 199662, -23067, -410213, -433802, 36083, 379983, 56608, -548954, -656636, -228069, 65250, -114127, -424398, -534347, -508112, -419432, -191611, 35670, -60039, -419524, -599130, -488313, -467385, -646839, -563438, 21581, 585583, 573661, 224741, 148577, 397262, 512584, 328121, 190156, 388253, 779692, 1042159, 1009796, 700942, 245216, -135321, -234983, -58487, 151672, 147076, -61941, -195865, -4886, 415091, 694958, 624018, 373875, 199917]
32558A99917r3486j14599n8709J07521J22723j00297k60512j62944l0182m8092
32548d38660j5229K18664L71542J88290q0675q6942N6642N7664k8113J083N9333
32537C03599l326k9970J32770K44380O1374j76425j34421M7053O8982K4556R7354
32526F35926P5254k25015m17399j17648K97688K59264j1174O3490L13861J49242
32516A023489k29804n6473N99388Q03172K85586j03677K28884Q11514J047289
32507D409368R99742Q04339K31716o27885j102455r41757p85461j035733j093800
32498H58074m47341K74511K32912k67680l40571L6012J56990j16992k34551j9557
32488A31807R9222l0011l3610K06875K90186L7018j67766n9705M5434j76711m70174
$$ y = [199917, 106431, -8168, -66877, 40644, 163367, 63070, -197442, -360386, -390568, -438660, -453889, -235225, 136317, 324607, 243932, 156990, 213632, 271296, 243183, 244266, 303599, 300273, 270303, 403073, 647453, 708827, 532402, 397981, 445034, 514016, 538572, 635926, 711180, 486165, 68766, -48882, 248806, 508070, 496896, 560386, 874247, 1023489, 793685, 737212, 1336600, 2139772, 2425358, 2321681, 2550565, 3362079, 4409368, 5409110, 6213449, 6445165, 5817280, 4714825, 3773068, 2987607, 1951874, 858074, 410733, 685244, 918156, 650476, 309905, 345917, 502907, 385915, 151364, 131807, 231029, 201018, 167408, 374283, 664469, 701487, 533721, 474016, 519450, 342739, -127435]
32477a27435l74797P5143L84077K24663k00158m13116j91396J78221K39459j9483
32467b24822j15366K08462N11405K65420l06174n04304j59985J96424J89876M7970
32457A08906N0378Q5149J5808M239J33170J30460j44929l23590q6642K21985Q6262
32446B81196l14718l53981K9406K38540J0425j75611O1001L56225K22218j51419
32436B03282k45042m7856K1241j35840k03198o7076L2383K1961J30483L57947
32426F8285L31482n6104l39659j63138J37453O1247k68819l41296p1848J40245
32416e02152Q0426n8152j10394j27523q6462J36068M03116L65308J3619k27576
32406a13722j35945K405m3347k8723K51595M36456J14034l95952l95797J27079
$$ y = [-127435, -502232, -427089, -43012, 181651, -18507, -431623, -623019, -444798, -205339, -224822, -340188, -131726, 379679, 645099, 338925, -165379, -325364, -128940, 60936, 108906, 159284, 244433, 260241, 264480, 397650, 528110, 383181, 59591, -27051, 194934, 281196, -33522, -387503, -358097, -119557, -109132, -284743, -223742, 132483, 354701, 203282, -41760, -89616, -68375, -204215, -407413, -474489, -442106, -420145, -289662, 68285, 399767, 343663, 4004, -159134, -21681, 39566, -229253, -570549, -642397, -502152, -421726, -479878, -590272, -717795, -804257, -668189, -265073, 100235, 113854, -113722, -249667, -247262, -290609, -319332, -67737, 368719, 482753, 86801, -308996, -181917]
32396a81917M25787R5879l46028k81890J07770K20771k0425j52519K5376J92376
32386H5180J06766l6287l6211m5393k07586k93474p2690K15137J98479M867N7601
32375b3611L18567K90702j43558m37151j76026K93664L75432K3023l29286l88356
32365a96600k03946N7972K13872R9012j92592k80863r599K42132J19496r2790
32355b43906R0801M93389M68707p6017m96414l75488o4203j0059r4899q794J59406
32344a57477J48302L0319M0974J08187r996k41578k72022n0118J54893J97014
32334e1502K02863K42364J89040Q022j13269o7660j3302q3443j28847K5501K27963
32323D37730J78089j13058l21036k78144j71742j82425j86437j3920J93214J57830
$$ y = [-181917, 243870, 339749, -6279, -288169, -180399, 40372, 19947, -132572, -107196, 85180, 191946, 155659, 119448, 74055, -133531, -427005, -499695, -284558, -86079, -81212, -23611, 294956, 585658, 442100, 4949, -171077, 122587, 498019, 521042, 191756, -196600, -400546, -342574, -128702, -29690, -222282, -503145, -512744, -270612, -151116, -243906, -153105, 340284, 808991, 732974, 236560, -138928, -203131, -213190, -308089, -316883, -157477, -9175, 21144, 62118, 170305, 160309, -81269, -353291, -403409, -248516, -51502, 151361, 393725, 582765, 590787, 477518, 409858, 396556, 313113, 184266, 209767, 437730, 615819, 502761, 181725, -96419, -268161, -450586, -637023, -650943, -457729, -299899]
32313b99899q5696k13108q3777Q2653P5888r241K0231J55166K53422K55408J72689
32302C23736K63j93879k23564k0807J85492J32621j02817k00140k8079K09532
32292H2358K57916Q1755j54357k54351j48483K5765M5740j12150k07971o7463
32282d51241J61786K50877K40342L10881M12190L15218N415k62724l27945k83081
32272C71718k32106j34337K9815J50009J41051M9626n6976j56117j83581n7773
32262g8671J48650K23938P1739j83613l76475m28840k90650L2975L38635L44592
32252a97720P2704j00785O9454L51542L68686J18860q0224p3221k0165o1648r0953
32241C56530K6561J88227J79790j5113k01498k52647k37667k32631j74944k1548
$$ y = [-299899, -385595, -598703, -682480, -599827, -523939, -533180, -512949, -357783, -104361, 151047, 323736, 323999, 130120, -93444, -114251, 71241, 203862, 101045, -99095, -127174, 82358, 340274, 422029, 267672, 13321, -135162, -109397, -63657, -175807, -383778, -451241, -289455, -38578, 201764, 512645, 924835, 1240053, 1245468, 982744, 654799, 371718, 139612, 5275, 35090, 185099, 326150, 375776, 318800, 162683, -20898, -78671, 69979, 293917, 365656, 182043, -194432, -623272, -913922, -880947, -542312, -197720, -125016, -225801, -156347, 195195, 563881, 682741, 602517, 529296, 509131, 447483, 356530, 383091, 571318, 751108, 735995, 534497, 281850, 44183, -188448, -363392, -384940]
32231c84940Q7401P983j40078j01367J33505K96263K26318O6548o152l2042j18408
32220C5031k13165j89064m1854J26903K35683K39264J20332n6044j76767k10350
32210a30031j87236o9282J59806K93973R4137k76378l51533j4958L03086K49513
32200G1097N070j00379o1664j6158N9459J59419Q5393j98932l65245j98686N2421
32189e08205J29189J73866L15976K94447l6693k81830j36928J7707j94562l55695
32179e82728M3827N57855M18464j11720j33188L18138L13382l19807o56113k49637
32169d01527J68707L1297j70885M1320K12899j11039m18398r8761M22260L63830
32159C9703j15199k44114R5019L28928K00255k854r7369j65571j49579P0854K61101
$$ y = [-384940, -297539, -289556, -429634, -531001, -397496, -101233, 125085, 191633, 185481, 153439, 35031, -178134, -367198, -409052, -282149, -46466, 192798, 313130, 257086, 80319, -130031, -317267, -386549, -226743, 67230, 161367, -115011, -466544, -481502, -178416, 71097, 76167, -24212, -85876, -102034, -42575, 116844, 202237, 3305, -361940, -560626, -508205, -379016, -205150, 110826, 405273, 368580, 86750, -50178, -32471, -227033, -582728, -538901, 18954, 437418, 325698, 192510, 510648, 824030, 504223, -151890, -401527, -232820, -201523, -372408, -331088, -118189, -229228, -647626, -746387, -324127, 39703, -75496, -319610, -224591, 104337, 304592, 301738, 204369, 38798, -110781, -39927, 221174]
32148B21174P7811l22034m49547k00881Q4487J97254K08058J42256r416n5597
32138a06435J36196K69176K6088k92424j49058K97153L42191j30336m04147m7278
32128e8874M03882K80277k26805m19360j17200J98270J47798r7734j87675q3218
32118a60639j1590p8444j20176L0557K65494L27556J76387L5953L9935N0337n4928
32107E00442j41929o6013L9080k5723j65200j30416O2002J39956j4257k20828
32097b2886k85669k10872q7851M3395J74428K73454K82391J40496j29223l31317
32087a53654k38296R8582L37818K58067J6058j20989j06229l5756M3080P2825
32077A71506l9558j99486j30194J75082L01858J5953k90178j52822K30847L16619
$$ y = [221174, 298985, -23049, -472596, -673477, -588990, -391736, -183678, -41422, -50838, -106435, 29761, 298937, 325025, 32601, -116457, 180696, 522887, 392551, -11596, -58874, 345008, 625285, 398480, -20880, -138080, 60190, 207988, 110254, -77421, -160639, -172229, -250673, -370849, -340292, -74798, 252758, 429145, 465098, 505033, 555370, 500442, 358513, 292500, 331580, 305857, 140657, 10241, 72243, 212199, 197942, -22886, -308555, -519427, -607278, -563883, -389455, -116001, 166390, 306886, 177663, -153654, -391950, -293368, 44450, 302517, 318575, 197586, 91357, 55601, 98681, 171506, 131948, -67538, -197732, -22650, 279208, 295161, 4983, -147839, 83008, 399627]
32067C99627O6219o9180O8853J60456L3717p8346l2949l0245j79896k50457q4335
32056C464J06107J03412K3880L7104M1643q9817j87949l5589K25913K66092N6270
32045E50530j09219n9338N4890M3960n7724r5996j3893J25326K34889K46620J33647
32034A053692k6945p6467M1257J61547R0064j04200j50236L7229K26965K33756
32024A486662K00457L22957M96878N39416O11832J015093J595831J791748J357522
32015I418396O51446P0211m00121q72101j195449j212017j074012r97228r28409
32006C460716p33271m89658l29367k16921j36651k32905m82966n25673j58700
31997A54604K72228L52100J80283O6547l9853k97680m36928j21294L23245K53501
$$ y = [399627, 465846, 396666, 465519, 625975, 659692, 581346, 548397, 518152, 338256, 87799, 3464, 109571, 212983, 236863, 273967, 315610, 225793, 37844, 2255, 228168, 494260, 550530, 441311, 381973, 436863, 480823, 423099, 327103, 313210, 438536, 673425, 920045, 1053692, 1026747, 950280, 991537, 1153084, 1243148, 1138948, 988712, 1025941, 1252906, 1486662, 1687119, 2010076, 2506954, 3046370, 3658202, 4673295, 6269126, 8060874, 9418396, 10069842, 10140053, 9739932, 8867831, 7672382, 6460365, 5386353, 4389125, 3460716, 2727445, 2237787, 1908420, 1691499, 1554848, 1321943, 838977, 313304, 154604, 426832, 778932, 959215, 1025762, 985909, 688229, 251301, 130007, 453252, 706753]
31987G06753k56309m55754q2030K49427N3345l10534l11740o0853L8559J0817
31977d18319J35169L34591K88749K3993j14294m9113p1577k88109l82235j11712
31967f52857K68243L43066J19360k7878O8660J51496j7902k61362k44988J7088
31957b37074J94710J30665J2441J5474M7934l1196j63478k12087j63062o8994
31947d74667N6520J64867J47084P343q0262M029J80155L09812L13235J20349k45474
31936E02991m98835l30319J03418K90020P8075j30848o5415K9321n1611n9455
31926a32658J67485K45735j51157o30784n90616r0816L25068M16241L23183J29774
31916A1455j03920j25459J41504K77247k4151l43341j75136J66496N9358l06373
$$ y = [706753, 450444, -5310, -87340, 162087, 215432, -95102, -406842, -467695, -429136, -418319, -283150, 51441, 340190, 364183, 249889, 200776, 129199, -158910, -541145, -652857, -384614, -41548, 77812, 49934, 118594, 270090, 252188, -9174, -254162, -237074, -42364, 88301, 100742, 116216, 164150, 132954, -30524, -242611, -405673, -474667, -418147, -253280, -106196, -98853, -179115, -175086, 5069, 314881, 628116, 748465, 502991, 4156, -326163, -222745, 67275, 145350, 14502, -50913, -21592, -73203, -132658, 34827, 280562, 129405, -501379, -1091995, -1182811, -857743, -441502, -118319, 11455, -92465, -217924, -76420, 200827, 176676, -166665, -341801, -175305, -115947, -422320]
31906d22320k24510K79764M69058J35724j39824n7067J8282r4328o1806J92957
31896I5930K48275n675j26251K4944O946l01809l75409K704K93826J61292M0735
31885F5508K44379L32672j1828k89538o8930J83462m6041l18031P927N71758N30386
31874A201724r6678n30500m33180j48405O4670K24464J97469j53250m87560l58391
31864e19637M5648J91609P5653R4826K14606O3715k33422j67289K03293K57076
31854B26078j26017l38256p4808K05795J28951l4790k952J3720j53566k16591
31844c72436k904J24700q3432k18877J17760N53900M81556J7292k40702j77326
31834A99531j79525l09308j98674J70937K92196l4587l00540p2183L22721L36164
$$ y = [-422320, -646830, -367066, 101992, 237716, 97892, 40825, 59107, -35221, -97027, 95930, 344205, 338530, 212279, 237223, 244169, -57640, -433049, -430345, -136519, 24773, 65508, 309887, 642559, 630731, 341193, 272263, 455725, 409684, 91653, 99580, 671338, 1201724, 1105046, 574546, 141366, -7039, 57631, 282095, 479564, 326314, -161246, -519637, -473989, -282380, -206727, -111901, 102705, 166420, -67002, -234291, -30998, 226078, 100061, -238195, -313003, -107208, 21743, -13047, -15999, -2279, -155845, -372436, -375340, -250640, -334072, -552949, -435189, 118711, 600267, 617559, 376857, 199531, 20006, -289302, -487976, -317039, -24843, -59430, -359970, -432153, -109432, 226732]
31824B26732M1164q7988K4357N6371l1001O3013L15654K81044j43942m27292k10017
31813A08095J03508J1269k75391k52293o79L1510j01218M6200M02757L96884k6493
31802D44149k18736P8647K36996k15281p36745n71831R2647M42174K01378j57182
31792d03784k16325n5543P4190P4810p278k8030J51241M05581L82656K4470k28295
31781A73693o1733J95310Q6428k33571k70261J6321K23908J83760R5639N3837
31771D63331n1212j67994r5711J04395J26676j02836l23631l35208j74966P1896
31761d85260L13114L50129Q2485k38376k91753j40078n4936k7515J28150L09003
31751e5037K42189n374j26391j15147j90602k41431N3023N32034O16216J80896
$$ y = [226732, 267896, 179908, 204265, 260636, 229635, 292648, 608302, 889346, 745404, 318112, 108095, 211603, 222872, -52519, -304812, -305491, -273981, -375199, -328999, 73758, 470642, 444149, 225413, 304060, 541056, 325775, -410970, -982801, -890154, -447980, -246602, -403784, -620109, -675652, -601462, -526652, -533930, -561960, -410719, -5138, 377518, 401988, 173693, 111960, 307270, 393698, 160127, -110134, -93813, 130095, 313855, 409494, 463331, 412119, 244125, 148414, 252809, 379485, 276649, -46982, -382190, -557156, -485260, -172146, 177983, 260468, 22092, -269661, -409739, -464675, -492190, -364040, -55037, 187152, 181778, 55387, -59760, -250362, -491793, -438770, 93264, 709480, 890376]
31741H90376k27187k17416l6579j5811p9778o9535p0083j35691j08163M5478J13559
31730H9170N5342R9089K41420J56634j58814k11437J85310M91794K68186r5979
31720A120715j9639L36554M08683K06465K68119P28374J038289O98371j35850
31711D650081q76787j086017q01098m40023l54382m25779k76489R0655K19941
31702G00102p2258l28725j25058K74591L50726J03364p2040m7058j6634n0709
31692G16301m7091k9460q7557j17567R542J39577N5870j29172j68240j07140j35874
31681I9189j85786q9329L4508n525o1368P4428J84567k6690l02978j93097J17322
31670c54759O5281k75293k59946J91451L92340L6636k95798j36412J54743J38522
$$ y = [890376, 663189, 445773, 409194, 393383, 313605, 244070, 173987, 38296, -69867, -24389, 89170, 144512, 243601, 485021, 641655, 482841, 271404, 456714, 948508, 1216694, 1120715, 1101076, 1437630, 1846313, 2052778, 2320897, 3049271, 4087560, 4785931, 4650081, 3773294, 2687277, 1886179, 1446156, 1091774, 665995, 389506, 480161, 700102, 627844, 299119, 174061, 448652, 799378, 902742, 830702, 783644, 767010, 716301, 669210, 639750, 552193, 434626, 444168, 583745, 639615, 510443, 342203, 235063, 99189, -86597, -175926, -141418, -146943, -208311, -133883, 50684, 23994, -278984, -472081, -354759, -289478, -564771, -824717, -633266, -240926, -204290, -500088, -636500, -481757, -343235]
31660c43235M9844K23860L78173J30203k38079k18009O7819J17589q8494j34395
31650e4724P5127K15659J34054O881n7899j19684j44263n1693L7856j4743m9915
31639b3344J27075L04687J49323j83823k34975K2286J54373j7398j93829j47989
31629d3614j3820O0239J01095Q0562p0870j71895K2485L05148K22574j35715j73463
31618A82726K21526M00146j5147m74926l48599J36834L66899K88730K58485K82361
31608A299035Q7201k42796l44647k06822j46481k08096j35634P0164J13946l4792
31598B51078p2754O0215N6475j58971k15469P5442L39573K11572q8556j31683
31588C26922M5881O8530j33253k37280p7575J03742O3255p0570k9474J47881J44746
$$ y = [-343235, -293391, -69531, 308642, 438845, 200766, -17243, 50576, 168165, 79671, -54724, 20403, 236062, 370116, 376997, 319098, 199414, 55151, 3458, 41314, 26571, -23344, 103731, 408418, 557741, 373918, 138943, 161229, 315602, 298204, 104375, -43614, -57434, 2805, 103900, 184462, 113592, -58303, -35818, 269330, 491904, 356189, 182726, 404252, 804398, 789251, 314325, -34274, 102560, 469459, 758189, 1016674, 1299035, 1386236, 1143440, 798793, 591971, 445490, 237394, 101760, 171924, 285870, 251078, 178324, 238539, 295014, 136043, -79426, -3984, 335589, 547161, 458605, 326922, 372803, 441333, 308080, 70800, -6775, 96967, 160222, 89652, 60178, 208059, 352805]
31577C52805j60389m58904l78584K6716L36563K90109N2997q8224q9286p9105
31567a95302j03789j15388r4474k0008J60453L65141L41918K3285k43113j22686
31557c963J67756J29551k46301m11308o6045L76992L79772K2695j62292N5745
31547B42602L50598L23791j3490l27781l76078k05836l284J16204J25360J6401
31537B48487j50166j96062j5803J97997J54816p6930j07873J66924L42570J14482
31527F78442k21639k28537m969L7170j23004j37185P4330K18037J65294J09831
31517E67770J24254K2812k13533l03082j19931Q4109Q3340k3461p0502o2863j1421
31506G7492J48205L14284K17210j57242m36958l49566q0072L9173m1376j37070
$$ y = [352805, 192416, -266488, -645072, -618356, -281793, 8316, 61313, -26911, -116197, -195302, -299091, -414479, -508953, -528961, -368508, -3367, 338551, 361836, 118723, -3963, 163793, 293344, 47043, -364265, -430310, -53318, 326454, 349149, 186857, 242602, 593200, 916991, 903501, 575720, 199642, -6194, -9478, 106726, 232086, 248487, 98321, -97741, -113544, 84453, 239269, 162339, 54466, 221390, 563960, 678442, 456803, 228266, 223297, 260467, 137463, 278, 74608, 292645, 457939, 567770, 692024, 714836, 501303, 198221, 78290, 162399, 245739, 222278, 151776, 88913, 77492, 225697, 539981, 757191, 599949, 162991, -186575, -266647, -227474, -268850, -405920]
31496d05920r9625R3351L30733L84819J51129j24386j36309m001r1478l69189
31486b70876m28343j68774N4701O8600R7470K00138J10794j32258o4399L65483
31476a67464N08135K0288m85100l55065J17899K67915J00182M6479R7802m2499
31466A08572k32424r2757K41653K85846K134k12550k20122k03469j59022M9981
31456d32158K41751J34357q8547m1399J61355J17374q1589l911K68182K21717
31446D97132j47212k80965m0099O7596j77041l18523o1307K17734J46578n7683
31436a53790n1275J01063J93935K35111K38928Q4625j77132k83393j97604j49213
31426a58745j32875Q1690L36224J64690l16172l71254J60105M49636k8054n76105
$$ y = [-405920, -505545, -412194, -81461, 303358, 454487, 330101, 193792, 189791, 98313, -270876, -699219, -867993, -813292, -744692, -647222, -447084, -336290, -468548, -532947, -167464, 340671, 360959, -124141, -479206, -361307, -93392, 6790, 53269, 151071, 108572, -123852, -216609, 25044, 310890, 313024, 100474, -119648, -323117, -482139, -432158, -190407, -56050, -144597, -185996, -24641, 92733, 11144, 7233, 275415, 497132, 349920, 68955, 28856, 96452, -80589, -399112, -460419, -242685, -96107, -153790, -205065, -104002, 89933, 325044, 563972, 648597, 471465, 188072, -9532, -158745, -291620, -209930, 126294, 290984, -25188, -396442, -236337, 213299, 185245, -390860]
$$ [...]
##END NTUPLES=NMR SPECTRUM
##END=
