##TITLE=31Pdec_PR195_T
 , 24 sc
 1.04.2021
##JCAMPDX= 6.0         $$ Bruker NMR JCAMP-DX V2.0
##DATA TYPE= NMR SPECTRUM
##DATA CLASS= NTUPLES
##ORIGIN= UXNMR, Bruker Analytische Messtechnik GmbH
##OWNER= root
$$ XWIN-NMR		Version 3.5
$$ Thu Apr  1 13:22:54 2021 Russian Standard Time (UT+4h)  she@DPX200
##.OBSERVE FREQUENCY= 81.013821
##.OBSERVE NUCLEUS= ^31P
##.ACQUISITION MODE= SIMULTANEOUS
##.ACQUISITION SCHEME= undefined
##.AVERAGES= 24
##.DIGITISER RES= 16
##SPECTROMETER/DATA SYSTEM= spect
##.PULSE SEQUENCE= zgpg30
##.SOLVENT NAME= CDCl3
##.SHIFT REFERENCE= (INTERNAL, CDCl3, 0, 248.564)
##AUDIT TRAIL= $$ (NUMBER, WHEN, WHO, WHERE, WHAT)
$$ ##TITLE= Audit trail, XWIN-NMR		Version 3.5
$$ ##JCAMPDX= 5.01
$$ ##ORIGIN= Bruker BioSpin GmbH
$$ ##OWNER= she
$$ F:/spectra/data/she/nmr/P31/1/pdata/1/auditp.txt
$$ ##AUDIT TRAIL=  $$ (NUMBER, WHEN, WHO, WHERE, WHAT)
(   1,<2021-04-01 13:21:47.39 +0400>,<she>,<DPX200>,
      <created by zg, POWCHK disabled, PULCHK disabled
       configuration hash MD5:
       00 E9 B6 7A A2 85 ED C7 34 08 36 98 17 FE 4E 26
       data hash MD5: 32K
       A1 E3 DC 3D 29 2A 5E BF 89 06 73 8B C8 DF CA 5F>)
(   2,<2021-04-01 13:21:49.85 +0400>,<she>,<DPX200>,
      <Start of raw data processing
       efp BC_mod = 2 LB = 1 FT_mod = 6 PKNL = 1 PHC0 = -4344.133 PHC1 = -53.19894 SI = 64K 
       data hash MD5: 64K
       38 58 54 97 5D 33 0A A6 E2 B3 11 70 BC A6 C9 1D>)
(   3,<2021-04-01 13:22:11.92 +0400>,<she>,<DPX200>,
      <pk PHC0 = 1.441726 PHC1 = -1.6 
       data hash MD5: 64K
       DD 77 4A BE 8F C7 DF E1 DF 7E AE 76 2F AD 8D E7>)
(   4,<2021-04-01 13:22:15.29 +0400>,<she>,<DPX200>,
      <abs ABSG = 5 
       data hash MD5: 64K
       E3 92 00 87 9C 21 9C F8 5D 73 23 49 84 DA A0 89>)
$$ ##END=
$$ 
$$ hash MD5
$$ B4 65 B2 F8 62 31 00 3E C4 C3 91 DB C5 11 7A 89
##$RELAX= 
##$RELAX= 
##$RELAX= 
##$RELAX= 
##$RELAX= 
##$RELAX= 
##$RELAX= 
##$RELAX= 
$$ Bruker specific parameters
$$ --------------------------
##$DU= <F:/spectra>
##$EXPNO= 1
##$NAME= <P31>
##$PROCNO= 1
##$TYPE= <nmr>
##$USER= <she>
##$AMP= (0..31)
100 100 100 100 100 100 100 100 100 100 100 100 100 100 100 100 100 100 
100 100 100 100 100 100 100 100 100 100 100 100 100 100 
##$AQSEQ= 0
##$AQ_mod= 1
##$AUNM= <au_zg>
##$AUTOPOS= <>
##$BF1= 81.014009
##$BF2= 200.13
##$BF3= 200.13
##$BF4= 200.13
##$BF5= 200.13
##$BF6= 200.13
##$BF7= 200.13
##$BF8= 200.13
##$BYTORDA= 1
##$CFDGTYP= 0
##$CFRGTYP= 5
##$CHEMSTR= <none>
##$CNST= (0..31)
1 1 145 1 1 1 1 1 1 1 1 1 1 1 1 1 1 1 1 1 1 1 1 1 1 1 1 1 1 1 1 1 
##$CPDPRG= <waltz16>
##$CPDPRG1= <>
##$CPDPRG2= <waltz16>
##$CPDPRG3= <>
##$CPDPRG4= <mlev>
##$CPDPRG5= <mlev>
##$CPDPRG6= <mlev>
##$CPDPRG7= <mlev>
##$CPDPRG8= <mlev>
##$CPDPRGB= <>
##$CPDPRGT= <>
##$D= (0..31)
0 1 0 0 0 0 0 0 0 0 0 0.03 2e-05 3e-06 0 0 0 0 0 0 0 0 0 0 0 0 0 0 0 0 
0 0 
##$DATE= 1617268906
##$DBL= (0..7)
120 120 120 11 120 120 24 19 
##$DBP= (0..7)
150 150 150 150 150 150 150 150 
##$DBP07= 0
##$DBPNAM0= <>
##$DBPNAM1= <>
##$DBPNAM2= <>
$$ [...]
##$SUBNAM3= <"">
##$SUBNAM4= <"">
##$SUBNAM5= <"">
##$SUBNAM6= <"">
##$SUBNAM7= <"">
##$SUBNAM8= <"">
##$SUBNAM9= <"">
##$SW= 501.771253377433
##$SWIBOX= (0..15)
0 1 3 0 0 0 0 0 0 0 0 0 0 0 0 0 
##$SW_h= 40650.406504065
##$TD= 32768
##$TD0= 1
##$TE= 0
##$TE2= 300
##$TE3= 300
##$TEG= 300
##$TL= (0..7)
0 120 53 12 22 120 120 120 
##$TP= (0..7)
150 150 150 150 150 150 150 150 
##$TP07= 0
##$TPNAME0= <>
##$TPNAME1= <>
##$TPNAME2= <>
##$TPNAME3= <>
##$TPNAME4= <>
##$TPNAME5= <>
##$TPNAME6= <>
##$TPNAME7= <>
##$TPOAL= (0..7)
0.5 0.5 0.5 0.5 0.5 0.5 0.5 0.5 
##$TPOFFS= (0..7)
0 0 0 0 0 0 0 0 
##$TUNHIN= 0
##$TUNHOUT= 0
##$TUNXOUT= 0
##$USERA1= <user>
##$USERA2= <user>
##$USERA3= <user>
##$USERA4= <user>
##$USERA5= <user>
##$V9= 5
##$VALIST= <valist>
##$VCLIST= <CCCCCCCCCCCCCCC>
##$VD= 0
##$VDLIST= <DDDDDDDDDDDDDDD>
##$VPLIST= <PPPPPPPPPPPPPPP>
##$VTLIST= <TTTTTTTTTTTTTTT>
##$WBST= 1024
##$WBSW= 4
##$XGAIN= (0..3)
0 0 0 0 
##$XL= 0
##$YL= 0
##$YMAX_a= 50040
##$YMIN_a= -54441
##$ZGOPTNS= <>
##$ZL1= 120
##$ZL2= 120
##$ZL3= 120
##$ZL4= 120
##$ABSF1= 248.5645
##$ABSF2= -253.2056
##$ABSG= 5
##$ABSL= 3
##$ALPHA= 0
##$AQORDER= 0
##$ASSFAC= 0
##$ASSFACI= 0
##$ASSFACX= 0
##$ASSWID= 0
##$AUNMP= <proc_1d>
##$AZFE= 0.1
##$AZFW= 0.5
##$BCFW= 0
##$BC_mod= 2
##$BYTORDP= 0
##$COROFFS= 0
##$CY= -3
##$DATMOD= 1
##$DC= 0
##$DFILT= <>
##$DTYPP= 0
##$F1P= 0
##$F2P= 0
##$FCOR= 1
##$FTSIZE= 65536
##$FT_mod= 6
##$GAMMA= 0
##$GB= 0
##$INTBC= 1
##$INTSCL= 5.30512e-09
##$ISEN= 30
##$LB= 1
##$LEV0= 0
##$LPBIN= 0
##$MAXI= 10000
##$MC2= 0
##$MEAN= 0
##$ME_mod= 0
##$MI= 50
##$NCOEF= 0
##$NC_proc= -1
##$NLEV= 6
##$NOISF1= 182.463
##$NOISF2= 159.3651
##$NSP= 0
##$NTH_PI= 0
##$NZP= 0
##$OFFSET= 248.5645
##$PC= 4
##$PHC0= -4342.691
##$PHC1= -54.79894
##$PH_mod= 1
##$PKNL= yes
##$PPARMOD= 0
##$PSCAL= 0
##$PSIGN= 0
##$REVERSE= no
##$SF= 81.014009
##$SI= 65536
##$SIGF1= 159.3651
##$SIGF2= -187.1042
##$SINO= 113.3802
##$SIOLD= 16384
##$SREGLST= <1H.CDCl3>
##$SSB= 0
##$STSI= 65536
##$STSR= 0
##$SW_p= 40650.406504065
##$SYMM= 0
##$S_DEV= 0
##$TDeff= 32768
##$TDoff= 0
##$TI= <>
##$TILT= no
##$TM1= 0
##$TM2= 0
##$TOPLEV= 0
##$USERP1= <user>
##$USERP2= <user>
##$USERP3= <user>
##$USERP4= <user>
##$USERP5= <user>
##$WDW= 1
##$XDIM= 65536
##$YMAX_p= 358882828
##$YMIN_p= -1887688
$$ End of Bruker specific parameters
$$ ---------------------------------
##NTUPLES= NMR SPECTRUM
##VAR_NAME=  FREQUENCY,     SPECTRUM/REAL,   SPECTRUM/IMAG
##SYMBOL=    X,             R,               I
##VAR_TYPE=  INDEPENDENT,   DEPENDENT,       DEPENDENT
##VAR_FORM=  AFFN,          ASDF,            ASDF
##VAR_DIM=   65536,         65536,           65536
##UNITS=     HZ,            ARBITRARY UNITS, ARBITRARY UNITS
##FACTOR=    0.620285442955139, 1,           1
##FIRST=     20137.2065510759, 0,            0
##LAST=      -20513.1999529892, 0,           0
##MIN=       -20513.1999529892, -1887688,    0
##MAX=       20137.2065510759, 358882828,    0
$$ Real data points
##PAGE= N=1
##DATA TABLE= (X++(R..R)), XYDATA
$$ [...]
39386b0377o4003l7033O981K2935K5680K5574J9511K3026L6849K0282l7566p4634
39374e2775m7768k897R864J4568L5433L1988j2704k9043K4786P2329L7573k9174
39362E2180m1558j2595p46N50J8142J9498k1752n3358l2845j1280l4268m4357
39350a62389J4927Q2275P5408K6365J1007J8232m010m3620o3404p1573o9279j8521
39338b04582N9327P0064J6773L6041J53981J79503n66j91818j63124J444N8623
39327A5666p079j8526N1617N6719k9735o5310k426L7708n280l7570J056L8850
39315C5690J7732j6597j9298j0580k844J7850K4511j8395n8526j8288N7635N6702
39303F5592j0725k6534L0969N7190R422l1395j6586k976l0343n2303l1463J757
$$ y = [-20377, -84380, -121413, -114432, -91497, -65817, -40243, -20732, 2294, 39143, 59425, 21859, -52775, -100543, -103440, -93576, -79008, -43575, -11587, -24291, -53334, -28548, 43781, 81354, 52180, 10622, -1973, -2719, -2169, 15973, 35471, 13719, -39639, -72484, -83764, -118032, -162389, -147462, -65187, 10221, 36586, 47593, 65825, 61815, 18195, -45209, -116782, -186061, -204582, -145255, -75191, -58418, -22377, 131604, 311107, 310541, 118723, -44401, -42957, 15666, 8587, -9939, 41678, 98397, 68662, 3352, 926, 38634, 33354, -4216, -3160, 35690, 53422, 36825, 17527, 6947, 4103, 21953, 46464, 28069, -30457, -48745, 8890, 65592, 54867, 28333, 59302, 116492, 125914, 94519, 77933, 74957, 44614, -7689, -39152, -37395]
39291c7395J6934J9311M038l6577n9936j8316N0880P0846M2942K4851K0212p811
39279H9979m3446m3020k0005q488R850M5130L7780l1252n9950J2929P1959J1754
39267G3220n8024O187J10338P3489m5647m9149M0853K8842p9604p7812N1825Q3228
39255A57746n1858j33248l3645P4613M0406j7469L8833J09261N1503o0720p6970
39244I8452j5710J3235L761N325m858m9600n9203Q876O1466J3922n8266m2565
39232b5165L1294O2436M1216J7522j2489o9304j08672q1932j6163M4964J01742
39221a4551J30592O1724q5892j56425n4033J05318J49788P4065n726l7807n3352
39210A13701o1753m7434l2425m2618m4733J060O0575O8140J5958n1978r2879p4486
$$ y = [-37395, -20461, -1150, 2888, -33689, -93625, -111941, -61061, 9785, 52727, 77578, 97790, 89979, 46533, 3513, -16492, -24980, -15130, 30000, 67780, 36528, -23422, -10493, 61466, 73220, 15196, 21383, 131721, 205210, 159563, 110414, 151267, 180109, 100505, 22693, 74518, 157746, 105888, -27360, -61005, 13608, 54014, 36545, 75378, 184639, 236142, 175422, 98452, 82742, 95977, 99738, 105063, 100205, 50605, -8598, 278, 61744, 75666, 17400, -25165, 6129, 68565, 109781, 127303, 114814, 45510, -63162, -145094, -161257, -116293, -14551, 116041, 177765, 91873, -64552, -118585, -13267, 136521, 210586, 204860, 167053, 113701, 51948, 4514, -27911, -70529, -115262, -114202, -53627, 14513, 30471, -21507, -114386, -188872]
39198a88872O847Q0495N2225n5060r8830r843J04253J13834L4708l6007o3771
39187f0021o6445l4451L7634Q7357M7312m8370r0678k2328R9256J56504Q3089
39176A88859n5631j13124l8024M3491K217r4307q6362J8942O7594K4461J5711
39165b6173P7013P6000l6891j08489l0990P3651N7979k1277l3150L504o602m4717
39153b0142l1593O518j1034n6825l6527M1448P4243K6634k8718k8117J1766L6081
39141a6266J1273m2541n3953K1034J11855J03554Q951l7885R614M0168k0477q6060
39129D9267o7372j8735k0471l6037l167L9855L6869K2417L2384J0240p3943j16496
39117a45189l1997Q2678Q4894L702l3944j9025l3883o4800k0343Q1944J13493
$$ y = [-188872, -182025, -101530, -49305, -104365, -203195, -213038, -108785, 5049, 39757, 3750, -60021, -126466, -160917, -123283, -35926, 11386, -36984, -127662, -149990, -50734, 105770, 188859, 133228, 20104, -17920, 25571, 27788, -66519, -152881, -133939, -66345, -41884, -26173, 50840, 126840, 89949, -18540, -49530, 24121, 82100, 60823, 27673, 31177, 24575, -20142, -51735, -45217, -56251, -113076, -149603, -108155, -33912, -7278, -35996, -64113, -52347, -16266, -4993, -47534, -101487, -80453, 31402, 134956, 143907, 106022, 115636, 155804, 135327, 49267, -18105, -36840, -57311, -93348, -96515, -56660, -19791, 2626, 35010, 45250, -28693, -145189, -177186, -94508, -9614, -5912, -39856, -58881, -92764, -157564, -177907, -95963, 17530]
39106A7530L0031o6624q0809k8440K5756M6863L2337L745j002K5960M4073L0677
39094H0097J8290K0830p093p3290r0504l965R5957R0030K54n8683m5465o491K8013
39081D7980N5648M7299j6176q0127p8418k9320Q909L3110O1118N5968j3491p7439
39069A5061l9903P2339J33677Q2092k2925r2295q8370k9793K6669K8539p163q411
39057F9517L9357N8137j028p6492r3363o5039l4718J271M1674L9273r464k2070
39045e2945L8380Q1429L1466m2701m3598J898J6452R571K3057K6358r239j6904
39033F3224N3241J09885N0171o0461q5211k7247N046j5433l4082m6314p4878o4952
39021a27011L7968J44401J17506j3003q9374n7181o617p06j2514k3207m0953l2484
$$ y = [17530, 47561, -19063, -99872, -128312, -102556, -55693, -23356, -19611, -20613, 5347, 49420, 80097, 98387, 119217, 112124, 38834, -51670, -55635, 40322, 130352, 130606, 71923, 26458, 19967, 47980, 103628, 150927, 134751, 54624, -23794, -53114, -44205, -11095, 50023, 105991, 92500, 15061, -24842, 47497, 181174, 263266, 240341, 148046, 59676, 29883, 56552, 85091, 77928, 69517, 108874, 167011, 165983, 89491, -3872, -68911, -103629, -102358, -60684, -21411, -30875, -52945, -14565, 66864, 98330, 55629, 12031, 13929, 30381, 39952, 63009, 89367, 80128, 63224, 116465, 226350, 276521, 216060, 130849, 103602, 108648, 93215, 59133, 12819, -62059, -127011, -89043, 55358, 172864, 159861, 70487, 13306, 6689, 5983, -6531, -29738, -70691, -103175]
39009a03175L1571Q3466M4416k7218j9383L7358K1604n7504p1638N15M3843J6215
38997G0M208M0563M4621j0248l9419j3359j9949r3055j30398o4041K2076L3623
38985b25308P630K0621N4856N0473J4138j0412k0278k9277j7190L2572Q4320R0859
38973E3004N3656R203j6236j9734j8208l6628p1117p7712l5091J1527J9939K1504
38961a05893N1777O2337P22o6099l2622O4206Q2109o728p1854k6841N3503O4472
38949F9089J1240l7059m7859l0460o490o581l8537n0189P088Q2137P9280P121
38937C8780l1528m202J2838j8156l4678k973J0825l5612p0584k3665N0052M9634
38925e9269k1866o9528l8122L4715Q0639O8454J7596k8770m8379n8451p4145o8319
$$ y = [-103175, -71604, 11862, 56278, 29060, 9677, 47035, 68639, 11135, -60503, -59988, -16145, 70, 4278, 44841, 89462, 79214, 39795, 26436, 6487, -86568, -216966, -281007, -258931, -225308, -217678, -197057, -142201, -91728, -77590, -88002, -108280, -137557, -154747, -122175, -37855, 53004, 106660, 115863, 99627, 79893, 61685, 25057, -46060, -123772, -158863, -147336, -127397, -105893, -54116, 8221, 8943, -57156, -89778, -25572, 56537, 49809, -22045, -48886, 4617, 69089, 80329, 43270, -4589, -35049, -41539, -48120, -86657, -136846, -129758, -47621, 31659, 38780, 7252, 3050, 15888, -2268, -36946, -39919, -29094, -64706, -135290, -158955, -108903, -59269, -81135, -150663, -188785, -154070, -73431, -4977, 12619, -16151, -64530, -122981, -197126, -265445]
38913b65445j4950M6861N4416J9101J2283N0730P1046L5220j1142j7463l865j6240
38901c9448m6903m3496J6251Q3997Q1318r546r8532p2417N5717J40895R2318m484
38889A55670k3900J1814q580q6352j12074n6849k0738n5899p0754J9976J46687
38878a00999J73645Q0017k9120o5336m1061j6331j5524j4470J3416N7728P9739
38867A21704N4729j690m9464n8583l0841J084J876k5706m2871l5006l8355p0599
38855a73722p7576j2966O8351Q2855N2231N9440R4336O8774k0196p7637o9172
38844e282n2287l8303K2042R4428P3461k4222n9129o373L140o3045o6163L3096
38832h8637O8915l6644j12050k9128P3478M9599L386O5976J25502L4353r7970
$$ y = [-265445, -280395, -233534, -179118, -160017, -147734, -97004, -25958, 9262, -1880, -19343, -23208, -39448, -86351, -129847, -113596, -29599, 51719, 42173, -56359, -128776, -73059, 67836, 160154, 155670, 131770, 143584, 135004, 48652, -63422, -120271, -141009, -196908, -267662, -247686, -100999, 72646, 152663, 123543, 58207, 17146, 815, -14709, -29179, -15763, 41965, 121704, 176433, 174743, 125279, 66696, 35855, 36939, 38815, 13109, -29762, -64768, -103123, -173722, -251298, -264264, -195913, -113058, -60827, -1387, 92949, 161723, 141527, 63890, -5282, -57569, -95872, -73830, 20598, 94059, 69837, 10708, 4335, 7475, -55570, -121733, -88637, -19722, -56366, -168416, -197544, -124066, -74467, -71081, -5105, 120397, 154750, 56780]
38821E6780r0425j0110k6628q7818l2405R0425J08534L7779J8706L3033k7703
38810G0168r6982l5191P8918O1157m2800m3361L9074L1726l6676J1463J28409
38799A65905Q4724j08098j82065n8741L9396j2318o4678o120N7229L7685J2681
38788c4400L5540L6128j0222k8136n282p440k2103L548K435r4769j47662K40J90493
38775h1630J49180m8988r4103L3097O7489l3666m2186O9569P3196n6298r0189
38764e4529p760l1565j45050q0483J40302J87303L0211l295J22783O6713j88163
38753C6467k16817O2665J90686K253p5674J35301K10705k0081q9643J91981L20557
38742G48400J15322J68924O38895P51005M48343J222937L759226N800204M449345
$$ y = [56780, -33645, -43755, -70383, -158201, -190606, -100181, 8353, 46132, 64838, 97871, 70168, -26814, -62005, 16913, 78070, 35270, -8091, 30983, 62709, 26033, 37496, 165905, 250629, 142531, -39534, -98275, -58879, -71197, -135875, -141995, -84766, -47081, -34400, 1140, 37268, 27046, -1090, -6372, -13812, -35915, -32367, -29932, -124701, -272363, -272123, -81630, 67550, 18562, -75541, -42444, 25045, -8621, -50807, 18762, 91958, 35660, -54529, -62289, -93854, -238904, -319387, -179085, 8218, 38429, 35134, 157917, 224630, 36467, -180350, -117685, 73001, 75254, -420, 134881, 345586, 325505, 235862, 427843, 748400, 863722, 1032646, 1671541, 2422546, 2870889, 4093826, 7853052, 13653256, 18102601]
38733A8102601K36965l202813l627243k372570j629630j570543j243038o69791
38725D023938n36085p20881n65742j32227k9595k87792l87103k14151j33352k33071
38715G83939k49605j62558k07360l44115k93907o8513M9497J5295L9288J41859
38705b96180J38846L6841K2930Q9257O1022l5202j4729Q7101O1747o8778p5097
38694G758N3682Q3298l9346r6436N270Q6620L0328l8346q601L7363J0541l5887
38682I6244l8508k4660j2791K5796O4323L7793j8464j0901L1923J829p2591n5727
38670B4266M3263O6713j6842n5943J5514O9125J4715n5775m5910j379J2116K1970
38658I1833N1637N1036M442k2724j1836l0513q3333p1621K6440Q9774N3272J5409
$$ y = [18102601, 18339566, 15136753, 11509510, 9136940, 7507310, 5936767, 4693729, 4023938, 3487853, 2766972, 2201230, 2069003, 2039408, 1751616, 1364513, 1150362, 1017010, 783939, 534334, 371776, 164416, -179699, -473606, -542119, -492622, -477327, -438039, -296180, -157334, -120493, -97563, -8306, 52716, 17514, 2785, 89886, 151633, 82855, 7758, 61440, 144738, 105392, 8956, 14226, 100846, 131174, 92828, 84227, 121590, 132131, 96244, 57736, 33076, 20285, 46081, 110404, 148197, 129733, 118832, 150755, 152584, 79993, 24266, 67529, 134242, 117400, 61457, 76971, 146096, 160811, 105036, 59126, 57747, 69863, 91833, 143470, 194506, 198948, 176224, 164388, 133875, 50542, -21079, 5361, 95135, 148407, 163816]
38646A63816M4700M0687p3378j64436p3056J15558J71380M1976r8898j11393m1951
38635A5005J847k646j6069j4693L209L2909N0436K3384l9702p9697m8788L2622
38623d2183R3838Q3812K0519k8986k2034J2460J5389k2645n2189l5304Q512L5459
38611F6648K6908n132l7264m8787l4395o563K4871N9553P5045K5418q1924j43860
38599g9482p1953O9413J21512L4863p1617p7313j905N7218N3623P484m5287o5293
38587f8737k1309N8263Q8523L0255n2023p7794m9961j7957Q623M5844P3313N6412
38575G3452J0396j8499k0230j6363p339J9889M6245L8048K241k3220k4053j2503
38563F8064N862K1869L883n3539q6271l5540M9316O2396o792n7368k7085K7154
$$ y = [163816, 208516, 249203, 175825, 11389, -61667, 53891, 225271, 267247, 168349, 56956, 15005, 16852, 14206, -1863, -16556, -13347, 19562, 69998, 93382, 53680, -26017, -74805, -42183, 51655, 135467, 155986, 127000, 104966, 117426, 132815, 110170, 57981, 22677, 31189, 66648, 93556, 88424, 51160, 2373, -32022, -38585, -13714, 45839, 120884, 146302, 64378, -79482, -151435, -82022, 39490, 74353, 2736, -74577, -76482, -19264, 34359, 41843, -3444, -68737, -90046, -31783, 56740, 86995, 34972, -42822, -92783, -110740, -102117, -56273, 17040, 73452, 83848, 65349, 45119, 28756, 21417, 41306, 87551, 125599, 127840, 104620, 80567, 68064, 73926, 95795, 99678, 46139, -40132, -75672, -26356, 36040, 29248, -28120, -55205, -28051]
38551b8051L3033R637J5185M4244M2560m220n5491p8816p9210o3996k0308N2869
38539a32564J13446J09394M8390M295K4113N1588O62j01111j27420l9764L8960
38528a0011P788n0726n772R9961J14239K2463l7697p615K0459o043j3978K6615
38516A59683J9411p3777j23124l3511P8282N7570m8489q6276l9353l236J2312
38505h0508O7564J21091O8938n1369q2746O057P0553K2425n2096n9610l3624k9940
38493c3265k2772J0943J8683k6382m8895J0970Q4213P1534q463o0612n3424l0311
38481h7781j5155R285M1763M9720J9936j8377k5919O514M5157M3752M184j2967
38469F0112K5066N8578K1439m1405l7613J2284P27p5698r0519O304R4328O7469
$$ y = [-28051, 4982, 14619, 29804, 74048, 116608, 112388, 56897, -21919, -101129, -165125, -185433, -132564, -19118, 90276, 138666, 142961, 167074, 218662, 219324, 118213, -9207, -48971, -10011, -2223, -52949, -58721, 41240, 155479, 177942, 140245, 132630, 153089, 147046, 133068, 159683, 179094, 105317, -17807, -51318, 26964, 84534, 36045, -50231, -89584, -92820, -80508, -12944, 108147, 177085, 125716, 42970, 49027, 119580, 142005, 89909, 30299, -3325, -33265, -56037, -45094, -26411, -52793, -101688, -90718, -6505, 65029, 56566, -4046, -57470, -87781, -102936, -93651, -51888, -2168, 17768, -609, -26528, -20014, 25143, 68895, 73079, 60112, 85178, 143756, 165195, 123790, 86177, 98461, 99188, 23490, -67029, -60725, 33603, 101072]
38457A01072j0074k5739Q788J3771j3565k1959j1541j1686o381K1232K3853l1006
38445C6765p1732k2497N5667M6235l3165n4330J8688Q3128O8967L2114L5891M5627
38433B41358K884o8832r7707o1738l871K6758J6124j4328k9065j3456P970N593
38421A1690r945n663J6550J9720p978l2134k4422j782P043P439K2418M3601L4466
38408H1003q757l2474M332N4616L3913m8191p9224n425P3702M8464k9533l0251
38396F2175M3585O8270J3264j2413M0246P1247J3335m1405j921N5063Q922j00405
38384B19963j31196n2874L0152M1079L297l4259m4786q162O4389J02925N6535
38373B47063k0279l9667j4006k4536p4639p9765r234O1709O6901L4256K0634K4413
$$ y = [101072, 90998, 65259, 74047, 87818, 74253, 52294, 40753, 29067, 22686, 43918, 67771, 36765, -34967, -57464, -1797, 44438, 11273, -43057, -24369, 58759, 127726, 159840, 195731, 241358, 244242, 175410, 77703, 15965, 12094, 38852, 54976, 40648, 11583, -1873, 6097, 11690, 1745, -3918, 12632, 32352, 24374, -7760, -32182, -33964, -26921, -19482, 2936, 46537, 81003, 72246, 39772, 44104, 98720, 132633, 84442, 5218, -207, 73495, 121959, 92426, 62175, 105760, 174030, 187294, 174881, 215127, 286374, 299709, 258304, 256383, 311446, 320368, 219963, 88767, 35893, 66045, 107124, 110421, 76162, 31376, 23214, 87603, 190528, 247063, 226784, 187117, 173111, 148575, 73936, -5829, -15063, 46646, 113547, 147803, 168437, 192850]
38361A92850L630n4664j13345j19422n4195L7379P9416M5477j3480m0069l6495
38350g2918l3654l5367l1955l0874l2069j0344L6515O3452M4571J8750K5375M5393
38338a3125N0886N1544M1424k4314j30949j65198o6202O0271Q4879L9468L4159
38327c7157N6368P812r3881j19124l5880M1211L8575J7821L7583N1111P507m7536
38315g5590m4600P809N4043O6764M6514r69m7917n2391j4349J7852J5904R93o665
38302c2602j4679k1611q409J8181K6312J4868J4158K2438M493l2749l2202J8671
38290b3131N1405J6218l6170k5605L8101O4824R353o0803m9724L3499P2464o38
38278H9793r3288o7878N3819J08257K9637n2923k2061M7069K3551o0756p2896
$$ y = [192850, 196480, 141816, 28471, -90951, -145146, -107767, -28351, 17126, 3646, -36423, -72918, -106572, -141939, -173894, -204768, -236837, -247181, -210666, -147214, -102643, -83893, -58518, -13125, 37761, 89305, 130729, 106415, -24534, -189732, -255934, -195663, -110784, -71316, -37157, 19211, 27023, -66858, -185982, -221862, -180651, -142076, -124255, -86672, -35561, -28054, -75590, -120190, -112381, -58338, 8426, 54940, 53971, 6054, -46337, -60686, -42834, -26930, -25937, -32602, -47281, -68892, -77301, -59120, -32808, -17940, -3782, 18656, 23149, -9600, -41802, -23131, 28274, 44492, 8322, -17283, 20818, 85642, 94995, 34192, -15532, 17967, 90431, 89793, -3495, -71373, -17554, 90703, 120340, 67417, 45356, 92425, 115976, 55220, -17676]
38267a7676J819N3338L1364p015k3481l7852m2889p671L1995J2065l0949l843
38255d0795O6656N2876n3845j03299k1437P0661N5917l041L001M0631J1058o5003
38243A3380p9549j3180M7550N3480M1564L6077L114o5340j01520n1023L2700M6019
38231c6728k1947o6478j2243P3645P5398K153k5949L2108P2909J9008n4236m5006
38219A2634J3828K6455n533j4653m606k7653o2391m2627J6312M2228L0976K4911
38207I881L188o6883j07431k5526R4262Q2280l5556o0081N2165J10198J0238r1059
38195b4324m5418M9736M1855j9565k540N9133L6804n4363q0547j3024M4382L6398
38183B8527J6124K4058L4446L1065L0401K0608k8732q5801p1655K4364J12310
$$ y = [-17676, -15857, 37481, 68845, 61830, 38349, 497, -42392, -50063, -18068, -6003, -36952, -40795, 25861, 78737, 24892, -78407, -99844, -29183, 26734, 23693, 26694, 67325, 78383, 13380, -66169, -79349, -31799, 21681, 63245, 99322, 102436, 37096, -64424, -115447, -82747, -36728, -58675, -125153, -137396, -63751, 11647, 13800, -12149, 19959, 92868, 111876, 57640, 12634, 26462, 52917, 47384, 32731, 28125, 472, -61919, -104546, -88234, -46006, -15030, 9881, 13069, -53814, -161245, -186771, -92509, -10229, -45785, -105866, -53701, 56497, 66735, -24324, -69742, -20006, 21849, 2284, -256, 58877, 95681, 41318, -39229, -52253, -7871, 28527, 44651, 68709, 103155, 134220, 164621, 185229, 156497, 70696, -959, 23405, 135715]
38172A35715J06747J8436p1642r5914n3461l404k342l8750m9996j0112L7707M6804
38160A9788J6973l4094q9649j06342l9976P0234J18098O9701Q479l30J644k8461
38148F065m0454J0142N8319L1071k0410p058M0477L1043j4832J757O8014N7024
38136B21158n9455j36969o0188Q7827J38012M8289p3604j19141p9506j3738K3936
38125b3379J8946n854j5389K546K6071K9799J8117J3179J4781l130m4857o7128
38113c6298l3916J6319R785m8799o5172O546Q1146O3155o417j8465K5786K3027
38101A6697m7721p6346K769R6615Q4998j1080o9098k7480N7121R1247L9332m7504
38089A09550p9732k9512K3500o184p7777p4473J5930P5984M0201j0659Q411N6235
$$ y = [135715, 242462, 260898, 189256, 93342, 39881, 36477, 34135, -4615, -54611, -64723, -27016, 19788, 36761, 2667, -86982, -193324, -233300, -163066, -44968, 24733, 33212, 32882, 34526, 6065, -34389, -24247, 34072, 65143, 44733, 37675, 78152, 109195, 94363, 96120, 164134, 221158, 161703, 24734, -35454, 52373, 190385, 238674, 165070, 45929, -33577, -47315, -23379, -4433, -10287, -25676, -23130, 2941, 32740, 50857, 64036, 78817, 75687, 30830, -36298, -70214, -53895, -44110, -92909, -158081, -151535, -70389, -7234, -13651, -32116, -6330, 16697, -31024, -107370, -104601, -7986, 77012, 65932, -3166, -30646, 26475, 117722, 157054, 109550, 29818, 306, 23806, 17622, -60155, -134628, -118698, -42714, -2513, -13172, -4761, 51474]
38077E1474N5400K2603J6049K1848q261n3712n4135j2004J4819K281k2434l0580
38065C348q569M2899Q3717N5144l0791q3204o2739m1686o8954p0684J3545Q8777
38053g9197L9756n9870m2644P7641J10530j2179j21209o2874Q0770J26494L9852
38042I7070n9886p8342k5610M3819P9494M5722l7804q2284k9002N2352M4322m3935
38030E916p6432J0524J04705P8185k4379n6310J2212O3728K5906k6609j1797K4234
38018A29883k412o4129p0030j9027Q267q384q802K3586L0792l173j1827L4916
38006C9660O7110K7554l2454l6914o08R031k2411n5429o5815n6205k7690Q381
37994a45790J7511j2105l7605j9259J7352K2366M15Q86M2294Q5992Q2002K1054
$$ y = [51474, 106874, 129477, 145526, 167374, 159113, 105401, 51266, 39262, 54081, 56362, 33928, 3348, -5221, 37678, 121395, 176539, 145748, 62544, -195, -41881, -110835, -181519, -167974, -79197, -39441, -99311, -141955, -64314, 46216, 34037, -87172, -150046, -69276, 57218, 97070, 37184, -41158, -66768, -22949, 56545, 102267, 64463, -17821, -46823, 5529, 49851, 5916, -70516, -59992, 44713, 122898, 98519, 42209, 54421, 118149, 144055, 117446, 105649, 129883, 127471, 63342, -6688, -25715, -17448, -25832, -34634, -11048, 19744, 16571, 4744, 39660, 106770, 134324, 101870, 64956, 64348, 73379, 50968, -4461, -70276, -126481, -154171, -145790, -128279, -140384, -177989, -197248, -179896, -157530, -157115, -156229, -113935, -27943, 54059, 75113]
37982G5113n1177o8908j8239L2114J3968l7515l1759K9116M5574j1952m1123K5872
37970c8916R9417P0503j4109l2583J5074K2390l8418p9064m7256L087J7294J2391
37958a0190J0661p035l9782m0383J698K5877R31j4557K3092N1738O266n0525j6699
37945e8908O6445O2173l0962n4843N0210J24092L4939r2730o7304N1831M3555
37934A28498j04055j56775q907J43726J13642n694l4774R15k5612p9817l4592
37923f3445P2684Q2453j6418p3719l1524J4961K1947N4678J04051N4146r4668
37912A25146j62334n1805Q7358P6465m3727j06750n9984J2176L3368p37n1721
37901a42545n7564K1450J22197J18545n149j08627q6621j0417n78m9500o6710
$$ y = [75113, 23936, -44972, -63211, -31097, -17129, -54644, -86403, -57287, -11713, -23665, -64788, -38916, 60501, 131004, 116895, 84312, 99386, 121776, 83358, 4294, -42962, -39875, -22581, -10190, 471, -6564, -46346, -86729, -85031, -59154, -58223, -72780, -49688, 2050, 8316, -42209, -58908, 7537, 69710, 38748, -16095, 34115, 158207, 193146, 100416, 33112, 84943, 128498, 24443, -132332, -141239, 2487, 116129, 110435, 75661, 76576, 50964, -28853, -63445, 9239, 91692, 75274, 1555, -29969, -15008, 6939, 61617, 165668, 219814, 125146, -37188, -88993, -1635, 74830, 31103, -75647, -135631, -123455, -90087, -90824, -142545, -200109, -178659, -56462, 62083, 56934, -51693, -138314, -148731, -149309, -198809, -265519]
37890b65519k8877J6188M6311P5568J00391J04555Q9888N5575j2330r2466j21376
37879c2092p3577L191N8060P9931N7231j6599p7429l7577O7173R5291J0536n4561
37867G9578j2045M2519Q62p6116o9057Q077N3496L7389K65l9180o6917l4071N9095
37854a6105J08615M3015n3530o1387o61K5781r41k3883k8887l8326l4482K344
37842g8447K8964J4293J6948P9299J16875M3276o3008o6544L783P398o4480p5452
37830c7095J9912R5999N4649l6432o3480j9065K6581K9738l263m2732n0491j1423
37818c7102L0619J2473n7720r2095k5994R6254J56486Q3093o1212j27169m5477
37807f7844P5227P9216k3982p5914n314P3809M5565m5973r1575o9235j9313L8664
$$ y = [-265519, -294396, -278208, -231897, -156329, -55938, 48617, 138505, 194080, 181750, 89284, -32092, -105669, -102478, -44418, 35513, 92744, 76145, -1284, -38861, 28312, 123603, 134139, 79578, 67533, 110052, 110914, 34798, -34259, -26182, 27314, 64703, 64968, 25788, -41129, -75200, -16105, 92510, 135525, 81995, 20608, 19947, 45728, 44787, 20904, -7983, -46309, -80791, -78447, -49483, -35190, -18242, 61057, 177932, 221208, 158200, 91656, 95439, 102837, 38357, -37095, -17183, 78816, 133465, 97033, 33553, 14488, 41069, 70807, 67544, 24812, -25679, -37102, -6483, 5990, -51730, -143825, -169819, -73565, 82921, 166014, 104802, -22367, -67844, 7383, 86599, 62617, -13297, -18611, 55198, 100763, 54790, -36785, -106020, -125333, -86669]
37795h6669P9768N4228k0600m0057L0746P9670K2099n5694m1728J8826J9082k4089
37783C5582k4521R037Q345j6594j2760J425j2594j2433M2599P8923K1524n2702
37771F5831k8930M5994M4024k3351m0389L147J6603j1177j2459O027j5322m1198
37759H800O066P2011L7434n7670n8473L8610P2998p278o7930k5985L2905L4583
37747H6071L0497N9441O0789L555m3083l8375l3291m6347j7677N2467O5629m376
37735A75300m6649K355M9652J0204n1643m4860K644K5044L9205P7780R5816N3236
37723C88084J1168L8598Q8940P2985L55n0419n8616o3234p0589m9771n334K0296
37711C22463J2264m126j1006j3681j2018P903M7880Q0060O4555m903o9848n2680
$$ y = [-86669, -6901, 47327, 26727, -13330, 17416, 97086, 119185, 63491, 21763, 40589, 59671, 35582, 11061, 20098, 28443, 11849, -911, 514, -12080, -24513, 18086, 97009, 118533, 65831, 36901, 82895, 126919, 103568, 63179, 66326, 82929, 71752, 59293, 65320, 49998, 8800, 14866, 86877, 124311, 66641, 8168, 46778, 119776, 112498, 44568, 18583, 51488, 86071, 116568, 176009, 236798, 240353, 197270, 158895, 125604, 79257, 61580, 114047, 179676, 175300, 128651, 131006, 180658, 190862, 139219, 94359, 97003, 122047, 161252, 239032, 334848, 388084, 399252, 437850, 526790, 599775, 600130, 549711, 491095, 427861, 357272, 307501, 302167, 322463, 334727, 330601, 319595, 305914, 293896, 301799, 349679, 429739, 494294, 489391, 419543, 366863]
37699C66863M1480J07190O7689j7557l5349K7631Q7752Q8511L5860o1458j84443
37688E24169k51781j88089n0675J8245j9887o3489m1256o325k0526n0786m3177
37677a93577j7198j6769k5796M7N1307O9858K4510m7460p1055p162R1692J19722
37665b1881L9799o2740q6987l8767N773J4070N221j2983l2354q153P1618J15520
37653a1864L5988r3989j10485J4823J31448J09591j6826j25816j36341m4378Q5676
37642a62173J47461Q6192k1933n2851M605M9402K4725j8388k3026k702O721L76
37630C8409r784r390J8390N7815M7836l2185r6632n5813M3544P2231m873r6487
37618b6939j15196n5844L6741R6310O0926m4108q9625m431R8331P2765l6722o7437
$$ y = [366863, 408343, 515533, 583222, 565665, 530316, 557947, 645699, 734210, 770070, 708612, 524169, 272388, 84299, 33624, 51869, 31982, -31507, -72763, -79088, -99614, -150400, -193577, -210775, -227544, -253340, -253293, -201986, -132128, -107618, -155078, -226133, -233295, -141603, -21881, 17918, -44822, -131809, -170576, -164803, -150733, -145512, -158495, -190849, -199002, -127384, -11864, 24124, -69865, -180350, -165527, -34079, 75512, 58686, -67130, -203471, -247849, -162173, -14712, 71480, 49547, -3304, 1301, 50703, 75428, 57040, 34014, 31312, 38033, 38409, 28625, 19235, 37625, 95440, 143276, 111091, 14459, -41354, 2190, 74421, 69548, -26939, -142135, -197979, -161238, -64928, -4002, -48110, -137735, -142166, -43835, 28930, -7792, -75229]
37606g5229P115N9333L0259n73J6774K6225n388k4820l727Q135j5573l1382j8130
37593b6981j4061k8929j5166M1916R1422R8146P9266N0176J0634j6864j2997j2284
37581B44278m6740o8910k6421K4859m100q1831j02281n4200j4457m61L1304O1416
37569c7544K7086m5231o4492k2190J3192K4858M0238L3900j7949l4422N5528J46924
37557A19898R1061n2616r9361l4700n534m2324l0867M0765N3511n453j8284K4295
37545D0391M051p1776n5530N3675P4680l1503p4001L0705J02481J2168r8064o8842
37533h1565K2799L5326l166n384l092m6341o6661P99P8786O9491O361k8212k7456
37520d8315j0240L4977P6872L9124o0017j01920n4261r838m23M0149Q5477J5764
$$ y = [-75229, -68114, -8781, 21478, 20905, 37679, 63904, 58516, 33696, 29969, 38104, 22531, -8851, -26981, -41042, -69971, -85137, -43221, 48201, 146347, 225613, 275789, 286423, 269559, 256562, 244278, 197538, 128628, 102207, 127066, 122966, 41135, -61146, -115346, -129803, -130264, -98960, -37544, -10458, -55689, -120181, -142371, -129179, -104321, -64083, -30183, -48132, -82554, -27026, 119898, 210959, 158343, 58982, 24282, 18748, -23576, -54443, -13678, 39833, 34380, 16096, 40391, 44442, -27334, -82864, -29189, 45491, 13988, -60013, -29308, 73173, 85341, -12723, -81565, -58766, -23440, -26606, -31990, -35082, -81423, -148084, -147285, -68499, 992, 7353, -20859, -48315, -58555, -23578, 53294, 92418, 32401, -69519, -123780, -133618, -134041, -93892, -8415, 7349]
37508G349j24873j20523O3776J77743P0023p7417o4248K4827K6842j5945K728
37497b9718K6191k6625o8542q460N3382Q374m2760K2943J01407L6217r3401j02302
37485a23294m637M6778K8631K5720K8051k7669q6730n4875J9241K9337R10J2129
37473a06408J9553m3001r0065j7358Q5053P1241R43K7758J04695N8399q9478j38373
37461a17041l8495M3629J0848l8858j5918K8182L1149K3306M0323N4551M0403
37450F2079J5941m452k3526k8120j0494k415k5539m6310l6176j6560P017O4146
37438d4409J15461N5122r9755j67090n9414O7560O1868O439L2405O7304j2197
37427B3294j15519p5209N0395O7836k4853n7175Q041L9265m464j7068L7567O5755
$$ y = [7349, -117524, -238047, -174271, 3472, 73495, -3922, -68170, -43343, -16501, -32446, -29718, -3527, -30152, -98694, -107154, -53772, -45398, -88158, -65215, 36192, 72409, -20992, -123294, -127931, -81153, -52522, -26802, 1249, -26420, -113150, -168025, -148784, -119447, -118537, -106408, -86855, -129856, -219921, -237279, -152226, -80985, -80042, -52284, 52411, 110810, 21332, -117041, -155536, -111907, -101059, -139917, -155835, -127653, -96504, -73198, -32875, 21676, 62079, 78020, 73568, 50042, 21922, 11428, 9013, -16526, -62836, -99012, -115572, -108555, -44409, 71052, 126174, 26419, -140671, -200085, -132525, -70657, -64218, -31813, 35491, 23294, -92225, -167434, -117039, -49203, -74056, -131231, -123190, -83925, -88389, -105457, -67890, -2135]
37415b135K8417n02J3579J8830l51l094M02l5096p2107l4220M2199M6369k5710
37402b3419p0736m7867j1615J0211L7207N2296K3575j4319j5725j4327m1817l1632
37390a48168N6629J06817J2476j12059q5405M6888Q8271Q242m4375j2305J8718
37379f4271K6873Q1375J55893J37382M1271J0903Q3971J59150K00585K58385K76219
37368A367736J21867j46540k85510k09058j02485j12534j48089r7188k8778l7110
37358C22311o3344k5692J5370k5150q7696o6686N161J1755n9490j07606p0029
37347a51096Q098M9343L1578J980K2371Q7968J14440M4997n7505r0427n3488k5851
37335a7592k7719r232L4502M9424K7157J6346K0296j1345p3669r1917l9310K1367
$$ y = [-2135, 26282, 25780, 39359, 58189, 57838, 54744, 55146, 20050, -52057, -86277, -44078, 2291, -23419, -94155, -142022, -153637, -143426, -106219, -53923, -30348, -44667, -60392, -74719, -116536, -148168, -91539, 15278, 27754, -84305, -169710, -122822, -34551, -26309, -70684, -82989, -64271, -37398, 43977, 199870, 337252, 378523, 389426, 473397, 632547, 833132, 1091517, 1367736, 1489603, 1343063, 1057553, 848495, 746010, 633476, 485387, 388199, 359421, 322311, 258967, 233275, 248645, 223495, 135799, 69113, 74274, 86029, 26539, -81067, -151096, -142998, -93655, -62077, -60097, -37726, 50242, 164682, 209679, 152174, 61747, 8259, -17592, -45311, -54543, -20041, 29383, 56540, 72886, 93182, 81837, 8168, -83749, -123059, -101692]
37323a01692L6864K2575M403k0848m7531n0161k6287r30J1054O622j7299l4556
37311b17786N704R1788J27176O1992k3741m5251l7342n8775o6369o776N4287L5312
37299g9781o958K1958P2979L8562m3493m8887J7013M2409J4097J7720N5827M5394
37287A46840j3753l8060j8333j7639k8889J787L3998j0368p4209l4365P4164R6741
37275A17914J2352m9497m1388m2761o6929l5550L4451L0416l9490m0243M2448
37264g8277O4002j9660p1592j8918L4184J6924O762M3405L4706m4138n8943M7952
37252d3593J20146L4873q2268o0638L9462M2282n2189q5717k227Q2179O6395j0528
37240D8177n2373k7964J6358K3849j1362m3617l6573o570J6284L4879N0335K8222
$$ y = [-101692, -64828, -42253, -37850, -58698, -106229, -156390, -182677, -183607, -172553, -165931, -183230, -217786, -212082, -120294, 6882, 68874, 45133, -118, -37460, -96235, -162604, -169380, -115093, -79781, -86739, -64781, 8198, 46760, 3267, -45620, -28607, 13802, 27899, 45619, 101446, 146840, 133087, 95027, 76694, 59055, 30166, 31953, 65951, 55583, -18626, -52991, 21173, 117914, 130266, 80769, 39381, -3380, -70309, -105859, -71408, -40992, -80482, -120725, -78277, -14275, -33935, -105527, -124445, -90261, -73337, -66575, -23170, 11536, -32602, -91545, -43593, 76553, 111426, 29158, -31480, 7982, 50264, -1925, -87642, -89869, -7690, 58705, 48177, -4196, -32160, -15802, 8047, -3315, -46932, -83505, -90075, -73791, -38912, 11423, 39645]
37228C9645l5282o6666j8998L5530K0009n915M7814J16095O6390o5637j13476
37217A9509m2879J3500l658k281N7119P1270j6633j01419p9448K952M7621M0511
37205F164J6668j2693l4182j7026K8634N2979M8005M5905L4533k2037q0178n5986
37193A0786K5036M6695j4613n7513k7228J4493J9477K1264L7569K9473m129p058
37181I4252K4709K3981k8164o9273o4469m7139l7541k1209j0578k6159k7196K9436
37169a59350Q3567M7094m2341p4321l9173q512J3927O3502Q5234J3567o2656j2862
37157i2324R7506R7111N98k7479K5075J5503n8800m7471M4646L3044j02727j49126
37145a64444k4739P6030K7953k0166N8595J32288N7191o3081o5371R410L0735
$$ y = [39645, 4363, -62303, -81301, -45771, -25762, -31677, 16137, 132232, 198622, 132985, 19509, -23370, -9870, -13528, -15809, 41310, 112580, 95947, -5472, -84920, -81968, -34347, 6164, 22832, 10139, -24043, -41069, -12435, 40544, 88549, 134454, 168987, 146950, 66772, 10786, 35822, 82517, 67904, 10391, -16837, -2344, 17133, 38397, 75966, 105439, 101310, 94252, 118961, 142942, 114778, 45505, -18964, -66103, -103644, -124853, -135431, -161590, -188786, -159350, -75783, -28689, -71030, -145351, -184524, -193036, -179109, -115607, -30373, -16806, -79462, -92324, 5182, 102293, 102891, 75412, 100487, 115990, 57190, 9719, 54365, 87409, -15318, -164444, -189183, -113153, -85200, -105366, -46771, 85517, 142708, 79627, 14256, 23666, 54401]
37134E4401P96j1213j8628m6705m3202Q140K2105k4180j9934O9733J02208R97
37122I4518q7393l9872K7487k2853r3158k7651J01233J16015L0816o924J4299
37111A06517j0747p3273o3936R196K4003l5749n0513K6620R4125O9145k222m2899
37099E0267m7876m5710l5945j0078J2822Q412j5272k4541m625J1680j6997o4455
37087a82318m7014N0965J21094P3599k2302m0958R790K5971q410k0241l048j7071
37075e9943m7573k5621J7334j2452q0331n6134N2338R4977L2751q548K2682K2737
37063d7783m8981q1158k2156J8997k3395n5146q929L2892O917j1735L3739O9629
37051a37109M5310M1619J14064J74216J36194M7961j5629n5191o4420L868J09683
$$ y = [54401, 55197, 43984, 25356, -21349, -64551, -56411, -34306, -58486, -78420, -8687, 93521, 94518, 7125, -32747, -5260, -28113, -121271, -148922, -47689, 68326, 99142, 92218, 106517, 95770, 22497, -41439, -32243, -8240, -43989, -94502, -67882, 26243, 95388, 93166, 50267, 2391, -43319, -79264, -89342, -76520, -68108, -83380, -107921, -112546, -100866, -117863, -182318, -229332, -178367, -57273, 16326, -5976, -46934, -37144, -11173, -19583, -39824, -42872, -59943, -107516, -133137, -115803, -128255, -208586, -264720, -212382, -117405, -84654, -93202, -70520, -47783, -96764, -177922, -200078, -181081, -204476, -259622, -268551, -235659, -228742, -240477, -206738, -137109, -91799, -50180, 63884, 238100, 374294, 422255, 406626, 351435, 287015, 290883, 400566]
37040D00566J21201K0020m9039j0867L0995J567j6894L3886O3196N819m9448k4529
37028E26473J5370N469j281L5899O0620N8327J04804J84296J53828p544j18186
37017A018075p7094j7527n5349j05908r0056r1157j46923j20714L3769J12916
37007D60032j8385j69278j19800K7900N0774k5158l0812K0983K91o3413m3417
36996H9717L1075L7753J140K7186P0531J1526r3494q5066J3521K4931p7701j22396
36984g1277j6538J19249J37129L8823o7862q8279o929R2082R1292j4281r2303
36973A21106n4002K4279L5245k727j5719l166K412J2087K4832p234p3991p9882
36961a6760l703M3915J0738N11P4023J14382K5692q7151q9894l1568k6726n0778
$$ y = [400566, 521767, 541787, 492748, 481881, 512876, 514443, 497549, 531435, 594631, 600450, 551002, 526473, 541843, 547312, 546031, 581930, 642550, 700877, 805681, 989977, 1143805, 1136261, 1018075, 940981, 923454, 868105, 762197, 672141, 580984, 434061, 313347, 347116, 460032, 441647, 272369, 152569, 180469, 231243, 206085, 175273, 196256, 196547, 133134, 89717, 120792, 158545, 159685, 186871, 257402, 268928, 175434, 90368, 103889, 128820, 51119, -71277, -87815, 31434, 168563, 207386, 139524, 51245, 44316, 136398, 227690, 213409, 121106, 67104, 91383, 126628, 123901, 108182, 105016, 107428, 119515, 144347, 137113, 63122, -16760, -20463, 23452, 34190, 34701, 108724, 223106, 248798, 161647, 71753, 40185, 13459, -37319]
36949c7319j7057M8136O4021L9348K4558R953j6952j5200J3281m765o0293l5081
36937A2630P7835J10176r059j15277q1750k2971n7054p6648L7132J62008J25274
36926A62296p244n8220k1789n957j5439L964J8354j0263j1148N5473Q3701J2237
36914B05965l2077M1081R5792N195j05125p1131K6899L0001j9357n389J8117l5281
36902A54690o8173J8460Q9999J445j06874l5797J03635P1858p8356j03614O536
36891E3809N3668Q370K1108R7526R5288K5123L6584J09055O5373r4303j66410
36880C05191q0768P851J800j7245P505J0985l3345n1092j2130J9646N135l1120
36868A32413o7599p6061m242J10003J09114n1454j70969q5306O6122P3850J921
$$ y = [-37319, -54376, -6240, 57781, 97129, 121687, 131640, 114688, 99488, 112769, 108004, 47711, 12630, 90465, 200641, 191582, 76305, -5445, -28416, -85470, -162118, -124986, 37022, 162296, 155052, 96832, 75043, 69086, 53647, 57611, 75965, 65702, 54554, 110027, 193728, 205965, 173888, 214969, 310761, 315956, 210831, 139700, 166599, 196600, 177243, 171854, 189971, 154690, 86517, 104977, 194976, 196421, 89547, 53750, 157385, 229243, 150887, 47273, 53809, 107477, 115847, 136955, 234481, 329769, 354892, 391476, 500531, 565904, 471601, 305191, 224423, 232274, 234074, 216829, 224334, 235319, 201974, 150882, 138752, 158398, 163533, 132413, 64814, -11247, -15489, 94514, 203628, 152174, -18795, -104101, -37979, 35871, 37792]
36857C7792K9606R4057J0688j48585j40457L0869J13563K0657p0400m7837l474
36846g3521n918p95K1238n840n2607j3772P9514Q1799j4886o1460k086N6123M2893
36833E0682J1234R750K6884N6318P9833L0786q6422j28549k5689O0216j3709j04361
36821c3027j5064J43394J23006l7462q7263O162M1650l3093o2033n650J16o4273
36809b3537n6541M1746P9387J8691n510M7336N7814p814l5376Q298J9640k9337
36797A14797m8201k5881m8390r8432o1285N1839J06609P9434O7382P0470J269
36786B09611r3145o9473M4460P1141j5310n8213l912L1501J232j2073M293k4602
36774H5510o4917n611J01966Q9855k7851o5399P232K3619n7826p6339K4932Q9324
$$ y = [37792, 67398, 161455, 172143, 23558, -116899, -86030, 27533, 48190, -22210, -70047, -73521, -79439, -80234, -58996, -64836, -117443, -131215, -51701, 30098, 15212, -46248, -48334, 7789, 50682, 61916, 71666, 98550, 154868, 234701, 265487, 179065, 50516, 24827, 85043, 71334, -33027, -48091, 95303, 218309, 180847, 93584, 99746, 141396, 108303, 46270, 40620, 40736, -23537, -80078, -38332, 41055, 59746, 54236, 101572, 159386, 151572, 116196, 124494, 144134, 114797, 66596, 40715, -7675, -106107, -167392, -115553, -8944, 70490, 137872, 208342, 209611, 116466, 46993, 91453, 162594, 147284, 89071, 85159, 116660, 117892, 105819, 110112, 85510, 20593, 14982, 116948, 206803, 178952, 113553, 120785, 144404, 86578, 10239, 35171, 124495]
36762A24495K8710l5990j1269K0751j0893l6755k771K3440r904m7353l9993j8344
36750a5876j1886j4357l4556o5649l7751O9075J31546N6357m3323k4406M2768
36739E1942K1389k3061M0987J18891L0682j40232j53900j2257O4662J7716j3066
36728C753N107k5341p2580j3955Q3250M1307q5620p8462N2054P9763l0534p9924
36716a21182j0115K6692p182J3870P8766L9072o6258m0083R0195Q6220o4768j06398
36704h1171L1800J17391L9014k5845K6631N2800k9310q6753m4708q498j9427J2003
36692a6073O2773K640j06853n9912R9414J02429o4983j08957N7653J62472O0283
36681A90886m2107l974J1424r6830j47554l1140P0603K5510k1454L8859O7876
$$ y = [124495, 153205, 117215, 105946, 126697, 115804, 79049, 76278, 99718, 89814, 42461, 2468, -15876, -27762, -42119, -76675, -142324, -180075, -111000, 20546, 76903, 33580, 9174, 51942, 73331, 50270, 91257, 210148, 240830, 100598, -53302, -65559, -897, 16819, 3753, 8860, -16481, -89061, -103016, -19766, 21541, -64079, -142541, -90487, -10724, -41258, -121182, -131297, -104605, -111787, -97917, -19151, 19921, -46337, -86420, 3775, 89995, 25227, -81171, -49371, 68020, 107034, 81189, 107820, 160620, 131310, 44557, -151, -8649, -28076, -16073, 46700, 49340, -57513, -117425, -18011, 84418, 19435, -89522, -31869, 130603, 190886, 148779, 144805, 156229, 59399, -88155, -119295, -48692, -23182, -44636, -5777, 62099]
36670F2099j8792o0687L1603Q4657p899p4051Q655Q0216R752n8898K419N8385
36658A17459j5494q3941j3170P3027L2084l8004m462N3285J6804n1376n3235k9781
36646C196k7619R789P7336N1951o7408r6447K8007J21755O1365l3816n1640n4034
36634B2435p1062q955J08156R7780m7036r1093L6595R9927k0441j07968j2629
36623E709P3000k3742j39055p9119M5267N6039K0067O2893J06627M5444l1133
36612A41997j9297K033l9096l8774O2651J15827J8297q5506n5432J2800m807m2373
36600F8320j6522L423k9276j7568O4149P1327l7132p9930K9437J10308L0774p1010
36588A26300n9214k5524n8177n3209N3432J22049O0360j1520q223k5786r2632
$$ y = [62099, 43307, -17380, 14223, 98880, 90981, 16930, 25585, 105801, 115553, 56655, 59074, 117459, 101965, 18024, 4854, 77881, 109965, 71961, 67499, 120784, 137588, 86212, 32977, 3196, -24423, -14634, 62702, 114653, 47245, -49202, -21195, 100560, 161925, 128109, 76469, 22435, -48627, -57582, 50574, 148354, 101318, 10225, 46820, 146747, 126306, 18338, 5709, 78709, 54967, -84088, -163207, -117940, -61901, -41834, 21059, 127686, 173130, 141997, 122700, 124733, 85637, 46863, 109514, 225341, 243638, 158132, 102700, 115500, 110693, 68320, 51798, 55221, 25945, 8377, 72526, 143853, 106721, 26791, 56228, 166536, 197310, 126300, 67086, 41562, -16615, -69824, -16392, 105657, 166017, 154497, 146274, 120488, 27856]
36577B7856o5825O9699J08319r022o3085L9475Q3594m0080j09109J5604J18540
36566A75966K9223o6567Q306R4230K3357n9849p994K7605q2398j45348K477J52399
36554A51407P4861p3057m2348P3975N6881l4535k7268K0080k5287p5966q441O2661
36542A52963q43q0370k8889L9282j8749p8490J2127J20214O4046n2169m4715J8394
36530A02801o528m2312K7501Q7994N927q8575l1605O3175J8496p8394n5066L0520
36518C3934L9472K5881Q3256J11430J1093q2953k9065N9363L5395j1121L6857
36507C13542O8133l2588j26718o2086M3131K4680l4580J453N2305M472n0050o576
36495A95118L8397m899l1485K4874L0989o3902p8743N1139J01253l3064j08037
$$ y = [27856, -37969, 31730, 140049, 131027, 67942, 107417, 191011, 150931, 41822, 57426, 175966, 205189, 138622, 146928, 241158, 264515, 204666, 196672, 224277, 141879, -3469, -992, 151407, 226268, 153211, 110863, 184838, 241719, 207184, 179916, 199996, 174709, 98743, 90302, 152963, 152120, 71750, 42861, 82143, 63394, -15096, -2969, 117245, 181291, 129122, 84407, 102801, 96273, 53961, 81462, 169456, 175383, 86808, 55203, 118378, 136874, 58480, 3414, 33934, 73406, 99287, 182543, 293973, 305066, 222113, 193048, 252411, 287806, 276685, 313542, 381675, 349087, 222369, 160283, 203414, 228094, 193514, 194967, 247272, 251744, 201694, 195118, 233515, 228616, 197131, 222005, 252994, 189092, 110349, 161488, 262741, 229677, 121640]
36484A21640K6378J29894J6618q6039L5485J67347N9281j17437r7689J2487m614
36473B63351n8174J5163Q6766k60q6284L203R7559Q44j22565o1257M7389J5465
36461B01200j9754Q8680J39870l9608j99555q5898P7589r576j70909r1091J02188
36450f864J02153j6536j0528L2260q0306j80121k5048J93098J47287m7375o6762
36439D1258M1569K3483o4628k0729M6226n6787j53019J345J93579Q6241j49982
36428a1444j11776J27427J75587K2391j5707Q0439N2544q6685q8477K1454l560
36417A62193j35117j26124J0509N1801L101L0841P0674m1305j73569r4033P6692
36406a64337O4174n9867m1630N6386O455r7810p812J72514J46612l6968r1953
$$ y = [121640, 148018, 277912, 294530, 208491, 243976, 411323, 470604, 353167, 255478, 267965, 263351, 205177, 220340, 307106, 306846, 220562, 223765, 321324, 322168, 199603, 138346, 185735, 201200, 181446, 270126, 409996, 370388, 170833, 84935, 162524, 152948, -17961, -109052, -6864, 95289, 78753, 68225, 100485, 20179, -159942, -184990, 8108, 155395, 108020, 41258, 82827, 106310, 41682, 20953, 67179, 10392, -142627, -141282, 52297, 138538, -11444, -123220, 4207, 179794, 202185, 186478, 266917, 319461, 232776, 144299, 165753, 162193, 27076, -99048, -88539, -36738, -33637, -2796, 67878, 26573, -146996, -241029, -164337, -100163, -160030, -201660, -145274, -138819, -236629, -244441, -71927, 74685, 37717, -54236]
36395e4236j0813n117o5123l3859K5374k8601p8940J9875R4712l1821j42786n981
36383c17316J45714K0202j64896p6249R6570P597j57733k8732K06794J20285j42174
36372b89938j07527J57280J83870l8121r4758N9175P5679q3311j18155j2660j8472
36361b86938q8175K4302J86903P3090j76835j50316Q4127J06567p2813p4420R3772
36350b80736P1894j13307p9058J67625K31821P0419L1820J61180J51868j2047
36340D01479l5922P3427L3341j08613n4719J09569M1352j64433j09921J37424
36330C22984J40437r2902j35873M8386P9015p9197q1582P4367M9588j19054o4341
36319A41828J55282J22777j19443j19090J11859J00533j74535k20605M5044J52728
$$ y = [-54236, -65049, -70166, -135289, -169148, -143774, -172375, -251315, -231440, -136728, -168549, -311335, -317316, -171602, -151400, -316296, -392545, -295975, -288378, -446111, -474843, -268049, -147764, -289938, -397465, -240185, -56315, -94436, -189194, -130019, -54340, -137651, -255806, -268466, -286938, -375113, -350811, -163908, -90818, -267653, -417969, -333842, -227275, -300088, -374508, -280736, -208842, -322149, -401207, -233582, -1761, 68658, 100478, 261658, 413526, 401479, 365557, 438984, 472325, 363712, 308993, 418562, 459914, 295481, 185560, 322984, 463421, 370519, 234646, 283032, 362047, 282850, 201268, 275635, 325223, 206169, 141828, 297110, 419887, 300444, 181354, 293213, 393746, 219211, -1394, 43650, 196378]
36309A96378k9573r7001O8433R6582r1709j08850J18794J73922n9223j75112o895
36298H5746J15295L7314P997Q5109J5918j60133r6184J62378J79022p6428j63662
36287A92372R857O3902p6264o0443J29305J01557j49382j75095P7067J53556m2167
36276B24265r6226P7826Q5278j24753j30543J10550J39741j07511j53093R5863
36266A21397J54408j00794j88823M8592J61858j6758p6134J18541J47241j09832
36256B59696k00961K5019J24031p7127j61944M0520J39312j4038m1467J59959
36246B53000J74826r0613j73766N5532J27476j17827k16293K4193J74396L4602
36236B45526k1478J45335J46538j19113k14239j5045M6290j41252j37402J39694
$$ y = [196378, 166805, 69804, 138237, 234819, 143110, 34260, 153054, 326976, 267753, 92641, 85746, 201041, 238355, 246352, 331461, 347379, 187246, 91062, 253440, 432462, 356034, 192372, 202229, 266131, 189867, 129424, 258729, 360286, 210904, 35809, 112876, 266432, 224265, 128039, 205865, 291143, 166390, 35847, 146397, 286138, 178627, 25534, 121397, 275805, 175011, -13812, 34780, 196638, 179880, 103746, 222287, 369528, 259696, 58735, 83754, 207785, 130658, -31286, 9234, 148546, 134508, 93041, 253000, 427826, 337213, 163447, 218979, 346455, 228628, 12335, 36528, 210924, 245526, 224048, 369383, 515921, 396808, 182569, 167524, 213814, 72562, -64840, 74854]
36226G4854J95402p6232j52598J08664J87656p3850j57014J05600J91655p8506
36216C25631j84661N8451J32056j45348k40490L8273J48912j11181j92599J17354
36206e3602K53398l1656j91192L4595J32111j19630j82446J45782K64235p9897
36196A71698k67562K4009K23705o831j48776R6155K05878q8155k26023P2436K24152
36185B80686p4376k30643Q0391K56642o0178k71543K3213K61267K1182j88695
36175I7946K9267J96251m5652k15774J6824J64793p3171j87037J01666K42542
36165C27655m6885j87375J11968K44650r8854k92160Q750J98003o2616j81197
36155B1939J34802K47839j20694k68183J15360K88528r9372k91272R4211K91791
$$ y = [74854, 270256, 194024, 41426, 150090, 337746, 263896, 106882, 212482, 404137, 325631, 140970, 199421, 331477, 186129, -54361, -16088, 132824, 21643, -170956, -53602, 199796, 168140, -23052, 11543, 143654, 24024, -158422, -12640, 251595, 171698, -95864, -71855, 151850, 145019, -3757, 92398, 298276, 210121, -15902, 56534, 280686, 206310, -24333, 56058, 312700, 252522, -19021, 4192, 265459, 286641, 97946, 127213, 323464, 277812, 62038, 78862, 243655, 170484, -16553, 85113, 327655, 280770, 93395, 205363, 450013, 351159, 58999, 67749, 265752, 203136, 21939, 156741, 404580, 283886, 15703, 131063, 419591, 320219, 28947, 123158, 414949]
36145D14949r7878k93969J16846L21489j27550l88278M4693L33635p2611l57924
36135a06598N0546L52948l3959l21303P1444L48597o7971l54723Q6555M05158
36125D30694m1635m02829R162L78498J3359l05281O6211L21982j37451m19368
36115h6658J01280M58776m1703m13915Q5727M60964n5906m31894J41280N90836
36105H08787O0931l15360M02007R95008K93868n95259l47388J93497j76544o85237
36095F34310k52261L12908j8809m12219P6880M97574p5710n40155J05606O44094
36085I72218n7159p28566q6148O36757O8414o13719k2579O68612O1476o46122
36075B53184l7254O52029o119o94761N7781Q32815N9336p78655r715Q35818J2550
$$ y = [414949, 317071, 23102, 139948, 461437, 333887, -54391, -9698, 323937, 251326, -106598, -56052, 296896, 262937, -58366, 13078, 361675, 293704, -61019, 25536, 430694, 389059, -13770, -4608, 373890, 387249, 81968, 148179, 470161, 332710, -86658, 14622, 473398, 431695, 17780, 103507, 564471, 508565, 76671, 217951, 808787, 869718, 554358, 956365, 1951373, 2245241, 1649982, 1302594, 1496091, 1319547, 634310, 382049, 694957, 676148, 263929, 340809, 838383, 762673, 222518, 328124, 972218, 915059, 186493, 100345, 737102, 805516, 191797, 169218, 837830, 899306, 253184, 215930, 867959, 861840, 167079, 224860, 1057675, 1117011, 338356, 328641, 1164459, 1177009]
36064A177009q67279M0761J030483J20727r16801K2854J091841O7884j082779
36055F84700K3726J301137J76994j142695J10217J569752K17793j403477M3167
36046A581314J868607M11868j453120K92251K512333P36882j546097P86986L935503
36037I126527K033702p40750K340441O591024M472215K178055R190211J7173458
36029E2364883J3608763J3241064M3478588R1503193J01173614M3512723l7431398
36022C21451430p6179633o2812627l8618663l0906302k8613557j8482432q883957
36015E6954259q920280j0987795o821935k097170l526492o099417l681322l40361
36007A4479487j455041l543848j819518O70846l80737k255523j028418Q58462
$$ y = [1177009, 309730, 350491, 1380974, 1501701, 584900, 607754, 1699595, 1767479, 684700, 708426, 2009563, 2186557, 1043862, 1154079, 2723831, 2941624, 1538147, 1581314, 3449921, 3861789, 2408669, 2700920, 5213253, 5950135, 4404038, 5191024, 9126527, 11160229, 10419479, 12759920, 19350944, 23823159, 26001214, 35191425, 52364883, 65973646, 79214710, 122693298, 214196491, 315370105, 358882828, 321451430, 245271797, 182459170, 143840507, 112934205, 84320648, 65838216, 56954259, 48033979, 37046184, 30224249, 28127079, 24600587, 18501170, 14819848, 14479487, 13024446, 9480598, 7661080, 8331926, 7951189, 5695666, 4667248, 5525710]
35999E525710j65261j814570p38097R51626P0710j461350o19384Q82034K07819
35990B839237j092965l87195Q72419K03105j026636m44511O95979J68881q43334
35981I84980k54011P71939K20845p81751k76361O70425J60418p87893l14829O31668
35971A025430K34127o53957k94961N37278K15362n22563j61144N38601J18551
35962A036724o26317k25901N54747K40341m85136k09134M33774J26770m73739
35953C72129j01064N52399K35259l16263J79255R36704N18162m39949m59039N8049
35943A535642j53603o60996k95009M15372K26500l97865k16342L94728K78100
35934A126527k10050j1199M39025P3995o04684m11428K47696J63980l78793k52735
$$ y = [5525710, 5360449, 3545879, 2807782, 3759408, 3830118, 2368768, 1749384, 2631418, 2839237, 1746272, 1359077, 2231496, 2434601, 1407965, 963454, 1659433, 1828314, 984980, 730969, 1502908, 1723753, 942002, 665641, 1336066, 1496484, 708591, 393762, 1025430, 1259557, 605600, 310639, 847917, 1063279, 540716, 379572, 918173, 1036724, 410407, 184506, 739253, 979594, 494458, 285324, 719098, 845868, 372129, 271065, 823464, 1058723, 742460, 921715, 1858419, 2376581, 1936632, 1477593, 1535642, 1382039, 721043, 426034, 841406, 1067906, 670041, 453699, 848427, 1126527, 916477, 905278, 1344303, 1418298, 813614, 402186, 649882, 813862, 435069, 182334]
35924A82334K92907J90906l19012k09642K86619J74498l19349k24543K42604J43868
35914D41190k96895j52266L49398K60462k41128k28605J80678J41360k27142j45836
35904H1216K33137J67083j60527l6261L16559K09455o5343J87107N61268K17107
35894A710801m56636m60265J3742K0775l46517k56918J73040J42018k24510j43085
35884A72445K47331J58799k67739k19734K01802J91820j90517j77221J86981J67656
35874D71623j91503j80176J58398J39911j82086j42732J82356J26460k19590j71036
35864h375J86749J53488k05582j84409J81263J96457j32807j47404J48454J30691
35854C18525j66453j19284K07455J51085k31556k31292J54676K15749j19223j91349
$$ y = [182334, 475241, 666147, 347135, 137493, 424112, 598610, 279261, 54718, 297322, 441190, 144295, -7971, 341427, 601889, 360761, 132156, 312834, 454194, 227052, 81216, 314353, 481436, 320909, 284648, 601207, 810662, 745319, 932426, 1493694, 1710801, 1254165, 793900, 807642, 828417, 481900, 224982, 398022, 540040, 315530, 172445, 419776, 578575, 310836, 91102, 292904, 484724, 294207, 116986, 303967, 471623, 280120, 99944, 258342, 398253, 216167, 73435, 255791, 382251, 162661, -8375, 178374, 331862, 126280, -58129, 123134, 319591, 186784, 39380, 187834, 318525, 152072, 32788, 240243, 391328, 159772, -71520, 83156, 298905, 179682, -11667]
35844a1667R6006J42738j31625j55030J32550J63813j14491j34143J63607K11644
35834C63402o7663j27039J21573J59842r3630j39417R8469J45067n5135m5710
35824C59759J82587J45031j42107j24438K32899L38258L8717j65045q0981o9910
35814G14770k19919j82860O4384J59908J07013K26035L70795J04781l65926l97466
35804E81515l5287N6835k02570k24212R0753J75978q8439j54634J13809J78459
35794D92207j17559k29674O2511K53424N5621j31719k7239P2001m3988j19707
35784B65878j4245L1152n5842k3759J27913Q6852j25442j30585Q0369J07879q5808
35773B64362j09458P5465P9672j18594j02784J47246J66093j13665k09395J5057
$$ y = [-11667, 84339, 227077, 95452, -59578, 72972, 236785, 122294, -11849, 151758, 363402, 295739, 168700, 290273, 450115, 356485, 217068, 315537, 460604, 405469, 359759, 542346, 687377, 545270, 420832, 653731, 991989, 1030706, 865661, 784680, 714770, 494851, 311991, 376375, 536283, 643296, 869331, 1240126, 1344907, 978981, 581515, 546228, 603063, 400493, 176281, 267034, 443012, 354573, 199939, 313748, 492207, 374648, 144974, 207485, 460909, 516530, 384811, 357572, 429573, 385585, 265878, 251633, 282785, 226943, 203184, 331097, 417949, 292507, 161922, 242291, 350170, 264362, 154904, 230369, 310041, 191447, 88663, 235909, 402002, 288337, 78942, 93999]
35763I3999J18222o2844j33997O1651J58879J2652l6730J25001J53949m4063j09974
35752C36745M2863M2941j74595j77947J32196K64164kk16529p7109J07126N4018
35741C33871k3615N5290P2622q8442j56145n46R8367o747o3241N3996R7290l2179
35729C40521p0143P3101J15358l6299q8155N9387J03472o6298j36926L0470J35231
35718D59719P844j00566l0079K2479l5353k033J44200J26666p9819j34644M4753
35707D23167J15786m4145j20850L575J6758j86929k53490k7484J37849K4583p8135
35696A0685M1065J24996k2752j50585m6748P6910K1527m2551L1050O5700m6226
35685F3071r2302L6478J04626j8345j00549L178P9190j7036r4092l0048j1824
$$ y = [93999, 212221, 149377, 15380, 77031, 235910, 248562, 211832, 336833, 490782, 446719, 336745, 379608, 422549, 247954, 70007, 202203, 466367, 466365, 249836, 172727, 279853, 333871, 310256, 365546, 438168, 349726, 193581, 193035, 291402, 284655, 221414, 275410, 372700, 340521, 270378, 343479, 458837, 422538, 334383, 393770, 497242, 430944, 294018, 324488, 459719, 467563, 366997, 336918, 359397, 324044, 322011, 466211, 592877, 513058, 378414, 423167, 538953, 494808, 373958, 377533, 394291, 207362, -46128, -73612, 64237, 88820, 10685, 51750, 176746, 153994, 3409, -43339, 33571, 55098, 12547, 43597, 109297, 63071, -29231, 7247, 111873, 93528, -7021, -3843, 75347, 58311, -35781, -65829, -77653]
35674g7653j30040j65674j5557R4474L9666Q028Q0447N2643j17418j51877L9377
35663c43584J60992O0756j8101O6854R7549l2192p8553O3147J19548m3756j48268
35652i5608k0505R3154J2360n0448N7623J19556m518p8892M5719J22071j9773
35641A80739j31168j2493J06850M231j27229n9902N9552L4080j1417P2060J27638
35630B42941J784j29826o9887N6949O1644R457J6652J2975n1334m9714N4098Q4148
35618B39887j5107n2481L2200L3460r7860j04953R2788J90416J5767j58044q8001
35607H8072N1720M0662j6490J9026K6802q0673j22510Q975J08564K8383n2331
35596A00200J4336O7123k3488r0033q460M7761m2581r6529J2373R4840J0188o5119
$$ y = [-77653, -207693, -373367, -388924, -294450, -254784, -246756, -166309, -113666, -231084, -382961, -343584, -182592, -121836, -139937, -73083, 24466, -7726, -86279, -23132, 96416, 52660, -95608, -116113, -22959, -10599, -61047, -3424, 116132, 111614, 32722, 78441, 200512, 180739, 49571, 37078, 143928, 148159, 20930, -38972, 20580, 54660, 43243, 115303, 242941, 244725, 114899, 45012, 101961, 163605, 173062, 189714, 202689, 151355, 101641, 155739, 239887, 224780, 172299, 204499, 237959, 140099, 35146, 127934, 318350, 334117, 176073, 88072, 139792, 180454, 163964, 182990, 209792, 129119, 6609, 15584, 124148, 152531, 100200, 114536, 181659, 158171, 68138, 59678, 107439, 64858, -31671, -19298, 75542, 85730, 20611]
35584B0611N681N4789l5344p9927L7023J10446O193p1773J5639O1634o9406j40332
35572h4766K0161J65066O2758q5191k3702J01961M6979q7373p7908K2826N1202
35561A12013L7678M9374k996j29961j31054M2301J19433k8773j22945L7624J99825
35550A82519J03493o6777m3913N3794K867r3993m5465M6590J6375k9788L8034
35539A63736O9536o9631j83489q1804N6920J5012o5001K0824J32471O3572n6145
35528F6001k5673L2874n9904j48695k6273J44302J06301k7024k127J03690O1316
35517B24788o3225n9409J3067l2346j20416o3947N8193N2684j7680J7469Q2380
35506I1558J5328q5191l9595N6366J9284n3081K2830J26732L6714j34616j12650
$$ y = [20611, 26292, 81081, 45737, -34190, 2833, 113279, 119472, 47699, 63338, 124972, 55566, -84766, -64605, 100461, 163219, 78028, 54326, 156287, 203266, 115893, 37985, 60811, 112013, 149691, 199065, 196069, 66108, -64946, -22645, 96788, 68015, -54930, -17306, 182519, 286012, 219235, 175322, 229116, 231983, 137990, 92525, 139115, 155490, 125702, 163736, 233272, 163641, -19848, -101652, -44732, -29720, -94721, -73897, 58574, 122146, 66001, 40328, 73202, 13298, -135397, -161670, -17368, 88933, 61909, 59782, 163472, 224788, 161563, 102154, 115221, 82875, -37541, -101488, -43295, 9389, -8291, 9178, 91558, 106886, 21695, -17900, 38466, 57750, 4669, 27499, 154231, 190945, 56329, -56321]
35495e6321N9834J17927L9616J8909O4877J9813q5044o6885N3182P4341l0904
35484B09345r6034o3945l1374k5983N759L3415m585m4586k087N4478L0392q765
35472E6030K7741O7775J8815n0341o0116p9190j42705j15961N1654J59254O8384
35461A340m9334j8596L9342k0990o4158N2589J56991M8166j27112j25321j3418
35450a20501J4400K758O6288Q2885o9291j87444n1233J52157J20664m1178k8540
35439e9035J09994Q7425q2079j25488j2458L1417l5179l4022N5775P2625M071
35428A3046r520K8036Pm5691J9926J08937L8882j11348j10200K1813O0882j8838
35416d068l7629L5811N8044Q373k469J5594k7970o6446J9086J23685O0808q8989
$$ y = [-56321, 3513, 121440, 161056, 179965, 244842, 264655, 179611, 112726, 165908, 240249, 209345, 113311, 49366, 17992, -7991, -2232, 31183, 26598, -17988, -20075, 34403, 64795, 56030, 83771, 151546, 170361, 120020, 59904, -19286, -161991, -277952, -226298, -67044, 1340, -47994, -66590, -27248, -48238, -112396, -59807, 97184, 145350, 18238, -107083, -120501, -106101, -103343, -37055, 45830, -23461, -210905, -262138, -109981, 10683, -30495, -59035, 50959, 138384, 56305, -69183, -81641, -50224, -85403, -119425, -63650, 8975, 13046, 3526, 31562, 31569, -14122, 5804, 114741, 153623, 42275, -67925, -46112, 14770, -4068, -41697, -5886, 52158, 60531, 58062, 73656, 45686, -20760, -1674, 122011, 182819, 93830]
35404I3830r4296K9246O7752o009l2143O092j1310n2125J3339J11047N5076r5898
35392H4601j11712J1254O3185N147j561O4785N7364k8415m2041J9654J0229o7043
35380F5447o5819L397j0351q8804o3636N7009R2307K0193k813M6014L2385m2558
35368D2771l5945M3012L8821m3730m5615K9142J7137p4453o6607M0789M8954o6662
35356g2386r3997L8116J35814P8214j2225k5941k1248l6428l133O9113O2420k2614
35344I5705m1599L2670N9650l965l2045J7091K1259n6029p7447J4641P9831J8270
35332A28032o9136o3986n720J3827p722k7672l3270k0282J2730L4691K7942L2928
35320B2362N8869K7099p9966j24130k2119P5218J1168r9215n7533P2231Q2054
$$ y = [93830, -466, 28780, 96532, 90523, 58380, 64472, 53162, 1037, 14376, 125423, 180499, 84601, -27111, -15857, 47328, 52475, 50914, 115699, 173063, 144648, 102607, 122261, 132490, 65447, -372, 3025, -7326, -96130, -159766, -102757, -10450, 9743, 6930, 52944, 85329, 42771, 6826, 49838, 88659, 44929, -686, 28456, 45593, -28860, -95467, -54678, -5724, -72386, -166383, -128267, 7547, 85761, 73536, 47595, 26347, -10081, -13214, 55899, 118319, 95705, 54106, 86776, 146426, 142461, 110416, 127507, 148766, 92737, 15290, 29931, 109762, 128032, 58896, -5090, -10810, 3017, -4705, -32377, -65647, -85929, -73199, -38508, -10566, 22362, 81231, 108330, 28364, -95766, -117885, -42667, -31499, -130714, -188247, -116016, -33962]
35309c3962j1992k1828N5953M9497n0461p1365K2174Q0070M6911J6453J613p5027
35297H036j55115r0560O6948J03077n956n7697K1722P0044l156p1165l4979K6546
35285a22255L5108K9427L2355k444n4462l4023M2379N6629m881l4014l294O089
35273e3386j3690J3562O9121N1781k2484l3533K5327M2366q88j4720P892r119
35261F2229m4757j0375N4459L0997n0622n5437L399q931q2257o7116M8463J08679
35249a1269N3446j1622k2235k1569j7474K2210M4786j5425p5771k5926N0005P485
35237b3359p5738k2915J02308Q4026o1946j12037k2167L3514O117K3590Q6284
35226A7677M5638p8690q8406L7988R7052K1705k3525L1221N1982j1194l1365K4214
$$ y = [-33962, -45954, -67782, -11829, 37668, -12793, -84158, -61984, 18086, 64997, 81450, 83063, 8036, -147079, -237639, -170691, -67614, -73570, -131267, -109545, -39501, -42657, -113822, -148801, -122255, -87147, -57720, -25365, -27809, -82271, -116294, -73915, -17286, -22167, -56181, -59475, -53386, -67076, -53514, 15607, 67388, 44904, 11371, 36698, 79064, 78176, 63456, 71348, 62229, 17472, 7097, 61556, 92553, 41931, -13506, -10107, -19038, -101295, -168411, -119948, -11269, 42177, 30555, 8320, -13249, -30723, -8513, 36273, 20848, -54923, -80849, -30844, -23359, -99097, -122012, -19704, 64322, 2376, -109661, -131828, -98314, -92197, -68607, 17677, 63315, -15375, -103781, -65793, 31259, 52964, 29439, 60660, 112642, 101448, 70083, 94297]
35214I4297K3829n4493o7419P328K0395n0068m8482M4089N5226m7155q3292n35
35202a06280L6651k0482j4245Q1750P7680o3574j19843p024O5724q791m0625P4489
35190d4570J30796p401j33728n8357O3613L0659n1911j480R6754O5009m3286p3507
35178b7409n4096q6067j01145Q732J46773J44218L7291j0888K5673N2486M9486
35167A85054N8426N0127k0262q8098o3083J7320M6074K250n4220q0542o3013l673
35155a3640M5879K4774k6790j1106N1941M4023l3143m4162L2340N2294k8128n8722
35143C5560L2680R7509K5140o6228m5637J7917J7970N607N3013Q4612J9815n7049
35131B20909m0534Q943j2043n6150k1216N6223O3073o414o4252o6997l5156M935
$$ y = [94297, 118126, 63633, -3786, 3542, 23937, -26131, -74613, -30524, 24702, -22453, -105745, -106280, -69629, -90111, -104356, -22606, 55074, -8500, -128343, -135367, -69643, -78434, -119059, -44570, 86226, 78825, -54903, -113260, -49647, -18988, -70899, -72379, 24375, 89384, 46098, -27409, -81505, -167572, -268717, -259985, -113212, 31006, 68297, 57409, 83082, 135568, 185054, 243480, 293607, 273345, 185247, 122164, 139484, 185558, 187808, 133588, 53046, -9967, -13640, 32239, 57013, 30223, 19117, 71058, 115081, 81938, 37776, 70116, 122410, 94282, 35560, 68240, 165749, 190889, 124661, 79024, 96941, 114911, 120518, 173531, 258143, 277958, 220909, 180375, 189318, 177275, 121125, 99909, 156132, 219205, 212791, 148539, 81542, 46386, 51321]
35119E1321K1698p610l4107J3181Q2598M3459q4084j16057O107J01560L4640o9704
35107D3002m1005O3643P2576k7461j00739p5770o797L5483K9997n109k4846N46
35095c6480L0847J0250k2996J2929Q5449P9389l145l6677O768R805o5349q9399
35083a8609J1451J12741P8133m2390j01560m4474O3333J17972N6471o4950q8591
35072G9527M0124J43576M9843j14788j00045O1437J10370L528l4123O2592P7329
35061C79370p4182j59762k9651J17776P6905m0001m9892k0023q4796j50637n8633
35050i3526J08668J44947M1090m1279l6950j4426p016J7601N9056Q5249Q9822
35039C53236O7731P177l7739K0326J40677J68308P3070J0088O2260J04880L1184
$$ y = [51321, 73019, 65409, 31302, 44483, 127081, 170540, 86456, -29601, -23494, 78066, 112706, 43002, 1997, 65640, 138216, 110755, 10016, -65754, -72551, -37068, -7071, -12180, -37026, -36480, -5633, 4617, -18379, -5450, 79999, 159388, 156243, 119566, 126334, 136139, 70790, -18609, -7158, 105583, 183716, 141326, 39766, -4708, 58625, 176597, 233068, 168118, 79527, 119651, 263227, 313070, 198282, 98237, 159674, 270044, 273572, 239449, 302041, 379370, 305188, 145426, 115775, 233551, 310456, 270455, 220563, 200540, 115744, -34893, -93526, 15142, 160089, 201179, 159900, 122950, 108524, 101508, 119109, 178165, 263414, 353236, 420967, 428144, 390405, 410731, 551408, 719716, 792786, 802874, 865134, 970014, 1001198]
35028A001198p0312q7951o3730o6432n2736R129L4036k5248o8471k4453J5288
35017F00318k8584p0653k3032M0722K8657m950J8248M8459J7679k5269j9948r835
35005E71812l4815l9244K650R124n5789j00314p6479o9140j12647j04105j4393
34994b3340J5479p4054j20060j0153J05322O0221n5020o9385j1113j315j7050
34983b00468K4153O9121K7152m4269m4283j4905l9229o0244J1535J06884J00857
34972f3696K3314r646K643j7685n5693l1722M6906R6845P9624J5031o5679j07048
34960h6806n6757L2846M1666k8957m9087O369L885r1088j16439P598J15867O6100
34948a54803l2153k6857K7189J4541j7025K4379P8811M9684j2200j4268R697n862
$$ y = [1001198, 930886, 842935, 779205, 712773, 660037, 669166, 703202, 677954, 609483, 585030, 600318, 571734, 501081, 478049, 518771, 547428, 542478, 560726, 609185, 626864, 601595, 581647, 571812, 536997, 497753, 500403, 509527, 453738, 353424, 276945, 207805, 95158, -8947, -23340, -7861, -81915, -201975, -212128, -106806, -46585, -101605, -170990, -182103, -183418, -200468, -176315, -107194, -80042, -124311, -168594, -183499, -222728, -282972, -271437, -164553, -63696, -40382, -50028, -47385, -65070, -120763, -152485, -105579, -8734, 70890, 85921, 20242, -86806, -143563, -110717, -69051, -98008, -147095, -140726, -136841, -227929, -344368, -336770, -220903, -154803, -186956, -213813, -186624, -172083, -189108, -164729, -85918, -36234, -48434, -62702, -53005, -58867]
34936e8867k1628M132J0924l2018l6780L3701P3159L2150J9764P6284O5101n6894
34924A09028j04274J6240J02509m352j28809o6348N8329L0719p0096m5592M7517
34913e5129K8768m9718j4092Q4167O3828l8957m1904M2907N3044o178M357O0975
34901A32068K0398q1296p4859K2391K9309o5608q3731J7430P3415N186o6275m8611
34889a20183o882j0332k9445l0126k5096j0000K9169N3201K5469p841m36K582
34877a29920k8900j5067Q2918J36329M0527q5414p5503K2572N8930L6287M3450
34866H6209M8599j7241p4736k1658N7162L1995k9300L99M5511l0066j30439p0634
34854a04199P6227Q2485m5013r1652j2710K7458k0251l0970K1011J9743m1711
$$ y = [-58867, -80495, -76363, -65439, -97457, -134237, -100536, -27377, 4773, 24537, 100821, 165922, 109028, 4754, 20994, 123503, 119151, -9658, -76006, -17677, 13042, -57054, -102646, -55129, -26361, -76079, -90171, -6004, 57824, 18867, -23037, 19870, 72914, 66736, 71093, 132068, 152466, 71170, -3689, 18702, 48011, -17597, -101328, -83898, -10483, -5297, -71572, -120183, -127065, -137397, -166842, -196968, -222064, -232064, -202895, -149694, -124225, -132066, -132502, -129920, -158820, -173887, -90969, 45360, 85887, 473, -75030, -52458, 6472, 42759, 86209, 134808, 117567, 42831, 21173, 78335, 110330, 81030, 81429, 126940, 96874, -33565, -104199, -27972, 54513, 9500, -82152, -94862, -67404, -87655, -118625, -97614, -77871, -119582]
34843a19582m0579K4498K5396l2900p934R4915J03089j1649o8293Q951O3222j6399
34831B2735j12563q4383K5183Q9491O9211P480l7887j8889N1512P6517K627p4109
34819A6925n0238Q158j4518o7708k8756O0617O5082M426O073N5625L0838m7482
34807C9042m1930L8608M4204m5416q7553k7726L2056L0426J1370j2422o7113r6357
34795a82811k4410P9325Q9877L9641L9096M9279k9436j08507k6389J33137J33941
34784A92743k3024j08034n4884k6574p1355m3937P5180J05445l292o8738k771
34773b9241M8278k218k6349N4806J13773N6538j6906j8624j5230m7674l3337L6879
34761A20695L1447p2871j06229K340Q2994J9396m9397Q498P5344M355j04910o9785
$$ y = [-119582, -160161, -135663, -110267, -143167, -151101, -56186, 46903, 35254, -33039, -24088, 39134, 22735, -89828, -174211, -149028, -59537, 9674, 17154, -20733, -39622, 11890, 88407, 91034, 16925, -33313, -25155, -39673, -107381, -136137, -75520, -10438, -6012, 61, 55686, 86524, 39042, -2888, 35720, 79924, 34508, -53045, -80771, -48715, -18289, -6919, -19341, -86454, -182811, -207221, -127896, -38019, 1622, 40718, 89997, 60561, -47946, -74335, 58802, 192743, 169719, 61685, 6801, -19773, -91128, -135065, -59885, 45560, 42268, -26470, -29241, 19037, 16819, -9530, 45276, 159049, 215587, 198681, 180057, 164827, 117153, 83816, 120695, 152142, 79271, -26958, -24618, 58376, 77772, 28375, 36873, 112217, 116572, 11662, -58123]
34749e8123P4201J41285O9373m6493j16188j09278k4392P7826Q9605R87n9565
34738C9238j3423M7520J8977n2353o7661l3073j0356j592J6277K2711P960J6863
34726h912N9498O1335j8666j01075r6167k9302J6480J7855M561o715j1900J828
34714a11180L2751N4670M9965J9581l1342p3935n4469K4095O7139J7441m0223
34703d5507p737O0922N4239l076p199K9588J4687l6881l4446K554j5093m7309
34691c5258K4696J59354J83478O9648k6080j8229K9366R5286K39807M07820M18870
34680A548758K27555J535j22070j74883k06003j89927j42659j39086j58665r9186
34670E45369J3742L1828n9581j07354o1686m7417r9837q1059M2710R2914k0697
$$ y = [-58123, 16078, 157363, 226736, 180243, 64055, -45223, -69615, 8211, 97816, 98803, 39238, 25815, 73335, 92312, 39959, -27702, -60775, -71131, -72723, -56446, -33735, -25775, -8912, 50586, 111921, 93255, -7820, -103987, -133289, -116809, -98954, -94393, -101108, -113008, -111180, -78429, -23759, 26206, 45787, 14445, -59490, -113959, -89864, -22725, -5284, -45507, -53244, 7678, 61917, 58841, 51642, 81230, 95917, 59036, 24590, 27144, 12051, -35258, -10562, 148792, 332270, 401918, 375838, 357609, 386975, 482261, 722068, 1129888, 1548758, 1776313, 1777848, 1655778, 1480895, 1274892, 1084965, 942306, 803220, 644555, 545369, 559111, 590939, 531358, 424004, 362318, 314901, 215064, 134005, 176715, 269629, 248932]
34659B48932j26372p2503K9745J7248n9362o2311k222L1481M5914Q2827R0797
34648B24174J2905q7495j15982p7077j7343N8119J21918R6706j1423p2401k1502
34637A10599L6243O905m3784l1534l502k0981k3682M7953J09805O1654l7458o7148
34625A45070l7144l5695n5660k2587M6133N4453j2305o1995l8210O254J553l6061
34613d6194k7598N8840J45731J20823j4918j20001p9137M7533J08295N0668n0763
34602A93279j14878j10656l3325P5208J16520M6248m2654m2824J4833L5234J6703
34591A53688J2253P053k9511m5171j364J7899n1299j02321k6851P5224N6289k0876
34579D5013r364N1971M1153P850N6930J03246L8421k142J19212K04193N4685j7194
$$ y = [248932, 122560, 50057, 79802, 97050, 37688, -24623, -26845, 4636, 50550, 133377, 224174, 237079, 149584, 33602, -43475, -60818, -2699, 119219, 215925, 204502, 132101, 110599, 146842, 153747, 109963, 78429, 74927, 53946, 30264, 78217, 188022, 249676, 212218, 145070, 107926, 72231, 16571, -6016, 40117, 94570, 82265, 20270, -17940, -11686, -10133, -46194, -73792, -14952, 130779, 251602, 236684, 116683, 37546, 85079, 193374, 244042, 193279, 78401, -32255, -65580, 9628, 126148, 172396, 129742, 86918, 101751, 136985, 153688, 165941, 172994, 143483, 98312, 96948, 114847, 63548, -38773, -65624, 9600, 65889, 45013, 35649, 87620, 128773, 136623, 193553, 296799, 335220, 333078, 452290, 656483, 711168, 693974]
34567F93974M15063J045127J043190K28460o02482p55554m60816k89627k99922
34558A017413k20206o9707p2350j87677j87096o3186L654k3296m2947m5291p1664
34547C7647n9617L7873R9909K0414q7749p4488M712K5738K0253N8293O4104l6644
34535A10445j32223r7610j1955m121k7390J1395M8160m067n8947m020Q6263Q2901
34523a169J9995n155j4854n5100o0304R519M6630j8217p1293k5630J2870l1682
34511a94390k9736R6815J66997L7402j11220o3516N7253J5728j13081q5078Q2975
34500a39851J64430J09186N6601L8280k1052o9642o19R2412K8935j28911j53000
34489b3231k7780L9056k3647o4169R1O5661N5622K3307O244k8078o4729m3646
$$ y = [693974, 1109037, 2154164, 3197354, 3425814, 2823332, 2067778, 1606962, 1317335, 1017413, 797207, 727500, 655150, 467473, 280377, 217191, 220845, 197549, 154602, 109311, 37647, -21970, 15903, 115812, 136226, 48477, -26011, -21299, 4439, 24692, 82985, 147089, 110445, -21778, -119388, -131343, -135464, -162854, -151459, -103299, -107366, -166313, -170333, -84070, -1169, 18826, 13671, -1183, -56283, -116587, -107068, -60438, -78655, -149948, -175578, -162708, -194390, -224126, -127311, 39686, 77088, -34132, -97648, -40395, -24667, -137748, -222826, -139851, 24579, 133765, 190366, 228646, 207594, 137952, 137333, 229745, 258680, 129769, -23231, -51011, -11955, -35602, -99771, -99680, -34019, 21603, 44910, 51154, 23076, -41653, -85299]
34477h5299J0072J5885j2528k93L4925J9274k4934k0374J7209K5501K8960O8930
34465G7328P9562M051n6823k703N7846k6152j63661j46616P865R3341M9348P277
34453a9337K3516J7065k5860k0928K5413J2171n3540n2108L2712Q3960N3810J5809
34441I2683K906l1649p8419o3101J1197O0292N9414N1902L6923j2416n1618k9784
34429D8330p121n5492r9592k8662R0660J00547L112o6709p3869q7166r0364n705
34417b72031J10664J09981p850q6023m9146K5664P0657Q8297O1641k5843r5775
34406f9764o3568P038K332l7592K389Q4982Q0405Q839Q18M8863K9877m7110n5301
34393g792j802j8082r4403p7438M1625R0472J5085l0294L8327R8319N0615k2285
$$ y = [-85299, -75227, -59342, -71870, -72163, -37238, -17964, -42898, -63272, -46063, -20562, 8398, 77328, 156890, 160941, 104118, 101415, 159261, 133109, -30552, -177168, -169303, -75962, -26614, -19337, 4179, 21244, -4616, -25544, -131, 12040, -41500, -93608, -60896, 23064, 76874, 92683, 95589, 63940, -14479, -77580, -66383, -6091, 53323, 105225, 142148, 129732, 78114, 48330, 41209, -14283, -113875, -142537, -51877, 48670, 51782, -14927, -88796, -175962, -266326, -272031, -161367, -51386, -59236, -145259, -194405, -168741, -98084, -9787, 51854, 26011, -69764, -133332, -126294, -123962, -161554, -159165, -74183, 6222, 15061, 15879, 64742, 94619, 47509, -7792, -9594, -27676, -122079, -199517, -157892, -67420, -52335, -82629, -44302, 54017, 104632, 82347]
34381H2347k5601J377kp562j2379o1270j34570j27848k1588O8398O5213K1974
34369a51511k645j9603k3029K5389Q8334P6749J5333K8446J24584J61040P4335
34358C97422j9523j9671K1450K7486J9155K6635J4277k6405k9433K2340M0581
34347D74314k3748q5731n9361Q414K3479q613q050N0780J07222R5040J7050n6304
34335E34492n9003n618K9673J9197Q923J5674j3393q3680r9377j4432O4195L3031
34323D29682m4652n5388k1242l0462o8616o6353l9045l3483j5418M3574N9171
34312A57768k6196r6754l4229O6564N0120l3296l5279J0834l2131j18205p9088
34301a69892O3712J16122L3149l2511r539J0145j4406j2205K1833R215k9862R097
$$ y = [82347, 56746, 58123, 58121, 50559, 38180, -23090, -157660, -285508, -307096, -238698, -173485, -151511, -154156, -173759, -196788, -171399, -83065, -6316, 9017, 37463, 162047, 323087, 397422, 377899, 358228, 379678, 407164, 426319, 452954, 467231, 440826, 411393, 433733, 474314, 450566, 364835, 305474, 313888, 337367, 328754, 320704, 371484, 478706, 573746, 590796, 534492, 475489, 469871, 499544, 518741, 527664, 543338, 529945, 446265, 346888, 332456, 396651, 429682, 385030, 329642, 308400, 277938, 209322, 142969, 103924, 70441, 55023, 98597, 157768, 131572, 34818, 589, 67153, 117273, 83977, 48698, 59532, 27401, -90804, -169892, -106180, 9942, 43091, 10580, 1041, 11186, -3220, -15425, 6408, 15623, -14239, -5142]
34289e142J00076J00212k150o3074k5246K0349K5634L1388J9572o4078j39487
34278a946p1220P8775J11881J0880m8819j4291j7244r2781j06436j6495M6079
34267a21617K1535M407K9838J8083k1309J8916J02406O4504p8978j17290l486
34256h2991O3909l50l2901M5352P1388l8643j07708j4625P9976K1027p2398l4139
34244a02103O6647P8578K2127l644p823k7817j5742M1190M1775m7890r8196l3292
34232h6190L2468R402p362N8781R7590J5854p3594m5806J9918l096o8503o7476
34220a18014j8221J5386N3531J01537P3891l8355q8632r100N5690L640l6897M4573
34208C9029J13668L1740p4694l7094M0475k7686j50220j01131P6236J26316J026
$$ y = [-5142, 94934, 195146, 192996, 129922, 104676, 125025, 150659, 182047, 201619, 137541, -1946, -73166, 5609, 117490, 128370, 79551, 65260, 48016, -44765, -151201, -167696, -121617, -100082, -95675, -65837, -47754, -69063, -50147, 52259, 116763, 37785, -79505, -82991, -19082, -19432, -52333, -6981, 64407, 25764, -81944, -96569, -16593, 4434, -67964, -102103, -35456, 43122, 65249, 61605, 53782, 25965, 10223, 51413, 93188, 45298, -52898, -86190, -53722, -44320, -51682, 7099, 104689, 120543, 46949, 1143, 21061, 17965, -50538, -118014, -136235, -120849, -67318, 34219, 108110, 69755, -18877, -27977, 27713, 31353, -5544, 39029, 152697, 184437, 109743, 72649, 113124, 85438, -64782, -165913, -89677, 36639, 37665]
34197C7665q2947j4677O1400J9237n9122n1379K0547O1484M3843R676O39J9512
34185F5878K3618l0515j04369r5739J0485Q9782M8127m0566n3710P556N9398O7605
34173D7550M3697j0450o1953l7609N4288R0639J5469n7696l1663J3450k2046o7598
34161b3922j6099O2998L4940n5070m9134N3569R2498O054q1704n9471K9342Q1105
34149G5106O2647J0699k8164l2445k0155k7038m9507m3802k470K6911K5125K7612
34137B4519L8012J0055m5257m5812J5141L2163l2292o3727J4632R9408P2279j0311
34125A08810k4822K1476L6618N586k5215n3075q6637p9646j3653K7916j4565n7192
34113a54399m023Q1558P6471J396k3742J9914M1366N177k8534k0106N046K1844
$$ y = [37665, -45282, -59959, 1441, 20678, -38444, -89823, -69276, -7792, 36051, 45727, 46366, 65878, 89496, 58981, -45388, -141127, -130642, -40860, 7267, -33299, -87009, -79453, -20055, 47550, 91247, 80797, 18844, -18765, 35523, 126162, 141631, 83935, 52272, 65722, 43676, -23922, -40021, 22977, 57917, 2847, -46287, 7282, 99780, 105834, 24130, -35341, -5999, 75106, 137753, 148452, 120288, 87843, 67688, 40650, -8857, -52659, -55129, -28218, -3093, 24519, 62531, 72586, 27329, -18483, -3342, 28821, -3471, -67198, -52566, 46842, 119121, 108810, 83988, 105464, 142082, 147668, 122453, 69378, -17259, -96905, -110558, -82642, -97207, -154399, -158422, -76864, -393, 1003, -22739, -2825, 38541, 43718, 15184, -4922, 124, 21968]
34101B1968K6643P319l2823m6836q861K7967N983m4860n6429k3142J0006K0294
34089i2771J3416k273o758J7533L7234J742n6654m8710K3322N5681J3720j5843
34077f0361J2050K7727j509J430O1179O8699l0301j09166m7633P8143J19982O4136
34065A84376o387n2763o9494l3489K8984K6825m7636p2544L924N5814j0903q4805
34053g8098k9250R3070J32555Q0002K6551n603m1381m9588n023K4920j7832p5156
34041E5167p5749m6555k2554L0710J00359Q0358l5931q2464J6926R0869j629j20001
34029a0494q0764K6580J2461p0526l8137P7553Q2468l3887q6992j2647N9783N1272
34017b3330K4890K3112J0996j0044m857j1495p9633j29096m7057R9373J32128
$$ y = [21968, 48611, 55930, 23107, -23729, -32590, -4623, 1360, -43500, -99929, -123071, -113065, -92771, -79355, -81628, -88386, -70853, -33619, -31877, -88531, -137241, -113919, -58238, -44518, -60361, -48311, -20584, -22093, -20663, 40516, 109215, 78914, -30252, -77885, 258, 120240, 184376, 177989, 125226, 55732, 22243, 51227, 78052, 30416, -42128, -38204, 17610, 6707, -78098, -107348, -14278, 118277, 198279, 224830, 219227, 177846, 128258, 123235, 148155, 130323, 55167, -20582, -67137, -89691, -58981, 41378, 121736, 85805, 3341, 20267, 111136, 109507, -10494, -91258, -64678, -52217, -122743, -160880, -83327, -859, -34746, -121738, -134385, -74602, -23330, 1560, 24672, 35668, 25624, 20767, 9272, -70361, -199457, -246514, -147141, -15013]
34006a5013K8916n8768m6689l803L849l972k427O493L5328P4495N6069l3373p6937
33993c5832K558Q9432N3186k1837J7277J07874O7791q1916j38085m2012N1625
33982G0061M1465k493j2058j5805k8584j5961N960j5135m8090j8658M1421L7794
33970C9917j3214j4323L1473L6144K208J0681M9967L0822l7949n8303j8130N200
33958F4493L66J8773L8688q61n5828l5746K2718J2225m9330n5523n707J7068J5467
33945a3197L8052K9998o8816j40861m0458J28505J38536N63o9403j6585Q261l6279
33933d1684k6264M4663K9601p3156q1517L9893R8602J1817n4997O629P2155L6007
33921F1749j0741J2550K2659l7393o8209p438M5410K1263L272M0197L9157l4893
$$ y = [-15013, 13903, -44865, -91554, -95357, -91508, -95480, -97907, -91414, -56086, 18409, 74478, 41105, -35832, -33274, 56158, 109344, 87507, 104784, 212658, 280449, 198533, 60448, 18436, 70061, 111526, 109033, 96975, 81170, 52586, 36625, 42585, 27450, -20640, -39298, 2123, 39917, 26703, 12380, 43853, 79997, 82205, 92886, 142853, 173675, 135726, 77423, 59293, 64493, 64859, 83632, 122320, 121459, 65631, 29885, 52603, 64828, 15498, -40025, -45732, -28664, -13197, 24855, 54853, -13963, -154824, -195282, -66777, 71759, 72322, 2919, -13666, -5405, -41684, -67948, -23285, 6316, -66840, -148357, -108464, -9862, 1955, -53042, -46413, 25742, 61749, 51008, 63558, 86217, 48824, -19385, -26823, 18587, 39850, 43122, 83319, 122476, 87583]
33909H7583n6665L1276Q6451L058j05062r9336k0715L4117O8063Q7275K8061q8829
33897E5277j11474K162Q2057K2069m1836J3048O9507o954j07787o5807N3920P6177
33885D0359O570k2763J177k823j9147K3402P9560M8380m1298p7759n1966l6764
33873e3072l1421J4013O3846M2100k1756l5854j816P396q433J1120N6222N4373
33861I6718n348o1155p4044m7700J3480Q3491R6742L4480k2287q011K2519o024
33849A22861n5880m7383L75J2760r194j2238m31j3335l4470k3995n190k0769m0991
33836a27880j1667M2131N3961K4465L646j720j7789l2873j7484J4405L3097M5896
33824H188O0849M6137j1343o0765o1636m1553k4073J8351P4219N9404l5775p6434
$$ y = [87583, 30918, 62194, 148645, 151703, 46641, -52695, -73410, -39293, 28770, 116045, 144106, 55277, -56197, -54035, 28022, 50091, 8255, 21303, 90810, 83856, -23931, -89738, -35818, 40359, 46929, 24166, 25343, 22520, 3373, 26775, 106335, 154715, 113417, 35658, -16308, -53072, -84493, -70480, -6634, 35466, 13710, -22144, -23960, -16564, -24997, -13877, 42345, 96718, 91370, 30215, -43829, -91529, -78049, 5442, 102184, 136664, 114377, 106366, 128885, 122861, 66981, 19598, 19973, 32733, 23539, 11301, 10870, -2465, -36935, -60930, -66120, -86889, -127880, -139547, -97416, -43455, -18990, -15344, -17064, -34853, -67726, -85210, -70805, -37708, 8188, 69037, 115174, 103831, 43066, -18570, -60123, -84196, -65845, 8374, 67778, 32003, -44431]
33812d4431J9991J22540P0811p0540j15735m9773j9241o1065n1003N3968J19579
33801b4899N2117m6784m0550M3009P7657K7397l3484m8995l9399l7627l4882o563
33789a13003M1476P3216O1451J3476m3790q8710j01178n6872L5432J04026P9498
33778E022n649m5837n748L5769J3612k9815k9756n589j0479k9502j0865L3752
33766h5085M2406M558k3333p633J6110K269l9079n6866k3893K8875M8395K6878
33754f6398J1068K9374M3986J5124k3163j5342J6156P752k5981j1386M3979M3768
33742F8937l6726r4589n4508K0384L7170N695j0554l999n942j2928j489J9771
33730f8778K6877J7782p17k2947k1229K9284Q4512O4591k2842p8142n8379l1003
$$ y = [-44431, -24440, 98100, 168911, 98371, -17364, -67137, -86378, -147443, -198446, -144478, -24899, 27218, -19566, -60116, -17107, 60550, 87947, 54463, 5468, -33931, -71558, -106440, -113003, -71527, 1689, 63140, 76616, 32826, -55884, -157062, -213934, -178502, -74476, 5022, -627, -46464, -52212, -16443, -2831, -32646, -62402, -67991, -78470, -107972, -118837, -85085, -42679, -38121, -61454, -69087, -52977, -50708, -89787, -146653, -170546, -141671, -93276, -66398, -55330, -25956, 18030, 33154, 9991, -5351, 10805, 18557, -7424, -18810, 25169, 68937, 32211, -62378, -116886, -96502, -59332, -53637, -64191, -68190, -74132, -87060, -88549, -68778, -41901, -24119, -24836, -47783, -69012, -39728, 44784, 109375, 86533, 8391, -49988, -80991]
33718h0991l6579j3699O6750J06788K5803r0112j02229j9347L5019J1523k6207
33707a23281k7775j1385K134J8584K9242J2773j8667l2164k6696k0861l249M5634
33695a55711R3143Q0835J4661k8726k821M4398L4339l5015p8374l0144N8359O9092
33683F4036k5994j11650p6208L6640R2682M9247j4034k8437n279K6771N9582O9897
33671A37253L1651k4420m1799k9277l6308m7705o706O4191Q4617N8362O2608R0463
33659C42930N4332l3496n0340K2533M7950l5395j01809n3800J6876J261m4925
33648A66117k7551R835j5738o2322m7673p354k1012n8031m0516N574R97m0028
33636a37702m2437p52L7910O6767Q7697N3621m3304r8230l2230O6369O9008K721
$$ y = [-80991, -117570, -131269, -64519, 42269, 68072, -22040, -124269, -143616, -108597, -97074, -123281, -151056, -162441, -160307, -141723, -112481, -99708, -118375, -150539, -177235, -198096, -201345, -155711, -62568, 18267, 32928, 4202, 1381, 45779, 80118, 45103, -33271, -63415, -5056, 64036, 38042, -73608, -149816, -113176, -20494, 28753, 14719, -13718, -18997, 7774, 67356, 137253, 168904, 144484, 102685, 73408, 37100, -10605, -17311, 46880, 131497, 189859, 252467, 342930, 397262, 363766, 313426, 335959, 383909, 348514, 246705, 192905, 209781, 211042, 166117, 138566, 148401, 132663, 70341, 22668, 15314, -5698, -63729, -104245, -98671, -97674, -137702, -180139, -180891, -142981, -76214, 11483, 65104, 21800, -76430, -108660, -42291, 26717, 29438]
33624B9438k2384r012l4608p5188m3827K7818K4636m6093n6868K4004Q2474M9239
33612e0371r928k8307k5603k0759J6052P5323Q3122J6935m6404m5893j6240r585
33600f1658j5181k512J9914L0169K7829J6835j591q237J1320K2451j7626p4579
33588e2866o7900K191M0072n392o2798m4725K8954P0623M9586J8896K8201N6661
33576F1503M6674j5454p4017o6564j61N6019N2863J0604j8494j0396J5203J7901
33564G5681k4265p7127p0342Q107O8905L5116l5700l4078K5576L3789k0526l5066
33552d9930J0221J1202n5135o3809K7924O5876m6573j46277m7898J45500J83353
33541C4454L7927q5694p0077j592K9019L9501M1670n451p7050o8240M1080J29493
$$ y = [29438, 7054, -1958, -36566, -111754, -155581, -127763, -103127, -149220, -206088, -182084, -99610, -50371, -60299, -88606, -114209, -134968, -118916, -43593, 39529, 56464, 10060, -35833, -52073, -61658, -76839, -79351, -59437, -29268, -1439, 15396, 13805, 5568, 16888, 39339, 21713, -52866, -120766, -118575, -78503, -83895, -146693, -191418, -162464, -91841, -42255, -23359, 4842, 61503, 108177, 92723, 18706, -47858, -48019, 8000, 60863, 71467, 52973, 42577, 57780, 75681, 51416, -25711, -96053, -87946, -19041, 16075, -19625, -53703, -28127, 5662, -14864, -49930, -39709, -28507, -83642, -147451, -119527, -53651, -100224, -246501, -294399, -148899, 34454, 72381, -13313, -83390, -84982, -55963, -16462, 25208, 19757, -57293, -125533, -84453, 45040]
33529D5040R9663j141p3434q4404n1239N565M6445K5743l8907p2058m0512J3117
33517a26122M7686O2133M9183m903n8954m4410K2771M8793Q323j6041J6634K5613
33505C0706m7121j11565n8471N4021P3438j3428n8546J5979R8167O7529j4759
33494C5950j3908N0401L7836o2559q7084M1032J61898J04877n9232j39252j03176
33483c3217o2237m1196L0370J18011R2039l5185r0422j4481M5016n689n4492k054
33471e3537N8987K3690l5643j6711K5085J923k8766J3754N7818R362n5631k2613
33459b2282M1203O184p0066l7121P0477Q3215j4797p7678n7322m2908m7329J3372
33447a55052J11030J06385o05m2703L3678P4089j4407j01517n4722M8475O0068
$$ y = [45040, 144703, 143562, 70128, -14276, -65515, -59950, -13505, 12238, -26669, -98727, -139239, -126122, -78436, -16303, 32880, 27977, -30977, -75387, -52616, -3823, 4500, -11541, 5093, 30706, -16415, -127980, -186451, -132430, -58992, -72420, -130966, -114987, -16820, 50709, 35950, 22042, 72443, 110279, 47720, -39364, 1668, 163566, 268443, 209211, 69959, -33217, -95454, -136650, -106280, 11731, 103770, 68585, -21837, -36318, 8698, 3009, -51483, -53537, 5450, 29140, -6503, -23214, 1871, 3794, -24972, -11218, 46600, 55962, 331, -22282, 18921, 25105, -44961, -82082, -11605, 71610, 56813, -20865, -78187, -121095, -168424, -155052, -44022, 62363, 61758, 19055, 52733, 126822, 112415, 10898, -43824, 4651, 64719]
33436F4719j4681n9452k3230M9339R7453Q1358K319o9677n9321R5Q530l3429k4705
33423A9318M3617M8760m9737j13433m1202N8152L7755n4895o5346K1521P4970
33412b0520K7308m7110o2934k4296K3500N8080O7408L4101l0954p1862m0511L9044
33400d8746Q5105N1892r034j5696K3821K0793m5900p5018K279R4180P4372k4948
33388A33100o9340l2288r038l3863l4320J3458L1006j4486m0549Q561O4993N4172
33376G1406R065o954l155j1118j1224J2714J7826j9712l9720L747M2626q380j01570
33363d4449j09844j2047P5670O0224j8528o0030k6582L2339M6319m116o7269p2524
33351b00837j5155L0013M768m8830m6824J1340M0144k199n4003o1459q2394j93114
$$ y = [64719, 50038, -9414, -32644, 16695, 114148, 195506, 197825, 128148, 68827, 68922, 77452, 44023, 19318, 62935, 111695, 61958, -51475, -92677, -34525, 3230, -51665, -117011, -95490, -20520, 6788, -40322, -103256, -127552, -104052, -45972, 21436, 55537, 24583, -47279, -87790, -48746, 36359, 88251, 79217, 63521, 87342, 108135, 62235, -12783, -10504, 83676, 158048, 133100, 63760, 31472, 22434, -11429, -45749, -32291, -1285, -15771, -56320, -47759, 17234, 71406, 80471, 73517, 70362, 59244, 48020, 60734, 78560, 58848, 19128, 22875, 65501, 57121, -44449, -154293, -166340, -90670, -30446, -48974, -109004, -135586, -103247, -56928, -61044, -128313, -200837, -215992, -185979, -181211, -230041, -276865, -265525, -225381, -227580, -281583, -343042, -425436, -618550]
33339f18550l22659k94742o4848J84798K55532J62739P1101O2825Q2850P9462
33329d01492P0575O7783N0864L3480M8699N9151k227q9065p4265M3931J14196
33318g8370O0611j1238l862L2347L5446M6426P7134K8486j18784j90582o7841
33307a90227R3838Q7538k7120m8158K8852L9239m2184p0403O473P9707Q3038O2041
33295A02634L2294m0428j07732p1834L5231Q0921M5905K9588M5083O352p2319
33284H5695p4277k617R142n4396n1752N0613J00545K7256l6061k87K3889n1441
33272B6309j11455l8023P6881Q3380N990l6542l1017l4876l6427J980L7749J8187
33260c7864j1489J1144M7236L2518m77P808K0623k6345q9282p3487J0649O3109
$$ y = [-618550, -941209, -1235951, -1300799, -1116001, -860469, -697730, -626629, -563804, -480954, -401492, -330917, -263134, -212270, -178790, -130091, -70940, -73167, -162232, -236497, -192566, -78370, -17759, -28997, -32859, -512, 34934, 81360, 158494, 186980, 68196, -122386, -190227, -96389, -8851, -35971, -84129, -55277, -16038, -58222, -128625, -122152, -42445, 40593, 102634, 134928, 94500, -13232, -85066, -49835, 31086, 76991, 106579, 151662, 158014, 85695, 11418, 8801, 17943, -36453, -88205, -37592, 62953, 90209, 54148, 53861, 77750, 26309, -85146, -123169, -46288, 37092, 43082, 6540, -24477, -59353, -95780, -93800, -56051, -37864, -49353, -38209, 9027, 41545, 41068, 48876, 69499, 43154, -46128, -119615, -108966, -45857]
33248d5857M3458N689k346Q818J2666O01j9953k6415j886K6490J4097k2153j6698
33235b3489L2586M5896j1522o8269n5759K427N2331P7399O3751r916j00296j12909
33223a07770l9208J7605M313p173L1907N0639r77l8717J3809P7694M5064l5929
33211A1257m5989K577J394n3591n2600L6760J06406O8119k5923o8635l5662J1121
33199d4766K3032K0783M5018P6251M7393m6316j05537n6088K9302L2979k2132
33188h1j6582N3324O4154j4125n4559J1082P4671L8154k9571l0011K376l913j6356
33175G8563J5884L8694o650n1144j0452N0505J9189o2879o3067J8398N1563j0475
33163F8129p5631p5210m3769j7544K2208P1748P6342K1560k6952j4741K9168M1512
$$ y = [-45857, -2399, 3290, 944, 9762, 22428, 23029, 3076, -23339, -25225, 1265, 15362, -6791, -23489, 9097, 54993, 43471, -24798, -80557, -78130, -25799, 51600, 115351, 105435, 5139, -107770, -146978, -129373, -125060, -132233, -100326, -49687, -50664, -89381, -75572, 2122, 47186, 11257, -34732, -32155, -30761, -84352, -136952, -100192, 6214, 74333, 48410, -20225, -55887, -44766, -21734, -951, 44067, 120318, 167711, 121395, 15858, -40230, -10928, 22051, -81, -16663, 36661, 100815, 86690, 32131, 43213, 117884, 156038, 126467, 96456, 98832, 94919, 78563, 94447, 133141, 126491, 75347, 64895, 115400, 134589, 71710, 8643, 27041, 78604, 68129, -7502, -82712, -126481, -144025, -121817, -50069, 26273, 47833, 20881, 6140, 35308, 76820]
33151G6820K092n7333q7631n9894K357L5142P861l1607k0945K8027M7890R509
33139d7712m3866n2925p077M2673L0097m6595r8735m7807N3060P2360j1657o8406
33127b26590m811R3637Q8057j4631p8736k3864Q7476J38524Q1793k4569p9913
33116C6373m9683o325k6146o6796k7185P6811J08962J5563q4727p5749k932K5246
33104g6588M833O073M0144N7803M3281K1882k015m1759p9500p8471l6075J0925
33092a29467K4777j904l3628j9328L4536N0528j101k5075N3381J24753L7104j31750
33080a7174j48764J4942J26047N1811n2954l2369K5068j0033n9761J282R1920
33069i985N2221p7503j17993k6293P6497J02774O3850r253o7242l0285Q8146J28962
$$ y = [76820, 78912, 21579, -66052, -125946, -123589, -88447, -80586, -112193, -133138, -105111, -57221, -47712, -91578, -144503, -151580, -108907, -78810, -125405, -224140, -271947, -218887, -146527, -158184, -226590, -231401, -137764, -49707, -64338, -143074, -166938, -79462, 59062, 140855, 116286, 36373, -13310, -19635, -45781, -112577, -139762, -62951, 46011, 61574, -23153, -98902, -101834, -76588, -71755, -65682, -25538, 32265, 75546, 97428, 95413, 53654, -25846, -104317, -140392, -129467, -104690, -106594, -140222, -159550, -125014, -74486, -75587, -100662, -47281, 77472, 114576, -17174, -165938, -150996, -24949, 26862, -26092, -58461, -33393, -43426, -103187, -101905, -9985, 42236, -35267, -153260, -179553, -103056, -282, 63568, 54315, -12927, -43212, 44934, 173896]
33057A73896N826j24364q1547N0481O3663l5006o1680J8258N4979j806k9540K4897
33045E8057N3742l443n5419l1584R803J3077J3390K8318K614p1168j05178n6312
33033a44103K221J0848J2510M8295P2019M1496L170J1059L4351J5912l2240n1868
33021B3670j9410L6685P0970N4999N588k0891L570L3382J6382k3662l0937r996
33009A40350k481o268J360l659m5413p1320k5181L8010K5673l2949k9590L7598
32997B6130O0189L901m1428j8350J8972J4769j0953k7792l7351k4836L4174R9550
32985I6975R8965M7542K7029L4768j7794j27056j58185m7824P8272P7551j4976
32974I5267o0074j5014L6362K3671k1638k3398L4765Q0278L5869o8381j11062
$$ y = [173896, 179722, 55358, -26189, 24292, 87955, 52949, -8731, 9527, 64506, 62700, 33160, 58057, 111799, 108356, 52937, 21353, 31156, 44233, 57623, 85941, 88555, 17387, -87791, -144103, -141882, -131034, -118524, -70229, 1790, 43286, 46456, 57515, 91866, 107778, 75538, 23670, 4260, 40945, 111915, 166914, 172502, 151611, 155181, 188563, 204945, 181283, 150346, 140350, 137869, 131601, 132961, 129302, 83889, 12569, -12612, 25398, 51071, 18122, -11468, 26130, 86319, 90220, 48792, 30442, 49414, 64183, 53230, 25438, -11913, -36749, -2575, 96975, 195940, 243482, 270511, 305279, 287485, 160429, 2244, -45580, 32692, 110243, 95267, 35193, 20179, 56541, 80212, 58574, 35176, 69941, 150219, 186088, 117707, 6645]
32963F645l8089N4071N6044K280m245L3077K9441j6950k5997R438J3047k3683
32951I5079k3629K0694J8828n0629q3813j9325O3209P6571M4115J8527r158m6578
32939A03891m5385J1425N1337J6578m6163o5161m0718l893M3561Q4900O3421k5748
32927A48045q9247n5515K0130M1975P541j7975r980N643J1537M587k2838n6367
32915a2464n3087n467L3790L1314K1263K9774J8937l3871o8492l0700K8006K5249
32903a5748k1536l0951O373K4795N241L335M4641P5760M8951q633m4596n1684
32891C5948n1539m4850k0575M328k221l5177m8644j6252L3031N9288O5871P5569
32879E4777P3214K5491m3372n9415n102M3694K6322j4446q849K5753K1037k5197
$$ y = [6645, -31444, 22627, 78671, 80951, 76706, 109783, 139224, 122274, 96277, 105715, 118762, 95079, 71450, 92144, 110972, 60343, -23470, -42795, 20414, 96985, 141100, 159627, 150469, 103891, 58506, 69931, 121268, 137846, 91683, 26522, -14196, -18089, 25472, 110372, 173793, 148045, 58798, 3283, 23413, 65388, 72929, 54954, 44974, 50617, 62154, 66741, 43903, -12464, -65551, -71018, -37228, -5914, 15349, 45123, 64060, 30189, -38303, -69003, -40997, -15748, -37284, -68235, -61862, -37067, -31826, -28491, 16150, 91910, 140861, 132228, 87632, 35948, -15591, -60441, -81016, -76688, -78909, -114086, -162730, -178982, -145951, -86663, -20792, 54777, 127991, 153482, 110110, 50695, 45593, 89287, 115609, 101163, 92314, 118067, 139104, 113907]
32867A13907n0374l2788j6224k5477k8186K978M4522N6061K3472l5664p8443o0757
32855h6973O526M8029K0463j1097L5129J13820R7307l0461j26732p8101M6518
32844C4428R3861K3634o2589o7181m810M4245M1709J9151J3982J7451K357k6723
32832A29515m3987m4026l2521N272P0912J04000M3275o4252j01139l8661L1898
32821F0286M4377L2634L3418K7849K0880N9683J23677J26270P8858R7055J78633
32810H83620J77785J14337K60634O95932R92526O76184j07834p26940q23253o15034
32800A527957m33841l20846j94854j05884j20135j52953j04704k9945k3186n2774
32790a1165m1471q430n947n338L5568O8308K9120m4176p0634m8066k7995j9003
$$ y = [113907, 63533, 30745, 14521, -10956, -39142, -36164, 8358, 64419, 87891, 52227, -26216, -86973, -80447, -32418, -11955, -23052, 12077, 125897, 223204, 192743, 66011, -12090, 34428, 128289, 151923, 89334, 22153, 17343, 61588, 103297, 122448, 136430, 153881, 156238, 129515, 85528, 41502, 8981, 14253, 85165, 189165, 232440, 168188, 67049, 28388, 60286, 104663, 137297, 170715, 198564, 219444, 279127, 402804, 529074, 607932, 704987, 883620, 1061405, 1175742, 1436376, 2132308, 3124834, 3801018, 3693184, 2966244, 2142991, 1527957, 1094116, 773270, 578416, 472532, 352397, 199444, 94740, 64795, 41609, -11165, -52636, -61066, -67013, -72351, -36783, 31525, 60645, 16469, -54165, -102231, -130226, -149229]
32778a49229R86J8179P248j0064j23J3663j8913q5694j05070j9737J21311J91168
32766c6275J16012k3205o8852J3625Q7240M3790m0544m2869N242q375o9374o7415
32754i1000J985L5401P928n403P958j6136o2475l9201M4011P3030K9094J4431
32742c77M9740L7717k8318k5588O0548P3849l8807j04103r855Q5143Q025j29527
32730b1553j05161N3830J14340j154j09905m9656R7407J31034j126j40792j18093
32719a50829L2254J13364L6384n1752K46R4877L7065j28037j60088n508J15081
32708f6943N9268m1871m3943j2326m1149n7413J7846Q5038L1858n5585l6423M5802
32696a15841N4722l195j8277K0104L2584N516j2663j8303k6406j978O1547P6099
$$ y = [-149229, -148243, -130064, -122816, -132880, -133003, -119340, -138253, -223947, -329017, -348754, -227443, -36275, 79737, 56532, -12320, 1305, 88545, 132335, 91791, 48922, 54164, 45789, -23585, -91000, -89015, -53614, -45686, -51089, -43131, -59267, -121742, -160943, -116932, -43902, -14808, -377, 49363, 87080, 58762, 33174, 93722, 167571, 128764, 24661, 14806, 99949, 107974, -21553, -126714, -72884, 41456, 40302, -69603, -119259, -21852, 109182, 108056, -32736, -150829, -118575, -5211, 31173, -20579, -20333, 74544, 111609, -16428, -176516, -182024, -66943, -7675, -49546, -93489, -105815, -146964, -204377, -186531, -101493, -69635, -125220, -161643, -115841, -61119, -64314, -82591, -62487, -29903, -24387, -37050, -55353, -81759, -83737, -22190, 53909]
32684E3909k184o0630K526R4336O9625l2631o9056k9687j0706j4401K7265P4564
32672A02930K8188o6544o3556L7599Q3397K0247l2746j939L0118o244m8263l1343
32660E1844n721l0759n9012k4645K8949J1346o6319r7335k7567P2337J00480M5581
32648h21j7308l2183j5365L218L1377O5024M9545l0731p8788j1298Q2215M8607
$$ y = [53909, 51725, -8905, -6379, 87957, 157582, 124951, 55895, 26208, 15502, 1101, 28366, 102930, 131118, 64574, 1018, 38617, 122014, 142261, 109515, 107576, 137694, 131450, 83187, 51844, 46123, 15364, -43648, -68293, -39344, -27998, -94317, -191652, -219219, -146882, -46402, -821, -18129, -50312, -65677, -62459, -31082, 33942, 83487, 52756, -26032, -37330, 44885, 93492]
$$ [...]
##END NTUPLES=NMR SPECTRUM
##END=
