##TITLE=31Pdec_PR195Si
 , 24 sc
 1.04.2021
##JCAMPDX= 6.0         $$ Bruker NMR JCAMP-DX V2.0
##DATA TYPE= NMR SPECTRUM
##DATA CLASS= NTUPLES
##ORIGIN= UXNMR, Bruker Analytische Messtechnik GmbH
##OWNER= root
$$ XWIN-NMR		Version 3.5
$$ Thu Apr  1 13:16:06 2021 Russian Standard Time (UT+4h)  she@DPX200
##.OBSERVE FREQUENCY= 81.013821
##.OBSERVE NUCLEUS= ^31P
##.ACQUISITION MODE= SIMULTANEOUS
##.ACQUISITION SCHEME= undefined
##.AVERAGES= 24
##.DIGITISER RES= 16
##SPECTROMETER/DATA SYSTEM= spect
##.PULSE SEQUENCE= zgpg30
##.SOLVENT NAME= CDCl3
##.SHIFT REFERENCE= (INTERNAL, CDCl3, 0, 248.564)
##AUDIT TRAIL= $$ (NUMBER, WHEN, WHO, WHERE, WHAT)
$$ ##TITLE= Audit trail, XWIN-NMR		Version 3.5
$$ ##JCAMPDX= 5.01
$$ ##ORIGIN= Bruker BioSpin GmbH
$$ ##OWNER= she
$$ F:/spectra/data/she/nmr/P31/1/pdata/1/auditp.txt
$$ ##AUDIT TRAIL=  $$ (NUMBER, WHEN, WHO, WHERE, WHAT)
(   1,<2021-04-01 13:14:24.73 +0400>,<she>,<DPX200>,
      <created by zg, POWCHK disabled, PULCHK disabled
       configuration hash MD5:
       00 E9 B6 7A A2 85 ED C7 34 08 36 98 17 FE 4E 26
       data hash MD5: 32K
       8E 31 8F 94 39 56 B1 20 30 F9 25 57 7D 5A BD 23>)
(   2,<2021-04-01 13:14:53.09 +0400>,<she>,<DPX200>,
      <Start of raw data processing
       efp BC_mod = 2 LB = 1 FT_mod = 6 PKNL = 1 PHC0 = -4581.233 PHC1 = 382.001 SI = 64K 
       data hash MD5: 64K
       E4 CA 4E 62 D4 C6 42 FC 7A 15 54 D5 4E 2C 27 21>)
(   3,<2021-04-01 13:15:18.06 +0400>,<she>,<DPX200>,
      <pk PHC0 = 237.0998 PHC1 = -435.2 
       data hash MD5: 64K
       A9 41 4E 1B 81 B1 F8 9C FC C7 1F C9 D7 BE 75 C1>)
(   4,<2021-04-01 13:15:20.95 +0400>,<she>,<DPX200>,
      <abs ABSG = 5 
       data hash MD5: 64K
       14 37 90 76 5B E6 5E A2 3D 4B 53 04 0B 8A 07 A6>)
$$ ##END=
$$ 
$$ hash MD5
$$ 63 E9 BC 89 B8 26 39 9A 63 EC 16 56 EB 51 62 0E
##$RELAX= 
##$RELAX= 
##$RELAX= 
##$RELAX= 
##$RELAX= 
##$RELAX= 
##$RELAX= 
##$RELAX= 
$$ Bruker specific parameters
$$ --------------------------
##$DU= <F:/spectra>
##$EXPNO= 1
##$NAME= <P31>
##$PROCNO= 1
##$TYPE= <nmr>
##$USER= <she>
##$AMP= (0..31)
100 100 100 100 100 100 100 100 100 100 100 100 100 100 100 100 100 100 
100 100 100 100 100 100 100 100 100 100 100 100 100 100 
##$AQSEQ= 0
##$AQ_mod= 1
##$AUNM= <au_zg>
##$AUTOPOS= <>
##$BF1= 81.014009
##$BF2= 200.13
##$BF3= 200.13
##$BF4= 200.13
##$BF5= 200.13
##$BF6= 200.13
##$BF7= 200.13
##$BF8= 200.13
##$BYTORDA= 1
##$CFDGTYP= 0
##$CFRGTYP= 5
##$CHEMSTR= <none>
##$CNST= (0..31)
1 1 145 1 1 1 1 1 1 1 1 1 1 1 1 1 1 1 1 1 1 1 1 1 1 1 1 1 1 1 1 1 
##$CPDPRG= <waltz16>
##$CPDPRG1= <>
##$CPDPRG2= <waltz16>
##$CPDPRG3= <>
##$CPDPRG4= <mlev>
##$CPDPRG5= <mlev>
##$CPDPRG6= <mlev>
##$CPDPRG7= <mlev>
##$CPDPRG8= <mlev>
##$CPDPRGB= <>
##$CPDPRGT= <>
##$D= (0..31)
0 1 0 0 0 0 0 0 0 0 0 0.03 2e-05 3e-06 0 0 0 0 0 0 0 0 0 0 0 0 0 0 0 0 
0 0 
##$DATE= 1617268464
##$DBL= (0..7)
120 120 120 11 120 120 24 19 
##$DBP= (0..7)
150 150 150 150 150 150 150 150 
##$DBP07= 0
##$DBPNAM0= <>
##$DBPNAM1= <>
##$DBPNAM2= <>
$$ [...]
##$SUBNAM3= <"">
##$SUBNAM4= <"">
##$SUBNAM5= <"">
##$SUBNAM6= <"">
##$SUBNAM7= <"">
##$SUBNAM8= <"">
##$SUBNAM9= <"">
##$SW= 501.771253377433
##$SWIBOX= (0..15)
0 1 3 0 0 0 0 0 0 0 0 0 0 0 0 0 
##$SW_h= 40650.406504065
##$TD= 32768
##$TD0= 1
##$TE= 0
##$TE2= 300
##$TE3= 300
##$TEG= 300
##$TL= (0..7)
0 120 53 12 22 120 120 120 
##$TP= (0..7)
150 150 150 150 150 150 150 150 
##$TP07= 0
##$TPNAME0= <>
##$TPNAME1= <>
##$TPNAME2= <>
##$TPNAME3= <>
##$TPNAME4= <>
##$TPNAME5= <>
##$TPNAME6= <>
##$TPNAME7= <>
##$TPOAL= (0..7)
0.5 0.5 0.5 0.5 0.5 0.5 0.5 0.5 
##$TPOFFS= (0..7)
0 0 0 0 0 0 0 0 
##$TUNHIN= 0
##$TUNHOUT= 0
##$TUNXOUT= 0
##$USERA1= <user>
##$USERA2= <user>
##$USERA3= <user>
##$USERA4= <user>
##$USERA5= <user>
##$V9= 5
##$VALIST= <valist>
##$VCLIST= <CCCCCCCCCCCCCCC>
##$VD= 0
##$VDLIST= <DDDDDDDDDDDDDDD>
##$VPLIST= <PPPPPPPPPPPPPPP>
##$VTLIST= <TTTTTTTTTTTTTTT>
##$WBST= 1024
##$WBSW= 4
##$XGAIN= (0..3)
0 0 0 0 
##$XL= 0
##$YL= 0
##$YMAX_a= 54169
##$YMIN_a= -60782
##$ZGOPTNS= <>
##$ZL1= 120
##$ZL2= 120
##$ZL3= 120
##$ZL4= 120
##$ABSF1= 248.5645
##$ABSF2= -253.2056
##$ABSG= 5
##$ABSL= 3
##$ALPHA= 0
##$AQORDER= 0
##$ASSFAC= 0
##$ASSFACI= 0
##$ASSFACX= 0
##$ASSWID= 0
##$AUNMP= <proc_1d>
##$AZFE= 0.1
##$AZFW= 0.5
##$BCFW= 0
##$BC_mod= 2
##$BYTORDP= 0
##$COROFFS= 0
##$CY= -3
##$DATMOD= 1
##$DC= 0
##$DFILT= <>
##$DTYPP= 0
##$F1P= 0
##$F2P= 0
##$FCOR= 1
##$FTSIZE= 65536
##$FT_mod= 6
##$GAMMA= 0
##$GB= 0
##$INTBC= 1
##$INTSCL= 5.30512e-09
##$ISEN= 30
##$LB= 1
##$LEV0= 0
##$LPBIN= 0
##$MAXI= 10000
##$MC2= 0
##$MEAN= 0
##$ME_mod= 0
##$MI= 50
##$NCOEF= 0
##$NC_proc= -2
##$NLEV= 6
##$NOISF1= 182.463
##$NOISF2= 159.3651
##$NSP= 0
##$NTH_PI= 0
##$NZP= 0
##$OFFSET= 248.5645
##$PC= 4
##$PHC0= -4344.133
##$PHC1= -53.19901
##$PH_mod= 1
##$PKNL= yes
##$PPARMOD= 0
##$PSCAL= 0
##$PSIGN= 0
##$REVERSE= no
##$SF= 81.014009
##$SI= 65536
##$SIGF1= 159.3651
##$SIGF2= -187.1042
##$SINO= 113.3802
##$SIOLD= 16384
##$SREGLST= <1H.CDCl3>
##$SSB= 0
##$STSI= 65536
##$STSR= 0
##$SW_p= 40650.406504065
##$SYMM= 0
##$S_DEV= 0
##$TDeff= 32768
##$TDoff= 0
##$TI= <>
##$TILT= no
##$TM1= 0
##$TM2= 0
##$TOPLEV= 0
##$USERP1= <user>
##$USERP2= <user>
##$USERP3= <user>
##$USERP4= <user>
##$USERP5= <user>
##$WDW= 1
##$XDIM= 65536
##$YMAX_p= 459029250
##$YMIN_p= -2417654
$$ End of Bruker specific parameters
$$ ---------------------------------
##NTUPLES= NMR SPECTRUM
##VAR_NAME=  FREQUENCY,     SPECTRUM/REAL,   SPECTRUM/IMAG
##SYMBOL=    X,             R,               I
##VAR_TYPE=  INDEPENDENT,   DEPENDENT,       DEPENDENT
##VAR_FORM=  AFFN,          ASDF,            ASDF
##VAR_DIM=   65536,         65536,           65536
##UNITS=     HZ,            ARBITRARY UNITS, ARBITRARY UNITS
##FACTOR=    0.620285442955139, 1,           1
##FIRST=     20137.2065510759, 0,            0
##LAST=      -20513.1999529892, 0,           0
##MIN=       -20513.1999529892, -2417654,    0
##MAX=       20137.2065510759, 459029250,    0
$$ Real data points
##PAGE= N=1
##DATA TABLE= (X++(R..R)), XYDATA
$$ [...]
39205a47716j36423p2921j4231L126K6727P3889J02814Q9287N3688K1326J2641
$$ -147716 -284139 -357060 -371291 -368165 -341438 -267549 -164735 -75448 -21760 -434 12207
39194A2207M6457R8519R5559J2962o5551n9100j5781l6225j03942j02066J514
$$ 12207 58664 157183 252742 265704 200153 141053 125272 89047 -14895 -116961 -115447
39183a15447R2952O7598l5730r7852n8650M5438J35041J38123K7930j35577k20471
$$ -115447 -22495 45103 9373 -88479 -147129 -101691 33350 171473 199403 63826 -156645
39172a56645j35937N4911J72868J05764n9955j30768l5776Q6018P0933m2628o3737
$$ -156645 -292582 -237671 -64803 40961 -18994 -149762 -185538 -99520 -28587 -71215 -134952
39161a34952P5225K03305J35443p1559j90701j14637L8085J06738O7823o489p0849
$$ -134952 -59727 143578 279021 207462 16761 -97876 -59791 46947 114770 108281 37432
39150C7432j12033r5962m531R6068J10920M2605j3420p822J0726O599K3237P6155
$$ 37432 -74601 -170563 -175094 -79026 31894 74499 61079 53257 63983 70582 93819 169974
39138A69974P3244n0600j83998j63059j8394N8400P082j5561R1024J83435R3462
$$ 169974 243218 192618 8620 -154439 -172833 -114433 -107351 -122912 -31888 151547 245009
39127B45009r1301j37883M418J54209J55788M0525p0186r8348l8011M5185M5923
$$ 245009 153708 15825 20243 174452 330240 370765 300579 202231 164220 209405 255328
39116B55328n3669j16607k7869J02181P1165r8040j66811l0863J39294J68826
$$ 255328 201659 85052 57183 159364 230529 132489 -34322 -65185 74109 242935
39106B42935R2718Q085r0624j94330j77549O948J69258J16971m7727p0748P5840
$$ 242935 335653 343738 253114 58784 -118765 -111817 57441 174412 126685 55937 131777
39095A31777J71111Q5327o0434j07874o5801l4719m5295m7510j893O6210Q5049
$$ 131777 302888 388215 327781 219907 154106 119387 74092 26582 24689 90899 175948
39084A75948J5885o9512m7547P7447J41639N5154l8631K1534J35416Q0735j13034
$$ 175948 191833 122321 74774 152221 293860 349014 310383 331917 467333 548068 435034
39073D35034j73569k616J55371P4325j18774j41079L5274J61301O6241j30013
$$ 435034 261465 258849 414220 488545 369771 228692 263966 425267 491508 361495
39063C61495j93665o3819R9283J17613p573j21776j15089l6714Q036M939O863
$$ 361495 167830 104011 203294 320907 313334 191558 76469 39755 47791 52730 59593
39052E9593J7134l374l7371k4429L2224P1635Q4525J12516J39754J03021K0852
$$ 59593 76727 73353 35982 11553 43777 115412 199937 312453 452207 555228 576080
39041E76080j2091J7305J7631m0870p8305p2307j17885k34782k65735r5014J45518
$$ 576080 563989 581294 598925 558055 479750 407443 289558 54776 -210959 -305973 -160455
39030a60455K29451J16338m9806j51683j73954j23582j8463O6677O4527J2484
$$ -160455 68996 185334 135528 -16155 -190109 -313691 -332154 -265477 -200950 -188466
39020a88466j0990j4017m8074p6687k1583P5414Q1645j6256o7578K6213J60825
$$ -188466 -199456 -213473 -261547 -338234 -359817 -284403 -202758 -219014 -286592 -260379 -99554
39009i9554J67282K9772j06295j11248n363P6073L3834p9469j15367j6651J01995
$$ -99554 67728 97500 -8795 -120043 -125406 -49333 -15499 -94968 -210335 -226986 -124991
38998a24991J09392L3125r947o812m0826j06325q6466M3379J36611Q5894n611
$$ -124991 -15599 17526 7579 767 -40059 -146384 -232850 -189471 -52860 33034 27423
38987B7423J8674J22390J27661j7511j61092j53657k2413J01378J38791R0098
$$ 27423 46097 168487 296148 278637 117545 -36112 -58525 42853 181644 271742
38977B71742j9910j41320j85824j04347L1693J04858J00389R1034P8445j6284
$$ 271742 251832 110512 -75312 -179659 -147966 -43108 57281 148315 226760 210476
38967B10476j61768j79505j8071R2183l9347k09285p9256K52911L07523n7561
$$ 210476 48708 -130797 -148868 -56685 -96032 -305317 -384573 -131662 175861 118300
38957A18300l61813j81831K07474K47209o3880k08958K4929K55435J44110j06983
$$ 118300 -243513 -425344 -217870 29339 -34541 -243499 -218570 36865 180975 73992
38947G3992j36250K4429Q2694l0590j21347p5256L3054J30892K12583K25206R7984
$$ 73992 -62258 -37829 44865 14275 -107072 -182328 -149274 -18382 194201 419407 517391
38936E17391r3886j67523p1490M7324M8337m5082j23029j25700o8506k956K2107
$$ 517391 423505 255982 184492 231816 280153 235071 112042 -13658 -82164 -85120 -63013
38925f3013L652j6469k5869o2558j11835p3503P0762J59369O8616o3622k9612
$$ -63013 -59361 -75830 -101699 -164257 -276092 -349595 -278833 -119464 -50848 -114470 -144082
38914a44082J00450P3833j14476j77270P170J80915J07700n9191l5956J44737
$$ -144082 -43632 30201 -84275 -261545 -254375 -73460 34240 -24951 -60907 83830
38904H3830K10308P4770p5510r7875n6774m1727k3448L4764O7228l94j26348j91581
$$ 83830 294138 368908 293398 195523 138749 97022 73574 108338 175566 175172 48824 -142757
38892a42757j28263J8881J34055J32421M2890l1366m5681m4467l8047L6417J57993
$$ -142757 -271020 -252139 -118084 14337 57227 25861 -19820 -64287 -102334 -65917 92076
38881I2076J61233k8537k14828j70456K4826J01631K776p6226l6118M738j7287
$$ 92076 253309 224772 9944 -160512 -135686 -34055 -31279 -107505 -143623 -138885 -156172
38870a56172J0738J21017J36969l6741k03893j47316N0166J52197J07672L9606
$$ -156172 -145434 -24417 112552 75811 -128082 -275398 -225232 -73035 34637 74243
38860G4243l565o8172j22347p3517M9121J03967L9435n0686p9602n5022j2077
$$ 74243 70678 2506 -119841 -193358 -144237 -40270 -835 -51521 -131123 -186145 -198222
38849a98222L3109N9034N4361M8755N8796M1241k3696o1776j2465N8601O3978
$$ -198222 -165113 -106079 -51718 -2963 55833 97074 73378 11602 -863 57738 121716
38838A21716L8646N2504N6361k8282j31674j26200m5624k3080m7805K092R9061
$$ 121716 160362 212866 269227 240945 109271 -16929 -62553 -85633 -133438 -131346 -32285
38827c2285P8129o1055j09777J2628J08243J3413j35845j13577O7731K10613K15750
$$ -32285 45844 -15211 -124988 -112360 -4117 9296 -126549 -240126 -172395 38218 253968
38816B53968J45629O4327l1033j31503j88336j78959j32648q0992k3049N3897
$$ 253968 399597 463924 432891 301388 113052 -65907 -198555 -279547 -302596 -248699
38806b48699J33675J59093Q7632k4376n0710L8580J09910N1321n3506o1810n717
$$ -248699 -115024 44069 131701 107325 56615 95195 205105 256426 202920 141110 135393
38795A35393j9253q5687o3221N3378J13749O7024J7334m66o3989j36466o0664
$$ 135393 116140 30453 -32768 20610 134359 201383 218717 218251 154262 17796 -42868
38784d2868J27362J52315p9239k69238j50855R6179J13443j01827k13856m1687
$$ -42868 84494 236809 157570 -111668 -262523 -166344 -52901 -154728 -368584 -410271
38774d10271K19785K90515J32854o4569j27277o4349j4816m2737m9149M1714J05726
$$ -410271 -190486 100029 232883 168314 41037 -23312 -38128 -80865 -130014 -88300 17426
38763A7426N875j18526j7150K30444K64750K918j99411q1428J65769K67551K62688
$$ 17426 23301 -95225 -112375 118069 382819 385737 186326 104898 270667 538218 800906
38752H00906K89740K85430J86361J70059L98273P43709J030909J312974J708350
$$ 800906 1090646 1376076 1562437 1732496 2130769 2874478 3905387 5218361 6926711
38743F926711K298333L343743M977116O263438N390894J802494k322577l971865
$$ 6926711 9225044 12568787 17545903 23809341 29200235 31002729 28680152 24708287
38735B4708287k705309j027559j156520k593647l441255l018486k168930j641121
$$ 24708287 22002978 20975419 19818899 17225252 13783997 10765511 8596581 6955460
38727F955460j326614r74691p08718o50671o46130n71375n19789n43792n21163
$$ 6955460 5628846 4654155 3945437 3294766 2648636 2077261 1557472 1013680 492517
38718D92517l85212k37400j50147p0287J8615L0117o0351j38447j04692M787R7900
$$ 492517 107305 -130095 -280242 -350529 -331914 -301797 -362148 -500595 -605287 -600500 -502600
38707e02600J41114J55733J55588J22929M0767n2532p4046r546L4731j2942m8059
$$ -502600 -361486 -205753 -50165 72764 113531 60999 -13047 -22593 12138 -804 -48863
38696d8863M6213J57418Q3779j14129j65010o053J34105J20953P6245P3454O524
$$ -48863 -2650 154768 238547 124418 -40592 -46645 87460 208413 284658 358112 364636
38685C64636j08464n5881J70153K41141K0146j53581j3805J59229Q609k75703
$$ 364636 256172 200291 370444 611585 631731 478150 464345 623574 632183 356480
38675C56480k78261n8929m656j36474j20729Q7540J69982M5450J0369J67347K14749
$$ 356480 78219 19290 14634 -121840 -242569 -155029 14953 60403 70772 238119 452868
38664D52868l612j85938o5466J53250J44269m0024j24057n6101l223l3704o9883
$$ 452868 449256 263318 197852 351102 495371 455347 331290 275189 271966 238262 168379
38653A68379p8501q7343o2896M5601J72657J95651J06036Q385k6302j4654J956
$$ 168379 89878 2535 -60361 -14760 157897 353548 459584 467969 441667 427013 428969
38642D28969n327n1873j11534j15179k8236R2119J50211J02512j2133j00406q2745
$$ 428969 423642 371769 260235 145056 116820 208939 359150 461662 449529 349123 266378
38631B66378J7120P0703l253j15746j22199k6518M1937L2762K2382N7739R1284
$$ 266378 283498 354201 350948 235202 113003 86485 128422 161184 183566 241305 332589
38620C32589R1510Q3782N4485m6449j68864j73809m3319N9921K3210n4893l5444
$$ 332589 424099 507881 562366 515917 347053 173244 129925 189846 213056 158163 122719
38609A22719M2124M0408n0678j05006n2482L2594M4552k7589j05488j09823k8514
$$ 122719 164843 205251 154573 49567 -2915 29679 74231 46642 -58846 -168669 -197183
38598a97183P9387J33602R1214k8131j50615j83371q7790N9340J26552Q0381J7930
$$ -197183 -117796 15806 107020 78889 -71726 -255097 -342887 -283547 -156995 -76614 -58684
38587e8684J0156K576n2574o7156M6818J82368J45977n7436k09535j63276J109
$$ -58684 -48528 -45952 -98526 -165682 -118864 63504 209481 152045 -57490 -220766 -219657
38576b19657J31156J73167J42274N3937l9013m0678O9646J72826J37474j9000
$$ -219657 -88501 84666 226940 280877 241864 201186 270832 443658 581132 562132
38566E62132j49390j42096l4120M3617K3670k1448O38L5793n3325k39515k95600
$$ 562132 412742 270646 236526 280143 303813 282365 283003 318796 265471 25956 -269644
38555b69644r7650J71603K55078J42705R530n5197p2235k3386J01870J74790P4526
$$ -269644 -367294 -195691 59387 202092 211622 156425 84190 60804 162674 337464 411990
38544D11990p4234n3358Q6376Q5699r3738j95350q6705L9224L474q0657l4308
$$ 411990 337756 284398 370774 456473 362735 167385 80680 119904 123378 42721 8413
38533H413R4837J47239R5188R172p5748j14576k2407J57760K06420J8621j91902
$$ 8413 103250 250489 345677 354849 279101 164525 142118 299878 506298 524919 333017
38522C33017j69808J5521Q9902k0502j26257q8836R416L1982l3652j03985r8970
$$ 333017 163209 178730 268632 248130 121873 33037 42453 74435 40783 -63202 -162172
38511a62172P305J51400J96617O9210j24309j96796r4736O1493J42553J31591
$$ -162172 -154867 -3467 193150 262360 138051 -58745 -153481 -91988 50565 182156
38501A82156P5937M238o8631j06263p2035J8511R3353Q9168K0602l5486l5290
$$ 182156 258093 262331 193700 87437 15402 33913 127266 216434 237036 201550 166260
38490A66260j7350l1760o0181n2752q918L4020N8518N7643J5746l9392l1873L5334
$$ 166260 148910 117150 56969 4217 -4701 29319 87837 145480 161226 121834 89961 125295
38478A25295L8068p3249j44700m8280P1463N766j50364j24898P2156J47173J4151
$$ 125295 163363 90114 -54586 -102866 -31403 -25637 -176001 -300899 -228743 -81570 -67419
38467f7419o5477N2774J43707K2031j12589j2854J85124J84972Q848p7806j4941
$$ -67419 -132896 -80122 63585 85616 -26973 -39827 145297 330269 339117 261311 246370
38456B46370P570q0947j23534k7387Q4708Q0098q532p4358o8571k156P6584R0175
$$ 246370 253940 172993 49459 22072 106780 186878 178346 103988 35417 33261 109845 200020
38444B00020J3161o1248l2976M7126M1737o5166j39393p9082O8107J76760J63187
$$ 200020 213181 151933 118957 166083 207820 142654 3261 -75821 -7714 169046 332233
38433C32233M1152q6849j16587n9139k3108n3546p9632o2140o0576p8572j511
$$ 332233 373385 286536 169949 110810 87702 34156 -45476 -107616 -168192 -246764 -248275
38422b48275J85505K78749J33111p9895j03029L0972R4352M6444M3559J04127
$$ -248275 -62770 215979 349090 269195 166166 197138 291490 337934 381493 485620
38412D85620O2677j06630k00128j09186O309p895n9337K781J19136J21313O937
$$ 485620 548297 441667 241539 132353 138662 130767 71430 74211 193347 314660 321597
38401C21597o1925k717R1903J13852Q2779P8428R4382M2070r2894j79447j02632
$$ 321597 259672 256955 348858 462710 545489 623917 718299 760369 667475 488028 385396
38390C85396M8980P7942m3239j34804q7392p837m299o937N8423R0200q130j15722
$$ 385396 434376 512318 469079 334275 246883 239046 234747 227810 286233 376433 368303 252581
38378B52581q1543N129k0247p4833L7235K39754K55602M7121j33227j48923j17159
$$ 252581 171038 176167 155920 81087 118322 358076 613678 660799 527572 378649 261490
38367B61490j04028k2066Q8506K7451j84239k35081j3210J68885O3440j22506
$$ 261490 157462 135396 223902 251353 67114 -167967 -181177 -12292 51148 -71358
38357g1358j04108J6726L226o0129L8717J83894J06691r9500r0942J38243K28569
$$ -71358 -175466 -158740 -155514 -215643 -176926 6968 113659 14159 -76783 61460 290029
38346B90029M9002j16229p5265j2703r8190j78452q5747M9729M7330j0175L2476
$$ 290029 339031 222802 147537 134834 36644 -141808 -227555 -177826 -130496 -140671 -108195
38335a08195J04243O2915k2375j0317L4805k3338j02592l1705J17749J23557j5009
$$ -108195 -3952 58963 36588 26271 61076 37738 -64854 -96559 21190 144747 129738
38324A29738q9958m3147j6726m7737j8837N4883O550j40334j28467J08088K78166
$$ 129738 39780 -3367 -20093 -67830 -86667 -31784 -25234 -165568 -294035 -185947 92219
38313I2219J65432n0154j08083m9233l9759m2290N0632J32735M1255j23768j35414
$$ 92219 257651 207497 99414 50181 10422 -31868 18764 151499 192754 68986 -66428
38302f6428l513Q3333R0847J13841J00497n9189k18478j21617J29531J53051j01866
$$ -66428 -69941 13392 104239 218080 318577 259388 40910 -80707 48824 201875 100009
38291A00009k31774j5332K27480J54072p3012r8286N2117P7960p1601j53328n2538
$$ 100009 -131765 -147097 80383 234455 161443 63157 115274 193234 121633 -31695 -84233
38280h4233P5867R9005P1074O3622M5633n316l4789j6167m837l8230o9746m0252
$$ -84233 -8366 90639 161713 225335 270968 265652 230863 214696 209859 171629 101883 61631
38268F1631M2228J12141J04106J4737p3908p8307l3754m6061j03982p2661O8641
$$ 61631 103859 216000 320106 334843 260935 182628 148874 102813 -1169 -73830 -5189
38257e189J43458M4277p6457l8281Q4207J01542J7499k3008j1572o0560j49495
$$ -5189 138269 182546 106089 67808 152015 253557 271056 248048 236476 175916 26421
38246B6421j34092j3955M2639k1291o3875O85O1166J5879n0083p115J23162K16564
$$ 26421 -107671 -121626 -78987 -100278 -164153 -163468 -102302 -86423 -136506 -143621 -20459 196105
38234A96105J98521P4978r4578j94683j30297K7183P9632l5359j37387n9467J01197
$$ 196105 394626 469604 375026 180343 50046 77229 156861 121502 -15885 -75352 25845
38223B5845J28690M319r0519n7653N379N42k4035J467K7890j2269n2603J3635
$$ 25845 154535 158854 68335 10682 16061 16603 -7432 -5965 21925 9656 -42947 -29312
38211b9312J30041J28858o788r9147m7402K4108r437o1758o059P9939M7518m1723
$$ -29312 100729 229587 222799 123652 76250 100358 90921 29163 23104 103043 150561 108838
38199A08838j2841R7161Q3897n8404j08737q084K7776j03100j86903n8159J08289
$$ 108838 95997 193158 277055 218651 109914 101830 129606 26506 -160397 -218556 -110267
38188a10267J02187L8341J29779K81859K31427j2523j81396j60407j02441j25913
$$ -110267 -8080 30261 160040 441899 673326 660803 479407 319000 216559 90646
38178I0646j56266j10895l3630J1328K5506K0344r01K490N9333J06801P0955q650
$$ 90646 -65620 -176515 -210145 -198817 -173311 -152967 -153868 -151378 -92045 14756 85711 77061
38166G7061m7998n4469o8679m8666L7857R1098K5160m8505J3628J17761O5116
$$ 77061 29063 -25406 -94085 -142751 -104894 -13796 11364 -37141 -23513 94248 159364
38155A59364j01050j43142j0200R4287M9289l3146m5747l7416n3432l8209J7190
$$ 159364 58314 -84828 -95028 -741 48548 15402 -30345 -67761 -121193 -159402 -142212
38144a42212K0035m5262n5682M4217J27879P0140p5027j52515p1057J34434L09591
$$ -142212 -122177 -167439 -223121 -178904 -51025 19115 -55912 -208427 -279484 -145050 164541
38133A64541K69166Q894k10896j58980M2092R6720j3494m1866P1518R6621o0769
$$ 164541 433707 442601 231705 72725 114817 211537 198043 156177 227695 324316 263547
38122B63547j66115m9028J03479N6534j06482j59780r1838m5332l5193L4386J49403
$$ 263547 97432 48404 151883 208417 101935 -57845 -149683 -195015 -230208 -195822 -46419
38111d6419J90861J21526J2567p5782j18064q7061r366P897p8942j45473n6829
$$ -46419 144442 265968 278535 202753 84689 -2372 -11738 -3841 -82783 -228256 -285085
38100b85085J26770K18548J37933k6693j50295j72949r9385J7425J00587J08909
$$ -285085 -158315 60233 198166 171473 21178 -151771 -251156 -233731 -133144 -24235
38090b4235O5162J4824q481J4486N6686L3133q7104j78796r7235R0769J66322
$$ -24235 40927 55751 47270 61756 118442 151575 64471 -114325 -211560 -120791 45531
38079D5531O4940m6278m0623p09l4186q8743o6180R820N7871P0041P4622N3936
$$ 45531 110471 64193 23570 22861 -11325 -100068 -166248 -156428 -98557 -28516 46106 100042
38067A00042p524o3410o7617l5736o80K6335L1821J5793K4362O8838N3738o9720
$$ 100042 92518 29108 -38509 -74245 -74925 -48590 -16769 -976 23386 92224 145962 76242
38055G6242j39552J0821K23069J75155j11893k52080o5887J60243J40661p472
$$ 76242 -63310 -52489 170580 345735 233842 -18238 -84125 76118 216779 209307
38045B09307m7968j4802m1706n2638O2554J57385M6507j28997r4703R4950J33691
$$ 209307 161339 146537 104831 52193 114747 272132 318639 189642 94939 189889 323580
38034C23580m0138j64476q6878L7297M7325N929J8658L9269j6435j07374j31846
$$ 323580 283442 118966 32088 69385 116710 122639 141297 180566 164131 56757 -75089
38023g5089o7484K7060Q6254P6560J9864j0095K8633P7635N7328j2270m7014k5132
$$ -75089 -142573 -115513 -29259 47301 67165 57070 85703 163338 220666 208396 161382 136250
38011A36250O241K2279L0823J8175k7343o0974l5657J1554Q695l5978m5652J3284
$$ 136250 142491 164770 195593 213768 186425 125451 89794 101348 110043 74065 28413 41697
37999D1697R5355J35812J00406M920q1114r7447q3494j29142k07813j71845K2856
$$ 41697 137052 272864 373270 378190 297076 199629 116135 -13007 -220820 -392665 -369809
37988c69809K07553K12144Q2580j9848m1845m1738m8338m0764j7526J4380O6408
$$ -369809 -162256 49888 132468 112620 70775 29037 -19301 -60065 -77591 -63211 3197
37977C197J06871N3469q4935j55010n7727Q8894J08084O925o6909m4376J7544
$$ 3197 110068 163537 78602 -76408 -134135 -45241 62843 69768 2859 -41517 -23973
37966b3973N6908N7458J7805l4401m1766k987Q834k2470r398P2766R7565j9035
$$ -23973 32935 90393 108198 73797 32031 29044 37878 15408 6010 78776 176341 157306
37954A57306j55559j51515l3029O6841J11354J35204J12850J3324q7808j02115
$$ 157306 1747 -149768 -182797 -115956 -4602 130602 243452 256776 168968 66853
37944F6853o6290n3942l5477L4311Q4188L6811l7819l4073J4744K6092K5973N2437
$$ 66853 563 -53379 -88856 -54545 29643 66454 28635 -5438 9306 35398 61371 113808
37932A13808K3889j03656j74831n7797Q9161L7067j24028j14278P2544J59504
$$ 113808 137697 34041 -140790 -198587 -109426 -72359 -196387 -310665 -238121 -78617
37922g8617M2880o6961k2530M5615K266o6001m2985J0957L776k860Q3649J96067
$$ -78617 -35737 -102698 -125228 -79613 -77347 -143348 -186333 -175376 -171600 -174460 -90811 105256
37910A05256J95339Q2131q497M148N3766K4348r8984j90200j21415M6539R5646
$$ 105256 300595 382726 374229 378377 432143 456491 357507 167307 45892 92431 188077
37899A88077n5790j92990q0074J80302K56258L6603k33932l02666j94632o8304
$$ 188077 132287 -60703 -140777 39525 295783 332386 98454 -204212 -398844 -467148
37889d67148L6544J62735K56424J96082p879j70670j39605K2759J26953R8436
$$ -467148 -430604 -267869 -11445 184637 176758 6088 -133517 -110758 16195 114631
37879A14631L8852K8483o989j29437k03925p0417J62201K32408J27922R4174J91703
$$ 114631 153483 181966 174977 45540 -158385 -228802 -66601 165807 293729 387903 579606
37868E79606J63571j09616l35567k34207J8300O5750r3243j64097l3132J22951
$$ 579606 743177 633561 297994 63787 82087 147837 54594 -109503 -142635 -19684
37858a9684J48287O6336l6296p5010K1919J82351J77204o3100k63514j73681M0659
$$ -19684 128603 194939 158643 83633 105552 287903 465107 402007 138493 -35188 5471
37847E471O6801n4552n1539P9123R5290k8461p2431L360J0519o5736k1315J43792
$$ 5471 72272 17720 -33819 45304 140594 112133 39702 43062 53581 -12155 -33470 110322
37835A10322J58689m7482j86109p5243Q0189N8145l9776k8466L7602O144r6451
$$ 110322 269011 221529 35420 -39823 40366 98511 58735 30269 67871 74015 -22436
37824b2436j29727n0585P5943J63116J28908k6234j38845n3782J19270J38819
$$ -22436 -152163 -202748 -126805 36311 165219 138985 140 -53642 65628 204447
37814B04447J4903j5951Q7798J02645m6083j46475q7719m0403j01539j03738L5251
$$ 204447 219350 203399 291197 393842 347759 201284 113565 73162 -28377 -132115 -96864
37803i6864J09895j312q2800L9074J66147P6250p1632j8260J34534J10987n0428
$$ -96864 13031 11719 -71081 -32007 134140 210390 138758 120498 255032 366019 315591
37792C15591p2814P9243J49234N469j84387k20893r9898M7688R1812o990j33973
$$ 315591 242777 322020 471254 476723 292336 71443 -28455 19233 111045 104055 -29918
37781b9918j10369N9763J57160P1595k0641L5746R9361l47j18172k6763J50124
$$ -29918 -140287 -80524 76636 148231 127590 163336 262697 262350 144178 117415 267539
37770B67539R9951j48528k33443j8129K10362J90663L0174l9696m404P903l4194
$$ 267539 367490 218962 -14481 -32610 177752 368415 398589 358893 354489 362392 328198
37759C28198o9037p3305n3304J1100J04307J34497N8272k3779l115O1664K7069
$$ 328198 259161 185856 132552 143652 247959 382456 440728 416949 413834 475498 502567
37748E02567j04034j66836p5534M2755L3874n3239m5850Q1591J65903J06047L785
$$ 502567 398533 231697 156163 198918 232792 179553 133703 215294 381197 487244 491029
37737D91029j8480L463p164n752O2680J05760L1713l6638P3067K62636K70726
$$ 491029 472549 476012 468848 463096 525776 631536 663249 626611 699678 962314 1233040
37726A233040Q3296m6890j8804j9240j52548k35871j23250K7516J5815q3235q1723
$$ 1233040 1316336 1269446 1250642 1231402 1078854 842983 719733 747249 763064 679829 598106
37715E98106L892K6341k0191k1401L9774Q0856Q2203Q7820Q9405N0582K923k764
$$ 598106 601998 628339 608148 586747 626521 707377 789580 877400 966805 1017387 1020310 1017546
37703A017546Q082q584k2748O545M2810L9290K1734K1247R509k4420l9215n6754
$$ 1017546 1025628 1017044 994296 1000841 1043651 1082941 1104675 1125922 1135431 1111011 1071796 1015042
37691A015042j72301l52462l89819k03441j8949n6613j85122j26558R1203J64375
$$ 1015042 842741 490279 100460 -102981 -121930 -178543 -363665 -490223 -399020 -234645
37681b34645j9559k09581j52246P9634K27435J80865M9889l1194n2755p0003p3472
$$ -234645 -254204 -463785 -616031 -536397 -308962 -128097 -78208 -109402 -162157 -232160 -305632
37670c05632j352J15514J24357m2254k05634j39288R9954K19628Q9573r7605j25385
$$ -305632 -306984 -191470 -67113 -109367 -315001 -454289 -354335 -134707 -45134 -142739 -268124
37659b68124k7489L7292K3176j3165l6700l1064K8521J07124J12871L6428k3787
$$ -268124 -295613 -258321 -235145 -248310 -285010 -316074 -287553 -180429 -67558 -31130 -54917
37648e4917k5629l0805m2511K1899J25527Q9889j08768k32720j20221O8527J11076
$$ -54917 -80546 -111351 -153862 -131963 -6436 83453 -25315 -258035 -378256 -309729 -198653
37637a98653L9858J1429L3167K7859K1758N9805O6260j0128m8769L9668J08406
$$ -198653 -158795 -147366 -114199 -86340 -64582 -4777 61483 51355 2586 42254 150660
37626A50660L022j44747j13644L0894M6551p0721q5812O8805J73058O4205j24531
$$ 150660 153682 8935 -104709 -73815 -27264 -97985 -183797 -114992 58066 122271 -2260
37615b260j59732L612K00462K37615P0541j46987k08040q4656N2021P6007M4049
$$ -2260 -161992 -158380 42082 279697 350238 203251 -4789 -89445 -37424 38583 82632
37604H2632K9585q034p9107p4634K8042N9031o2573j35603J0300J97416J68404
$$ 82632 112217 104183 25076 -49558 -21516 37515 -25058 -160661 -150361 47055 215459
37593B15459J0391j884J31109J63288L1290p8893p4158n1792n0834j511N6819
$$ 215459 225850 223966 355075 518363 549653 470760 396602 344810 293976 292465 349284
37582C49284o967j43400j44427O600P6270m6532j73650j23562K1259R7476J12860
$$ 349284 342317 198917 54490 61090 137360 90828 -82822 -206384 -185125 -87649 25211
37571B5211J56822J89709Q8938j38068l06002k37816K6987K30955J54685j14506
$$ 25211 182033 371742 460680 322612 16610 -221206 -194219 36736 191421 76915
37561G6915k61878j34389Q0346J47082R3507P9204J06359O7456k2394n7076l6841
$$ 76915 -184963 -319352 -239006 -91924 1583 80787 187146 254602 232208 175132 138291
37550A38291l6256l6575J9517O8550J1647j00418j46626j28490j07770m6862R4107
$$ 138291 102035 65460 84977 153527 165174 64756 -81870 -210360 -318130 -364992 -270885
37539b70885K02392J63587O3994L2813J1255q7790j43184l0687Q6598j402j58484
$$ -270885 -68493 95094 159088 191901 203156 115366 -27818 -58505 28093 26691 -131793
37528a31793j13343N8312P2142l7900J0907J93444J81094o4017j89157m1678J08380
$$ -131793 -245136 -186824 -114682 -152582 -141675 51769 232863 168846 -20311 -61989 46391
37517D6391P1796J3354N0338J9921j35955j70819K5484J70409N6021q3901J0117
$$ 46391 118187 131541 181879 201800 65845 -104974 -79490 90919 146940 63039 73156
37506G3156J61099O5071j90671k81050j33168O4608J92795K40747J54673o3509
$$ 73156 234255 299326 108655 -172395 -305563 -240955 -48160 192587 347260 283751
37496B83751k17469j43571K4240N7373j6604j7294M9947L6656m5044m1801N0372
$$ 283751 66282 -77289 -53049 4324 -12280 -29574 20373 57029 11985 -29816 20556
37485B0556P2827j8225q6789n0226J3019J9047j3587m2100o0098n2621J0118J06023
$$ 20556 93383 75158 -11631 -61857 -48838 -29791 -43378 -85478 -145576 -198197 -188079 -82056
37473h2056J52324Q5394o7445j85245j42369L7925J52851N8385r6438n0199J65762
$$ -82056 70268 155662 88217 -97028 -239397 -201472 -48621 9764 -86674 -136873 28889
37462B8889K39073M5725j51573r7985R9979J83435R8261l8529j46746j75504o6028
$$ 28889 267962 313687 162114 64129 164108 347543 445804 407275 260529 85025 18997
37451A8997R4573P2393j59929k78755o3292K19145J90544n9151j39244K2674J38828
$$ 18997 113570 185963 26034 -252721 -316013 -96868 93676 34525 -104719 -82045 56783
37440E6783Q4915L5088M6005n9326k71060k66123P7690L80390K61280j04268k49273
$$ 56783 141698 176786 222791 163465 -107595 -373718 -296028 84362 345642 241374 -7899
37429g899p7266P8960K075j37892j12402K9942R1320K3729n2045m8019J846L0577
$$ -7899 -85165 -6205 -4130 -142022 -254424 -224482 -133162 -109433 -161478 -209497 -207651 -177074
37417a77074J8991j3437l1655J652P8363J15074M1167p7512r1153K3027R9551
$$ -177074 -158083 -171520 -203175 -201523 -123160 -8086 33081 -44431 -135584 -112557 -13006
37406a3006J2715j19553q5113J12437K43961J69439J7867j5129O2909Q1568l6009
$$ -13006 -291 -119844 -204957 -92520 151441 320880 338747 323618 386527 468095 432086
37395D32086j68638j57560P18J55892J69067M6441q4142j00335J8928J87006K64841
$$ 432086 263448 105888 106606 262498 431565 478006 393864 293529 312457 499463 764304
37384G64304J63236m1846j25492N5127L53455M75539L36875J33624L2318k5889
$$ 764304 927540 885694 760202 815329 1168784 1644323 1981198 2114822 2147140 2121251
37374B121251j31619k17584k04083j58840j43902p1367R3420J57297k5908k56401
$$ 2121251 1989632 1772048 1567965 1409125 1265223 1193856 1287276 1444573 1418665 1162264
37364A162264k52106r1252o6856j84754j77614k073O9243p8819k00805r5209R1320
$$ 1162264 910158 818906 752050 567296 389682 387609 456852 378033 177228 82019 173339
37353A73339J25833J3461r3883j17631n7039N3241J04662R536j20172r6537K1600
$$ 173339 299172 312633 218750 101119 44080 97321 201983 211519 91347 -5190 16410
37342A6410k582j58554j60730O3803K16446J12677k8010P417O6255m2442j64066
$$ 16410 13828 -144726 -305456 -241653 -25207 87470 59460 66877 133132 90690 -73376
37331g3376o8791J32621J80228Q4947K9500J1768p9475j64773q9763N1687L9514
$$ -73376 -142167 -9546 170682 255629 285129 296897 217422 52649 -37114 14573 54087
37320E4087r0689j06407K0249Q2197K222o6279k7094L3380M7043N7579P0444J8420
$$ 54087 -36602 -143009 -122760 -40563 -38341 -104620 -131714 -98334 -51291 6288 76732 95152
37308I5152p7028r3972k973Q3451P9083L961r7668j73532j25973O8171K25717
$$ 95152 18124 -75848 -78821 4630 83713 87674 -9994 -183526 -309499 -241328 -15611
37297a5611J42272r6481j95940n9003J04578J15263M6369K6363K9203p845k8798
$$ -15611 126661 30180 -165760 -224763 -120185 -4922 41447 67810 97013 89168 60370
37286F0370K0631M4597n6635j74173j13654R2476J87012M7873j25880j04114L1655
$$ 60370 81001 125598 68963 -105210 -218864 -126388 60624 108497 -17383 -121497 -89842
37275h9842K7812j17790j27240J00297K66033R8578k01669k29225L2565K11901
$$ -89842 -62030 -179820 -307060 -206763 59270 157848 -43821 -273046 -240481 -28580
37265b8580J10183p6586j35358r7871l1282J04180K47248K01989j0176p8020J04937
$$ -28580 81603 5017 -130341 -228212 -259494 -155314 91934 293923 283747 205727 310664
37254C10664J98049n0424l40636k68746K2858R2209p7712r9170J32919K75772
$$ 310664 508713 458289 117653 -151093 -128235 -36026 -113738 -212908 -79989 195783
37244A95783J24654q4860j07239m1653n9059q4319J0781J22375P3998p6190j18708
$$ 195783 320437 235577 128338 86685 27626 -56693 -45912 76463 150461 74271 -44437
37233d4437j4038O7206J1036q9794q5474L0030J26347J07486J3692o0237q8556
$$ -44437 -58475 8731 19767 -70027 -155501 -125471 876 108362 122054 61817 -26739
37222b6739r2992m8763O6658J49457O1271j25626j68769j9104P0414o1421k01486
$$ -26739 -119731 -168494 -101836 47621 108892 -16734 -185503 -204607 -134193 -195614 -397100
37211c97100q8813J59719K23295N8394q4730o8022k351J2614K0381M8470M2669
$$ -397100 -485913 -326194 -102899 -44505 -129235 -197257 -199608 -186994 -166613 -118143 -75474
37200g5474N850J7052P6082R1176M1866M069R597K6410O1785J30967J54820N8038
$$ -75474 -69624 -52572 23510 114686 156552 160621 170218 196628 258413 389380 544200 602238
37188F02238o8921q8044m3505o6604j11325l9321P1315M983j89758k00567O3993
$$ 602238 533317 445273 401768 335164 223839 184518 255833 260816 71058 -129509 -65516
37177f5516K96341K32798M265j24802j30762j41013j56621q9620L2739R6481P2996
$$ -65516 230825 463623 467888 343086 212324 71311 -85310 -174930 -142191 -45710 27286
37166B7286K2950j2047j2654N2670J63088K12104J30673j2967j04406j10493o6471
$$ 27286 50236 38189 25535 78205 241293 453397 584070 571103 466697 356204 289733
37155B89733j6494j1167p1171j15606m0859R0082Q3842r0113k07105j02366P6416
$$ 289733 273239 262072 190901 75295 34436 124518 208360 118247 -88858 -191224 -114808
37144a14808R0004m1598j00974j4639P0697M3687k3728k5015K7225O4470P9123
$$ -114808 -24804 -66402 -167376 -182015 -111318 -67631 -91359 -116374 -89149 -24679 54444
37133E4444R7286R4489K5214p8499j15021m4598M0864L1075m9331p5133q152M2043
$$ 54444 151730 246219 271433 192934 77913 33315 74179 105254 55923 -19210 -27362 14681
37121A4681j2641r8326q8602J2494R5086J03905O8645R968o7036j04292m2377
$$ 14681 2040 -96286 -184888 -172394 -77308 26597 95242 105210 38174 -66118 -108495
37110a08495N4105M5781q2146j82534j44926k8760M8026N9443N1640M9836N1951
$$ -108495 -54390 -8609 -90755 -273289 -418215 -446975 -398949 -339506 -287866 -238030 -186079
37099a86079O2539P3091M5954k9904r4376p6096J4591R0955Q8364K8585k5134
$$ -186079 -123540 -50449 -4495 -34399 -128775 -204871 -190280 -99325 -10961 17624 -7510
37088g510n1323p0721p1990r431Q7230Q9795m5029j52189p4069O3043J0230j82358
$$ -7510 -58833 -129554 -201544 -210975 -123745 -33950 -78979 -231168 -305237 -242194 -231964 -414322
37076d14322j91413O0483K29053P1514j54238r4105J43026J88805J5414p2761
$$ -414322 -605735 -545252 -316199 -244685 -398923 -493028 -350002 -161197 -145783 -218544
37066b18544J9979O4614m0885r8067Q355J01555M5597q777R5290K36062K22983
$$ -218544 -198565 -133951 -174836 -272903 -264548 -162993 -117396 -126173 -30883 205179 428162
37055D28162J07605O9990J25763J48624R7698M6396M0473O5076J03468J22463
$$ 428162 535767 605757 731520 880144 977842 1024238 1064711 1129787 1233255 1355718
37045A355718O2785o0309j24140o5174Q748j3347n6399J4677J47060J54795R144
$$ 1355718 1418503 1358194 1234054 1168880 1177628 1164281 1107882 1122559 1269619 1424414 1433558
37034A433558j00448m1157P2751N7884o5257j04301K4856J78454J90551R7703
$$ 1433558 1333110 1291953 1364704 1422588 1357331 1253030 1277886 1456340 1646891 1744594
37024A744594N8138J02233J02311l677j07419j13029r0796j40970k10677j82651
$$ 1744594 1802732 1904965 2007276 2003599 1896180 1783151 1692355 1551385 1340708 1158057
37014A158057p5567j3891m1600r8964j47461j83506j61546m8392O4526M8821o7793
$$ 1158057 1082490 1068599 1026999 928035 780574 597068 435522 387130 451656 500477 432684
37003D32684j35158r7635l0764K7701J10750J72864R7480q7519j78396p5974M9578
$$ 432684 297526 199891 169127 196828 307578 480442 577922 490403 312007 236033 285611
36992B85611k483j67483k00302r874K20298K61281J09382k3167K1982J43934J15652
$$ 285611 283128 115645 -84657 -94531 125767 387048 496430 473263 495245 639179 754831
36981G54831r0609k36217j40038O0974J13283J0688l3394O3292J39653O0319q6627
$$ 754831 664222 428005 287967 348941 462224 472912 439518 502810 642463 702782 616155
36970F16155j38451p4460M85O361m6094r1143p3498r086K3429j2903n7587n6715
$$ 616155 477704 403244 403729 410090 363996 272853 199355 190269 213698 200795 143208 86493
36958H6493n3653q3689n9555R5253K57894K27386J9694j33777r9855Q425L7913
$$ 86493 32840 -50849 -110404 -15151 242743 470129 489823 356046 256191 264616 302529
36947C02529j618j2868K1015L0721k3263q4882n6846O8695J50201N1864j31740
$$ 302529 300911 288043 309058 339779 316516 231634 174788 243483 393684 445548 313808
36936C13808j50161M4121J92064J01678p3134j06609m9771n8135o2492O9658J95363
$$ 313808 163647 207768 399832 501510 428376 321767 271996 213861 151369 221027 416390
36925D16390R4288r1703l4121K03786K18354o0920k21474l6467J65605M3051k28846
$$ 416390 510678 418975 384854 588640 806994 746074 524600 488133 653738 696789 467943
36914D67943k78198r6592N0614O8589O5895P5843L7227k0891j5082K2626J975
$$ 467943 189745 93153 143767 212356 278251 354094 391321 370430 355348 377974 379949
36903C79949n2861n2353m016K4060M0702R1156J35281R7513m405q4415r6697m6296
$$ 379949 327088 274735 270719 294779 335481 426637 561918 659431 655026 570611 473914 427618
36891D27618M0034R3522M7502m0918l1123P9466J23857L6236k4782M8799J00372
$$ 427618 467652 561174 608676 567758 536635 616101 739958 776194 751412 800211 900583
36880I00583m2579k54680k75285r5133N0727L5621l4751n2021n1914q2873r7079
$$ 900583 858004 603324 328039 232906 283633 319254 284503 232482 180568 97695 616
36869F16n3506j0103k3774l9670K3792J24355J35670M0125k5174K5070O8753m1723
$$ 616 -52890 -62993 -86767 -126437 -102645 21710 157380 197505 172331 197401 266154 224431
36857B24431j98945j46451J06098K17002J679k41579j39191J92976L09971Q4039
$$ 224431 25486 -120965 -14867 202135 203814 -37765 -176956 16020 325991 410030
36847D10030j56059j45988q975L9706J8688N0858J19980J25891M9920n4776j32675
$$ 410030 253971 107983 99008 138714 157402 208260 328240 454131 504051 449275 316600
36836C16600j21333j409J10432O7670p8456j32483o1964l8980j23975j46074Q97
$$ 316600 195267 193858 304290 371960 293504 161021 99057 60077 -63898 -209972 -209075
36825b09075J65665J71848N2659o8074j43577j34167L0539K73020L39505J22038
$$ -209075 -43410 128438 181097 113023 -30554 -164721 -134182 138838 478343 600381
36815F00381j46237j88946m5892L6767l5017j28568j04390K8439J46334J29762
$$ 600381 454144 265198 219306 256073 221056 92488 -11902 16537 162871 292633
36805B92633p426r5834j2398J14257O2230j30509j94432m3446R0815K7832j05021
$$ 292633 285207 189373 176975 291232 353462 222953 28521 -14925 75890 103722 -1299
36794a299j12426q394Q6592J30974J13684P740j09449q3677O0661J07051n220
$$ -1299 -113725 -122119 -35527 95447 209131 216871 107422 23745 84406 191457 186237
36783A86237o5698M8213J67262J45185R4997J14738O7582j19111k15705m8075
$$ 186237 120539 168752 336014 481199 576196 690934 758516 639405 423700 375625
36773C75625J52607R0402j10838j24097L7060P7843n8948j16720K9662J81637
$$ 375625 528232 618634 507796 383699 420759 498602 439654 322934 352596 534233
36763E34233J34279n2264j71193j11292N2894J30264P010j75373j54564O9470
$$ 534233 668512 616248 445055 333763 386657 516921 523931 348558 193994 263464
36753B63464J78409n214k27184j75811O3278J83769J12944P308n9417j09168p9890
$$ 263464 441873 436659 209475 33664 96942 280711 393655 400963 341546 232378 152488
36742A52488O8085J64929M8719j20831p7083J02524R7285j39948l08808k21703
$$ 152488 220573 385502 434221 313390 236307 338831 436116 296168 -12640 -234343
36732b34343k4007R2557J14477Q3323K258o2074k342J39445J93326J13119K3041
$$ -234343 -258350 -165793 -51316 32007 34265 -27809 -30151 109294 302620 415739 438780
36721D38780p152l4584o9676m2893J6824j4187j13322q8318J12836K60942J43072
$$ 438780 431628 397044 327368 284475 301299 287112 173790 85472 198308 459250 602322
36710F02322j36904k88078j81636L9143J56463J02528j3202o3042n1293o4629
$$ 602322 465418 177340 -4296 34847 191310 293838 280636 217594 166301 101672
36700A01672r8727n2390P3784J23434K3336p2065j5894Q6820N1894p3826q7832
$$ 101672 2945 -49445 24339 147773 171109 99044 83150 169970 221864 148038 60206
36689F0206M2112J42365J08645K2634j9929l1178m6302m3321Q493Q8637J29863
$$ 60206 102318 244683 353328 375962 356033 324855 278553 235232 243725 332362 462225
36678D62225O2060j00961k05373j00054J22213J79613j8385k17995j74209K0870
$$ 462225 524285 423324 217951 117897 240110 419723 401338 183343 9134 30004
36668C0004J27531J02607N0542j4314j19633j69726p4434M6479K6567o1433k6945
$$ 30004 157535 260142 310684 296370 176737 7011 -67423 -20944 5623 -55810 -82755
36657h2755J04558J40863O0218K8565Q6632Q1469n3192j73878j46945k0237P8806
$$ -82755 21803 162666 222884 251449 338081 419550 366358 192480 45535 25298 104104
36646A04104Q9345L3558j4837J5390R2096Q8900k0115q1086J230P8089j4280j65252
$$ 104104 193449 227007 212170 227560 319656 408556 388441 307355 308585 386674 372394 207142
36634B07142j49627J5150J10575N9996q213j3807j2200k7533l303N9808Q4455
$$ 207142 57515 72665 183240 243236 235023 221216 209016 181483 178180 237988 322443
36623C22443N2278K6084L8611O7275Q9569P0161m0472j97830k48685j29716L2560
$$ 322443 374721 400805 439416 506691 596260 666421 625949 428119 179434 49718 82278
36612H2278J19755J64668J86385R2065r5936j50133J0045J19711j5048j56802
$$ 82278 202033 366701 553086 645151 549215 399082 409127 528838 513790 356988
36602C56988k5085J95848J47077r4942j59291j1335M5510n2409m9983J01752J29720
$$ 356988 331903 527751 674828 579886 420595 409260 454770 402361 352378 454130 583850
36591E83850n2151j65876n4014N8586k2206j32843n8939J11250J67752J03604
$$ 583850 531699 365823 311809 370395 348189 215346 156407 267657 435409 539013
36581E39013N2106N1625M4034L505m9476q4138o0965J5357N0956j1741o5240J0799
$$ 539013 591119 642744 686778 690283 640807 556669 495704 511061 562017 550276 485036 495835
36569D95835J26875J05975l0350j16477j20608j21439p3962J07974K76534J85988
$$ 495835 622710 728685 698335 581858 461250 339811 265849 373823 650357 836345
36559H36345r0468k09737o1900J00651R5651M3598P1918R8154L9244k9074m7992
$$ 836345 745877 536140 474240 574891 670542 714140 786058 884212 923456 894382 846390
36548H46390p5293j10515n9105M2116J8225j31105j77600l4844Q5516K4179p8832
$$ 846390 771097 660582 601477 643593 661818 530713 353113 318269 403785 427964 349132
36537C49132n0222L9365M4436r156k6545k4334m4499l6005L0588O7953K3301q072
$$ 349132 298910 338275 382711 373555 347010 322676 278177 242172 272760 340713 364014 355942
36525C55942N6995J42903J43568Q0091K8632J490j3430j067K5503K6114L1293
$$ 355942 412937 555840 699408 779499 808131 809621 796191 795124 820627 846741 878034
36514H78034J08793J99765J47794n6703k24185k22535j28999o1246j9669K2116
$$ 878034 986827 1186592 1334386 1277683 1053498 830963 701964 640718 621049 643165
36504F43165K4633k5399n8985m2244l2204n1328l2356M5842R3823N5559Q51K159
$$ 643165 667798 642399 583414 541170 508966 457638 425282 471124 564947 620506 621357 623516
36492F23516K5844J7273k863l2k574m4102q3671m6257P7489K00546K06878O5920
$$ 623516 649360 666633 663770 663738 661164 617062 533391 487134 564623 765169 972047 1037967
36480A037967j10693j70017r1763j179L950m6863q1928o3500K6773J42983J30212
$$ 1037967 927274 757257 665494 664315 668265 621402 539474 475974 502747 645730 775942
36469G75942q4598k79557j83870O7191P9383j52155j89286J08962L01481R8199
$$ 775942 691344 411787 227917 295108 374491 222336 33050 142012 443493 541692
36459E41692j39386l8707J30915k5704k84070j97454Q9623J12305o6441o381K49366
$$ 541692 402306 363599 494514 468810 184740 -12714 76909 189214 122773 116392 365758
36448C65758K18146j37927l03879p2279J58378R0770o8263q7085n1428m5180K5095
$$ 365758 583904 445977 142098 69819 228197 318967 250704 163619 112191 67011 92106
36437I2106J21663M6465j42156j36151P7878J49315l4621j59072m2839R0086P1367
$$ 92106 213769 260234 118078 -18073 59805 209120 174499 15427 -27412 62674 134041
36426A34041N1990J15969Q2699r9450j86203o7063L5609k1940q6272n7757n7099
$$ 134041 186031 302000 384699 285249 99046 31983 67592 45652 -40620 -98377 -155476
36415a55476r8580k1297J19315N1468j77988j70437J40552L00349O7529j90253
$$ -155476 -254056 -275353 -156038 -104570 -282558 -452995 -312443 -12094 55435 -134818
36405a34818j29899M3646L3389l6823M6403J42288M1433j30311j51839o5154N917
$$ -134818 -264717 -221071 -187682 -224505 -178102 -35814 5619 -124692 -276531 -341685 -335768
36394c35768R9576K07566J39012j37997l34472k71769j45459j26284p3867R3951
$$ -335768 -236192 -28626 110386 -27611 -362083 -633852 -779311 -905595 -979462 -885511
36384h85511J52449n89o5242J62270L85453K78126J8714l8947P1412Q9448l905
$$ -885511 -733062 -733651 -798893 -636623 -251170 26956 45670 6723 78135 167583 163678
36373A63678n4748n2991n1021J7029J45249J29992q8893k34344j22476J4136n8508
$$ 163678 108930 55939 4918 21947 167196 297188 208295 -26049 -148525 -134389 -192897
36362a92897j57900m1327J24364N8734j17753r4427R2428J53467M7623k251Q3329
$$ -192897 -350797 -392124 -267760 -209026 -326779 -421206 -328778 -175311 -127688 -129939 -46610
36351d6610J62217J58577J44319J52860J29761N7809p550l78J09302K47310K29259
$$ -46610 115607 274184 418503 571363 701124 758933 751383 751005 860307 1107617 1336876
36340A336876r218k22448j46921P1875Q1514r4497j03508J04581J87929K9756
$$ 1336876 1327658 1105210 958289 1030164 1111678 1017181 913673 1018254 1206183 1235939
36330A235939p5423J2740N2867o4974j04111J6477L3779j21663j42454N7265J26179
$$ 1235939 1160516 1173256 1226123 1161149 1057038 1073515 1107294 985631 843177 900442 1026621
36319A026621o6315j48431N8609J76998j9193j54517M5362K15204K4606j95282
$$ 1026621 960306 811875 870484 1047482 1028289 873772 919134 1134338 1158944 963662
36309I63662o9651J21938j2467k31410j19652J34788J06046q8835n6981J25757
$$ 963662 894011 1015949 1003482 772072 652420 787208 893254 804419 747438 873195
36299H73195J07918n2775m6183O3107j0246j74939j20301Q3038J07955l9151q7219
$$ 873195 981113 928338 882155 945262 935016 760077 639776 722814 830769 791618 704399
36288G04399k8923o8082j57664p8644J17395J82594Q7994j4863j01519j89788
$$ 704399 675476 607394 449730 371086 488481 671075 759069 744206 642687 452899
36278D52899j42904Q3976K24826R0381q1186k7475Q1948l662j24051j8297J65992
$$ 452899 309995 393971 618797 709178 627992 600517 682465 678803 554752 536455 702447
36267G02447J43498K820j3568K4433n5576j21725K587J40448O8390n8208j9945
$$ 702447 845945 848765 835197 859630 804054 682329 684916 825364 893754 835546 815601
36256H15601L8256o5779j41575q410Q3553q7600k26714l2863K01886R5517j20898
$$ 815601 853857 788078 646503 638093 721646 634046 407332 374469 576355 671872 550974
36245E50974m6567J27420M191k15535p4253K70249K88159m462j27082J1940P1750
$$ 550974 504407 631827 636018 420483 346230 616479 904638 900176 773094 785034 856784
36234H56784j9412j4014Q2910L9315q5210n1578L5534q6328k61517j43702J31778
$$ 856784 837372 823358 906268 945583 860373 808795 844329 758001 496484 352782 484560
36223D84560J38409q8994j33596N3505J18304k5716r6893M45O8623M3312L7615
$$ 484560 622969 533975 400379 453884 572188 546472 449579 450024 518647 561959 599574
36212E99574J7136j12224j96736o0874J09278N6706o7041J8143J85802J45755
$$ 599574 616710 504486 307750 246876 356154 412860 345819 363962 549764 695519
36202F95519j0180j7345M7013k4968j03172J3119J38131M4004m9426J08926K37802
$$ 695519 685339 667994 715007 690039 586867 599986 738117 782121 732695 841621 1079423
36191A079423p281l39392k73937N4252J76140Q6386P6777P7497j29539l20482
$$ 1079423 1072142 732750 458813 513065 689205 775591 852368 929865 800326 479844
36181D79844j60175J34908J41078l9069m4871N3358j466o2711R0056K03797J8692
$$ 479844 319669 454577 595655 556586 511715 565073 563607 500896 590952 794749 813441
36170H13441j39154N9957K55248M6663j92434K359K54346L5654k77879q1364K76900
$$ 813441 674287 734244 989492 1036155 843721 846080 1100426 1136080 858201 776837 1053737
36159A053737J25067k28255n4965L65740K04811l60537m15184P6448K80358J0390
$$ 1053737 1178804 950549 895584 1261324 1466135 1105598 690414 766862 1047220 1057610
36149A057610r4185J21696J25187j62190k24395r840k546k03812j29008J80940
$$ 1057610 963425 1085121 1210308 1048118 823723 813883 811337 607525 478517 659457
36139F59457K09004j8171j3938J56939K6294k46378j04357K86869K90148K507
$$ 659457 868461 850290 836352 993291 1019585 773207 668850 955719 1245867 1248374
36129A248374L3257K63437P1000l73678l31931J14427K04441q6551q8124K18816
$$ 1248374 1281631 1545068 1616068 1242390 910459 1024886 1229327 1142776 1054652 1273468
36119A273468K25754l5930K3422L20780K70250J3275J37410M10462K08758j04616
$$ 1273468 1499222 1463292 1486714 1807494 2077744 2091019 2228429 2638891 2847649 2743033
36109B743033K30292P41733L81351m86829n72126Q4345K45184k63900m09594k5924
$$ 2743033 2973325 3715058 4096409 3609580 3037454 3121799 3366983 3103083 2693489 2667565
36099B667565j4811m20351l22551K37017K37287k94280k70741L16042L36430k57080
$$ 2667565 2652754 2232403 1909852 2146869 2384156 2089876 1819135 2135177 2471607 2214527
36089B214527l05351K83713L47290k26426k63968L59506M50137j48844k63267
$$ 2214527 1909176 2192889 2540179 2313753 2049785 2409291 2859428 2710584 2447317
36080B447317K53840K56021l15791k52080M40257M32703k68738k45048M93009
$$ 2447317 2701157 2957178 2641387 2389307 2829564 3262267 2993529 2748481 3241490
36071C241490M34884l72509k49722P78195Q19330k51724m32121N64861P26468
$$ 3241490 3676374 3303865 3054143 3832338 4651668 4399944 3967823 4532684 5259152
36062E259152k91261m23034P14572R71973q6529k41754R48619J163224J3483M6027
$$ 5259152 4967891 4544857 5259429 6231402 6144873 5903119 6851738 8014962 8028445 8074472
36052H074472J631785J889068L57778L04133K427468L197310J782567K118475
$$ 8074472 9706257 11595325 11953103 12257236 14684704 17882014 19664581 21783056
36044B1783056N227314O728311N649310P673297J4743546K0226020K1020248K5220149
$$ 21783056 27010370 33738681 39387991 47061288 61804834 82030854 103051102 128271251
36036A28271251L8757988N3291760N8469645N7658022N7309146M8274746J6996692
$$ 128271251 167029239 220320999 278790644 336448666 393757812 442032558 459029250
36029D59029250k6278834n0775208m1947554j9036200r142238j7665835l2388288
$$ 459029250 432750416 381975208 340027654 320991454 311849216 294183381 261795093
36022B61795093m3486447m7895849m3251386l0402337j7673739j2658181j2605804
$$ 261795093 218308646 170412797 127161411 96759074 79085335 66427154 53821350
36015E3821350j0373529n970825m405886n684809n383326l059482k249967l239382
$$ 53821350 43447821 37476996 33071110 27386301 22002975 18943493 16693526 13454144
36007A3454144k885038j001488n35357j697024j718655l13764j8866j107732j176817
$$ 13454144 10569106 9567618 9032261 7335237 5616582 5302818 5283952 4176220 2999403
35998B999403P4466L47228p31350r83779O5537M27326m27165p21484N0136K92586
$$ 2999403 3073869 3421097 2689747 1705968 1771505 2198831 1771666 1050182 1100318 1392904
35988A392904m17054n82284J54690L53341l16696m78433J69709L12877l00833
$$ 1392904 975850 393566 548256 901597 584901 106468 276177 589054 288221
35979B88221l77473L08141M63937j52526k94011K66487L14377l34237m32002K24616
$$ 288221 -89252 218889 682826 530300 236289 502776 817153 482916 50914 275530
35969B75530L75383k22850l26891L16439M42906k42296m36498K71013O06414L1268
$$ 275530 650913 428063 101172 417611 860517 618221 181723 452736 1059150 1090418
35959A090418k86908K65060O51084K35547q5691K58964M16927j53521n90064k58567
$$ 1090418 803510 1068570 1719654 1955201 1869510 2128474 2545401 2391880 1801816 1543249
35949A543249J13068j10840l61589j22835Q1813j65720l31322m5224J49099q6818
$$ 1543249 1656317 1545477 1183888 1061053 1142866 977146 645824 600600 749699 662881
35939F62881j92699J66118M21366K04365R879J45434J31440k49248m08739o8765
$$ 662881 470182 636300 1057666 1262031 1271910 1417344 1548784 1299536 890797 822032
35929H22032J51001j39766m13495k43778j8137p2774q2623J41963J87349j13398
$$ 822032 973033 833267 419772 175994 157857 85083 2460 144423 331772 218374
35919B18374k66132l0506J41232J2232p996K36470K57714j15417l13488l3004
$$ 218374 -47758 -78264 62968 75200 67204 303674 561388 445971 132483 99479
35909I9479K29166J15603M862J92945L28830J55936K0234J65276K64096Q3458
$$ 99479 328645 444248 449110 642055 970885 1126821 1147055 1312331 1576427 1659885
35899A659885r5326q6375j21352k55228j88218M9079J3990k89936l04654O3925
$$ 1659885 1564559 1478184 1356832 1101604 913386 962465 976455 686519 381865 445790
35889D45790J98451j40668l73312j30563J37746J9592j97211j63869m2064k7575
$$ 445790 644241 503573 130261 -302 137444 157036 -40175 -204044 -246108 -273683
35879b73683J8176J16582K3825j89175j13344K10043K39594j04185k47483K0481
$$ -273683 -255507 -138925 -115100 -304275 -417619 -207576 32018 -72167 -319650 -299169
35869b99169K01635M2745n0719J18169J48011j12186k01547O6106K12101k109
$$ -299169 -97534 -54789 -105508 12661 160672 48486 -153061 -86955 125146 123037
35859A23037j33790N7052J42717j04590k34137J6974K11666N3921q0655N5682
$$ 123037 -10753 46299 189016 84426 -149711 -132737 78929 132850 52195 107877
35849A07877Q6995j72189k53674O3779K37182o2240k90393K510L56813K52392
$$ 107877 194872 22683 -230991 -167212 69970 7730 -282663 -280153 76660 329052
35839C29052K972O5434J79226l0109k51023q4486J55986L5577j62413J4480L05987
$$ 329052 332024 397458 576684 546575 295552 211066 367052 402629 240216 254696 560683
35828E60683K17160o1069j4981K73464L42470J77456J00509J05234k3247j70795
$$ 560683 777843 716774 701793 975257 1317727 1495183 1595692 1700926 1677679 1506884
35818A506884r7961O0842O5177N5061K17949K91372o002l55147k80962M6806R8668
$$ 1506884 1408923 1469765 1534942 1590003 1807952 2099324 2093322 1738175 1457213 1504019 1602687
35807A602687j44347k51645j20573n9378j67423k09802r7329m629r373j5920j5293
$$ 1602687 1458340 1206695 1086122 1026744 859321 649519 552190 547561 538188 522268 506975
35796E06975p4268j17787l3860Q0547O0271m2440p1990m2500m9259m9909K6597
$$ 506975 432707 314920 281060 361607 421878 379438 307448 264948 215689 165780 192377
35785A92377R7439O7018l438m3352r7352j47028n4085J48172J86517l0308k10494
$$ 192377 289816 356834 353396 310044 212692 65664 11579 159751 346268 315960 105466
35774A05466j19797O5715Q5269o752j7999N4358J12673J51436J59657N5097j19952
$$ 105466 -14331 51384 136653 129901 111902 166260 278933 430369 590026 645123 525171
35763E25171j78167r2617n1189j02824p1549P1596J15284R836k4100P6891R0128
$$ 525171 347004 254387 203198 100374 28825 100421 215705 225541 201441 278332 368460
35752C68460n0178j10256j3895Q155j03279q3473J32775K25224N1716r2709k0717
$$ 368460 318282 208026 194131 202286 99007 15534 148309 373533 425249 332540 311823
35741C11823M0156n9895j01346K8281Q0012m3714m5551J87551K98446Q9595j04759
$$ 311823 351979 292084 190738 219019 299031 255317 209766 397317 695763 785358 680599
35730F80599l7537J8174j43306k05466P3244L38797K20591m8717r0539J446n943
$$ 680599 643062 661236 517930 312464 385708 724505 945096 896379 805840 807286 801343
35719H01343Q103J71878K27819R61j79383m5250P7224j48916m14895k96315r476
$$ 801343 809446 981324 1209143 1210104 1030721 985471 1062695 913779 498884 202569 193093
35708A93093N236j33064m9997J36146O0278j71589j85115k9203j9963j03259l234
$$ 193093 198329 65265 15268 151414 211692 40103 -145012 -174215 -194178 -297437 -300671
35697c00671J82180J49651j7030j4374R3201L6067q7388O314J94544J40448p1881
$$ -300671 -118491 31160 14130 -244 92957 129024 41636 47950 242494 382942 311061
35686C11061r5939K0177m7976k37395j87024O7545J14915j19274k68766j68283
$$ 311061 215122 235299 187323 -50072 -237096 -169551 -54636 -173910 -442676 -610959
35676f10959n4406p0340o8087K2926O7406K8842K7611O9931N5679K9901R9761
$$ -610959 -665365 -735705 -803792 -780866 -713460 -684618 -657007 -587076 -531397 -501496 -401735
35665d01735J72927J09675K2150P4485J36210J7780j22001l3569J31032N6996
$$ -401735 -228808 -119133 -96983 -22498 113712 131492 9491 -24078 106954 163950
35655A63950j52918j43772O1173J20141r460l6975J05572J73860Q2749J0664K2901
$$ 163950 11032 -132740 -71567 48574 39114 2139 107711 281571 364320 374984 397885
35644C97885M246m2803j7203J1494p1348j27408J0129J50907L2082j63352p9140
$$ 397885 402131 359328 342125 353619 282271 154863 164992 315899 347981 184629 105489
35633A05489J62469J46183r8924j55991K7876P8939q9117j31747O1699J66264
$$ 105489 267958 414141 315217 159226 187102 266041 176924 45177 106876 273140
35623B73140L1398p2286O308M0449q9578j45948O833J35977O3503m5715l5985
$$ 273140 304538 232252 238560 279009 189431 43483 50316 186293 249796 204081 168096
35612A68096k4103r8697j12310J2843R6523K0759o0413j5447M5984J9056o836
$$ 168096 143993 45296 -67014 -54171 42352 63111 2698 -12749 33235 52291 45455
35601D5455L5115M7238q977n027R7757J34275J6040j11331j18798p7643p7558
$$ 45455 80570 127808 118831 113804 211561 345836 361876 250545 131747 54104 -23454
35590b3454p6486l6596j0675j0807J9987N7839J9937m3310o82J07036J11620J8921
$$ -23454 -99940 -136536 -147211 -158018 -138031 -80192 -60255 -103565 -104247 2789 114409 133330
35578A33330k74P1381P4126j4532l9041K5144K1214q0863j19627m1282K2172K3520
$$ 133330 133056 204437 278563 264031 224990 250134 271348 190485 70858 29576 51748 75268
35566G5268N8662J07885K6646j41563j56541K6740J58187Q3886m9204q4109p1556
$$ 75268 133930 241815 268461 126898 -29643 -2903 155284 239170 189966 105857 34301
35555C4301q0709n0170M7769J13951R4960N4874K0507l8074n3441O6661J95946
$$ 34301 -46408 -96578 -48809 65142 160102 214976 235483 197409 143968 210629 406575
35544D06575R9553j72347k93565j29800Q7150J29641M1446m9453j16594j38978
$$ 406575 506128 333781 40216 -89584 -2434 127207 168653 119200 2606 -136372
35534a36372o2943N7104R9099R2220J57359K24976J04367j46084k42345j16901
$$ -136372 -199315 -142211 -43112 49108 206467 431443 535810 389726 147381 30480
35524C0480o906l8491o8923k5745m0227j24662q1428J12000J81741O506j47956
$$ 30480 23574 -14917 -83840 -109585 -149812 -274474 -355902 -243902 -62161 -55655 -203611
35513b03611n4924J23847J46241O3646L8585L8620k9619q7771l5404L8664J6097
$$ -203611 -258535 -134688 11553 75199 113784 152404 122785 35014 -390 38274 54371
35502E4371l7181j6823J6832k4403o6640j2691O5399N5825K966L03R467l9316
$$ 54371 17190 367 17199 -7204 -73844 -86535 -21136 34689 37655 37958 47425 8109
35490H109p6827o980R0569M6759j41007k78014j99036M7309K40387J99862j8388
$$ 8109 -68718 -75698 14871 61630 -79377 -357391 -556427 -509118 -268731 -68869 -87257
35479h7257j67652j04741L6597O9795M0569J00302J91698J23470p5018j58617
$$ -87257 -254909 -359650 -323053 -253258 -212689 -112387 79311 202781 127763 -30854
35469c0854n1036M6458r629j10841j17615n2103J3196O6033Q5253L6036k4016
$$ -30854 -81890 -35432 -45061 -155902 -273517 -325620 -312424 -246391 -161138 -125102 -149118
35458a49118m075M7573J5995n7889m4752K0828R340k7103N3919J53997M1919k10229
$$ -149118 -153193 -105620 -89625 -147514 -192266 -171438 -162098 -189201 -135282 18715 60634 -149595
35446a49595k76702r8109M1215J8395L6906J76780K09631L5382r9500k7759O6224
$$ -149595 -426297 -524406 -483191 -464796 -427890 -251110 -41479 -6097 -105597 -133356 -67132
35435f7132J7018l8272K1386M9413n1445r8061K4793J15012K6939l5951R7870
$$ -67132 -50114 -88386 -67000 -17587 -69032 -167093 -142300 -27288 -349 -36300 61570
35424F1570K20372J10959n8441m9116L762j23970k78233j81000N1949R7038k6187
$$ 61570 281942 392901 334460 285344 289106 165136 -113097 -294097 -242148 -145110 -171297
35413a71297m0195O6410N7690o4821n1569J14509J56395j4182j37666l7928J16635
$$ -171297 -211492 -145082 -87392 -152213 -203782 -89273 67122 52940 -84726 -122654 -6019
35402f019J15227j870q8719j14022j04968m5943M4272O6440k3181j23589j10737
$$ -6019 109208 107338 18619 -95403 -200371 -246314 -202042 -135602 -158783 -282372 -393109
35391c93109J5814J46937J74259Q0780l4740m9584K6907N4367k6840q7357p965
$$ -393109 -377295 -230358 -56099 24681 -10059 -59643 -32736 21631 -5209 -92566 -100531
35380a00531J19729J23712j866j18946j43724q9853J3074J07788R1268m6873j40285
$$ -100531 19198 142910 141044 22098 -121626 -211479 -198405 -90617 651 -46222 -186507
35369a86507m9826J21098J74895J09872P8519J10817Q4208l9549j39598j25339
$$ -186507 -236333 -115235 59660 169532 248051 358868 443076 403527 263929 138590
35359A38590m7310J2776L5985K1147m4726j36299j85880j50388m0980R2830J68726
$$ 138590 91280 104056 140041 161188 116462 -19837 -205717 -356105 -397085 -304255 -135529
35348a35529J19398o372o5223j2958J9065o3759j46743q8947K7320K1592p4150
$$ -135529 -16131 -22503 -87726 -100684 -81619 -145378 -292121 -381068 -353748 -332156 -406306
35337d06306m9019J43450K83820J86983n5078k10014j74374l0562Q9543J24495
$$ -406306 -455325 -311875 -28055 158928 103850 -106164 -280538 -311100 -221557 -97062
35327i7062R8021O1144K8200j7236n6632l7861K7541M7026j4266o2795k8117Q041
$$ -97062 959 62103 90303 73067 16435 -21426 6115 53141 38875 -23920 -52037 -43996
35315d3996m5741j05582l4003J04850J06325n4292j58066n9127J05463J24413
$$ -43996 -89737 -195319 -229322 -124472 -18147 -72439 -230505 -289632 -184169 -59756
35305e9756j178j05460j01002l6601L5976J07873J34244N2426q2223j04132L8613
$$ -59756 -60934 -166394 -267396 -303997 -268021 -160148 -25904 26522 -55701 -159833 -121220
35294a21220J66529R1507j04681j63689j3525J26405O0139j14623j66809n6598
$$ -121220 45309 136816 32135 -131554 -145079 -18674 41465 -73158 -239967 -296565
35284b96565M9356L7542k8243m2274P105O1806O8051Q861p2020q3478N550Q9914
$$ -296565 -247209 -209667 -237910 -280184 -273079 -211273 -143222 -134361 -206381 -289859 -284309 -194395
35272a94395M7345q0255j27989l4035Q3320J00727M2558J0382L4176N4876K1009
$$ -194395 -147050 -227305 -355294 -389329 -306009 -205282 -162724 -152342 -118166 -63290 -42281
35261d2281m3804o9304k4085L7536M0382n676k2020J0019K1666j3193k2654L3063
$$ -42281 -86085 -155389 -179474 -141938 -101556 -107232 -129252 -119233 -97567 -110760 -133414 -100351
35249a00351Q1423O1503K3936K4334K5557l229o933L6022M0001l5231r6368r0824
$$ -100351 -18928 42575 66511 90845 116402 113173 106240 142262 182263 147032 50664 -40160
35237d0160j00505j34027l9048J94213K76800K8504k71291k53671J94J39039J01108
$$ -40160 -140665 -274692 -313740 -119527 157273 185777 -85514 -339185 -338991 -199952 -98844
35226i8844R3487J28100K3700j67878j80760q9J04496M5888J4798O4251K0698
$$ -98844 -5357 122743 146443 -21435 -202195 -202284 -97788 -51900 -37102 27149 47847
35215D7847j14416j03567P2981J24821m4518j56968n1886N3874l787n3280L2976
$$ 47847 -66569 -170136 -97155 27666 -16852 -173820 -225706 -171832 -175619 -228899 -195923
35204a95923P2185m7254r5837Q1942K32863J09128r7971r2832L4536K2906r3537
$$ -195923 -123738 -170992 -266829 -184887 47976 157104 59133 -33699 837 23743 -69794
35193f9794j07184l0572p767k775P7289J11210l3421j77309p4839J42456J46781
$$ -69794 -176978 -207550 -215317 -218092 -140803 -29593 -63014 -240323 -315162 -172706 -25925
35182b5925m7389j12410N5235K01150J49283M1583N7765J53362J80635R7222k5873
$$ -25925 -73314 -185724 -130489 70661 219944 261527 319292 472654 653289 750511 724638
35171G24638r7618p8521k7231m5411j19638j10368K3714J21514N1307r3690j60494
$$ 724638 627020 548499 521268 475857 356219 245851 269565 391079 442386 348696 188202
35160A88202j47539j09119j3934J32020J83380O3610p3718p3971j3754j9533l4347
$$ 188202 40663 -68456 -82390 49630 233010 296620 222902 148931 135177 115644 81297
35149H1297K3481N5897j9701n4474Q2897K13251J02812j32898j95671n8862O0384
$$ 81297 104778 160675 140974 86500 169397 382648 485460 352562 156891 98029 158413
35138A58413Q3170J01831J11675L4011n1195j0022O2353k0681j71460j39452M4825
$$ 158413 241583 343414 455089 489100 437905 427883 490236 469555 298095 158643 203468
35127B03468R6777m4202j26384k8021O2611R307m6883L6719J63300J76832Q1880
$$ 203468 300245 256043 129659 101638 164249 173556 126673 163392 326692 503524 585404
35116E85404l5197j30898j61895q6377J9264J1541r2383j09503K7040J55467J25891
$$ 585404 550207 419309 257414 171037 190301 201842 109459 -44 26996 182463 308354
35105C08354o606j01902j06393m2136M5523P8668O201r3689r0389N025N5090J2056
$$ 308354 301748 199846 93453 51317 96840 175508 181709 88020 -2369 2656 57746 69802
35093F9802l1740k3070j5367k6963O538Q8753J17464M2705n1603p7438m9799k2341
$$ 69802 38062 14992 -375 -27338 -20800 67953 185417 228122 176519 99081 49282 26941
35081B6941q681P95J9892P0065J30978J16263o825j18732r2169Q035J9196n5602
$$ 26941 18260 19055 38947 109012 239990 356253 349428 230696 138527 146562 165758 110156
35069A10156n2632P7906J78744J17551k9148r4551l0427O4250O8970m0610j72708
$$ 110156 57524 135430 314174 431725 402577 308026 277599 341849 410819 370209 197501
35058A97501k11289j37098k7820N5195J01687Q1750k2033r3202K1640K33345K51032
$$ 197501 -13788 -150886 -178706 -123511 -21824 59926 37893 -55309 -33669 199676 450708
35047D50708J8835j34494L1289K89009K95580J10441M7341J64333K46593K04161
$$ 450708 469543 335049 366338 655347 950927 1061368 1108709 1273042 1519635 1723796
35037A723796J42479Q3282n3640k01725j88618l4816O3356M5873J6430j7978j37584
$$ 1723796 1866275 1949557 1895917 1694192 1505574 1470758 1534114 1579987 1596417 1578439 1440855
35026A440855k51343j70668L4834Q1674p4063j54085j6521J23978O8794o1638
$$ 1440855 1189512 1018844 1053678 1135352 1061289 907204 890683 1014661 1083455 1021817
35016A021817o7881K2051O6863N1988M7903N8534M2443j0029r6780k06562k73467
$$ 1021817 953936 975987 1042850 1094838 1142741 1201275 1243718 1233689 1136909 930347 656880
35005F56880k42619j78653j72737j73285q1630L1134K0973n7099k9474O9799M1795
$$ 656880 414261 235608 62871 -110414 -192044 -160910 -139937 -197036 -226510 -156711 -114916
34994a14916j09513j64378o9628p641l3633Q637J27845J10553o6482j24024M3820
$$ -114916 -224429 -388807 -458435 -466076 -499709 -491072 -363227 -252674 -319156 -443180 -399360
34983c99360J53234J4747j31383m7556P6324j8616j69968p4618J50766J34334
$$ -399360 -246126 -231379 -362762 -410318 -333994 -352610 -522578 -597196 -446430 -312096
34973c12096j33671k78215j16617J20328J80792Q3093m7036j49416j58072j040
$$ -312096 -445767 -723982 -840599 -720271 -539479 -456386 -503422 -652838 -810910 -811950
34963h11950K25369K81403R3846j15239j15620M4638J49010J07724J9834j2106
$$ -811950 -586581 -305178 -211332 -326571 -442191 -397553 -248543 -140819 -120985 -133091
34953a33091j2225n6507j34639j46452m3339Q0029R9130M0083M4482J38857J66815
$$ -133091 -145316 -201823 -336462 -482914 -526253 -446224 -347094 -307011 -262529 -123672 43143
34942D3143K5632j46006j42656J8575J29213Q1329j8823m1958l558J4680N007
$$ 43143 68775 -77231 -219887 -201312 -72099 9230 -9593 -51551 -55109 -40429 -35422
34931c5422J1316L0084K2062p205k1639l5536q9430j37987p0754J03905K04758
$$ -35422 -24106 5978 28040 20835 -804 -36340 -125770 -263757 -334511 -230606 -25848
34920b5848J09115n1564p1425J8003N173j47449k26983j01216Q6324J55801J33833
$$ -25848 83267 31703 -39722 -21719 -16546 -163995 -390978 -492194 -405870 -250069 -116236
34909a16236J22456J02579L6480J5386J11364J95897J02672j11015k43953k17092
$$ -116236 6220 108799 145279 160665 272029 467926 570598 459583 215630 -1462
34899a462j00146L4415J16558M5307j59349k74132j45467N7757Q1123l6124o7807
$$ -1462 -101608 -67193 49365 94672 -64677 -338809 -484276 -426519 -345396 -381520 -449327
34888d49327J4762N0618J2947K4800Q5110P5286K3209O6507J59377J18782k8674
$$ -449327 -434565 -383947 -371000 -346200 -261090 -185804 -162595 -96088 63289 182071 153397
34877A53397n8172O4920J23086K7147n2066q092M4562K6780K0588M7891O629q3666
$$ 153397 95225 160145 283231 310378 258312 250220 294782 321562 342150 390041 396670 313004
34865C13004o5256L8612L898j83577k38137m9599R9781L307j21531k1192J55182
$$ 313004 247748 286360 290258 106681 -131456 -181055 -81274 -77967 -199498 -220690 -65508
34854f5508J25978m5066q5085K8136P7416o969p1448k2095N7333O7611R81r9122
$$ -65508 60470 15404 -69681 -41545 35871 28902 -42546 -64641 -7308 60303 61284 -37838
34842c7838j59446j05132K7183Q2078l384q1519p558J34610J60405N1094n2103
$$ -37838 -197284 -302416 -275233 -193155 -196539 -278058 -285616 -151006 9399 60493 8390
34831H390o2146k7760l0591q3817j14221l1031J31151J78471J541j94867j22035
$$ 8390 -53756 -81516 -112107 -195924 -310145 -341176 -210025 -31554 -30013 -224880 -346915
34820c46915J46720K38943L7712j42511n6566J14690J07567j3744m8726k6373
$$ -346915 -200195 38748 76460 -66051 -122617 -7927 99640 85896 37170 10797
34810A0797q5191j59859q9555O9357J17575L2939k8133k181K5540O477j5643j4590
$$ 10797 -74394 -234253 -323808 -254451 -136876 -103937 -132070 -134251 -108711 -102234 -117877 -132467
34798a32467l267K3464N9985O3330L9990O0012J04703M6738j14174j75641l6959
$$ -132467 -135734 -112270 -52285 11045 51035 111047 215750 262488 148314 -27327 -64286
34787f4286J10465Q0391r694L6162J40906R9438n2215j03066k7635K423o7800
$$ -64286 46179 126570 116876 153038 293944 393382 341167 238101 210466 212889 145089
34776A45089j13594p3847j9670K3738J02823J70221J06138n9438j35648l5667
$$ 145089 31495 -42352 -62022 -38284 64539 234760 340898 281460 145812 110145
34766A10145J01147J06695j7067j42462j66379q5019J4798L3285k5435m7706K3285
$$ 110145 211292 317987 300920 158458 -7921 -92940 -78142 -44857 -70292 -117998 -94713
34755i4713Q2462J3689j17329j34966J2843J92228K38810J07652j05048k38244
$$ -94713 -12251 1438 -115891 -250857 -238014 -45786 193024 300676 195628 -42616
34745d2616k01007o4681K7354M1497N2769P3022L2495m8054n1633J5499J316j11621
$$ -42616 -243623 -308304 -280950 -239453 -186684 -113662 -81167 -129221 -180854 -165355 -164039 -275660
34733b75660j25240M4398J78182P6527j20036j45332N956J24480J09580L9918
$$ -275660 -400900 -356502 -178320 -101793 -221829 -367161 -361205 -236725 -127145 -87227
34723h7227l208q065J2966J6576m3817j00664k1014J43958J56325l9681j79242
$$ -87227 -90435 -98500 -85534 -68958 -112775 -213439 -234453 -90495 65830 26149 -153093
34712a53093q0137O4033K3839p7578j0152J38738J28018J87m603J20813J56990
$$ -153093 -233230 -169197 -145358 -222936 -233088 -94350 33668 33855 29252 150065 307055
34701C07055M9516l1520p210K9795M3104R0441J43055J22300R8774K01563L51616
$$ 307055 356571 325051 317841 347636 390740 481181 624236 746536 845310 1046873 1398489
34690A398489L47722K01957J18769J41758J00035o4088j80377j25128J1203Q8223
$$ 1398489 1746211 1948168 2066937 2208695 2308730 2244642 2064265 1939137 1950340 2038563
34680B038563O2085o1261k40559l53882l09431j94537j50126j45482p2658O554
$$ 2038563 2100648 2039387 1798828 1444946 1135515 940978 790852 645370 572712 579266
34670E79266m4170j48578j08264M4712Q5354j2471l9867N5507P6546l6250o0552
$$ 579266 535096 386518 278254 322966 408320 395849 355982 411489 488035 451785 391233
34659C91233J10705K33957R2216j38460j55131R274O1212r6529k40362j70215
$$ 391233 501938 735895 828111 689651 534520 543794 605006 508477 268115 97900
34649I7900K1660J07314L3570m0300M878P5221K0199j14950j43050k9796N1812
$$ 97900 119560 226874 260444 220144 225022 300243 320442 205492 62442 32646 84458
34638H4458J2768j3226O2465Q7978o8854k41917j85507M6588J80158J01969n5745
$$ 84458 97226 84000 146465 234443 165589 -76328 -261835 -215247 -35089 66880 11135
34627A1135j46220j23085O397J53151J51592k5762j64757j05285O175j7326o0349
$$ 11135 -135085 -258170 -251773 -98622 52970 27208 -137549 -242834 -236659 -253985 -314334
34616c14334P5848K64607K19099k6987j69416j16745o5536j08623j16363k4836
$$ -314334 -238486 26121 245220 218233 48817 -67928 -133464 -242087 -358450 -383286
34606c83286P0228J21702J53127R8600q5701k04873n2696J99851K10789J2167
$$ -383286 -313058 -191356 -38229 60371 -25330 -230203 -282899 -83048 127741 139908
34596A39908n7691O5185J09278k826m5879K2454l7763k39914k53663K1140K27257
$$ 139908 82217 147402 256680 253854 207975 230429 192666 -47248 -300911 -279771 -52514
34585e2514J22846m6696m022J26704J22619N2696P4219J23629P6745j6346n7290
$$ -52514 70332 23636 19614 146318 268937 321633 395852 519481 596226 579880 522590
34574E22590l4457Q3317L05880M25257K64210J68659O77396J520482J626521N35411
$$ 522590 488133 571450 877330 1302587 1566797 1735456 2412852 3933334 5559855 6095266
34564F095266q16659j274049q90687n33754n22959m74215k42351j56027l11585
$$ 6095266 5278607 4004558 3113871 2580117 2057158 1582943 1340592 1184565 872980
34555H72980l69534j80068j8974n3612q4896J7750P7798j4717q6368k0316L3709
$$ 872980 503446 323378 304404 250792 165896 183646 261444 246727 160359 140043 173752
34544A73752k8222n4850O3494J60824O4285j19635j86531j33337r1839r0493n7183
$$ 173752 145530 90680 154174 314998 379283 259648 73117 -60220 -152059 -242552 -299735
34533b99735J3107M0365m879l6345N1982K32099L14613J51893j26910k20756n2667
$$ -299735 -286628 -246263 -251142 -287487 -235505 -3406 311207 463100 336190 115434 62767
34522F2767J11861N1712j02087j19927l5861j5706l4818K4440Q6979J1289r8205
$$ 62767 174628 226340 124253 4326 -31535 -47241 -82059 -57619 29360 40649 -57556
34511e7556l6022J19502J13424m2038r9031k7220l7539j33557o8289J64132K33104
$$ -57556 -93578 25924 139348 97310 -1721 -28941 -66480 -200037 -268326 -104194 128910
34500A28910L0811j00677N7465J99225n923l40608l65463r2035R1045L9806j5474
$$ 128910 159721 59044 116509 315734 309811 -30797 -396260 -488295 -397250 -357444 -372918
34489c72918O3748J19169L0820o0224l288J11384J11157Q212m4755O331N7144
$$ -372918 -309170 -190001 -159181 -219405 -222693 -111309 -152 8060 -36695 -30364 26780
34478B6780J7402n3581l1890Q3412J41499M0351j06176j06628K7482Q6537k5143
$$ 26780 44182 -9399 -41289 42123 183622 223973 117797 11169 38651 125188 100045
34467A00045j50114j33800n1476m1706o4654j5556M0308k2244j16781m5323J47457
$$ 100045 -50069 -183869 -235345 -277051 -341705 -357261 -316953 -339197 -455978 -501301 -353844
34456c53844J94051J8882j35363q5068M9071J03013J18691J49956O7716j86152
$$ -353844 -159793 -140911 -276274 -361342 -312271 -209258 -90567 59389 127105 -59047
34446e9047l54340j84929J42363K43979R2996o358M9032N8759l0573l375J80669
$$ -59047 -413387 -598316 -455953 -211974 -118978 -125336 -76304 -17545 -48118 -51493 129176
34435A29176K37139M3947j12617k9057N3893r6507k42063p6665J90343J38904
$$ 129176 366315 410262 297645 268588 322481 225974 -16089 -92754 97589 236493
34425B36493j58462k54033n6495P5438k7652j18462l2831M3043m0611j31420p2074
$$ 236493 78031 -176002 -232497 -157059 -184711 -303173 -336004 -292961 -333572 -464992 -537066
34414e37066N6797J43159K00421J97769M0421j67609j70624R120N1032j12046
$$ -537066 -480269 -337110 -136689 61080 101501 -66108 -236732 -227612 -176580 -288626
34404b88626j33256J40571L30096J14302k21648k27539K7332J46233N3584l763
$$ -288626 -421882 -281311 48785 163087 -58561 -286100 -258768 -112535 -58951 -62714
34394f2714L9582R540j17379j59769o3637L0305M8843M9145M5056J0825Q128Q2291
$$ -62714 -23132 -13592 -130971 -290740 -354377 -324072 -275229 -226084 -181028 -170203 -162075 -79784
34382g9784J14068P475r2499l5209K4224j24351l11168j95920J51561L01848J11057
$$ -79784 34284 41759 -50740 -85949 -61725 -186076 -497244 -693164 -541603 -239755 -128698
34371a28698r3325m5855J17807J80224J66212J85858K18254K07492J69572R4843
$$ -128698 -222023 -267878 -150071 30153 196365 382223 600477 807969 977541 1072384
34361A072384n9877k09313j87364k4634N4791j3678l7976Q0878J67916Q0986m8708
$$ 1072384 1012507 803194 615830 591196 645987 632309 594333 675211 843127 924113 875405
34350H75405n3963K128j6382p0142m8861O845k4757j35698j97451j30507K9521
$$ 875405 821442 823570 807188 737046 688185 695030 670273 534575 337124 206617 236138
34339B36138J79054K09894J08800J9708Q9281K32641K10558k2425k27724k10142
$$ 236138 415192 625086 733886 753594 842875 1075516 1286074 1263649 1035925 825783
34329H25783n7617L7942L0990j6443p4834j27934j28344p4904m1153o0067p9713
$$ 825783 768166 806108 837098 820655 745821 617887 489543 414639 373486 313419 233706
34318B33706o9787n1564o896Q9565J43283L9239j21319j17807K9347P0956m2784
$$ 233706 163919 112355 105459 195024 338307 377546 256227 138420 167767 238723 195939
34307A95939o8988P8229J35394n6210k41039j59961L0623O2543J0229Q1665J79324
$$ 195939 126951 205180 340574 284364 43325 -116636 -86013 -23470 -13241 68424 247748
34296B47748P4669j34012j55071k06O1012j4462j7905O9846L6611j21461j37107
$$ 247748 322417 188405 33334 33128 94140 79678 61773 131619 168230 46769 -90338
34285i0338N1099J53925J3180j36767q1569L1376j649q4103m0484M2582p103j07826
$$ -90338 -39239 114686 127866 -8901 -90470 -59094 -60743 -144846 -185330 -142748 -149851 -257677
34273b57677o6116O5413P8025j8921j8552J07407J49695K3055q1885j1591J05892
$$ -257677 -323793 -258380 -180355 -199276 -217828 -110421 39274 62329 -19556 -31147 74745
34262G4745P7715n2459r6550k5711L625q4522j58342p6021R8750J77869R9432
$$ 74745 152460 100001 3451 -22260 -18635 -103157 -261499 -337520 -238770 -60901 38531
34251C8531r232k5675J2395K589m9479m9464K6906R8011J01910O4572K4308k3390
$$ 38531 29299 3624 16019 18608 -30871 -80335 -53429 44582 146492 211064 235372 211982
34239B11982p2259p8991l7941j2601m0920p0364m0434K5795O5767O0197K1470
$$ 211982 139723 60732 22791 10190 -30730 -101094 -141528 -115733 -49966 10231 31701
34228C1701m1029q7716m9689O2017J14697J9661j11972r5911O7305J83529J20466
$$ 31701 -9328 -97044 -146733 -84716 29981 49642 -62330 -158241 -90936 92593 213059
34217B13059m0483j37462j17256m2217K2423O6311J03235J22577Q3786k3826j18940
$$ 213059 172576 35114 -82142 -124359 -101936 -35625 67610 190187 273973 250147 131207
34206A31207r2152K7786N7707r9013k74820k36255m135J87605K18741J74704J18365
$$ 131207 39055 66841 124548 25535 -249285 -485540 -489675 -302070 -83329 91375 209740
34195B09740L051j32894j28693K3423R1699m2569j57561l0014J84618J81314j8927
$$ 209740 212791 79897 -48796 -25373 66326 23757 -133804 -163818 20800 202114 183187
34184A83187j28935n8988L620k8743j6349R3836J30479L52j26061q6106K6142
$$ 183187 54252 -4736 -1116 -29859 -46208 47628 178107 178459 52398 -33708 -7566
34173g566M4408j4124m3696m5215n6730k6057P1471J09316j2540j67166j64376
$$ -7566 36842 22718 -20978 -66193 -122923 -148980 -77509 31807 19267 -147899 -312275
34162c12275l0978N8366N4947M5745N1897K5416P292P4304J46773P1942r4903
$$ -312275 -343253 -284887 -229940 -184195 -132298 -106882 -99590 -25286 121487 193429 98526
34151I8526j25247K4614J23930K2067j27253j26129k4802J4135q353J5102O4812
$$ 98526 -26721 -2107 121823 143890 16637 -109492 -134294 -120159 -128512 -113410 -48598
34140d8598K8503p0569q0369L3792J25417R6650M1115P2996J30091O8706r9938
$$ -48598 -20095 -90664 -171033 -137241 -11824 84826 125941 198937 329028 397734 297796
34129B97796j96829j11928M2377P1543n4253j66053j14260M0792J06857O077j25222
$$ 297796 100967 -10961 31416 102959 48706 -117347 -231607 -190815 -83958 -77881 -203103
34118b03103j10766M4116J69114J50380N4273O71j1003o7878j69449j93689o5231
$$ -203103 -313869 -269753 -100639 49741 104014 104685 93682 25804 -143645 -337334 -402565
34107d02565J23755K15829J61497L8577n7364q3332m5326J0663K4094j0901k7714
$$ -402565 -278810 -62981 98516 137093 79729 -3603 -48929 -38266 -14172 -25073 -52787
34096e2787J3088N1578K2533l0006k2346L0470N2282L9093K9781j4576j42670
$$ -52787 -39699 11879 34412 4406 -17940 12530 64812 103905 133686 119110 -23560
34085b3560k45959j52327R0848K25598J34162j2231l6106J4036K8389L3065O6031
$$ -23560 -269519 -421846 -330998 -105400 28762 16531 -19575 -5539 22850 55915 121946
34074A21946L7774r3417j63279l3815J47057J50296J8683l9248j3921n9506j46277
$$ 121946 159720 66303 -96976 -130791 16266 166562 185245 145997 132076 72570 -73707
34063g3707p7768J25477J92572M1603o3548N3402J80894P0910j46874j77400k8928
$$ -73707 -151475 -25998 166574 208177 144629 198031 378925 449835 302961 125561 96633
34052I6633L1337q0025j60325p4945M7018N1609r504p112M8415N2130j4400o9934
$$ 96633 127970 47945 -112380 -187325 -140307 -88698 -98202 -105314 -56899 -4769 -19169 -89103
34040h9103o3492k0333K0440L3925o205r1942j42686q8924Q553K2346m2579l1705
$$ -89103 -152595 -172928 -152488 -118563 -124768 -216710 -359396 -448320 -439767 -417421 -460000 -491705
34028d91705J18970K45740J74345j3075q0910K7395J25682O7883o3252j08941
$$ -491705 -372735 -126995 47350 34275 -46635 -19240 106442 174325 111073 2132
34018B132m7253L0335O2692N1701J1829l6709o0423m7320j8392J3915M9605N9701
$$ 2132 -45121 -14786 47906 99607 111436 74727 14304 -33016 -51408 -37493 12112 71813
34006G1813J2383n6502q3031p9013r1500p7731L1102J49140J12008m1275q6144
$$ 71813 84196 27694 -55337 -134350 -225850 -303581 -272479 -123339 -11331 -52606 -138750
33995a38750K4796O7776o9399j78950q7051M6527K7075j7311J13266K77027J94944
$$ -138750 -113954 -46178 -115577 -294527 -381578 -335051 -307976 -325287 -212021 65006 259950
33984B59950n3455j29410J8226R6495k2320j13188r759J30173J09083k7211j33766
$$ 259950 206495 77085 95311 191806 169486 56298 46539 176712 285795 258584 124818
33973A24818j75861j64652p3947N9956J18729P6047L9245N7835O0478K7498L0353
$$ 124818 -51043 -215695 -289642 -229686 -110957 -34910 4335 62170 122648 150146 180499
33962A80499N3500l805r6894n6550Q9077R5552q3265j65949k9J55671M4874j61712
$$ 180499 233999 230194 133300 76750 165827 261379 178114 12165 12136 167807 212681 50969
33950E0969j53928K0504P8524k4998q5010k3425M2952P1019J26991J64398N3035
$$ 50969 -102959 -82455 -3931 -28929 -113939 -137364 -94412 -23393 103598 267996 321031
33939C21031j48964k17247j00704M685j7458l8967N5227J56131J14184k1574r3376
$$ 321031 172067 -45180 -145884 -141199 -158657 -197624 -142397 13734 127918 106344 12968
33928A2968o3011j7683q143K057M3417P8739M7968n2166j42119j28856j6568Q6251
$$ 12968 -50043 -67726 -75869 -73812 -30395 48344 96312 44146 -97973 -226829 -243397 -157146
33916a57146J02354P4978O7532M7398l2598j03257o7388J9012J4253o8002o4015
$$ -157146 -54792 20186 87718 135116 102518 -739 -68127 -49115 -34862 -102864 -166879
33905a66879O0773J27128K7003p9411O64J84334K23629O4196r4815r9860k8944
$$ -166879 -106106 21022 48025 -31386 -30722 153612 377241 441437 346622 246762 217818
33894B17818k4836q1850r4243l1292L9709O4663M6314m124p5413j18127p7383
$$ 217818 192982 111132 16889 -14403 25306 89969 136283 132159 56746 -61381 -138764
33883a38764J6696N5742j7279j29006j54741m6733J27924K41220J95633J7252
$$ -138764 -122068 -66326 -83605 -212611 -367352 -414085 -286161 -44941 150692 167944
33873A67944j37365j35770l6848j2169q8420j03473K2395J31529P6565j8389N5952
$$ 167944 30579 -105191 -142039 -154208 -242628 -346101 -323706 -192177 -115612 -134001 -78049
33862g8049K31391K26747k8395k67728k50216n4459Q6734Q9219L3676o635k2383
$$ -78049 153342 380089 351694 83966 -166250 -220709 -133975 -44756 -11080 -17715 -40098
33851d0098j3984J0144J1766k7514o3254m5546J4176P0411R5497P4423J535q0684
$$ -40098 -54082 -43938 -32172 -59686 -122940 -168486 -154310 -83899 11598 86021 87556 6872
33839F872r1806o713R7097J20078M5059n3491q2808j9775N1854K4158q3343j22437
$$ 6872 -84934 -91647 5450 125528 170587 117096 34288 14513 66367 90525 7182 -115255
33827a15255l0666M9186j6760j19729p1665P0699Q2601m9085r3525L2525J18579
$$ -115255 -145921 -96735 -113495 -233224 -304889 -234190 -151589 -200674 -294199 -261674 -143095
33816a43095J7279j10200p2347M7155O3283l708j2928L5315M0813J3638L2721
$$ -143095 -125816 -236016 -308363 -261208 -197925 -201633 -214561 -179246 -138433 -124795 -92074
33805i2074O1335N273q9640q8228J2066Q2866O9394L2131K139m4044p4035k5179
$$ -92074 -30739 -25466 -115106 -203334 -191268 -108402 -39008 -6877 -4738 -48782 -122817 -147996
33793a47996N5116N1888j7184k583J31795K12629Q7863j52885k82897k04473k8671
$$ -147996 -92880 -40992 -58176 -60759 71036 283665 371528 218643 -64254 -268727 -297398
33782b97398Q3108Q5257M5851K6500J2209l3133r0773j14784j01537o3807K9455
$$ -297398 -214290 -129033 -83182 -56682 -44473 -77606 -168379 -283163 -384700 -448507 -419052
33771d19052J84714K79375J71834o4849j77823o2083R8550J00292j8889r2753
$$ -419052 -234338 45037 216871 152022 -25801 -87884 10666 110958 92069 -684
33761f84o5769L925O1669N6497n6564j94140j58174Q8646K99131K51483M0947
$$ -684 -66453 -62528 -859 55638 -926 -195066 -353240 -264594 34537 286020 326967
33750C26967j13950j92391k67968k45665j2263K46213K23605k9001j47566j1012
$$ 326967 213017 20626 -247342 -493007 -505270 -259057 -35452 -64453 -212019 -223031
33740b23031R2115m3813k08613j22591J34095K59935J41859o8602j83120j27517
$$ -223031 -130916 -174729 -383342 -505933 -371838 -111903 29956 -38646 -221766 -349283
33730c49283M4816J71952J11446n8090r0906P2378J74049J6991j99597j57143
$$ -349283 -304467 -132515 -21069 -79159 -170065 -97687 76362 93353 -106244 -263387
33720b63387Q6110J66320l8925k31541j42950R1722J73991P4231K804L7140K3309
$$ -263387 -177277 -10957 -49882 -281423 -424373 -332651 -158660 -84429 -81625 -44485 -21176
33709b1176j23788k36503j33104R4697J96110J03748r515j3919J4027k4819o4828
$$ -21176 -144964 -381467 -514571 -419874 -223764 -120016 -129531 -143450 -129423 -154242 -219070
33698b19070M23J11858J17696O470p8543m6594M6186J10474J12358M1070q8212
$$ -219070 -218647 -106789 10907 17377 -61166 -107760 -61574 48900 161258 202328 114116
33687A14116j76242j09199O8100J62752P6931o4058r4594j6224O3915J03132J17306
$$ 114116 -62126 -171325 -103225 59527 136458 72400 -22194 -38418 25497 128629 245935
33676B45935Q3074j7119r7807o1966L1170L9173k5878o174J17664J46873k0259
$$ 245935 329009 311890 214083 152117 183287 222460 196582 190408 308072 454945 434686
33665D34686j74494q2682J41355J90146K0398j12061p7485l9895j12493j34759
$$ 434686 260192 177510 318865 509011 529409 417348 339863 299968 187475 52716
33655E2716K4783J85935J24611n4496r1862N337J8386q0972j07194k3890k989
$$ 52716 77499 263434 388045 333549 241687 247024 265410 184438 77244 53354 50365
33644E0365q1748q0366N0889J10405L149p0166M2084J70163J09134m5735q7156
$$ 50365 -31383 -111749 -60860 49545 52694 -17472 24612 194775 303909 258174 171018
33633A71018l5741m0368q3986m7392L7483M7555N488K0541N6609l583j08597r5051
$$ 171018 135277 94909 10923 -36469 1014 48569 54057 74598 131207 127624 19027 -76024
33621g6024K1984N3735n0543j21311m8044N9423O9205K4490L8973J03770J05534
$$ -76024 -54040 -305 -50848 -172159 -220203 -160780 -91575 -67085 -28112 75658 181192
33610A81192o077j41784j65691m8817Q2183Q1068l7172j15323n9961O1483J44927
$$ 181192 175115 33331 -132360 -181177 -98994 -17926 -55098 -170421 -230382 -168899 -23972
33599b3972J54707P7685q1103k06327j44582N2618J38592K2641q9957l6388N2662
$$ -23972 130735 208420 127317 -79010 -223592 -170974 -32382 -9741 -99698 -136086 -83424
33588h3424J9496l7247J4345N1034p4010j92896o0526J95306K29800K2898j05192
$$ -83424 -63928 -101175 -86830 -35796 -109806 -302702 -363228 -167922 61878 84776 -20416
33577b0416j2702Q7043J6943j14313j41995o8019L1468J13713J26643L8823o4366
$$ -20416 -33118 53925 70868 -43445 -185440 -253459 -221991 -108278 18365 57188 -7178
33566g178p9807n5105p8441p8912K9868J08081o599j45580k8517K21619K13899
$$ -7178 -86985 -142090 -220531 -299443 -269575 -161494 -168093 -313673 -342190 -120571 93328
33555I3328n5048j57532O1082K26217P2063j33216q2189O4494J7747j24928r5937
$$ 93328 38280 -119252 -58170 168047 240110 106894 24705 89199 106946 -17982 -113919
33544a13919N2032O6554n3910r9673l5422o649k8085J6794R6269M7074j17694
$$ -113919 -61887 4667 -49243 -148916 -184338 -190987 -219072 -202278 -106009 -58935 -176629
33533a76629j77478k9005J66307K22130J51181P7780M6524M757p4438j22908n5521
$$ -176629 -354107 -383112 -216805 5325 156506 234286 280810 285567 211129 88221 32700
33522C2700Q9435J45856K1321j47212j54141j0409Q1335K7622n3903n2835l100
$$ 32700 122135 267991 289312 142100 -12041 -22450 58885 86507 32604 -20231 -23331
33511b3331M0572Q1791Q5733j3611j50109j54673j0388J09867J16076J01721J12106
$$ -23331 17241 99032 184765 171154 21045 -133628 -144016 -34149 81927 183648 295754
33500B95754N1568q8947j57471j02033n9152p3020m091J48195J45200p5165k02467
$$ 295754 347322 258375 100904 -1129 -60281 -133301 -137392 10803 156003 80838 -121629
33489a21629l2403J62371O5675j42783p6985K06984K84084J8002k55151k33841
$$ -121629 -154032 8339 74014 -68769 -145754 61230 345314 363316 108165 -125676
33479a25676j9920J04832M5303o2431n7112N3611Q7840o8671k31439j14263K08102
$$ -125676 -145596 -40764 4539 -57892 -115004 -61393 26447 -42224 -273663 -387926 -179824
33468a79824L14542M4590k27374j53522P1617Q3056n3222k9092J22729J06740
$$ -179824 134718 179308 -48066 -201588 -129971 -46915 -100137 -129229 -6500 100240
33458A00240p8068j29254K6339J22151J3980j26610j43977r1480l0364O2985J33994
$$ 100240 22172 -107082 -80743 41408 55388 -71222 -215199 -306679 -337043 -274058 -140064
33447a40064P6632l4305j2129J13220J20484k3524j09026m6821J6695p93p385
$$ -140064 -63432 -97737 -109866 3354 123838 100314 -8712 -55533 -38838 -39631 -47016
33436d7016J3076m8778j53710j07058Q0364J45745O180q6795K4581J39725N8013
$$ -47016 -33940 -82718 -236428 -343486 -263122 -117377 -111197 -197992 -173411 -33686 24327
33425B4327q6163p5550M0414Q4065M5881J6443k0255j12259j82135j31933r820
$$ 24327 -61836 -137386 -96972 -12907 32974 49417 29162 -83097 -265232 -397165 -406985
33414d06985P1880Q8791O9158K4256J015O5485J59431J36884Q825m9192l902k9731
$$ -406985 -335105 -246314 -177156 -152900 -151885 -86400 73031 209915 218740 169548 165646 135915
33402A35915j61628j70859L6752J86505M4741j88833j92373k1626K8142q3974
$$ 135915 -25713 -196572 -159820 26685 71426 -117407 -309780 -331406 -303264 -387238
33392c87238j27765m703J44761K05033J83668P2409j28249k60526j45893J16483
$$ -387238 -515003 -519706 -374945 -169912 13756 86165 -42084 -302610 -448503 -332020
33382c32020K28079R4709p2848r5044l2516N238M2399J16310J42132L3667j36115
$$ -332020 -103941 -9232 -82080 -177124 -209640 -204402 -162003 -45693 96439 130106 -6009
33371f009k07857j24389J9022Q3682J8220r4044j20466l6212M3469K9891j2093
$$ -6009 -213866 -338255 -319233 -235551 -217331 -311375 -431841 -468053 -424584 -394693 -406786
33360d06786J4033O4124K6177q5874j48089j09871l3131K7074M9666j7025j95500
$$ -406786 -392753 -328629 -302452 -388326 -536415 -646286 -679417 -652343 -602677 -619702 -815202
33349h15202l62431l48387j68719r912K9384L1856P2784J03548P8710M6698M1957
$$ -815202 -1177633 -1526020 -1694739 -1704651 -1675267 -1643411 -1570627 -1467079 -1388369 -1341671 -1299714
33338a299714K2896j0320K5515J35775J86086J06664K2498N0146R5039J8481r8837
$$ -1299714 -1276818 -1287138 -1261623 -1125848 -939762 -833098 -810600 -760454 -665415 -646934 -745771
33327g45771o5254J04920K01920J45802Q3199J11397J18398P687r9766n3889O0954
$$ -745771 -811025 -706105 -504185 -358383 -275184 -163787 -45389 -37702 -137468 -191357 -130403
33316a30403M9933o8768q0944P5361J90165R3893q3087j04934K7433J01966K1791
$$ -130403 -80470 -149238 -230182 -154821 35344 129237 46150 -58784 -31351 70615 92406
33305I2406p0894k7894R2710J29588M3368n9720r0384o9550n6822n8368l9714
$$ 92406 21512 -6382 86328 215916 259284 199564 109180 39630 -17192 -75560 -115274
33294a15274O399M5078M6689K1087k464q702L095L1159O0759O0260K0352j9205
$$ -115274 -108875 -63797 -17108 3979 1515 -7187 -4092 27067 87826 148086 168438 149233
33282A49233k2012j2275k3109j7301M8589J01956L0558j07496j19619J6854Q3068
$$ 149233 127221 114946 91837 74536 123125 225081 255639 148143 28524 45378 128446
33271A28446k5406q4876R6529K93590J58657k01969l27405q3973J47688P7178
$$ 128446 103040 18164 114693 408283 566940 364971 37566 -46407 101281 178459
33261A78459q8529n8560O0112R772j36431j11888O4000J22702J2881l5435O3587
$$ 178459 89930 31370 91482 101254 -35177 -147065 -83065 39637 52518 17083 80670
33250H0670J06632k0647j23816k2207J42356J20683p0467j89059j02502Q3626
$$ 80670 187302 166655 42839 20632 162988 283671 213204 24145 -78357 5269
33240E269J93848J53517J0484j21456j49942q7993k8990j7397n902L3846N0439
$$ 5269 199117 352634 363118 241662 91720 3727 -25263 -42660 -48562 -14716 35723
33229C5723J4488j6560o336j3594p1769r8954l9375J1282l4067p0581L1650J56331
$$ 35723 50211 33651 27315 13721 -58048 -157002 -196377 -185095 -219162 -289743 -258093 -101762
33217a01762Q1838j27370j54006Q2663K58086J19972j22349j28260N0497Q9674
$$ -101762 -19924 -147294 -301300 -218637 39449 159421 37072 -91188 -40691 48983
33207D8983o8574j49571k5274Q7709J9313o9820J3950J56835J38801M574l8718
$$ 48983 -19591 -169162 -194436 -106727 -87414 -157234 -143284 13551 152352 156926 118208
33196A18208J0135l0245j69218k04360o8210N5133M1204M656M7256O2469l3504
$$ 118208 128343 98098 -71120 -275480 -343690 -288557 -247353 -242697 -195441 -132972 -166476
33185a66476q4353N7790K21306J34828j22442j96591R606J85011Q2800j26663
$$ -166476 -250829 -193039 28267 163095 40653 -155938 -146332 38679 121479 -5184
33175e184j49028l405O6756R20j8475J01823K03416J17055q9315k04770j35791
$$ -5184 -154212 -157617 -90861 -89941 -108416 -6593 196823 313878 224563 19793 -115998
33164a15998J6488J01304P1125m845l9772k5433k0217m1504j8124R8358K14660
$$ -115998 -99510 1794 72919 68074 28302 2869 -17348 -58852 -76976 21382 236042
33153B36042J80723l781j60765j44071k880J04747R1890j1933j30654j94957j71132
$$ 236042 416765 412984 252219 108148 105268 210015 301905 289972 159318 -35639 -206771
33142b06771r2762k8978J2253Q8014J86594J83145K0233j48990j31984K9641J05412
$$ -206771 -299533 -328511 -316258 -228244 -41650 141495 161728 12738 -119246 -89605 15807
33131A5807o280j52800j57709m4564M3150M6462K1176J8957K8270K0753l157j8474
$$ 15807 9527 -143273 -300982 -345546 -302396 -255934 -234758 -215801 -187531 -166778 -169935 -188409
33119a88409k121L7527N1839j534r3398j32297n5277J02170K25865K07447M1327
$$ -188409 -190530 -153003 -101164 -102698 -196096 -328393 -383670 -281500 -55635 151812 193139
33108A93139j37016j55930j070J44011J18971n184l7364N8141J27738O0635p9305
$$ 193139 56123 -99807 -100877 43134 162105 156921 119557 177698 305436 366071 286766
33097B86766j73298j77202j00505K9632J40674J49906O9332o620l8267p1437j18177
$$ 286766 113468 -63734 -164239 -134607 6067 155973 225305 218685 180418 108981 -9196
33086i196j19450n5453J3447M4233N1768M2278J2041L341L9770L9905m6421p4775
$$ -9196 -128646 -184099 -170652 -126419 -74651 -32373 -20332 -16991 22779 62684 16263 -58512
33074e8512R0770K59887J17986k38814l46541n9406K02558R6308j40214j28733
$$ -58512 32258 292145 410131 171317 -175224 -234630 -32072 64236 -75978 -204711
33064b04711M8570P7092k5648j0917J06990R9085l0840o4860J4443K2657m3993
$$ -204711 -156141 -79049 -104697 -115614 -8624 90461 59621 -5239 9204 31861 -12132
33053a2132j2914Q9331N7484q1016p2163R7385J39418l4654j42534p223J53308
$$ -12132 -25046 64285 121769 40753 -31410 65975 205393 170739 28205 20982 174290
33042A74290R8396p9694j68341j42633p6248K1802J08978O4840r5033j64717m7165
$$ 174290 272686 192992 24651 -117982 -194230 -172428 -63450 1390 -93643 -258360 -305525
33031c05525R8705J29830J06472Q7529J853j24486q7284J57812L34262K32311
$$ -305525 -206820 -76990 29482 117011 118864 -5622 -92906 64906 399168 631479
33021F31479J5028p7603p8839j07343q4625O6022J58265O422k17697k17368k8536
$$ 631479 646507 568904 490065 382722 298097 364119 522384 528806 311109 93741 65205
33010F5205P2559J0060n7366n7356n2127l0793N4496J01784q370j51234j13377
$$ 65205 137764 147824 90458 33102 -19025 -49818 4678 106462 98092 -53142 -166519
32999a66519M8377J01129L4387M0110J26793J05416k7081n2391N9502O4872j14724
$$ -166519 -118142 -17013 17374 57484 184277 289693 262612 210221 269723 334595 219871
32988B19871k12906n2668J46225J18972l5007n3629O1296R9230J7394j5872O4226
$$ 219871 6965 -45703 100522 219494 184487 130858 192154 291384 308778 292906 357132
32977C57132J02425k1082j90643k11802p7102L5066P368p4781p5698k0764l8879
$$ 357132 459557 438475 247832 36030 -41072 -6006 1362 -73419 -149117 -169881 -208760
32966b08760j23388j13719M0486J66865J27325L0750L7955R4792N5554l6643k3000
$$ -208760 -332148 -445867 -405381 -238516 -111191 -80441 -42486 52306 107860 71217 48217
32955D8217P9394R5841j6477j18158j22677p4435J667J13630J68367N7489j07369
$$ 48217 127611 223452 206975 88817 -33860 -108295 -106628 7002 175369 232858 125489
32944A25489r1122R3650J68143J0295j63434j48382l4823O675r99L7569P7903
$$ 125489 34367 128017 296160 306455 143021 -5361 -40184 -33509 -34508 3061 80964
32933H0964L6857l0560l4634j8851n9439r7907l6822P6579J13115M8767l3982
$$ 80964 117821 87261 52627 33776 -25663 -123570 -160392 -83813 29302 78069 44087
32922D4087p1479m3435N4159J62326J64829L5390j01422j36259j03114o9082k7692
$$ 44087 -27392 -70827 -16668 145658 310487 345877 244455 108196 5082 -64000 -91692
32911i1692R707k6568r9110l6888J71227K51571L1887k28644j78310R3916J96583
$$ -91692 -81985 -108553 -207663 -244551 -73324 178247 210134 -18510 -196820 -102904 93679
32900I3679L5216r2695j3163Q5469L3007l9748K0972J02965M1020q2918r0872
$$ 93679 128895 36200 23037 108506 141513 101765 122737 225702 266722 183804 92932
32889I2932j7341k5179j04834r7425K1682J06847R1242O8060Q9687P3689k1945
$$ 92932 75591 50412 -54422 -151847 -130165 -23318 67924 135984 225671 299360 277415
32878B77415r3616o3591k4009q0737j50673p2676J21536K15151J06497m6781n6598
$$ 277415 183799 120208 96199 15462 -135211 -207887 -86351 128800 235297 188516 131918
32867A31918L7118N0690o5283j67840j38725l4535K6382L0445M1816O5822L9416
$$ 131918 169036 219726 154443 -13397 -152122 -186657 -160275 -129830 -88014 -22192 17224
32856A7224m5265r4892l2230R0086J46895R5812J9873J803J0963k9894r6532p3738
$$ 17224 -28041 -122933 -155163 -65077 81818 177630 197503 199306 210269 180375 83843 10105
32844A0105O2363J65111R9286n7034j00640K3260J49549J19849j7460q7786n603
$$ 10105 72468 237579 336865 279831 179191 202451 352000 471849 454389 366603 361000
32833C61000J46818K19503J39449j3834o9207N0054K06628J99291L3389q2295
$$ 361000 507818 727321 866770 852936 783729 833783 1040411 1239702 1273091 1190796
$$ [...]
##END NTUPLES=NMR SPECTRUM
##END=
