##TITLE=31Pdec_PR194_D
 D2O+DMSO, 24 sc
 30.08.2021
##JCAMPDX= 6.0         $$ Bruker NMR JCAMP-DX V2.0
##DATA TYPE= NMR SPECTRUM
##DATA CLASS= NTUPLES
##ORIGIN= UXNMR, Bruker Analytische Messtechnik GmbH
##OWNER= root
$$ XWIN-NMR		Version 3.5
$$ Mon Aug 30 12:40:19 2021 Russian Standard Time (UT+4h)  she@DPX200
##.OBSERVE FREQUENCY= 81.013821
##.OBSERVE NUCLEUS= ^31P
##.ACQUISITION MODE= SIMULTANEOUS
##.ACQUISITION SCHEME= undefined
##.AVERAGES= 24
##.DIGITISER RES= 16
##SPECTROMETER/DATA SYSTEM= spect
##.PULSE SEQUENCE= zgpg30
##.SOLVENT NAME= CDCl3
##.SHIFT REFERENCE= (INTERNAL, CDCl3, 0, 248.564)
##AUDIT TRAIL= $$ (NUMBER, WHEN, WHO, WHERE, WHAT)
$$ ##TITLE= Audit trail, XWIN-NMR		Version 3.5
$$ ##JCAMPDX= 5.01
$$ ##ORIGIN= Bruker BioSpin GmbH
$$ ##OWNER= she
$$ F:/spectra/data/she/nmr/P31/1/pdata/1/auditp.txt
$$ ##AUDIT TRAIL=  $$ (NUMBER, WHEN, WHO, WHERE, WHAT)
(   1,<2021-08-30 12:39:13.46 +0400>,<she>,<DPX200>,
      <created by zg, POWCHK disabled, PULCHK disabled
       configuration hash MD5:
       00 E9 B6 7A A2 85 ED C7 34 08 36 98 17 FE 4E 26
       data hash MD5: 32K
       3E 63 F7 98 1D F5 C5 BC C1 8F CD F9 55 7C 01 3A>)
(   2,<2021-08-30 12:39:15.93 +0400>,<she>,<DPX200>,
      <Start of raw data processing
       efp BC_mod = 2 LB = 1 FT_mod = 6 PKNL = 1 PHC0 = -7910.52 PHC1 = 465.2734 SI = 64K 
       data hash MD5: 64K
       FF 1D BB BB 78 0F 0E 29 DD 70 8E FE E2 85 4D 5E>)
(   3,<2021-08-30 12:39:41.40 +0400>,<she>,<DPX200>,
      <pk PHC0 = -192.5801 PHC1 = 423.7997 
       data hash MD5: 64K
       C7 35 A7 81 7F B7 B5 06 38 8F D7 09 D8 C0 4D 70>)
(   4,<2021-08-30 12:39:44.92 +0400>,<she>,<DPX200>,
      <abs ABSG = 5 
       data hash MD5: 64K
       64 8A 6C CA 00 81 F5 3B F2 7D 04 50 96 0A 93 C7>)
$$ ##END=
$$ 
$$ hash MD5
$$ EF 08 83 79 D1 31 41 91 B2 B1 49 E5 FA 31 CF 4C
##$RELAX= 
##$RELAX= 
##$RELAX= 
##$RELAX= 
##$RELAX= 
##$RELAX= 
##$RELAX= 
##$RELAX= 
$$ Bruker specific parameters
$$ --------------------------
##$DU= <F:/spectra>
##$EXPNO= 1
##$NAME= <P31>
##$PROCNO= 1
##$TYPE= <nmr>
##$USER= <she>
##$AMP= (0..31)
100 100 100 100 100 100 100 100 100 100 100 100 100 100 100 100 100 100 
100 100 100 100 100 100 100 100 100 100 100 100 100 100 
##$AQSEQ= 0
##$AQ_mod= 1
##$AUNM= <au_zg>
##$AUTOPOS= <>
##$BF1= 81.014009
##$BF2= 200.13
##$BF3= 200.13
##$BF4= 200.13
##$BF5= 200.13
##$BF6= 200.13
##$BF7= 200.13
##$BF8= 200.13
##$BYTORDA= 1
##$CFDGTYP= 0
##$CFRGTYP= 5
##$CHEMSTR= <none>
##$CNST= (0..31)
1 1 145 1 1 1 1 1 1 1 1 1 1 1 1 1 1 1 1 1 1 1 1 1 1 1 1 1 1 1 1 1 
##$CPDPRG= <waltz16>
##$CPDPRG1= <>
##$CPDPRG2= <waltz16>
##$CPDPRG3= <>
##$CPDPRG4= <mlev>
##$CPDPRG5= <mlev>
##$CPDPRG6= <mlev>
##$CPDPRG7= <mlev>
##$CPDPRG8= <mlev>
##$CPDPRGB= <>
##$CPDPRGT= <>
##$D= (0..31)
0 1 0 0 0 0 0 0 0 0 0 0.03 2e-05 3e-06 0 0 0 0 0 0 0 0 0 0 0 0 0 0 0 0 
0 0 
##$DATE= 1630312752
##$DBL= (0..7)
120 120 120 11 120 120 24 19 
##$DBP= (0..7)
150 150 150 150 150 150 150 150 
##$DBP07= 0
##$DBPNAM0= <>
##$DBPNAM1= <>
$$ [...]
##$SUBNAM3= <"">
##$SUBNAM4= <"">
##$SUBNAM5= <"">
##$SUBNAM6= <"">
##$SUBNAM7= <"">
##$SUBNAM8= <"">
##$SUBNAM9= <"">
##$SW= 501.771253377433
##$SWIBOX= (0..15)
0 1 3 0 0 0 0 0 0 0 0 0 0 0 0 0 
##$SW_h= 40650.406504065
##$TD= 32768
##$TD0= 1
##$TE= 0
##$TE2= 300
##$TE3= 300
##$TEG= 300
##$TL= (0..7)
0 120 53 12 22 120 120 120 
##$TP= (0..7)
150 150 150 150 150 150 150 150 
##$TP07= 0
##$TPNAME0= <>
##$TPNAME1= <>
##$TPNAME2= <>
##$TPNAME3= <>
##$TPNAME4= <>
##$TPNAME5= <>
##$TPNAME6= <>
##$TPNAME7= <>
##$TPOAL= (0..7)
0.5 0.5 0.5 0.5 0.5 0.5 0.5 0.5 
##$TPOFFS= (0..7)
0 0 0 0 0 0 0 0 
##$TUNHIN= 0
##$TUNHOUT= 0
##$TUNXOUT= 0
##$USERA1= <user>
##$USERA2= <user>
##$USERA3= <user>
##$USERA4= <user>
##$USERA5= <user>
##$V9= 5
##$VALIST= <valist>
##$VCLIST= <CCCCCCCCCCCCCCC>
##$VD= 0
##$VDLIST= <DDDDDDDDDDDDDDD>
##$VPLIST= <PPPPPPPPPPPPPPP>
##$VTLIST= <TTTTTTTTTTTTTTT>
##$WBST= 1024
##$WBSW= 4
##$XGAIN= (0..3)
0 0 0 0 
##$XL= 0
##$YL= 0
##$YMAX_a= 2895
##$YMIN_a= -2994
##$ZGOPTNS= <>
##$ZL1= 120
##$ZL2= 120
##$ZL3= 120
##$ZL4= 120
##$ABSF1= 248.5645
##$ABSF2= -253.2056
##$ABSG= 5
##$ABSL= 3
##$ALPHA= 0
##$AQORDER= 0
##$ASSFAC= 0
##$ASSFACI= 0
##$ASSFACX= 0
##$ASSWID= 0
##$AUNMP= <proc_1d>
##$AZFE= 0.1
##$AZFW= 0.5
##$BCFW= 0
##$BC_mod= 2
##$BYTORDP= 0
##$COROFFS= 0
##$CY= -3
##$DATMOD= 1
##$DC= 0
##$DFILT= <>
##$DTYPP= 0
##$F1P= 0
##$F2P= 0
##$FCOR= 1
##$FTSIZE= 65536
##$FT_mod= 6
##$GAMMA= 0
##$GB= 0
##$INTBC= 1
##$INTSCL= 5.30512e-09
##$ISEN= 30
##$LB= 1
##$LEV0= 0
##$LPBIN= 0
##$MAXI= 10000
##$MC2= 0
##$MEAN= 0
##$ME_mod= 0
##$MI= 50
##$NCOEF= 0
##$NC_proc= -6
##$NLEV= 6
##$NOISF1= 182.463
##$NOISF2= 159.3651
##$NSP= 0
##$NTH_PI= 0
##$NZP= 0
##$OFFSET= 248.5645
##$PC= 4
##$PHC0= -8103.1
##$PHC1= 889.0731
##$PH_mod= 1
##$PKNL= yes
##$PPARMOD= 0
##$PSCAL= 0
##$PSIGN= 0
##$REVERSE= no
##$SF= 81.014009
##$SI= 65536
##$SIGF1= 159.3651
##$SIGF2= -187.1042
##$SINO= 113.3802
##$SIOLD= 16384
##$SREGLST= <1H.CDCl3>
##$SSB= 0
##$STSI= 65536
##$STSR= 0
##$SW_p= 40650.406504065
##$SYMM= 0
##$S_DEV= 0
##$TDeff= 32768
##$TDoff= 0
##$TI= <>
##$TILT= no
##$TM1= 0
##$TM2= 0
##$TOPLEV= 0
##$USERP1= <user>
##$USERP2= <user>
##$USERP3= <user>
##$USERP4= <user>
##$USERP5= <user>
##$WDW= 1
##$XDIM= 65536
##$YMAX_p= 459483718
##$YMIN_p= -15445035
$$ End of Bruker specific parameters
$$ ---------------------------------
##NTUPLES= NMR SPECTRUM
##VAR_NAME=  FREQUENCY,     SPECTRUM/REAL,   SPECTRUM/IMAG
##SYMBOL=    X,             R,               I
##VAR_TYPE=  INDEPENDENT,   DEPENDENT,       DEPENDENT
##VAR_FORM=  AFFN,          ASDF,            ASDF
##VAR_DIM=   65536,         65536,           65536
##UNITS=     HZ,            ARBITRARY UNITS, ARBITRARY UNITS
##FACTOR=    0.620285442955139, 1,           1
##FIRST=     20137.2065510759, 0,            0
##LAST=      -20513.1999529892, 0,           0
##MIN=       -20513.1999529892, -15445035,   0
##MAX=       20137.2065510759, 459483718,    0
$$ Real data points
##PAGE= N=1
##DATA TABLE= (X++(R..R)), XYDATA
$$ [...]
$$ plain form
40588 384702 251490 57300 522202 1611304 2368222 2275846 2030858 2324244 2562592 1789872
40578 1789872 426793 -133028 390584 725958 22461 -872866 -795511 -52723 111830
40569 111830 -613354 -1257859 -1034960 -336395 -42139 -393695 -887875 -1001837 -713998 -384645
40559 -384645 -306685 -394294 -276029 295221 1127494 1700958 1587481 802584 -153222 -606760
40549 -606760 -241626 567183 1035535 694341 -183181 -873842 -849961 -186760 509236 613289
40539 613289 134913 -187073 265601 1082793 1188954 171849 -1251449 -2250202 -2753164
40530 -2753164 -2966390 -2693647 -1799464 -861569 -551931 -646270 -456098 -16297 84719 -58929
40520 -58929 302082 1158752 1479821 789710 -27016 -122410 87226 -63081 -132875 588570
$$ packed form
40588C84702j33212j94190M64902J089102P56918r2376k44988K93386K38348p72720
40578A789872j363079n59821N23612L35374p03497q95327P7355P42788J64553
40569A11830p25184o44505K22899O98565K94256l51556m94180j13962K87839L29353
40559c84645P7960q7609J18265N71250Q32273N73464j13477p84897r55806m53538
40549f06760L65134Q08809M68352l41194q77522o90661K3881O63201O95996J04053
40539F13289m78376l21986M52674Q17192J06161j017105j423298r98753n02962
40530b753164k13226K72743Q94183R37895L09638r4339J90172M39801J01016j43648
40520e8929L61011Q56670L21069o90111q16726r5394K09636j50307o9794P21445
$$ plain form
40510 588570 1481592 1224555 -112078 -962719 -501772 231460 -13190 -915176 -1252333
40501 -1252333 -689850 -11038 131570 -110946 -297161 -236431 33571 312841 228386 -381316
40491 -381316 -988443 -770152 294803 1130971 699096 -826808 -2301349 -2781578 -2143564
40482 -2143564 -812492 600923 1479493 1564728 1249630 1098740 1041929 559431 -261837
40473 -261837 -584315 -93788 315054 -214623 -1171802 -1479034 -1193390 -1297713 -1933862 -2087280
40463 -2087280 -1271478 -323986 38246 361666 1280734 2095873 1715964 525370 -319
40454 -319 515455 789559 -160541 -1532895 -1858798 -926340 143832 379177 -185685 -966328
40444 -966328 -1455022 -1322972 -518323 433809 666152 -72105 -934160 -875062 141249 1300445
$$ packed form
40510E88570Q93022k57037j336633q50641M60947P33232k44650r01986l37157
40501a252333N62483O78812J42608k42516j86215O0730K70002K79270q4455o09702
40491c81316o07127K18291J064955Q36168m31875j525904j474541m80229O38014
40482b143564J331072J413415Q78570Q5235l15098j50890n6811m82498q21268
40473b61837l22478M90527M08842n29677r57179l07232K85644j04323o36149j53418
40463b087280Q15802R47492L62232L23420R19068Q15139l79909j190594n25689
40454c19N15774K74104r50100j372354l25903R32458J070172K35345n64862p80643
40444i66328m88694J32050Q04649R52132K32343p38257q62055N9098J016311J159196
$$ plain form
40434 1300445 2127462 2818608 3353450 3165674 2155621 1262426 1292040 1720303 1493099
40425 1493099 599337 -84464 -211777 -177512 -63146 483976 1252408 1469835 1004101 497065
40415 497065 111555 -651932 -1576683 -1543073 -352069 591310 288685 -380780 -229473 370030
40405 370030 438195 171929 311802 542242 102162 -603168 -641982 -406026 -1109100 -2573453
40395 -2573453 -3204257 -2309585 -933514 -141231 120208 151898 -134615 -524412 -344918
40386 -344918 514099 1397846 1992277 2584109 2979545 2391807 865743 -322737 -252140
40377 -252140 612590 1401485 1848951 1911523 1454485 808750 612461 694326 272430 -362916
40367 -362916 150615 1880101 2842669 1761234 156322 249716 1901715 3187148 3144876
$$ packed form
40434A300445Q27017O91146N34842j87776j010053q93195K9614M28263k27204
40425A493099q93762o83801j27313L4265J14366N47122P68432K17427m65734n07036
40415D97065l85510p63487r24751L3610J191004R43379l02625o69465J51307N99503
40405C70030O8165k66266J39873K30440m40080p05330l8814K35956p03074j464353
40395b573453o30804Q94672J376071P92283K61439L1690k86513l89797J79494
40386c44918Q59017Q83747N94431N91832L95436n87738j526064j188480P0597
40377b52140Q64730P88895M47466O2572m57038o45735j96289Q1865m21896o35346
40367c62916N13531J729486R62568j081435j604912R3394J651999J285433m2272
$$ plain form
40358 3144876 2344320 1380194 474866 187795 895351 1700980 1315861 -15602 -794016
40349 -794016 -436970 147362 226088 167552 437450 819706 1007238 1046150 889302 327732
40339 327732 -401182 -712148 -547899 -398969 -364052 -45193 500337 637358 227301 -71315
40329 -71315 101250 251557 -60477 -554210 -852041 -990456 -895816 -184253 933379 1331187
40319 1331187 371283 -884156 -750917 969922 2723563 3078650 2278480 1684740 2021800
40310 2021800 2569188 2176905 786490 -514697 -968578 -1016717 -1290426 -1416801 -676656
40301 -676656 589141 1311542 1284588 1283970 1536556 1295326 285373 -615399 -749739 -690939
40291 -690939 -1108859 -1538522 -1219580 -465569 -179408 -475575 -773529 -931455 -1289756 -1733481
$$ packed form
40358C144876q00556r64126r05328k87071P07556Q05629l85119j331463p78414
40349g94016L57046N84332P8726n8536K69898L82256J87532L8912j56848n61570
40339C27732p28914l10966J64249J48930L4917L18859N45530J37021m10057k98616
40329g1315J72565J50307l12034m93733k97831j38415R4640P11563J117632L97808
40319A331187r59904j255439J33239J720839J753641L55087q00170n93740L37060
40310B021800N47388l92283j390415j301187m53881m8139k73709j26375P40145
40301f76656J265797P22401k6954o18K52586k41230j009953r00772j34340N8800
40291f90939m17920m29663L18942P54011K86161k96167k97954j57926l58301m43725
$$ plain form
40281 -1733481 -1661898 -955689 -223389 26854 -126580 -422713 -771411 -1124237 -1431296 -1768332
40271 -1768332 -2147210 -2263314 -1832983 -1104559 -609000 -466518 -358613 -119352 80266
40262 80266 110135 58136 46293 152360 402815 612361 500565 235081 405004 1039778
40252 1039778 1259533 569461 -160340 17307 479564 -1740 -1088047 -1340543 -773495
40243 -773495 -1006459 -2426379 -3174459 -1956905 -79747 715438 864360 1619608 2352721
40234 2352721 1491553 -468641 -1276436 -270973 772401 571416 92853 554658 1420993
40225 1420993 1570743 1159937 1018434 1088905 744653 107653 -95860 303071 801550 1027630
40215 1027630 916985 361430 -604370 -1466428 -1683545 -1287397 -594710 304297 1260757
$$ packed form
40281a733481P1583P06209P32300K50243j53434k96133l48698l52826l07059l37036
40271a768332l78878j16104M30331P28424M95559J42482J07905K39261J99618
40262H0266K9869n1999j1843J06067K50455K09546j11796k65484J69923O34774
40252A039778K19755o90072p29801J77647M62257m81304j086307k52496N67048
40243g73495k32964j419920p48080J217554J877158P95185J48922P55248P33113
40234B352721q61168j960194q07795J005463J043374k00985m78563M61805Q66335
40225A420993J49750m10806j41503P0471l44252o37000k03513L98931M98479K26080
40215A027630j10645n55555r65800q62058k17117L96148O92687Q99007R56460
$$ plain form
40206 1260757 1722851 1337407 562401 59516 -189567 -546830 -872050 -716284 -101461
40197 -101461 512006 790056 598788 -23640 -479154 105515 1507453 2152104 1198665
40188 1198665 952 201160 1224407 1355948 640323 613556 1403021 1425311 245085
40179 245085 -603565 -383678 -494011 -1846036 -2906263 -1963116 190118 1531894 1581948
40170 1581948 1254776 982279 673210 699459 1228083 1274588 102308 -1110766 -815342
40161 -815342 286734 205964 -1074305 -1540336 -457939 521903 151848 -613380 -612874 -472910
40151 -472910 -1225276 -2227563 -1982010 -337840 1374067 1984741 1320051 -168148 -1693914
40142 -1693914 -2385067 -2058469 -1546491 -1649829 -2088574 -2097933 -1661101 -1393679 -1483375 -1536589
$$ packed form
40206A260757M62094l85444p75006n02885k49083l57263l25220J55766O14823
40197a01461O13467K78050j91268o22428m55514N84669J401938O44651r53439
40188A198665j197713K00208J023247J31541p15625k6767P89465K2290j180226
40179B45085q48650K19887j10333j352025j060227R43147K153234J341776N0054
40170A581948l27172k72497l09069K6249N28624M6505j172280j213074K95424
40161h15342J102076q0770j280269m66031J082397R79842l70055p65228N06J39964
40151d72910p52366j002287K45553J644170J711907O10674o64690j488199j525766
40142a693914o91153L26598N11978j03338m38745r359M36832K67422q9696n3214
$$ plain form
40132 -1536589 -1336987 -1016778 -571548 39497 355755 -162514 -1020098 -888730 616322
40123 616322 2110190 2101480 977696 435423 1109837 1760940 1054520 -716954 -2230171
40114 -2230171 -2768526 -2515015 -1695109 -404080 851651 1449069 1641805 2357055 3701831
40105 3701831 4532692 3966825 2536328 1282203 437354 -313225 -925008 -1142427 -1059743
40096 -1059743 -808895 -197739 623528 774930 -152830 -1109355 -878654 156451 746330
40087 746330 774338 1065052 1508249 1091356 -101418 -640464 38440 712218 322447 -502416
40077 -502416 -657373 -126277 472593 875987 932684 354443 -532308 -781916 -329617 -383402
40067 -383402 -1433364 -2114935 -1285925 -69912 -230327 -1366557 -1549921 -311179 838212
$$ packed form
40132a536589J99602L20209M45230O11045L16258n18269q57584J31368J505052
40123F16322J493868q710j123784n42273O74414O51103p06420j771474j513217
40114b230171n38355K53511Q19906J291029J255731N97418J92736P15250J344776
40105C701831Q30861n65867j430497j254125q44849p50579o11783k17419Q2684
40096a059743K50848O11156Q21267J51402r27760r56525K30701J035105N89879
40087G46330K8008K90714M43197m16893j192774n39046O78904O73778l89771q24863
40077e02416j54957N31096N98870M03394N6697n78241q86751k49608M52299n3785
40067c83402j049962o81571Q29010J216013j60415j136230j83364J238742J149391
$$ plain form
40058 838212 792898 61610 -575723 -1056995 -1328229 -1049241 -502201 -561121 -1217034 -1300951
40048 -1300951 -308435 639534 497035 -52169 281809 1326224 1716378 928549 -122068
40039 -122068 -578234 -742971 -1275982 -1929270 -1725609 -336441 1171372 1318812 -45781
40030 -45781 -1370409 -1123949 358649 1364669 1069313 475476 777846 1639008 1848938
40021 1848938 1154617 466184 395539 530688 330459 -29185 -62143 288843 666712 706036
40011 706036 215631 -650119 -1233225 -912906 -78789 66711 -845454 -1581566 -969961 239534
40001 239534 313483 -923283 -1829455 -1416388 -704536 -956414 -1743619 -1830802 -1162451 -701304
39991 -701304 -682342 -318451 717824 1602417 1464025 459958 -549458 -917804 -634988
$$ packed form
40058H38212m5314p31288o37333m81272k71234K78988N47040n8920o55913q3917
40048a300951R92516R47969j42499n49204L33978J044415L90154p87829j050617
40039a22068m56166j64737n33011o53288K03661J389168J507813J47440j364593
40030d5781j324628K46460J482598J006020k95356n93837L02370Q61162K09930
40021A848938o94321o88433p0645J35149k00229l59644l2958L50986L77869L9324
40011G06036m90405q65750n83106L20319Q34117J45500r12165p36112O11605J209495
40001B39534P3949j236766r06172M13067P11852k51878p87205q7183O68351M61147
39991g01304J8962L63891J036275Q84593j38392j004067j009416l68346K82816
$$ plain form
39982 -634988 -224075 -280966 -816985 -1200973 -1095072 -1063358 -1650385 -2307378 -2146982 -1426311
39972 -1426311 -1134204 -1264870 -843416 226539 796965 393550 82425 686841 1427016
39963 1427016 1312081 792255 886482 1518970 1892196 1825738 1564961 883082 -375200 -1336532
39953 -1336532 -996228 196944 861371 558003 -35536 -551223 -1166847 -1529495 -939691
39944 -939691 195192 504674 -367047 -1217922 -1154235 -674594 -304751 439162 1752951
39935 1752951 2454342 1522071 -101517 -658364 -34500 345423 -127267 -449342 233930
39926 233930 1351120 1924718 1915737 1869367 1876915 1640782 1222727 1018807 1065218 913448
39916 913448 265629 -632152 -1335655 -1695832 -1888167 -2088375 -2225014 -2025826 -1299869 -206008
$$ packed form
39982f34988M10913n6891n36019l83988J05901L1714n87027o56993J60396P20671
39972a426311K92107j30666M21454J069955N70426m03415l11125O04416P40175
39963A427016j14935n19826R4227O32488L73226o6458k60777o81879j258282r61332
39953a336532L40304J193172O64427l03368n93539n15687o15624l62648N89804
39944i39691J134883L09482q71721q50875O3687M79641L69843P43913J313789
39935A752951P01391r32271j623588n56847O23864L79923m72690l22075O83272
39926B33930J117190N73598q981m6370P548k36133m18055k03920M6411j51770
39916I13448o47819q97781p03503l60177j92335k00208j36639J99188P25957J093861
$$ plain form
39906 -206008 776184 1164472 751173 -330077 -1587900 -2245828 -1737999 -375787 818612
39897 818612 1288185 1596951 2409419 3216603 2964483 1826887 1232273 1814641 2428060
39888 2428060 1862221 589905 -118694 -73143 -59461 -398589 -787638 -1209163 -1753035 -1783623
39878 -1783623 -655613 813937 1070570 171146 -141205 885402 1853393 1468133 432954
39869 432954 49163 258864 372956 638102 1571901 2509270 2358670 1332326 478623
39860 478623 -117549 -1148065 -2313239 -2374990 -1154481 -14269 62340 -378431 -531361
39851 -531361 -587817 -998298 -1412386 -1247741 -743722 -581127 -751005 -613599 -57685 111787
39841 111787 -749032 -2060261 -2509255 -1573385 -105724 803329 1082734 1288368 1360303
$$ packed form
39906b06008R82192L88288m13299j081250j257823o57928N07829J362212J194399
39897H18612M69573L08766Q12468Q07184k52120j137596n94614N82368O13419
39888B428060n65839j272316p08599M5551J3682l39128l89049m21525n43872l0588
39878a783623J128010J469550K56633q99424l12351J026607R67991l85260j035179
39869D32954l83791K09701J14092K65146R33799R37369j50600j026344q53703
39860D78623n96172j030516j165174o1751J220509J140212P6609m40771j52930
39851e31361n6456m10481m14088J64645N04019J62595j69878J37406N55914J69472
39841A11787q60819j311229m48994R35870J467661R09053K79405K05634P1935
$$ plain form
39832 1360303 685403 -624911 -1512033 -1309201 -443709 473781 1273043 1559581 630572
39823 630572 -1198680 -2305838 -1758750 -609623 -193323 -209797 258349 883296 803572
39814 803572 359471 447506 810545 675654 443339 854860 1066722 -263337 -2295246
39805 -2295246 -2765397 -1414068 -257998 -239854 -152122 549760 522821 -784666 -1670609
39796 -1670609 -860349 439110 736265 576610 933807 1086523 133884 -850562 -387114
39787 -387114 777840 825032 -123088 -341697 586111 1315142 1093822 691473 836005 1283213
39777 1283213 1640766 1860573 1797543 1337399 915089 933149 915173 279322 -443526 -397154
39767 -397154 -1099 -320015 -1099894 -1034180 33926 809111 679597 602643 1377532 2377185
$$ packed form
39832A360303o74900j310314q87122K02832Q65492R17490P99262K86538r29009
39823F30572j829252j107158N47088J149127M16300j6474M68146O24947p9724
39814H03572m44101Q8035L63039j34891k32315M11521K11862j330059k031909
39805b295246m70151J351329J156070J8144Q7732P01882k6939j307487q85943
39796a670609Q10260J299459K97155j59655L57197J52716r52639r84446M63448
39787c87114J164954M7192r48120k18609R27808P29031k21320m02349J44532M47208
39777A283213L57553K19807o3030m60144m22310J8060j7976o35851p22848M6372
39767c97154L96055l18916p79879O5714J068106P75185j29514p6954P74889R99653
$$ plain form
39757 2377185 2610838 1986849 986935 16743 -493437 -264006 162906 -163229 -1169870
39748 -1169870 -1724338 -1411494 -1243631 -1972388 -2746663 -2371913 -1162900 -522431 -1029221
39739 -1029221 -1834227 -1912208 -1293384 -896059 -1342913 -2068921 -1830384 -320690 1105573
39730 1105573 939467 -533112 -1659010 -1667357 -1399597 -1630362 -1847323 -1288089 -256424
39721 -256424 354796 247502 -226635 -723712 -1080845 -1231769 -1337005 -1576356 -1616509 -962930
39711 -962930 -65961 -113242 -1215500 -1852174 -956633 425646 663380 -123149 -618518
39702 -618518 -572192 -846052 -1429845 -1213160 -51783 620441 15336 -564334 407754 2379743
39692 2379743 3529446 3224003 2383135 1741504 1107393 388482 69400 248658 234742
$$ packed form
39757B377185K33653o23989r99914r70192n10180K29431M26912l26135j006641
39748a169870n54468L12844J67863p28757p74275L74750J209013O40469n06790
39739a029221q05006p7981O18824L97325m46854p26008K38537J509694J426263
39730A105573j66106j472579j125898q347K67760k30765k16961N59234J031665
39721b56424O11220j07294m74137m97077l57133j50924j05236k39351m0153O53579
39711i62930Q96969m7281j102258o36674Q95541J382279K37734p86529m95369
39702f18518M6326k73860n83793K16685J161377O72224o05105n79670R72088J971989
39692B379743J149703l05443q40868o41631o34111p18911l19082J79258j3916
$$ plain form
39683 234742 -275757 -425494 616151 2224325 2915394 2127644 680554 -398574 -809449
39674 -809449 -787493 -661193 -700664 -875724 -713299 92945 969744 1032152 406179 173066
39664 173066 748620 1164083 457881 -935463 -1823043 -1730339 -1090114 -418416 12606 33878
39654 33878 -220885 -241678 173391 511379 386513 290278 726033 1092113 479602 -700921
39644 -700921 -1096403 -428117 79520 -401441 -1065616 -717768 553365 1613775 1694032
39635 1694032 985434 153137 -274294 -187548 155204 520397 973060 1510769 1686941 1202247
39625 1202247 701285 1125796 2207774 2552491 1558588 375862 404973 1543674 2539811
39616 2539811 2549795 1742308 773546 229707 299731 594660 583627 404350 691930 1380412
$$ packed form
39683B34742n10499j49737J041645J608174O91069p87750j447090j079128m10875
39674h09449K1956J26300l9471j75060J62425Q06244Q76799O2408o25973k33113
39664A73066N75554M15463p06202j393344q87580R2704O40225O71698M31022K1272
39654C3878k54763k0793M15069L37988j24866r6235M35755L66080o12511j180523
39644g00921l95482O68286N07637m80961o64175L47848J271133J060410Q0257
39635A694032p08598q32297m27431Q6746L42752L65193M52663N37709J76172m84694
39625A202247n00962M24511J081978L44717r93903j182726K9111J138701R96137
39616B539811R984q07487r68762n43839P0024K94929j1033j79277K87580O88482
$$ plain form
39606 1380412 1496018 630911 -266235 -312833 -18607 -178352 -287277 521662 1509676 1040273
39596 1040273 -753134 -1738217 -690065 1090724 1803944 1429652 969031 610138 49570
39587 49570 -153053 817052 2291466 2546038 1199030 -123391 -5828 953377 1247999
39578 1247999 545701 -183322 -141311 512141 1171877 1453335 1381878 1299006 1489133 1696341
39568 1696341 1332604 426040 -136967 223023 896697 1014938 756161 872288 1308224
39559 1308224 1343036 915814 673188 686682 294035 -582715 -1120833 -960736 -779780 -1036389
39549 -1036389 -1233491 -1028000 -1010984 -1651998 -2442727 -2862162 -3209446 -3623253 -3326411 -1946629
39539 -1946629 -646370 -660831 -1456280 -1632923 -981222 -291375 237203 902898 1336960
$$ packed form
39606A380412J15606q65107q97146m6598K94226j59745j08925Q08939R88014m69403
39596A040273j793407r85083J048152J780789P13220l74292m60621l58893n60568
39587D9570k02623R70105J474414K54572j347008j322421J17563R59205K94622
39578A247999p02298p29023M2011O53452O59736K81458p1457q2872J90127K07208
39568A696341l63737r06564n63007L59990O73674J18241k58777J16127M35936
39559A308224L4812m27222k42626J3494l92647q76750n38118J60097J80956k56609
39549a036389j97102K05491J7016o41014p90729m19435l47284m13807K96842J379782
39539a946629J300259j4461p95449j76643O51701O89847N28578O65695M34062
$$ plain form
39530 1336960 1006570 511374 793273 1367598 1004986 -78269 -512896 -125703 -50313
39521 -50313 -441433 -176925 813354 1081208 215105 -218399 718500 1707102 1377254 423517
39511 423517 145265 411872 577772 1032564 2163591 2914890 2168551 752340 345478
39502 345478 971721 1221682 537096 -322818 -853158 -1343984 -1876891 -2044793 -1755164 -1360728
39492 -1360728 -1004539 -580805 -152565 237188 766625 1231484 919926 -144541 -705932
39483 -705932 -24115 839829 735208 372133 927241 1686694 1201477 170143 699124
39474 699124 2732949 3738471 2469134 727365 449017 1081606 1122052 572749 381741
39465 381741 647814 823524 856328 882270 505120 -471091 -1234683 -1015373 -406662 -541203
$$ packed form
39530A336960l30390m95196K81899N74325l62612j083255m34627L87193P5390
39521e0313l91120K64508R90279K67854q66103m33504R36899R88602l29848r53737
39511D23517k78252K66607J65900M54792J131027P51299p46339j416211m06862
39502C45478O26243K49961o84586q59914n30340m90826n32907j67902K89629L94436
39492a360728L56189M23734M28240L89753N29437M64859l11558j064467n61391
39483g05932O81817Q63944j04621l63075N55108P59453m85217j031334N28981
39474F99124K033825J005522j269337j741769k78348O32589M0446n49303j91008
39465C81741K66073J75710L2804K5942l77150r76211p63592K19310O08711j34541
$$ plain form
39455 -541203 -1369937 -1867861 -1707965 -1669750 -2381493 -3478834 -4111524 -3771182 -2658702
39446 -2658702 -1603551 -1388934 -1795275 -1719275 -691099 307269 249649 -296957 -4047
39437 -4047 1072251 1450888 438678 -845691 -1155493 -815809 -969269 -1801674 -2411645
39428 -2411645 -2138566 -1223380 -261837 307665 211699 -474314 -1081716 -949629 -378186 -233143
39418 -233143 -420807 202855 1774755 2395206 467280 -2612067 -3795774 -2330270 -575213
39409 -575213 -475042 -1035955 -383340 1208403 1969762 1418791 757759 832839 1272502 1666057
39399 1666057 2235813 3070469 3709145 3764104 3251996 2305452 1284904 981467 1750296
39390 1750296 2580300 2112766 546710 -624787 -795867 -859347 -1426739 -1825857 -1394614
$$ packed form
39455e41203q28734m97924J59896L8215p11743j097341o32690L40342J112480
39446b658702J055151K14617m06341P6000J028176R98368n7620n46606K92910
39437d047J076298L78637j012210j284369l09802L39684j53460q32405o09971
39428b411645K73079R15186R61543N69502r5966o86013o07402J32087N71443J45043
39418b33143j87664O23662J571900O20451j927926l079347j183707J465504J755057
39409e75213J00171n60913O52615J591743P61359n50971o61032P5080M39663L93555
39399A666057N69756Q34656O38676N4959n12108r46544j020548l03437P68829
39390A750296Q30004m67534j566056j171497j71080o3480n67392l99118M31243
$$ plain form
39381 -1394614 -535332 171241 789437 1276091 1011103 -67594 -842567 -474342 365995
39372 365995 661575 574381 681061 490030 -826163 -2609210 -3126605 -1863423 -145050
39363 -145050 776800 1147441 1747992 2431221 2395414 1507552 610460 471728 902582 1206787
39353 1206787 1292021 1813728 2977415 3725832 2864265 821522 -664987 -811788 -725288
39344 -725288 -1518932 -2455208 -1985675 -101945 1518005 1630786 678719 -248770 -802596
39335 -802596 -1238922 -1507761 -1212156 -405287 198399 168407 184126 1271749 3150549 4124880
39325 4124880 3164131 1385123 537016 565540 6703 -1444155 -2411735 -2135497 -1548845
39316 -1548845 -1348145 -692344 952039 2164897 1442773 -319441 -1023102 -368928 171875
$$ packed form
39381a394614Q59282P06573O18196M86654k64988j078697p74973L68225Q40337
39372C65995K95580q7194J06680j91031j316193j783047n17395J263182J718373
39363a45050R21850L70641O00551O83229l5807q87862q97092j38732M30854L04205
39353A206787Q5234N21707J163687P48417q61567k042743j486509j46801Q6500
39344g25288p93644r36276M69533J883730J619950J12781r52067r27489n53826
39335h02596m36326k68839K95605Q06869O03686k9992J5719J087623J878800R74331
39325D124880r60749j779008q48107K8524n58837j450858r67580K76238N86652
39316a548845K00700O55801J644383J212858p22124j762214p03661O54174N40803
$$ plain form
39307 171875 -39551 -186111 82507 17641 -636219 -1130025 -1250001 -1759663 -2687491 -2733738
39297 -2733738 -1273878 403214 920474 745565 1133213 2062864 2527284 2258508 1873118
39288 1873118 1635192 1263386 816799 677560 637920 -8683 -1286305 -2252925 -2174619 -1403270
39278 -1403270 -843647 -985125 -1625547 -2169366 -2074440 -1336706 -591783 -417267 -578986 -408532
39268 -408532 114724 281461 -192079 -600322 -284563 287323 124069 -855284 -1684754 -1666538
39258 -1666538 -1196933 -1046875 -1308982 -1445618 -1081066 -309853 634981 1567015 2195291
39249 2195291 2214293 1712110 1209720 1110729 1287710 1324970 973281 276344 -479824 -794303
39239 -794303 -265548 815066 1451675 941079 -241492 -952630 -718177 -162157 -106389
$$ packed form
39307A71875k11426j46560K68618o4866o53860m93806j19976n09662r27828m6247
39297b733738J459860J677092N17260j74909L87648R29651M64420k68776l85390
39288A873118k37926l71806m46587j39239l9640o46603j277622r66620P8306P71349
39278a403270N59623j41478o40422n43819R4926P37734P44923J74516j61719J70454
39268d08532N23256J66737m73540m08243L15759N71886j63254r79353q29470J8216
39258a666538M69605J50058k62107j36636L64552P71213R44834R32034O28276
39249B195291J9002n02183n02390r8991J76981L7260l51689o96937p56168l14479
39239g94303N28755J080614O36609n10596j182571p11138K34453N56020N5768
$$ plain form
39230 -106389 -666366 -1338201 -1584659 -1152305 -165806 813638 1090310 537041 -132494 -105207
39220 -105207 581174 1126495 988276 477481 225036 363064 500163 336893 -19230 -322051
39210 -322051 -462603 -418347 -208247 -16782 -101870 -428021 -666140 -743619 -1035337 -1667218
39200 -1667218 -2002861 -1391472 -215568 476031 345152 94489 328078 756747 763900 157917
39190 157917 -891633 -2057620 -2709618 -2252776 -1050694 -344993 -698289 -1163802 -696011
39181 -696011 255578 510761 58791 31877 859396 1592372 1366600 644312 496871 1208138
39171 1208138 2095867 2461884 2335639 2270590 2499239 2419021 1258183 -660804 -1923650
39162 -1923650 -1729174 -965343 -865034 -1217991 -1005305 -353028 -405371 -1279700 -1673840 -880646
$$ packed form
39230a06389n59977o71835k46458M32354R86499R79444K76672n53269o69535K7287
39220a05207O86381N45321j38219n10795k52445J38028J37099j63270l56123l02821
39210c22051j40552M4256K10100J91465q5088l26151k38119p7479k91718o31881
39200a667218l35643O11389J175904O91599j30879k50663K33589M28669P153o05983
39190A57917j049550j165987o51998M56842J202082P05701l53296m65513M67791
39181f96011R51589K55183m51970k6914Q27519P32976k25772p22288j47441P11267
39171A208138Q87729L66017j26245o5049K28649q0218j160838j918987j262846
39162a923650J94476P63831J00309l52957K12686O52277n2343q74329l94140P93194
$$ plain form
39152 -880646 238537 905787 1653993 2970095 3964838 3653907 2636982 2132040 2037109
39143 2037109 1424064 456111 158736 437383 43613 -1244812 -2056648 -1613161 -956426
39134 -956426 -1093607 -1286518 -490454 538356 215129 -1269557 -2013974 -1136214 91548
39125 91548 278850 -265711 -547906 -630936 -1230051 -2174641 -2482126 -1816408 -852062 -150894
39115 -150894 391161 792427 602284 -261250 -993077 -827249 -33766 580032 808285 1075001
39105 1075001 1553768 1909745 1886777 1596372 1173006 639310 237241 430077 1301560 2236308
39095 2236308 2498960 2035706 1479581 1348751 1398805 940528 -167109 -1088886 -907318
39086 -907318 154245 897715 629760 -101587 -516044 -665916 -900029 -866474 9513 1302994
$$ packed form
39152h80646J119183O67250P48206J316102R94743l10931j016925n04942r4931
39143B037109o13045r67953k97375K78647l93770j288425q11836M43487O56735
39134i56426j37181j92911P96064J028810l23227j484686p44417Q77760J227762
39125I1548J87302n44561k82195q3030n99115r44590l07485O65718R64346P01168
39115a50894N42055M01266j90143q63534p31827J65828P93483O13798K28253K66716
39105A075001M78767L55977k2968k90405m23366n33696m02069J92836Q71483R34748
39095B236308K62652m63254n56125j30830N0054m58277j107637r21777J81568
39086i07318J061563P43470k67955p31347m14457j49872k34113L3555Q75987J293481
$$ plain form
39076 1302994 1848390 1280343 429886 8434 -230045 -666972 -985564 -741572 -185686
39067 -185686 110947 82015 62354 137150 107450 -80890 -300390 -469143 -469981 -78686 638424
39056 638424 1100177 846977 220108 -86494 -19472 -154145 -701515 -1109763 -844828 -117528
39046 -117528 455824 639727 744884 1145657 1839299 2427639 2444274 1788098 882045 271614
39036 271614 29023 -244662 -745515 -1091414 -899501 -514935 -680697 -1431898 -1804653 -983295
39026 -983295 531795 1338050 697561 -634182 -1227910 -444264 960832 1575299 728740
39017 728740 -732614 -1256726 -380368 627206 384714 -712051 -1085960 -336792 159157
39008 159157 -629077 -1803759 -1884365 -884302 -48674 -97159 -746143 -1544093 -2109060 -1830692
$$ packed form
39076A302994N45396n68047q50457m21452k38479m36927l18592K43992N55886
39067a85686K96633k8932j9661P4796k9700j88340k19500j68753q38L91295P17110
39056F38424M61753k53200o26869l06602O7022j34673n47370m08248K64935P27300
39046a17528N73352J83903J05157M00773O93642N88340J6635o56176r06053o10431
39036B71614k42591k73685n00853l45899J91913L84566j65762p51201l72755Q21358
39026i83295J515090Q06255o40489j331743n93728P83646J405096O14467q46559
39017G28740j461354n24112Q76358J007574k42492j096765l73909P49168M95949
39008A59157p88234j174682q0606J000063Q35628m8485o48984p97950n64967K78368
$$ plain form
38998 -1830692 -458447 1126073 1759545 1520154 1377751 1515711 1268071 658133 489000
38989 489000 677069 136279 -1084280 -1230791 502572 2211612 1676797 -495664 -1797890
38980 -1797890 -1290637 -407051 -413876 -745199 -297113 846731 1652183 1418494 321235
38971 321235 -925341 -1633569 -1612354 -1182604 -599568 273230 1340593 1732793 661395
38962 661395 -1283493 -2489566 -2107603 -848129 123969 437916 435603 462958 645447 978058
38952 978058 1251023 1102091 435895 -320918 -565973 -88658 717408 1133799 720219 -182146
38942 -182146 -675869 -254105 636995 1224878 1332509 1273830 1114815 679774 201658 219299
38932 219299 644406 600923 -400339 -1593117 -1776046 -805417 204622 211321 -564631 -1008901
$$ packed form
38998a830692J372245J584520O33472k39391j42403J37960k47640o09938j69133
38989D89000J88069n40790j220559j46511J733363J709040n34815k172461j302226
38980a797890N07253Q83586o825l31323M48086J143844Q05452k33689j097259
38971C21235j246576p08228K1215M29750N83036Q72798J067363L92200j071398
38962F61395j944888j206073L81963J259474R72098L13947k313K7355J82489L32611
38952I78058K72965j48932o66196p56813k45055M77315Q06066M16391m13580r02365
38942a82146m93723M21764Q91100N87883J07631n8679j59015m35041m78116J7641
38932B19299M25107m3483j001262j192778j82929R70629J010039O699p75952m44270
$$ plain form
38922 -1008901 -574808 -8569 -317254 -1260450 -1545583 -678920 167402 -248732 -1401755
38913 -1401755 -1715708 -827222 -10824 -245816 -959230 -1162374 -915149 -895565 -1116357 -982949
38903 -982949 -437792 -221535 -834828 -1764150 -2010885 -1165266 222128 1229928 1403116
38894 1403116 1017881 595877 292060 -109043 -677988 -1100427 -1066456 -706755 -442560 -459823
38884 -459823 -523971 -395930 -303213 -730067 -1608760 -2022729 -1193645 311095 1014981 385000
38874 385000 -465124 -403916 129594 29851 -567435 -521047 355165 962290 799051 772846
38864 772846 1429240 1648308 311638 -1578526 -1937442 -486143 844192 575868 -536929
38855 -536929 -939474 -415823 107083 213073 325904 545552 266037 -690355 -1397239 -975983
$$ packed form
38922a008901M34093N66239l08685r43196k85133Q66663Q46322m16134j153023
38913a401755l13953Q88486Q16398k34992p13414k03144K47225J9584k20792J33408
38903i82949N45157K16257o13293r29322k46735Q45619J387394J007800J73188
38894A403116l85235m22004l03817m01103n68945m22439L3971L59701K64195j7263
38884d59823o4148J28041R2717m26854q78693m13969Q29084J504740P03886o29981
38874C85000q50124O1208N33510r9743n97286M6388Q76212O07125j63239k6205
38864G72846O56394K19068j336670j890164l58916J451299J330335k68324j112797
38855e36929m02545N23651N22906J05990J12831K19648k79515r56392p06884M21256
$$ plain form
38845 -975983 29750 253020 -629100 -1488961 -1439484 -1084390 -1430549 -2175829 -2093809 -971044
38835 -971044 -73926 -370104 -1206372 -1397344 -953507 -841377 -1348104 -1664908 -1184508 -364025
38825 -364025 72248 150976 341063 649511 653721 255630 -219213 -670261 -1358087 -2228058
38815 -2228058 -2678730 -2359523 -1732436 -1381218 -1159658 -617350 37333 165892 -206230
38806 -206230 -352348 -14014 211878 -72737 -457698 -638261 -1115299 -2222996 -3094595
38797 -3094595 -2585341 -943278 394818 631158 392352 613596 1407246 2265964 2756725
38788 2756725 2673600 1931249 690896 -537284 -1127749 -766311 192623 811900 444832
38779 444832 -318136 -179488 1030896 1831589 1104777 -167997 -286648 676032 1162198
$$ packed form
38845i75983J005733K23270q82120q59861M9477L55094l46159p45280Q2020J122765
38835i71044Q97118k96178q36268j90972M43837J12130n06727l16804M80400Q20483
38825c64025M36273P8728J90087L08448M210l98091m74843m51048o87826q69971
38815b228058m50672L19207O27087L51218K21560N42308O54683J28559l72122
38806b06230j46118L38334K25892k84615l84961j80563m77038j107697q71599
38797c094595N09254J642063J338096K36340k38806K21244P93650Q58718M90761
38788B756725q3125p42351j240353j228180n90465L61438R58934O19277l67068
38779D44832p62968J38648J210384Q00693p26812j272774j18651R62680M86166
$$ plain form
38770 1162198 560548 -223731 -576124 -875784 -1142391 -693005 272045 388865 -707717
38761 -707717 -1465382 -719599 506454 779082 492174 754228 1161170 567167 -610723
38752 -610723 -841901 -13067 332804 -600458 -1804507 -2066911 -1289050 30190 1383993
38743 1383993 2105097 1820737 1277984 1546983 2276826 2097748 953241 413390 1134460
38734 1134460 1719041 1080571 331814 880329 1927456 1664640 194365 -665947 -250259
38725 -250259 171799 -269130 -653800 -12388 878546 637511 -474601 -731834 673685
38716 673685 2465913 2894760 1817889 525029 -155328 -677459 -1544366 -2135650 -1502021
38707 -1502021 118935 1444055 1670560 1067587 131491 -910763 -1661417 -1651952 -1222911
$$ packed form
38770A162198o01650p84279l52393k99660k66607M49386R65050J16820j096582
38761g07717p57665P45783J226053K72628k86908K62054M06942n94003j177890
38752f10723k31178Q28834L45871r33262j204049k62404P77861J319240J353803
38743A383993P21104k84360n42753K68999P29843j79078j144507n39851P21070
38734A134460N84581o38470p48757N48515J047127k62816j470275q60312M15688
38725b50259M22058m40929l84670O41412Q90934k41035j112112k57233J405519
38716F73685J792228M28847j076871j292860o80357n22131q66907n91284O33629
38707a502021J620956J325120K26505o02973r36096j042254p50654R465M29041
$$ plain form
38698 -1222911 -1305168 -1875450 -1735793 -526448 240767 -707652 -2296186 -2596677 -1698116
38689 -1698116 -1292102 -1732877 -1539839 -105942 1056836 635450 -508106 -849074 -486459
38680 -486459 -566016 -1223630 -1527697 -1097293 -495563 -126668 144957 262239 -101927 -695798
38670 -695798 -652321 333451 1403498 1455124 273661 -1396730 -2512226 -2418950 -1398896
38661 -1398896 -618581 -994934 -2005611 -2241414 -1311062 -441813 -746232 -1595257 -1455154
38652 -1455154 55703 1741261 2340142 1773155 849378 334070 491886 1105311 1668432
38643 1668432 1766658 1430820 1031209 838167 820839 766428 379988 -559138 -1784182 -2442817
38633 -2442817 -1920209 -726538 235 -67970 -156688 276803 678273 373269 -247714 -314493
$$ packed form
38698a222911q2257n70282J39657J209345P67215r48419j588534l00491Q98561
38689a698116M06014m40775J93038J433897J162778m21386j143556l40968L62615
38680d86459p9557o57614l04067M30404O01730L68895K71625J17282l64166n93871
38670f95798M3477R85772J070047N1626j181463j670391j115496R3276J020054
38661a398896P80315l76353j010677k35803R30352Q69249l04419q49025J40103
38652a455154J510857J685558N98881n66987r23777n15308J57816O13425N63121
38643A668432R8226l35838l99611j93042j7328n4411l86440r39126j225044o58635
38633b442817N22608J193671P26773o8205q8718M33491M01470l05004o20983o6779
$$ plain form
38623 -314493 101140 11969 -1067989 -2452663 -3138641 -2780629 -1723553 -570978 167027
38614 167027 443179 774708 1582677 2487627 2783472 2486047 2152330 1710257 510939
38605 510939 -1205270 -2059799 -1395949 -354655 -226398 -659636 -585294 -87480 186 -243817
38595 -243817 -116022 98330 -533748 -1674760 -1865422 -869799 -176905 -620772 -1167643
38586 -1167643 -904102 -631183 -1294702 -2178005 -2061705 -1166020 -547624 -424007 -469401 -925372
38576 -925372 -1903343 -2350152 -1387479 -58405 66454 -501151 2747 1455101 1848070
38567 1848070 570930 -676432 -807303 -845615 -1530047 -1677651 -414464 878820 652772
38558 652772 -279359 -221430 575612 608387 -195598 -602624 -401887 -515459 -933965 -606719
$$ packed form
38623c14493M15633q9171j079958j384674o85978L58012J057076J152575P38005
38614A67027K76152L31529Q07969R04950K95845k97425l33717m42073j199318
38605E10939j716209q54529O63850J041294J28257m33238P4342M97814Q7666k44003
38595b43817J27795K14352o32078j141012j90662R95623O92894m43867n46871
38586a167643K63541K72919o63519q83303J16300Q95685O18396J23617m5394m55971
38576i25372r77971m46809R62673J329074J24859n67605N03898J452354L92969
38567A848070j277140j247362j30871l8312o84432j47604J263187J293284k26048
38558F52772r32131N7929P97042L2775q03985m07026K00737j13572m18506L27246
$$ plain form
38548 -606719 382536 464617 -963813 -2343802 -2098135 -785827 -132264 -672060 -1321962
38539 -1321962 -1014073 -43177 331280 -541443 -1711503 -1621320 -193925 866080 429208
38530 429208 -347116 208210 1590487 1813416 430148 -917674 -1022396 -450234 -60491
38521 -60491 132438 139332 -305258 -608361 414078 2318665 2857794 1154650 -705258
38512 -705258 -750560 -97417 -863859 -2511046 -2743234 -1302640 -258502 -643503 -1287950
38503 -1287950 -1328847 -1541240 -2397334 -2850522 -2160850 -1258519 -1045479 -756593 568332
38494 568332 2091834 2232547 1045267 66009 132801 672098 960443 886745 513832 -16599
38484 -16599 -108176 731847 1849864 1946830 828572 -261261 -313197 349334 950949 1242487
$$ packed form
38548f06719R89255Q2081j428430j379989K45667J312308O53563n39796o49902
38539a321962L07889R70896L74457q72723j170060R0183J427395J060005m36872
38530D29208p76324N55326J382277K22929j383268j347822j04722N72162L89743
38521f0491J92929O894m44590l03103J022439J904587N39129j703144j859908
38512g05258m5302O53143p66442j647187k32188J440594J044138l85001o44447
38503a287950m0897k12393q56094m53188O89672R02331K13040K88886J324925
38494E68332J523502J40713j187280r79258O6792N39297K88345p3698l72913n30431
38484a6599r1577Q40023J118017R6966j118258j089833n1936O62531O01615K91538
$$ plain form
38474 1242487 1062546 -66422 -2002153 -3386672 -3071799 -1721009 -914315 -929081 -610830
38465 -610830 557560 1563334 1463873 749979 391042 400239 246042 35373 220435 475173
38455 475173 -4085 -1079399 -1585709 -909721 210911 823186 912077 931385 898066 655028
38445 655028 517444 811528 1029729 341156 -1044408 -1874705 -1474172 -634712 -445736
38436 -445736 -826405 -852107 -187468 510035 523927 -190017 -1201787 -1971694 -1991783 -1183409
38426 -1183409 -266697 -60646 -237609 371197 1823614 2475287 1267264 -337197 -170026
38417 -170026 1407983 1909867 417296 -1092549 -871796 -48572 -701679 -2536336 -3307019
38408 -3307019 -2068639 -291440 326678 -211174 -789722 -703508 -166324 125506 -292977
$$ packed form
38474A242487j79941j128968j935731j384519L14873J350790Q06694j4766L18251
38465f10830J168390J005774r9461p13894l58937R197j54197k10669J85062K54738
38455D75173m79258j075314n06310O75988J120632O12275Q8891J9308l3319k43038
38445F55028j37584K94084K18201o88573j385564q30297M00533Q39460J88976
38436d45736l80669k5702O64639O97503J3892p13944j011770p69907k0089Q08374
38426a183409R16712K06051j76963O08806J452417O51673j208023j604461J67171
38417a70026J578009N01884j492571j509845K20753Q23224o53107j834657p70683
38408c307019J238380J777199O18118n37852n78548Q6214N37184K91830m18483
$$ plain form
38399 -292977 -1051014 -1186003 -389280 385774 190718 -528481 -696636 -303908 -188303 -437753
38389 -437753 -363825 -7814 -225036 -1037837 -1291429 -391061 855094 1593943 1896416 1844164
38379 1844164 973244 -574517 -1539682 -1145956 -230850 137852 174919 488754 707739
38370 707739 302430 -40725 601166 1492249 921012 -1224921 -2978095 -2738055 -1156371
38361 -1156371 -81441 -306891 -945383 -829733 -93270 -33992 -1291869 -2660789 -2515237
38352 -2515237 -1188569 -666744 -1682993 -2605497 -1990596 -781151 -665033 -1408425 -1443137
38343 -1443137 -371614 770714 1335145 1590420 1686989 1515474 1390788 1555580 1328728
38334 1328728 182339 -733805 111473 1999107 2545733 1043978 -700578 -1198546 -985280
$$ packed form
38399b92977p58037j34989P96723P75054j95056p19199j68155L92728J15605k49450
38389d37753P3928L56011k17222q12801k53592R00368J246155P38849L02473n2252
38379A844164q70920j547761r65165L93726R15106L68702L7067L13835K18985
38370G07739m05309l43155O41891Q91083n71237k145933j753174K40040J581684
38361a156371J074930k25450o38492J15650P36463N9278j257877j368920J45552
38352b515237J326668N21825j016249r22504O14901J209445J16118p43392l4712
38343a443137J071523J142328N64431K55275R6569j71515j24686J64792k26852
38334A328728j146389r16144Q45278J887634N46626j501755j744556m97968K13266
$$ plain form
38325 -985280 -916610 -726782 -233018 -188396 -739104 -602550 860047 2137742 1679939 385247
38315 385247 271719 1410704 1940516 849217 -803627 -1501867 -962912 -82493 40205
38306 40205 -967138 -2247477 -2385787 -1076936 339545 561340 -126203 -712683 -1058890
38297 -1058890 -1534251 -1764861 -1166998 -363667 -532346 -1336773 -1003217 1158628 3536936
38288 3536936 4092931 2577141 366709 -1152267 -1477180 -821446 323282 1551694 2635775
38279 2635775 3193131 2619959 924863 -663259 -827803 74716 299184 -1036581 -2851170
38270 -2851170 -3594519 -3047858 -2147743 -1647941 -1502978 -1211791 -428475 470913 412415 -1161313
38260 -1161313 -3061559 -3269161 -1400563 719876 1455203 1240259 1257174 1353598 651717
$$ packed form
38325i85280O8670J89828M93764M4622n50708J36554J462597J277695m57803j294692
38315C85247j13528J138985N29812j091299j652844o98240N38955Q80419J22698
38306D0205j007343j280339j38310J308851J416481K21795o87543n86480l46207
38297a058890m75361k30610N97863Q03331j68679q04427L33556K161845K378308
38288C536936N55995j515790k210432j518976l24913O55734J144728J228412J084081
38279B635775N57356n73172j695096j588122j64544R02519K24468j335765j814589
38270b851170p43349N46661R00115M99802J44963K91187P83316Q99388n8498j573728
38260a161313j900246k07602J868598K120439P35327k14944J6915R6424p01881
$$ plain form
38251 651717 -468352 -632204 398344 1342602 1350680 1021835 1067355 1151795 742251 187681
38241 187681 132028 428212 387195 -218675 -959411 -1301074 -982262 -153995 566968 596243
38231 596243 196124 254796 956560 1385823 934187 280926 211589 265717 -347370 -1101926
38221 -1101926 -782387 521604 1468688 1506742 1409728 1542563 1127635 -102060 -927870
38212 -927870 -381254 600386 491793 -556068 -1083242 -573038 -2443 -127074 -403436
38203 -403436 607 949474 1609795 1538385 1057311 689008 496891 71307 -816296 -1684582
38193 -1684582 -1791658 -1127002 -491072 -430506 -635271 -660084 -592788 -539806 -128551 777522
38183 777522 1451938 1238674 638503 525053 694416 314784 -439469 -508859 229789 560442
$$ packed form
38251F51717j120069j63852J030548R44258Q078l28845M5520Q4440m09544n54570
38241A87681n5653K96184m1017o05870p40736l41663L18812Q28267P20963K9275
38231E96243m00119N8672P01764M29263m51636o53261o9337N4128o13087p54556
38221a101926L19539J303991R47084L8054r7014J32835m14928j229695q25810
38212i27870N46616R81640j08593j047861n27174N10204N70595j24631k76362
38203d03436M04043R48867O60321p1410m81074l68303j92117m25584q87603q68286
38193a684582j07076O64656O35930O0566k04765k4813O7296N2982M11255R06073
38183G77522O74416k13264o00171j13450J69363l79632p54253o9390P38648L30653
$$ plain form
38173 560442 -259122 -1380215 -1617090 -943931 -157150 236435 230260 35345 96422 798577
38163 798577 1688059 1641181 363307 -948182 -1113304 -503383 -227262 -327066 143239 1450774
38153 1450774 2675787 2980551 2493259 1699043 760986 -156219 -565943 -238801 312338
38144 312338 495022 511759 969893 1756016 2005094 1339778 474168 157872 58427 -607961
38134 -607961 -1619441 -1815992 -732657 666415 1258572 1050428 668176 238990 -422930
38125 -422930 -975329 -850541 -254770 10586 -277666 -561754 -484877 -239643 144824 932289
38115 932289 1827982 1935011 1042079 120526 -58321 -6806 -458504 -968686 -644630 196051
38105 196051 373029 -208932 -278099 726107 1469470 518390 -1420079 -2200507 -981607
$$ packed form
38173E60442q19564j121093k36875O73159P86781L93585o175j94915O1077P02155
38163G98577Q89482m6878j277874j311489j65122O09921K76121r9804M70305J307535
38153A450774J225013L04764m87292p94216r38057r17205m09724L27142N51139
38144C12338J82684J6737M58134P86123K49078o65316q65610l16296r9445o66388
38134f07961j011480j96551J083335J399072N92157k08144l82252m29186o61920
38125d22930n52399J24788N95771K65356k88252k84088P6877K45234L84467P87465
38115I32289Q95693J07029q92932r21553j78847N1515m51698n10182L24056Q40681
38105A96051J76978n81961o9167J004206P43363r51080j938469p80428J218900
$$ plain form
38096 -981607 812100 1420686 659729 -511826 -1389872 -1696803 -1100703 275000 1189103
38087 1189103 421827 -1338035 -1968751 -610500 1285945 2107520 2041266 2051066 2058588 1397539
38077 1397539 308346 -354734 -458160 -446066 -296627 182616 463947 31766 -380731
38068 -380731 240647 1284695 1240938 209211 -177639 497963 771169 -66391 -679277
38059 -679277 -69509 561263 -252412 -1843206 -2499077 -1907689 -994543 -164652 730432
38050 730432 1287017 1002689 508879 875928 1835707 2068614 1251654 520199 724311 1388483
38040 1388483 1707295 1577872 1256947 830326 469057 529356 897754 753005 -457989
38031 -457989 -2084114 -2864103 -2455772 -1915170 -2365432 -3441982 -3630750 -2297746 -711792
$$ packed form
38096i81607J793707O08586p60957j171555q78046l06931N96100J375703R14103
38087A189103p67276j759862o30716J358251J896445Q21575o6254R800P522o61049
38077A397539j089193o63080j03426J2094J49439M79243K81331m32181m12497
38068c80731O21378J044048m3757j031727l86850O75602K73206q37560o12886
38059f79277O09768O30772q13675j590794o55871N91388R13146Q29891Q95084
38050G30432N56585k84328m93810L67049R59779K32907q16960p31455K04112O64172
38040A388483L18812j29423l20925m26621l61269O0299L68398j44749j210994
38031d57989j626125p79989M08331N40602m50262j076550j88768J333004J585954
$$ plain form
38022 -711792 -426545 -1168319 -1327247 -307734 837142 1200009 1111188 1028021 695131 158628
38012 158628 328175 1458820 2160425 1204115 -514547 -1165309 -474990 367633 742695
38003 742695 983676 1057287 515805 -214450 -72339 827293 1035224 -117640 -1475018
37994 -1475018 -1698689 -927149 -185773 -17546 -323095 -827463 -1090313 -649487 295819
37985 295819 864569 617542 166244 207502 518233 455906 -36757 -525805 -798592 -905649
37975 -905649 -818031 -597254 -578828 -781582 -465074 945366 2656652 3119647 1950401
37966 1950401 417321 -238551 -118094 167421 728214 1847012 2802164 2508949 1241798
37957 1241798 479339 825778 1296076 1101334 858886 1215893 1511680 1054581 714419
$$ packed form
38022g11792K85247p41774j58928J019513J144876L62867q8821q3167l32890n36503
38012A58628J69547J130645P01605r56310j718662o50762O90319Q42623L75062
38003G42695K40981P3611n41482p30255J42111Q99632K07931j152864j357378
37994a475018k23671P71540P41376J68227l05549n04368k62850M40826R45306
37985B95819N68750k47027m51298M1258L10731o2327m92663m89048k72787j07057
37975i05649Q7618K20777J8426k02754L16508J410440J711286M62995j169246
37966A950401j533080o55872J20457K85515N60793J118798R55152k93215j267151
37957A241798p62459L46439M70298j94742k42448L57007K95787m57099l40162
$$ plain form
37948 714419 1637253 3038622 3127172 1985301 1572178 2651676 3637576 3125965 1843998
37939 1843998 1140978 1025551 855436 781246 1222478 1740438 1618937 977136 355824 -180696
37929 -180696 -651158 -561741 335053 1298145 1551766 1394333 1446306 1451555 888702 219345
37919 219345 364675 1266273 2021052 2218193 2202215 2188026 1942546 1231858 27823 -1426703
37909 -1426703 -2353671 -1903050 -446737 429506 -8181 -516535 211767 1513787 1926319
37900 1926319 1500851 1402065 1846103 2098077 2094354 2369595 2616817 2034746 1015175 746551
37890 746551 1089333 675097 -575503 -938495 360326 1594015 921879 -913557 -1630405
37881 -1630405 -421699 1360953 2220936 2077712 1765553 1844724 2244931 2618180 2680533
$$ packed form
37948G14419R22834J401369Q8550j141871m13123J079498R85900n11611j281967
37939A843998p03020j15427j70115p4190M41232N17960j21501o41801o21312n36520
37929a80696m70462Q9417Q96794R63092K53621j57433N1973N249n62853o69357
37919B19345J45330R01598P54779J97141j5978j4189k45480p10688j204035j454526
37909a426703r26968M50621J456313Q76243m37687n08354P28302J302020M12532
37900A926319m25468r8786M44038K51974l723K75241K47222n82071j019571k68624
37890G46551L42782m14236j250600l62992J298821J233689o72136j835436p16848
37881a630405J208706J782652Q59983j43224l12159P9171M00207L73249O2353
$$ plain form
37872 2680533 2392824 2078346 2230304 2872953 3222358 2533590 1332922 991597 1731907
37863 1731907 2134307 1430482 1006331 2122696 3347746 2531706 564289 307187 1952877
37854 1952877 2696456 1549076 990248 2508673 3958438 3438428 2606631 3435176 4498304
37845 4498304 3706202 2390076 3072122 4904322 5041599 3389245 2381515 2829078 3426003
37836 3426003 3803773 4727698 5623343 5093157 3663607 3102898 3405218 3348896 3430347 5046054
37826 5046054 7280292 7875531 7030427 6830208 7283343 6563090 4961404 4754522 6052176
37817 6052176 6600767 5962446 6099879 7459593 8250050 8039782 8373501 9461613 9967978
37808 9967978 10256413 11959231 14323690 15172072 15323958 17456254 20901980 22836102 24277506
$$ packed form
37872B680533k87709l14478J51958O42649L49405o88768j200668l41325P40310
37863A731907M02400p03825m24151J116365J225050q16040j967417k57102J645690
37854A952877P43579j147380n58828J518425J449765n20010q31797Q28545J063128
37845D498304p92102j316126O82046J832200J37277j652354j007730M47563N96925
37836C426003L77770R23925Q95645n30186j429550n60709L02320n6322Q1451J615707
37826E046054K234238N95239q45104k00219M53135p20253j601686k06882J297654
37817F052176N48591o38321J37433J359714P90457k10268L33719J088112N06365
37808I967978K88435J702818K364459Q48382J51886K132296L445726J934122J441404
$$ plain form
37799 24277506 28865247 35859313 41263097 45975602 54914310 67599025 78874218 90196699
37791 90196699 109541510 138368352 172397690 219127774 295154494 391792927 459483718
37784 459483718 449803317 369161757 271826776 201620470 159342190 126973491 99594616
37777 99594616 82186288 72349886 62588575 52464271 46210486 42654052 37233158 30704202
37769 30704202 27314242 26574978 24257292 19986158 17274509 16950239 16286536 14184265
37761 14184265 12307230 11304411 10080147 8652493 8169675 8296005 7666002 6581500
37753 6581500 6459772 7062226 6896642 5896507 5254455 5078877 4493608 3579040 3129915
37744 3129915 3033361 2797666 2964301 4059246 4946567 4269149 2808392 2345498 2803303
$$ packed form
37799B4277506M587741O994066N403784M712505Q938708J2684715J1275193J1322481
37791I0196699J9344811K8826842L4029338M6730084P6026720R6638433O7690791
37784D59483718r680401q0641560r7334981p0206306m2278280l2368699k7378875
37777I9594616j7408328r836402r761311j0124304o253785l556434n420894o528956
37769C0704202l389960p39264k317686m271134k711649l24270o63703k102271
37761A4184265j877035j002819j224264j427654m82818J26330o30003j084502
37753F581500j21728O02454j65584j000135o42052j75578n85269r14568m49125
37744C129915r6554k35695J66635J094945Q87321o77418j460757m62894M57805
$$ plain form
37735 2803303 2626218 1553323 906483 1256513 1682380 1447936 935604 813720 1375595
37726 1375595 2609088 4013497 4607908 3894572 2457005 1116757 216481 114846 1167805
37717 1167805 2572420 2671706 1311926 373093 922798 1596769 1170740 826801 1938580
37708 1938580 3309270 2967494 1433230 701230 917606 671155 -3982 370836 1792541
37699 1792541 2399047 1416450 337946 524701 1367386 1588345 1063373 601495 762822
37690 762822 1424775 2016904 1997919 1418761 827948 383663 -300589 -1056583 -943581 156421
37680 156421 913340 524070 33748 413928 745610 42350 -510101 601146 2210749
37671 2210749 1979969 316818 -74573 1501474 2801483 2493737 2079765 2876156 3623037
$$ packed form
37735B803303j77085j072895o46840L50030M25867k34444n12332j21884N61875
37726A375595J233493J404409N94411p13336j437567j340248r00276j01635J052959
37717A167805J404615R9286j359780r38833N49705O73971m26029l43939J111779
37708A938580J370690l41776j534264p32000K16376k46451o75137L74818J421705
37699A792541O06506r82597j078504J86755Q42685K20959n24972m61878J61327
37690G62822O61953N92129j8985n79158n90813m44285o84252p55994J13002J100002
37680A56421P56919l89270m90322L80180L31682p03260n52451J111247J609603
37671B210749k30780j663151l91391J576047J300009l07746m13972P96391P46881
$$ plain form
37662 3623037 2746858 1066569 366757 585936 283791 -867777 -1758372 -1677356 -1084306
37653 -1084306 -569397 -110610 448835 878748 815286 287731 -194624 -171823 129608 15032
37643 15032 -547406 -537131 685013 2025571 1819617 150929 -1232087 -1379084 -1136321
37634 -1136321 -1295445 -1210830 -195638 879494 711295 -344105 -680775 199378 984862
37625 984862 475317 -784535 -1382601 -950440 -425907 -533193 -752128 -167392 1102476
37616 1102476 1948990 1689447 832610 265641 251007 566180 1087471 1681278 1907173 1486604
37606 1486604 876609 776345 1173363 1423458 1173191 659532 186281 -125695 -116353 301450
37596 301450 801218 966658 956898 1259858 1756601 1707402 840674 -197532 -758557 -935139
$$ packed form
37662C623037q76179j680289o99812K19179l02145j151568q90595Q1016N93050
37653a084306N14909M58787N59445M29913o3462n27555m82355K2801L01431j14576
37643A5032n62438J0275J222144J340558k05954j668688j383016j46997K42763
37634a136321j59124Q4615J015192J075132j68199j055400l36670Q80153P85484
37625I84862n09545j259852n98066M32161N24533j07286k18935N84736J269868
37616A102476Q46514k59543q56837n66969j4634L15173N21291N93807K25895m20569
37606A486604o09995j00264L97018K50095k50267n13659m73251l11976R342M17803
37596C01450M99768J65440r760L02960M96743m9199q66728j038206n61025j76582
$$ plain form
37586 -935139 -1012806 -801557 -133481 415386 101509 -811777 -1256763 -879975 -595704 -1196217
37576 -1196217 -2067970 -2038220 -1092411 -266831 69498 631436 1566914 1672118 233182
37567 233182 -1338919 -1128245 553131 1618029 1240263 733182 1077924 1292595 185546
37558 185546 -1587067 -2423541 -1903760 -868999 35497 773779 1219787 1090406 504577
37549 504577 -126395 -654985 -1078009 -1138248 -698567 -263359 -412462 -841900 -646126 442850
37539 442850 1642403 2004359 1355513 354733 -149300 117505 617839 706508 533227
37530 533227 776740 1456194 1739345 1223019 644577 820184 1539020 2082767 2227466 2099672
37520 2099672 1625662 858832 397012 736242 1534332 2123112 2382942 2530821 2479842 2085141
$$ packed form
37586i35139p7667K11249O68076N48867l13877r13286m44986L76788K84271o00513
37576a196217q71753K9750R45809Q25580L36329N61938R35478J05204j438936
37567B33182j572101K10674J681376J064898l77766n07081L44742K14671j107049
37558A85546j772613q36474N19781J034761R04496P38282M46008j29381n85829
37549E04577o30972n28590m23024o0239M39681M35208j49103m29438J95774J088976
37539D42850J199553L61956o48846j000780n04033K66805N00334Q8669j73281
37530E33227K43513O79454K83151n16326n78442J75607P18836N43747J44699j27794
37520B099672m74010p66830m61820L39230P98090N88780K59830J47879n0979l94701
$$ plain form
37510 2085141 1675744 1673986 1930870 1972561 1643136 1094870 523486 285412 768701 1740621
37500 1740621 2401203 2485799 2606108 3037328 3025850 1960846 424385 -629593 -955829
37491 -955829 -664999 184669 891368 248874 -1524702 -2254438 -629102 1584664 1818864
37482 1818864 184825 -1235721 -1707726 -2167203 -2684994 -2105909 -409414 817339 796490
37473 796490 532603 778863 842776 195762 -357752 -74743 463536 388634 -225694 -914523
37463 -914523 -1565371 -1943622 -1539941 -579996 -124793 -450051 -433088 604202 1566249 1198509
37453 1198509 93352 -225826 375747 603413 -206844 -1242683 -1564718 -1312066 -1200466
37444 -1200466 -1482494 -1869739 -2149935 -2401551 -2596115 -2367257 -1484137 -424374 -21492
$$ packed form
37510B085141m09397j758K56884M1691l29425n48266n71384k38074M83289R71920
37500A740621O60582Q4596J20309M31220j1478j065004j536461j053978l26236
37491i55829K90830Q49668P06699o42494j773576p29736J625336K213766K34200
37482A818864j634039j420546m72005m59477n17791N79085J696495J226753k0849
37473G96490k63887K46260O3913o47014n53514K83009N38279p4902o14328o88829
37463i14523o50848l78251M03681R59945M55203l25258J6963J037290R62047l67740
37453A198509j105157l19178O01573K27666q10257j035839l22035K52652J11600
37444a200466k82028l87245k80196k51616j94564K28858Q83120J059763M02882
$$ plain form
37435 -21492 -415595 -805387 -503967 220070 691633 677486 224906 -707624 -1767412 -1991638
37425 -1991638 -1007773 64550 -20758 -808314 -916900 -304998 -265942 -1179259 -1866731 -1582080
37415 -1582080 -1162134 -1471656 -1926333 -1511465 -403562 415046 617728 667319 728141 302000
37405 302000 -865263 -1986200 -1779946 40021 2082113 2599901 1510748 367405 137312
37396 137312 88823 -508805 -876422 -154710 782208 640903 23318 439650 1505588 1364942
37386 1364942 -163429 -1193459 -867607 -541719 -1154992 -1617400 -928163 37884 214090
37377 214090 182809 872315 1747825 1775957 1133157 615755 326373 198548 800500 2238609
37367 2238609 3168350 2351819 506039 -736178 -1012803 -1027360 -863098 -53480 1082446
$$ packed form
37435b1492l94103l89792L01420P24037M71563j4147m52580r32530j059788k24226
37425a991638R83865J072323q5308p87556j08586O11902L9056r13317o87472K84651
37415a582080M19946l09522m54677M14868J107903Q18608K02682M9591O0822m26141
37405C02000j167263j120937K06254J819967K042092N17788j089153j143343k30093
37396A37312m8489n97628l67617P21712R36918j41305o17585M16332J065938j40646
37386A364942j528371j030030L25852L25888o13273m62408O89237R66047J76206
37377B14090l1281O89506Q75510K8132o42800n17402k89382j27825O01952J438109
37367B238609R29741q16531j845780j242217k76625j4557J64262Q09618J135926
$$ plain form
37358 1082446 1677897 1714709 1908797 2375419 2570670 2352013 1972499 1282772 107588
37349 107588 -868790 -873678 -469363 -802126 -1557978 -1261250 230401 1217498 712716 -69509
37339 -69509 283881 1237091 1433729 957548 886978 1113879 384366 -1318693 -2098680 -691617
37329 -691617 1507795 2173534 1092019 93827 242625 673115 503800 344036 1017415
37320 1017415 1991775 2255961 1916598 1681247 1414840 561867 -465510 -736400 -332620
37311 -332620 -25526 285528 1245978 2352787 2368393 1474345 1127182 1505313 1135725 -339586
37301 -339586 -1138430 -125283 1313409 1532554 1036805 1023660 1023711 -109163 -1892945 -2799910
37291 -2799910 -2512277 -1950322 -1576652 -1191047 -932369 -1015840 -895612 -100093 525357 -141711
$$ packed form
37358A082446N95451L6812J94088M66622J95251k18657l79514o89727j175184
37349A07588r76378m888M04315l32763p55852K96728J491651R87097n04782p82225
37339f9509L53390R53210J96638m76181p0570K26901p29513j703059p79987J407063
37329f91617K199412O65739j081515r98192J48798M30490j69315j59764O73379
37320A017415R74360K64186l39363k35351k66407q52973j027377k70890M03780
37311c32620L07094L11054R60450J106809J5606q94048l47163L78131l69588j475311
37301c39586p98844J013147J438692K19145m95749j3145N1j132874j783782r06965
37291b799910K87633N61955L73670L85605K58678q3471J20228P95519O25450o67068
$$ plain form
37281 -141711 -1590346 -2300867 -2012277 -1834698 -2226277 -2426855 -2029114 -1657230 -1740419 -1811990
37271 -1811990 -1427631 -833401 -396923 -158440 -148129 -430287 -717621 -614881 -274604 -155508
37261 -155508 -182817 161619 963802 1728185 2004503 1618381 557568 -753132 -1440663
37252 -1440663 -1148793 -595596 -473567 -421062 29043 264654 -389249 -1161901 -879450 -32755
37242 -32755 -100868 -1078263 -1507225 -956389 -568732 -898145 -1109846 -829380 -886733 -1442744
37232 -1442744 -1229471 204621 1136023 1514 -2173275 -3237602 -2867360 -2442263 -2599812
37223 -2599812 -2575252 -1808247 -746963 95791 757624 1260923 1329614 970658 682774 821191
37213 821191 1236411 1701976 2218844 2683955 2676534 1908725 713712 -183252 -381402 -165422
$$ packed form
37281a41711j448635p10521K88590J77579l91579k00578L97741L71884q3189p1571
37271a811990L84359N94230M36478K38483J0311k82158k87334J02740L40277J19096
37261a55508k7309L44436Q02183P64383K76318l86122j060813j310700o87531
37252a440663K91870N53197J22029N2505M50105K35611o53903p72652K82451Q46695
37242c2755o8113r77395m28962N50836L87657l29413k11701K80466n7353n56011
37232a442744K13273J434092R31402j134509k174789j064327L70242M25097j57549
37223b599812K4560P67005J061284Q42754O61833N03299O8691l58956k87884J38417
37213H21191M15220M65565N16868M65111p421p67809j195013q96964j98150K15980
$$ plain form
37203 -165422 -87697 -246102 -172651 418244 991334 692931 -529798 -1739187 -2048146 -1448564
37193 -1448564 -448368 609281 1466382 1632776 848594 -211181 -407081 442103 1196148
37184 1196148 926094 314394 704962 1950070 2335143 1029087 -524506 -613740 252366
37175 252366 314489 -466751 -280538 1490351 3021300 2738880 1605183 1327457 1588287
37166 1588287 870243 -691704 -1289763 -268228 784655 281768 -1270904 -2107937 -1389918
37157 -1389918 28071 665562 -51640 -1204406 -1400633 -496433 166835 -415646 -1552795
37148 -1552795 -1988389 -1644826 -1267076 -1019211 -677671 -650675 -1304265 -1629553 -291027
37139 -291027 2026222 3069195 2068302 618387 64072 -206035 -1029081 -1726829 -1366154
$$ packed form
37203a65422P7725j58405P3451N90895N73090k98403j222729j209389l08959N99582
37193a448564J000196J057649Q57101J66394p84182j059775j95900Q49184P54045
37184A196148k70054o11700L90568J245108L85073j306056j553593q9234Q66106
37175B52366O2123p81240J86213J770889J530949k82420j133697k77726K60830
37166A588287p18044j561947n98059J021535J052883n02887j552672q37033P18019
37157a389918J417989O37491p17202j152766j96227R04200O63268n82481j137149
37148a552795m35594L43563L77750K47865L41540K6996o53590l25288J338526
37139b91027K317249J042973j000893j449915n54315k70107q23046o97748L60675
$$ plain form
37130 -1366154 -503615 -277806 -613100 -637038 -250250 -8140 133850 727647 1662766 2165613
37120 2165613 1998555 1830318 2281792 3146861 3650448 3187945 1891281 627136 161209
37111 161209 218090 -128783 -993135 -1371542 -682927 259375 483028 247611 305229 480484
37101 480484 121956 -485813 -403768 426235 1098429 1191974 1154786 1098388 405900 -993924
37091 -993924 -1990140 -1635648 -427232 450203 600262 429051 172568 -207457 -374428
37082 -374428 189057 1187580 1502417 584640 -667370 -928541 -47096 892061 957129 256353
37072 256353 -619538 -1434027 -2172044 -2460609 -1810695 -524673 237611 -234983 -1133692
37063 -1133692 -1018522 176621 775333 -478642 -2459498 -2810739 -924787 1333075 2146513
$$ packed form
37130a366154Q62539K25809l35294k3938L86788K42110J41990N93797R35119N02847
37120B165613j67058j68237M51474Q65069N03587m62503j296664j264145m65927
37111A61209N6881l46873q64352l78407O88615R42302K23653k35417N7618J75255
37101D80484l58528o07769Q2045Q30003O72194R3545l7188n6398o92488j399824
37091i93924r96216L54492J208416Q77435J50059j71211k56483l80025j66971
37082c74428N63485R98523L14837r17777j252010k61171Q81445R39157O5068p00776
37072B56353q75891q14489p38017k88565O49914J286022P62284m72594q98709
37063a133692J15170J195143N98712j253975j980856l51241J885952K257862Q13438
$$ plain form
37054 2146513 1791604 1408772 936081 -279519 -1533444 -1325093 106588 663300 -604517
37045 -604517 -1992147 -1619813 -77378 672318 56675 -825010 -1050803 -630092 219937
37036 219937 1209650 1519983 473774 -1224007 -1976028 -1234288 -84611 304977 -3968
37027 -3968 -256596 -129413 153228 417602 784834 1346119 1814330 1728444 1198323 1183308
37017 1183308 2396843 3981598 4190707 2657092 979187 532697 771956 502750 -216306
37008 -216306 -547857 -390789 -201095 31858 444553 574251 156834 -40726 564986 1109126
36998 1109126 658797 28146 506208 1511117 1471160 478988 -59747 6060 -297149 -612524
36988 -612524 452766 2423808 3059457 1910027 1104656 1746553 2243099 1502966 1119917
$$ packed form
37054B146513l54909l82832m72691j215600j253925K08351J431681N56712j267817
37045f04517j387630L72334J542435P49696o15643q81685k25793M20711Q50029
37036B19937R89713L10333j046209j697781p52021P41740J149677L89588l08945
37027c968k52628J27183K82641K64374L67232N61285M68211q5886n30121j5015
37017A183308J213535J584755K09109j533615j677905m46490K39259k69206p19056
37008b16306l31551J57068J89694K32953M12695J29698m17417j97560O05712N44140
36998A109126m50329o30651M78062J004909l9957r92172n38735O5807l03209l15375
36988f12524J065290J971042O35649j149430q05371O41897M96546p40133l83049
$$ plain form
36979 1119917 2499735 4065701 3566538 1507805 45356 -269930 -441689 -678472 -277889
36970 -277889 649241 1223049 1279111 1299348 1213991 650606 8728 -452 466469 796516
36960 796516 1028774 1426815 1527910 862394 97072 181687 803499 939166 499747 155204
36950 155204 -45889 -530345 -998838 -735281 54383 469206 348226 307273 487327 433665
36940 433665 136212 80421 301969 374198 220024 10315 -478035 -1366486 -1864207 -1181852
36930 -1181852 -54064 -19870 -1187479 -2022736 -1529173 -421990 155841 -10083 -504095
36921 -504095 -982215 -1137642 -698913 143468 813500 1021305 893487 493789 -145892 -564246
36911 -564246 -180994 831165 1591080 1510082 779162 -79029 -663400 -824168 -779256 -884197
$$ packed form
36979A119917J379818J565966m99163k058733j462449l15286j71759k36783M00583
36970b77889R27130N73808N6062K0237q5357n63385o41878r180M66921L30047
36960G96516K32258L98041J01095o65516p65322Q4615O21812J35667m39419l44543
36950A55204k01093m84456m68493K63557P89664M14823j20980m0953J80054n3662
36940D33665k97453n5791K21548P2229j54174k09709m88350q88451m97721O82355
36930a181852J127788L4194j167609q35257M93563J107183N77831j65924m94012
36921e04095m78120j55427M38729Q42381O70032K07805j27818l99698o39681m18354
36911e64246L83252J012159P59915q0998p30920q58191n84371j60768M4912j04941
$$ plain form
36901 -884197 -951832 -334721 826118 1234118 186280 -1094455 -1042164 11795 583238
36892 583238 474329 774495 1634085 1865585 993076 14356 -358356 -691785 -1420089 -1830202
36882 -1830202 -1312516 -511072 -312380 -535439 -477340 -75861 256606 397996 406334 113706
36872 113706 -519630 -1009360 -871142 -289129 131971 24445 -595159 -1500101 -2325095 -2781892
36862 -2781892 -2980358 -3213481 -3364268 -2969663 -1942594 -739554 240111 868470 908295
36853 908295 189505 -660289 -524479 709559 1703136 1328713 197353 -228848 328694
36844 328694 720823 163567 -603210 -425013 559727 1119659 753343 393442 855214 1441371
36834 1441371 1053698 106496 -35052 676128 900185 335793 365442 1487184 1967114
$$ packed form
36901h84197o7635O17111J160839M08000j047838j280735N2291J053959N71443
36892E83238j08909L00166Q59590K31500q72509r78720l72712l33429p28304m10113
36882a830202N17686Q01444J98692k23059N8099M01479L32467J41390Q338k92628
36872A13706o33336m89730J38218N82013M21100j07526o19604r04942q24994m56797
36862b781892j98466k33123j50787L94605J027069J203040R79665O28359L9825
36853I08295p18790q49794J35810J234038R93577l74423j131360m26201N57542
36844C28694L92129n57256p66777J78197R84740N59932l66316l59901M61772N86157
36834A441371l87673r47202j41548P11180K24057n64392K9649J121742M79930
$$ plain form
36825 1967114 473974 -1498818 -1656666 -190090 921835 1007722 1010448 1319743 1484408
36816 1484408 1732623 2576802 3091368 1873633 -271271 -1002348 -57768 285675 -1053233
36807 -1053233 -2291097 -1839814 -644486 -109772 151218 858207 1207579 302157 -1019778
36798 -1019778 -1550982 -1650708 -2119526 -2389633 -1694685 -949998 -1426208 -2344486 -1906355 -262518
36788 -262518 620687 -72186 -1102315 -1364841 -1227904 -1307857 -1378069 -1050255 -485052 25397
36778 25397 389857 407973 -107375 -759763 -853727 -329184 267438 689684 1095734 1337275
36768 1337275 1068567 615105 771028 1493535 1681717 664142 -769562 -1270301 -409036
36759 -409036 1076492 2115230 2077745 1073352 -141472 -675998 -220165 666369 1016593
$$ packed form
36825A967114j493140j972792j57848J466576J111925Q5887K726L09295J64665
36816A484408K48215Q44179N14566j217735k144904p31077R44580L43443j338908
36807a053233j237864M51283J195328N34714K60990P06989L49372r05422j321935
36798a019778n31204r9726m68818k70107O94948P44687m76210r18278M38131J643837
36788b62518Q83205o92873j030129k62526J36937p9953p0212L27814N65203N10449
36778B5397L64460J8116n15348o52388r3964N24543N96622M22246M06050K41541
36768A337275k68708m53462J55923P22507J88182j017575j433704n00739Q61265
36759d09036J485528J038738l7485j004393j214824n34526M55833Q86534L50224
$$ plain form
36750 1016593 297678 -1067559 -2026485 -1903980 -1038831 -229501 212043 385466 77159
36741 77159 -985843 -2138019 -2122004 -856909 110868 -466454 -1995383 -3050249 -3062428
36732 -3062428 -2277440 -957239 380860 709920 -369141 -1755427 -2145998 -1678583 -1274398
36723 -1274398 -1030601 -555360 -306019 -1020784 -2092342 -2126922 -1123414 -532682 -963033
36714 -963033 -1358028 -857760 -42078 283706 290074 407444 485087 411006 651435 1422293
36704 1422293 2111875 2226231 2149816 2269167 2134062 1339323 543991 607343 1175954 1168438
36694 1168438 430334 -101807 113700 473273 197600 -595119 -1114950 -845325 -24365
36685 -24365 637580 635869 197661 65177 553778 979842 421374 -970230 -1897970 -1378972
$$ packed form
36750A016593p18915j365237r58926J22505Q65149Q09330M41544J73423l08307
36741G7159j063002j152176J6015J265095R67777n77322j528929j054866j2179
36732c062428P84988J320201J338099L29060j079061j386286l90571M67415M04185
36723a274398K43797M75241K49341p14765j071558l4580J003508N90732m30351
36714i63033l94995N00268Q15682L25784O368J17370P7643p4081K40429P70858
36704A422293O89582J14356p6415J19351j35105p94739p95332O3352N68611p516
36694A168438p38104n32141K15507L59573k75673p92719n19831K69625Q20960
36685b4365O61945j711m38208j32484M88601M26064n58468j391604r27740N18998
$$ plain form
36675 -1378972 88844 1161422 1179004 576744 -91718 -814546 -1539780 -1655754 -800290
36666 -800290 168008 -66143 -1508024 -2708922 -2620138 -1777754 -1242680 -1148716 -927572 -364412
36656 -364412 279779 774956 942978 615624 148919 406285 1507466 2233332 1633676
36647 1633676 621190 718474 1649357 1715925 535851 -242978 573344 1965568 2242015
36638 2242015 1265002 204190 -188413 -106141 97375 397741 907808 1645075 2379040
36629 2379040 2579294 1893834 799262 233173 389568 500042 62285 -427245 -363803
36620 -363803 34647 197671 5779 -393789 -995293 -1604762 -1660097 -986660 -238015 3472
36610 3472 43792 360687 624643 222556 -670425 -1356799 -1607842 -1586880 -1146103 -145773
$$ packed form
36675a378972J467816J072578J7582o02260o68462p22828p25234j15974Q55464
36666h00290R68298k34151j441881j200898Q8784Q42384N35074R3964K21144N63160
36656c64412O44191M95177J68022l27354m66705K57366J101181P25866n99656
36647A633676j012486R7284R30883O6568j180074p78829Q16322J392224K76447
36638B242015r77013j060812l92603Q2272K03516L00366N10067P37267P33965
36629B379040K00254o85460j094572n66089J56395J10474m37757m89530O3442
36620c63803L98450J63024j91892l99568o01504o09469n5335O73437P48645K41487
36610C472M0320L16895K63956m02087q92981o86374k51043K0962M40777J000330
$$ plain form
36600 -145773 745459 596460 -415639 -1084851 -745048 35676 459943 428255 268343 260716
36590 260716 676721 1614334 2510121 2453596 1339342 144644 -301683 -277719 -469695 -854288
36580 -854288 -891676 -501975 -171024 -151546 -152417 47282 131830 -301242 -1039980 -1351644 -807738
36569 -807738 229863 1071618 1428308 1453782 1315552 1169218 1380549 2082948 2506274 1648698
36559 1648698 -77824 -898754 -35381 1051229 851547 213990 902211 2417260 2442183
36550 2442183 534973 -884493 -28537 1789922 2452072 2070309 2031730 2321265 1850745
36541 1850745 778828 459690 1210814 1868331 1624948 812711 -163117 -1130383 -1318305
36532 -1318305 64779 2048302 2431433 818040 -495742 333110 2137310 2648830 1765846
$$ packed form
36600a45773Q91232j48999j012099o69212L39803P80724M24267l1688j59912p627
36590B60716M16005R37613Q95787n6525j114254j194698m46327K3964j91976l84593
36580h54288l7388L89701L30951J9478q71J99699Q4548m33072p38738l11664N43906
36569h07738J037601Q41755L56690K5474j38230j46334K11331P02399M23326q57576
36559A648698j726522q20930Q63373J086610j99682o37557O88221J515049K4923
36550B442183j907210j419466Q55956J818459O62150l81763l8579K89535m70520
36541A850745j071917l19138P51124O57517k43383q12237r75828r67266j87922
36532a318305J383084J983523L83131j613393j313782Q28852J804200N11520q82984
$$ plain form
36523 1765846 1287371 2069148 3076234 3103162 2133169 957480 409048 935550 2109046
36514 2109046 2679979 1883064 476300 -275883 -277787 -315748 -506367 -268758 340671 632955
36504 632955 695196 1411595 2774067 3509451 2905298 1781767 1026724 379059 -502957
36495 -502957 -906408 -116017 1208869 1835446 1551519 954319 267723 -493330 -704080
36486 -704080 209751 1520237 1848241 994188 -15007 -599160 -1068932 -1373569 -857036
36477 -857036 341380 1008062 633363 253430 694110 1122542 460973 -680305 -837613
36468 -837613 89093 839219 768147 486650 543907 751884 994647 1475928 1806927 1062773
36458 1062773 -642899 -1739321 -1195833 -38443 113611 -708688 -1203192 -917088 -657184
$$ packed form
36523A765846m78475P81777J007086K6928r69993j175689n48432N26502J173496
36514B109046N70933p96915j406764p52183j904l7961j90619K37609O09429K92284
36504F32955O2241P16399J362472P35384o04153j123531p55043o47665q82016
36495e02957m03451P90391J324886O26577k83927n97200o86596p61053k10750
36486g04080R13831J310486L28004q54053j009195n84153m69772l04637N16533
36477h57036J198416O66682l74699l79933M40680M28432o61569j141278j57308
36468h37613R26706P50126p1072k81497N7257K07977K42763M81281L30999p44154
36458A062773j705672j096422N43488J157390J52054q22299m94504K86104K59904
$$ plain form
36449 -657184 -881710 -971194 -395601 390882 652861 274010 -372368 -847674 -721029 121362
36439 121362 1000552 963332 34871 -767245 -918077 -991811 -1375769 -1416916 -627614 158823
36429 158823 -128417 -1176825 -1800263 -1593360 -1025597 -318079 577609 1139335 714136
36420 714136 -166433 -112438 1239140 2641761 2777864 1546365 -277127 -1740985 -1996714
36411 -1996714 -928485 286389 271846 -697417 -1062359 -374743 111598 -261903 -290988
36402 -290988 1018083 2533377 2624785 1692823 1419871 2092111 2361778 1503511 329225
36393 329225 -321645 -665885 -1143253 -1521558 -1337224 -580113 399293 1183404 1368696 899300
36383 899300 405192 634630 1441956 1884367 1421229 481597 -243285 -509056 -405112 -115889
$$ packed form
36449f57184k24526q9484N75593P86483K61979l78851o46378m75306J26645Q42391
36439A21362Q79190l7220r28461q02116j50832p3734l83958m1147P89302P86437
36429A58823k87240j048408o23438K06903N67763P07518Q95688N61726m25199
36420G14136q80569N3995J351578J402621J36103j231499j823492j463858k55729
36411a996714J068229J214874j4543r69263l64942O87616M86341l73501k9085
36402b90988J309071J515294R1408r31962k72952O72240K69667q58267j174286
36393C29225o50870l44240m77368l78305J84334P57111R79406P84111J85292m69396
36383H99300m94108K29438Q07326M42411m63138r39632p24882k65771J03944K89223
$$ plain form
36373 -115889 -8357 -451398 -1281708 -1833552 -1720525 -1251484 -887794 -636141 -235834 286468
36363 286468 525684 138819 -708244 -1364634 -1286403 -665612 -265787 -508072 -989597 -1090290
36353 -1090290 -716741 -160803 418764 977771 1337381 1348179 1069338 504232 -477756 -1674853
36343 -1674853 -2526479 -2909635 -3294750 -3625175 -2915502 -804346 1327484 1916809 1226245
36334 1226245 561341 168493 -526214 -1095643 -448572 1045965 1674798 911346 45455
36325 45455 -116209 -309708 -918704 -946366 57341 786669 237908 -527747 -171969 689727
36315 689727 695924 54784 -166844 -199009 -1043952 -2298641 -2468293 -1325005 -182458 220240
36305 220240 463354 898660 901669 64447 -1089824 -1901067 -2044851 -1163688 731780 2401608
$$ packed form
36373a15889J07532m43041q30310n51844J13027M69041L63690K51653M00307N22302
36363B86468K39216l86865q47063o56390P8231O20791L99825k42285m81525j00693
36353a090290L73549N55938N79567N59007L59610J0798k78841n65106r81988j197097
36343a674853q51626l83156l85115l30425P09673K111156K131830N89325o90564
36334A226245o64904l92848o94707n69429O47071J494537O28833p63452q65891
36325D5455j61664j93499o08996k7662J003707P29328n48761p65655L55778Q61696
36315F89727O197o41140k21628l2165q44943j254689j69652J143288J142547M02698
36305B20240K43114M35306L009q37222j154271q11243j43784Q81163J895468J669828
$$ plain form
36295 2401608 2322360 806972 -168789 363376 1253936 1278735 801191 617963 567440 348339
36285 348339 493838 1251472 1458172 -27660 -2343077 -3441460 -2643395 -1213905 -523999
36276 -523999 -659935 -890996 -719241 -329734 -392597 -1286894 -2312210 -2230824 -975034 27
36266 27 -276372 -887868 -650123 -138522 -573891 -1398130 -905654 847821 1775328 805931
36256 805931 -578955 -594533 562662 1561832 1763800 1212304 -23188 -1349865 -1489729
36247 -1489729 -93033 1249514 926257 -382740 -747895 86052 458308 -522847 -1688998
36238 -1688998 -1708323 -923637 -469781 -534399 -508034 -295466 -396344 -788056 -682903 301707
36228 301707 1368752 1445055 559137 -244493 -310273 -54017 -2374 169939 964076 1876110
$$ packed form
36295B401608p9248j515388r75761N32165Q90560K4799m77544j83228n0523k19101
36285C48339J45499P57634K06700j485832k315417j098383P98065J429490O89906
36276e23999j35936k31061J71755L89507o2863q94297j025316Q1386J255790R75061
36266B7k76399o11496K37745N11601m35369q24239M92476J753475R27507r69397
36256H05931j384886j5578J157195R99170K01968n51496j235492j326677j39864
36247a489729J396696J342547l23257j308997l65155Q33947L72256r81155j166151
36238a688998j9325P84686M53856o4618K6365K12568j00878l91712J05153R84610
36228C01707J067045P6303q85918q03630o5780K56256N1643J72313P94137R12034
$$ plain form
36218 1876110 1904869 1193606 1074282 2139546 3263714 3145709 2014767 1076813 920988
36209 920988 1242907 1599560 1665754 1228284 655455 825661 1832526 2447749 1820923 947910
36199 947910 1172890 1905529 1461506 -182617 -1296986 -1092447 -686301 -1004908 -1445007
36190 -1445007 -1284249 -892619 -709238 -337802 449256 968317 761076 397825 330369 86768
36180 86768 -506376 -545388 380551 1030089 282754 -947997 -1091940 -364595 -155420 -585576
36170 -585576 -505198 292705 642467 -42221 -901548 -1073896 -797162 -682571 -850870 -1117867
36160 -1117867 -1288061 -1113169 -623572 -417610 -858217 -1217249 -598026 515615 806303
36151 806303 113594 -402208 -100782 502600 1068406 1873576 2543575 1968139 254948
$$ packed form
36218A876110K8759p11263j19324J065264J124168j18005j130942r37954j55825
36209I20988L21919L56653O6194m37470n72829J70206J006865O15223o26826q73013
36199I47910K24980P32639m44023j644123j114369K04539M06146l18607m40099
36190a445007J60758L91630J83381L71436P87058N19061k07241l63251o7456k43601
36180H6768n93144l9012R25939O49538p47335j230751j43943P27345K09175m30156
36170e85576Q0378P97903L49762o84688q59327j72348K76734J14591j68299k66997
36160a117867j70194J74892M89597K05962m40607l59032O19223J113641K90688
36151H06303o92709n15802L01426O03382N65806Q05170O69999n75436j713191
$$ plain form
36142 254948 -735139 92648 1272252 841616 -758750 -1388606 -284602 1101160 1254104
36133 1254104 269444 -821557 -1347469 -1253749 -783166 -264235 182136 832402 1851037
36124 1851037 2648494 2367440 1100131 -41382 -326998 -247459 -536330 -964634 -829019
36115 -829019 -282081 -244310 -927807 -1341308 -687061 455130 961538 642636 117913 -370350
36105 -370350 -1029482 -1570783 -1316899 -413866 134482 -21512 -89007 361615 529753 -189011
36095 -189011 -931827 -575764 550667 1264306 1219046 890788 435129 -236754 -680107 -442661
36085 -442661 -26819 -142901 -409605 -109269 192817 -639011 -2213868 -2938626 -2426558
36076 -2426558 -1844846 -1746472 -1420959 -734110 -628611 -1137025 -889304 411134 959857
$$ packed form
36142B54948r90087Q27787J179604m30636j600366o29856J104004J385762J52944
36133A254104r84660j091001n25912R3720M70583N18931M46371O50266J018635
36124A851037P97457k81054j267309j141513k85616P9539k88871m28304J35615
36115h29019N46938L7771o83497m13501O54247J142191N06408l18902n24723m88263
36105c70350o59132n41301K53884R03033N48348j55994o7495M50622J68138p18764
36095a89011p42816L56063J126431P13639m5260l28258m55659o71883m43353K37446
36085d42661M15842j16082k66704L00336L02086q31828j574857p24758N12068
36076b426558N81712R8374L25513O86849J05499n08414K47721J300438N48723
$$ plain form
36067 959857 -340791 -1809926 -1446128 7745 494378 86933 688097 2643724 3894067
36058 3894067 2865129 528440 -1031402 -944332 124097 1112159 1408121 1023063 392198
36049 392198 -82096 -342745 -467161 -404307 -169929 6357 46032 213709 643577 1063279
36039 1063279 1291679 1518328 1724353 1405853 371273 -726208 -1187738 -1099686 -888981
36030 -888981 -651402 -459274 -657862 -1193882 -1314920 -663533 4120 -18979 -224157 201918
36020 201918 1001860 1436093 1605683 2009766 2324793 1910424 1143190 942760 1251795 1275636
36010 1275636 973682 950322 1068404 651780 -8246 75040 719933 650752 -248954 -496273
36000 -496273 510141 1228133 244405 -1547141 -2297345 -1700954 -801139 -65608 853541
$$ packed form
36067I59857j300648j469135L63798J453873M86633m07445O01164J955627J250343
36058C894067j028938k336689j559842Q7070J068429R88062K95962l85058o30865
36049C92198m74294k60649j24416O2854K34378J76286L9675J67677M29868M19702
36039A063279K28400K26649K06025l18500j034580j097481m61530Q8052K10705
36030h88981K37579J92128j98588n36020j21038O51387O67653k3099k05178M26075
36020B01918P99942M34233J69590M04083L15027m14369p67234k00430L09035K3841
36010A275636l01954k3360J18082m16624o60026Q3286O44893o9181q99706k47319
36000d96273J006414P17992r83728j791546p50204N96391Q99815P35531R19149
$$ plain form
35991 853541 1775312 1864256 1008386 213771 249890 682890 697491 302196 128562 289833
35981 289833 102052 -870460 -1962786 -2097482 -1167723 -143389 251870 257325 169675 -444622
35971 -444622 -1877579 -3233002 -3256066 -1937879 -371691 742668 1438913 1559145 781851
35962 781851 -301280 -423183 615614 1530251 1358213 638917 227315 -2453 -487693
35953 -487693 -956204 -1015369 -1011822 -1323588 -1439022 -803285 -46292 -161914 -785980 -597740
35943 -597740 587104 1433099 1103552 478572 726039 1581256 1909952 1398526 716991
35934 716991 232462 -444919 -1457196 -2092518 -1739136 -953591 -876180 -1715168 -2483978 -2364881
35924 -2364881 -1739728 -1543276 -2041071 -2670395 -2788405 -2161154 -979281 161362 548639
$$ packed form
35991H53541R21771Q8944q55870p94615L6119M33000J4601l95295j73634J61271
35981B89833j87781r72512j092326j34696R29759J024334L95259N455q7650o14297
35971d44622j432957j355423k3064J318187J566188J114359O96245J20232p77294
35962G81851j083131j21903J038797R14637j72038p19296m11602k29768m85240
35953d87693m68511n9165L547l11766j15434O35737P56993j15622o24066J88240
35943e97740J184844Q45995l29547o24980K47467Q55217L28696n11426o81535
35934G16991m84529o77381j012277o35322L53382P85545P7411q38988p68810J19097
35924b364881O25153J96452m97795o29324j18010O27251J181873J140643L87277
$$ plain form
35915 548639 145045 -129111 501596 1485887 1633605 921691 663636 1575249 2551168 2044546
35905 2044546 168060 -1321624 -1026832 636540 2048215 2131069 1335853 928661 1432987
35896 1432987 2071357 1914935 1167611 756808 922206 1027195 773140 668664 958320
35887 958320 955304 76549 -1077532 -1417471 -770238 92061 563075 652110 463753 -68985
35877 -68985 -848747 -1534865 -1934511 -2103179 -1988411 -1365497 -288974 691550 994598 577108
35867 577108 -71083 -426835 -369925 -185001 -182836 -337109 -345516 -41671 395224 727153
35857 727153 1020678 1546222 2330342 2967652 2985834 2374803 1630825 1170495 800204 27047
35847 27047 -1085383 -1754919 -1433233 -611793 -269536 -678986 -1190388 -1141985 -582061 -79902
$$ packed form
35915E48639m03594k74156O30707R84291J47718p11914k58055R11613R75919n06622
35905B044546j876486j489684K94792J663372J411675Q2854p95216m07192N04326
35896A432987O38370j56422p47324m10803J65398J04989k54055j04476K89656
35887I58320l016q78755j154081l39939O47233Q62299M71014Q9035j88357n32738
35877f8985p79762o86118l99646j68668J14768O22914J076523R80524L03048m17490
35867E77108o48191l55752N6910J84924K165j54273q407L03845M36895L31929
35857G27153K93525N25544P84120O37310J8182o11031p43978m60330l70291p73157
35847B7047j112430o69536L21686Q21440L42257m09450n11402M8403N59924N02159
$$ plain form
35837 -79902 -139542 -774305 -1389194 -1212247 -159307 944014 1399795 1560869 2087671 2624547
35827 2624547 2185890 804549 -296788 -434985 -322568 -718428 -1197247 -980691 -216067
35818 -216067 411850 772546 1125151 1269258 758048 -204143 -833457 -694977 -18340 779531
35808 779531 1365479 1448449 1014036 505303 318813 261188 -86738 -690179 -1179489 -1377309
35798 -1377309 -1252386 -702664 62860 324239 -272037 -995279 -984089 -581519 -778814 -1570655
35788 -1570655 -1940665 -1415788 -537946 224056 849292 942244 -108082 -1742938 -2362369
35779 -2362369 -1504430 -628123 -899670 -1499578 -1265315 -762575 -1139627 -1846090 -1395298
35770 -1395298 22064 653063 -45601 -620332 -25893 881142 980992 556587 371197
$$ packed form
35837g9902n9640o34763o14889J76947J052940J103321M55781J61074N26802N36876
35827B624547m38657j381341j101337j38197J12417l95860m78819K16556P64624
35818b16067O27917L60696L52605J44107n11210r62191o29314J38480O76637P97871
35808G79531N85948Q2970m34413n08733j86490n7625l47926o03441m89310j97820
35798a377309J24923N49722P65524K61379n96276p23242J1190M02570j97295p91841
35788a570655l70010N24877Q77842P62002O25236R2952j050326j634856o19431
35779b362369Q57939Q76307k71547n99908K34263N02740l77052p06463M50792
35770a395298J417362O30999o98664n74731N94439R07035R9850m24405j85390
$$ plain form
35761 371197 273618 -192773 -675968 -579313 -95748 231169 359263 340114 -188837 -1149641
35751 -1149641 -1460957 -521788 456046 20200 -1166923 -1188931 199771 1344784 1471561
35742 1471561 1762064 3052971 4214801 3871258 2412015 1143395 438931 -107048 -452962
35733 -452962 -192482 612085 1580975 2528028 3096361 2590968 1084444 -33996 265879
35724 265879 1028562 605320 -906767 -1927889 -1835432 -1589977 -1818948 -1794856 -841183 463861
35714 463861 1195592 1320472 1344087 1388685 1283264 1118436 1144530 1394605 1758937 2129516
35704 2129516 2232604 1727535 767523 69652 87132 428760 421057 -41573 -555397 -897333
35694 -897333 -1258670 -1803162 -2280479 -2237854 -1574286 -728647 -178121 117479 451567 652236
$$ packed form
35761C71197r7579m66391m83195R6655M83565L26917J28094j9149n28951r60804
35751a149641l11316R39169R77834m35846j187123k2008J388702J145013J26777
35742A471561K90503J290907J161830l43543j459243j268620p04464n45979l45914
35733d52962K60480Q04567R68890R47053N68333n05393j506524j118440K99875
35724B65879P62683m23242j512087j021122R2457K45455k28971K4092R53673J305044
35714D63861P31731J24880K3615M4598j05421j64828K6094K50075L64332L70579
35704B129516J03088n05069r60012o97871J7480L41628p703m62630n13824l41936
35694h97333l61337n44492m77317M2625O63568Q45639N50526K95600L34088K00669
$$ plain form
35684 652236 226239 -636357 -937829 -207249 720482 892913 558241 479021 537569 94886
35674 94886 -669672 -977680 -824044 -925583 -1354772 -1459519 -1212281 -1348429 -1916831 -1986653
35664 -1986653 -1216134 -450844 -187374 305153 1530292 2593577 2550240 2017777 2223340
35655 2223340 3019680 3096854 1936992 434258 -465078 -807087 -1070974 -1233427 -807850
35646 -807850 391380 1780832 2399589 1845147 724588 -45484 -240933 -239997 -127288 397849
35636 397849 1160188 1357742 625432 -357520 -698523 -244560 571133 1290933 1530277 1061921
35626 1061921 185582 -408565 -425854 -218038 -129615 -146320 -307793 -786373 -1369391 -1585724
35616 -1585724 -1543104 -1836785 -2415446 -2490206 -1910286 -1581283 -1981726 -2293883 -1700663 -598219
$$ packed form
35684F52236m25997q62596l01472P30580R27731J72431l34672p9220N8548m42683
35674I4886p64558l08008J53636j01539m29189j04747K47238j36148n68402o9822
35664a986653P70519P65290K63470M92527J225139J063285m3337n32463K05563
35655B223340P96340P7174j159862j502734q99336l42009k63887j62453M25577
35646h07850J199230J389452O18757n54442j120559p70072j95449R36J12709N25137
35636C97849P62339J97554p32310r82952l41003M53963Q15693P19800K39344m68356
35626A061921q76339n94147j7289K07816Q8423j6705j61473m78580n83018k16333
35616a585724M2620k93681n78661p4760N79920L29003m00443l12157N93220J102444
$$ plain form
35606 -598219 237065 764544 1128800 917390 -32362 -871130 -841431 -490547 -741108 -1362799
35596 -1362799 -1457490 -944076 -462087 -237194 -117928 -328568 -1072397 -1707069 -1416802 -490597
35586 -490597 53630 -130636 -622959 -1172092 -1679109 -1594018 -502358 877321 1396404
35577 1396404 1009832 543460 206036 -423327 -1124080 -1161436 -708515 -737582 -1313752 -1391748
35567 -1391748 -640245 -70660 -304566 -532526 32068 801741 862693 491371 584933 1149541
35557 1149541 1368312 891895 177037 -392686 -996366 -1856359 -2712965 -3070308 -2805810
35548 -2805810 -2333063 -2070372 -1835301 -1074545 167223 921093 375456 -987949 -1883541
35539 -1883541 -1698509 -929811 -278019 24832 -46785 -543794 -1227814 -1518497 -1131916 -546967
$$ packed form
35606e98219Q35284N27479L64256k11410r49752q38768K9699L50884k50561o21691
35596a362799r4691N13414M81989K24893J19266k10640p43829o34672K90267R26205
35586d90597N44227j84266m92323n49133n07017Q5091J091660J379679N19083
35577A396404l86572m66372l37424o29363p00753l7356M52921k9067n76170p7996
35567a391748P51503N69585k33906k27960N64594P69673O0952l71322R3562N64608
35557A149541K18771m76417p14858n69723o03680q59993q56606l57343K64498
35548b805810M72747K62691K35071P60756J241768P53870n45637j363405q95592
35539a883541J85032P68698O51792L02851p1617m97009o84020k90683L86581N84949
$$ plain form
35529 -546967 -546213 -1330945 -2229162 -2349429 -1538388 -540277 -49929 94071 323408 330245
35519 330245 -425577 -1341692 -1092991 289520 1140651 583074 -200240 -52093 291591
35510 291591 -199323 -772260 -255954 575162 160697 -1006212 -1045250 77495 425955
35501 425955 -608542 -1288301 -457980 689678 780564 335836 474181 1045212 1344689
35492 1344689 1517691 1993513 2411192 2224110 1653069 1094034 290915 -982868 -2065654
35483 -2065654 -2154894 -1452258 -807848 -628736 -729093 -814083 -608246 23093 689566 780282
35473 780282 452027 540677 1109953 1050321 -212155 -1516379 -1412440 -194823 492355
35464 492355 -215138 -1504869 -2038815 -1387657 -258214 386974 315962 61871 -37765 -347816
$$ packed form
35529e46967P54p84732q98217j20267Q11041R98111M90348J44000K29337O837
35519C30245p55822r16115K48701J382511Q51131n57577p83314J48147L43684
35510B91591m90914n72937N16306Q31116m14465j166909l9038J122745L48460
35501D25955j034497o79759Q30321J147658R0886m44728J38345N71031K99477
35492A344689J73002M75822M17679j87082n71041n59035q03119j273783j082786
35483b065654q9240P02636O44410J79112j00357q4990K05837O31339O66473R0716
35473G80282l28255Q8650N69276n9632j262476j304224J03939J217617O87178
35464D92355p07493j289731n33946O51158J129443O45188p1012k54091r9636l10051
$$ plain form
35454 -347816 -1045693 -1375941 -739790 -8044 -433319 -1526399 -1553343 -153315 1170094
35445 1170094 1393165 1110931 918156 445000 -277682 -258113 639355 913064 -353557
35436 -353557 -1875829 -2002800 -929645 128437 778769 1226301 1322605 1079305 1111882
35427 1111882 1484648 1268172 286955 -138912 539873 739806 -678060 -2076999 -1378654
35418 -1378654 622140 1604472 1302175 1234958 1644625 1340336 237445 -476453 -600532
35409 -600532 -1002405 -1508022 -1032467 155641 612951 264499 434925 1191533 1141672 219766
35399 219766 54338 910785 943146 -489875 -1387449 -403328 844926 537840 -398332
35390 -398332 -168457 801714 915206 289946 296139 956972 944360 -159243 -1364067 -1845013
$$ packed form
35454c47816o97877l30248O36151P31746m25275j093080k6944J400028J323409
35445A170094K23071k82234j92775m73156p22682J9569Q97468K73709j266621
35436c53557j522272j26971J073155J058082O50332M47532R6304k43300L2577
35427A111882L72766k16476r81217m25867O78785J99933j417866j398939O98345
35418a378654K000794R82332l02297o7217M09667l04289j102891p13898j24079
35409f00532m01873n05617M75555J188108M57310l48452J70426P56608m9861r21906
35399B19766j65428Q56447L2361j433021q97574R84121J248254l07086r36172
35390c98332K29875R70171J13492o25260O193O60833j2612j103603j204824m80946
$$ plain form
35380 -1845013 -1556838 -547614 941122 1905220 1468566 266874 -235395 289304 863789
35371 863789 882508 776926 948689 1123968 999758 692778 338373 -71968 -308818 24017
35361 24017 877581 1665237 1849140 1322655 386830 -282757 20638 1153849 1876107 1174719
35351 1174719 -333637 -1049911 -386997 586942 562792 -590187 -1985043 -2749765 -2597733
35342 -2597733 -1703745 -409564 857570 1511670 1034565 -317812 -1251734 -631624 931490
35333 931490 1509814 261334 -1409202 -1669428 -447785 963582 1721752 1799787 1137822
35324 1137822 -249644 -1477853 -1359310 40761 1328265 1400952 382353 -1014117 -2098162
35315 -2098162 -2139993 -815799 931503 1472517 448016 -680225 -571337 300363 566431
$$ packed form
35380a845013K88175J009224J488736R64098m36654j201692n02269N24699N74485
35371H63789J8719j05582J71763J75279j24210l06980l54405m10341k36850L32835
35361B4017Q53564P87656J83903n26485r35825o69587L03395J133211P22258p01388
35351A174719j508356p16274O62914R73939k4150j152979j394856p64722J52032
35342b597733Q93988J294181J267134O54100m77105j352377r33922O20110J563114
35333I31490N78324j248480j670536k60226J221643J411367P58170P8035o61965
35324A137822j387466j228209J18543J400071J287504P2687j018599j396470j084045
35315b098162m1831J324194J747302N41014j024501j128241J08888Q71700K66068
$$ plain form
35306 566431 -129125 -1010739 -1494644 -1666230 -1572153 -969343 -26988 385474 -383844 -1764674
35296 -1764674 -2315485 -1246433 570784 1415314 627480 -617131 -749383 276571 1062636
35287 1062636 643822 -413347 -938648 -525319 367034 1123334 1335387 881290 161305
35278 161305 -18850 697630 1629936 1750362 873867 -178527 -508390 51074 925757
35269 925757 1323666 889728 71254 -311964 -11854 411617 455170 306296 290468 258987
35259 258987 102040 310078 1174900 1847978 1267891 -147197 -928011 -751818 -916179
35250 -916179 -2181472 -3397564 -3121823 -1637728 -338672 210218 496922 799909 852286
35241 852286 650396 617991 905161 1234501 1410330 1373282 971059 393684 489731 1646932
$$ packed form
35306E66431o95556q81614m83905j71586R4077O02810R42355M12462p69318j380830
35296a764674n50811J069052J817217Q44530p87834j244611j32252J025954P86065
35287A062636m18814j057169n25301M13329Q92353P56300K12053m54097p19985
35278A61305j80155P16480R32306J20426q76495j052394l29863N59464Q74683
35269I25757L97909m33938q18474l83218L00110M23471M3553j48874j5828l1481
35259B58987j56947K08038Q64822O73078n80087j415088p80814J76193j64361
35250i16179j265293j216092K75741J484095J299056N48890K86704L02987N2377
35241H52286k01890l2405K87170L29340J75829l7048m02223n77375R6047J157201
$$ plain form
35231 1646932 2628434 1837622 -211590 -1139377 142832 1914039 2079970 902754 174367
35222 174367 557994 1057268 691908 -474568 -1793333 -2556900 -2218003 -946891 148688
35213 148688 136126 -568109 -884033 -649109 -579111 -859495 -907703 -593638 -559785 -1034861
35203 -1034861 -1358053 -1114543 -825182 -984261 -1241769 -1152934 -992641 -1095058 -988050 -16369
35193 -16369 1527489 2643829 2787149 2195431 1324964 587757 415272 862098 1221195
35184 1221195 720446 -361173 -913206 -465658 151263 -101337 -1171120 -2065841 -2039718
35175 -2039718 -1290486 -592126 -504203 -922600 -1216970 -763786 543397 2198773 3464367
35166 3464367 3902146 3614622 2976372 2137806 951330 -463112 -1316626 -809280 729373
$$ packed form
35231A646932R81502p90812k049212r27787J282209J771207J65931j177216p28387
35222A74367L83627M99274l65360j166476j318765p63567L38897J271112J095579
35213A48688j2562p04235l15924K34924O9998k80384m8208L14065L3853m75076
35203a034861l23192K43510K89361j59079k57508Q8835J60293j02417J07008R71681
35193a6369J543858J116340J43320n91718q70467p37207j72485M46826L59097
35184A221195n00749j081619n52033M47548O16921k52600j069783q94721K6123
35175b039718P49232O98360Q7923m18397k94370M53184J307183J655376J265594
35166C464367M37779k87524o38250q38566j186476j414442q53514N07346J538653
$$ plain form
35157 729373 1859492 1530072 236231 -697197 -720901 -470435 -700622 -1349074 -1766740
35148 -1766740 -1497727 -668259 149664 344439 -235477 -1045782 -1274805 -647153 285603
35139 285603 735755 501453 162289 473779 1518520 2455321 2317028 1197398 372105
35130 372105 889614 2219343 2784948 1833150 267909 -507231 -97621 784934 1311747
35121 1311747 1243140 888455 700215 781553 658196 -143423 -1130999 -1039670 498168 2033324
35111 2033324 1922150 558452 -119300 635880 1416267 936931 37833 345300 1790648
35102 1790648 2852009 2873727 2600021 2319583 1118956 -1252471 -3091077 -2581345 -249372
35093 -249372 1686431 2078080 1703048 1463206 1157160 494676 76995 430633 861251
$$ packed form
35157G29373J130119l29420j293841r33428k3704K50466k30187o48452m17666
35148a766740K69013Q29468Q17923J94775n79916q10305k29023O27652R32756
35139B85603M50152k34302l39164L11490J044741R36801j38293j119630q25293
35130C72105N17509J329729N65605r51798j565241p75140M09610Q82555N26813
35121A311747o8607l54685j88240Q1338j23357q01619r87576R1329J537838J535156
35111B033324j11174j363698o77752P55180P80387m79336q99098L07467J445348
35102A790648J061361K1718k73706k80438j200627k371427j838606N09732K331973
35093b49372J935803L91649l75032k39842l06046o62484m17681L53638M30618
$$ plain form
35084 861251 368118 -689616 -956282 -54051 881087 897934 489657 574111 974299 787157
35074 787157 -81051 -665947 -288393 568652 977903 672346 139388 -55345 251040 810459
35064 810459 1203242 1186599 894378 573961 197471 -351882 -779190 -611258 -59889 -24954
35054 -24954 -872807 -1780193 -1802967 -1088392 -401598 55847 510092 660458 -64062 -1298465
35044 -1298465 -1827235 -1144100 -86724 397004 340580 255953 292018 365400 493113 528291
35034 528291 156832 -418403 -468011 88564 254396 -614155 -1683163 -1819918 -1248511 -980479
35024 -980479 -1108219 -907619 -382504 -365120 -1004629 -1416827 -1155303 -907845 -1237026 -1588525
35014 -1588525 -1184497 -186806 641686 887992 600072 -12226 -490301 -253635 668698
$$ packed form
35084H61251m93133j057734k66666R02231R35138J6847m08277Q4454M00188j87142
35074G87157q68208n84896L77554Q57045M09251l05557n32958j94733L06385N59419
35064H10459L92783j6643k92221l20417l76490n49353m27308J67932N51369L4935
35054b4954q47853r07386k2774P14575O86794M57445M54245J50366p24520j234403
35044a298465n28770O83135J057376M83728n6424q4627L6065P3382J27713L5178
35034E28291l71459n75235m9608N56575J65832q68551j069008j36755N71407K68032
35024i80479j27740K00600N25115J7384o39509m12198K61524K47458l29181l51499
35014a588525M04028R97691Q28492K46306k87920o12298m78075K36666R22333
$$ plain form
35005 668698 1464602 1531153 1161626 844641 524293 133965 163525 834366 1258981 471555
34995 471555 -1007858 -1727034 -1293949 -702047 -642084 -698865 -531060 -631622 -1249566 -1572147
34985 -1572147 -883551 196234 598375 388539 447756 968530 1379951 1562700 1935901
34976 1935901 2299439 1842825 645622 -18387 527246 1335532 1405984 1299070 2069456
34967 2069456 3307881 3595905 2608764 1438510 841948 439818 -111925 -344260 135205
$$ packed form
35005F68698P95904O6551l69527l16985l20348l90328K9560O70841M24615p87426
34995D71555j479413p19176M33085N91902N9963n6781J67805j00562o17944l22581
34985a572147O88596J079785M02141k09836N9217N20774M11421J82749L73201
34976A935901L63538m56614j197203o64009N45633Q08286P0452j06914P70386
34967B069456J238425K88024r87141j170254n96562m02130n51743k32335M79465
$$ [...]
##END NTUPLES=NMR SPECTRUM
##END=
