##TITLE=31Pdec_PR194_11
 D2O, 24 sc
 11.11.2021
##JCAMPDX= 6.0         $$ Bruker NMR JCAMP-DX V2.0
##DATA TYPE= NMR SPECTRUM
##DATA CLASS= NTUPLES
##ORIGIN= UXNMR, Bruker Analytische Messtechnik GmbH
##OWNER= root
$$ XWIN-NMR		Version 3.5
$$ Thu Nov 11 13:19:49 2021 Russian Standard Time (UT+4h)  she@DPX200
##.OBSERVE FREQUENCY= 81.013821
##.OBSERVE NUCLEUS= ^31P
##.ACQUISITION MODE= SIMULTANEOUS
##.ACQUISITION SCHEME= undefined
##.AVERAGES= 24
##.DIGITISER RES= 16
##SPECTROMETER/DATA SYSTEM= spect
##.PULSE SEQUENCE= zgpg30
##.SOLVENT NAME= CDCl3
##.SHIFT REFERENCE= (INTERNAL, CDCl3, 0, 248.564)
##AUDIT TRAIL= $$ (NUMBER, WHEN, WHO, WHERE, WHAT)
$$ ##TITLE= Audit trail, XWIN-NMR		Version 3.5
$$ ##JCAMPDX= 5.01
$$ ##ORIGIN= Bruker BioSpin GmbH
$$ ##OWNER= she
$$ F:/spectra/data/she/nmr/P31/1/pdata/1/auditp.txt
$$ ##AUDIT TRAIL=  $$ (NUMBER, WHEN, WHO, WHERE, WHAT)
(   1,<2021-11-11 13:18:25.32 +0400>,<she>,<DPX200>,
      <created by zg, POWCHK disabled, PULCHK disabled
       configuration hash MD5:
       00 E9 B6 7A A2 85 ED C7 34 08 36 98 17 FE 4E 26
       data hash MD5: 32K
       7E FF 71 CE 6C 9D A1 B8 98 6B 10 1D EB 21 D7 D0>)
(   2,<2021-11-11 13:18:30.57 +0400>,<she>,<DPX200>,
      <Start of raw data processing
       efp BC_mod = 2 LB = 1 FT_mod = 6 PKNL = 1 PHC0 = -8708.11 PHC1 = -270.1306 SI = 64K 
       data hash MD5: 64K
       5F 37 CA E0 52 B4 7E E3 A5 CE 50 50 16 6F 31 A7>)
(   3,<2021-11-11 13:18:44.57 +0400>,<she>,<DPX200>,
      <pk PHC0 = -146.1451 PHC1 = 0 
       data hash MD5: 64K
       17 B5 C6 F6 81 E4 AE D6 AE 06 FA FF C2 14 7E 1D>)
(   4,<2021-11-11 13:19:11.93 +0400>,<she>,<DPX200>,
      <pk PHC0 = -363.6794 PHC1 = 400.4 
       data hash MD5: 64K
       A8 AF 46 92 0B 67 16 4E 23 D0 C7 AC 0A 4A 63 BA>)
(   5,<2021-11-11 13:19:27.03 +0400>,<she>,<DPX200>,
      <abs ABSG = 5 
       data hash MD5: 64K
       72 11 D2 8C 41 F3 71 F7 96 80 67 64 40 BE 24 7A>)
$$ ##END=
$$ 
$$ hash MD5
$$ 1C D9 C8 24 1E 21 FB 93 62 D6 7F 01 C5 94 94 80
##$RELAX= 
##$RELAX= 
##$RELAX= 
##$RELAX= 
##$RELAX= 
##$RELAX= 
##$RELAX= 
##$RELAX= 
$$ Bruker specific parameters
$$ --------------------------
##$DU= <F:/spectra>
##$EXPNO= 1
##$NAME= <P31>
##$PROCNO= 1
##$TYPE= <nmr>
##$USER= <she>
##$AMP= (0..31)
100 100 100 100 100 100 100 100 100 100 100 100 100 100 100 100 100 100 
100 100 100 100 100 100 100 100 100 100 100 100 100 100 
##$AQSEQ= 0
##$AQ_mod= 1
##$AUNM= <au_zg>
##$AUTOPOS= <>
##$BF1= 81.014009
##$BF2= 200.13
##$BF3= 200.13
##$BF4= 200.13
##$BF5= 200.13
##$BF6= 200.13
##$BF7= 200.13
##$BF8= 200.13
##$BYTORDA= 1
##$CFDGTYP= 0
##$CFRGTYP= 5
##$CHEMSTR= <none>
##$CNST= (0..31)
1 1 145 1 1 1 1 1 1 1 1 1 1 1 1 1 1 1 1 1 1 1 1 1 1 1 1 1 1 1 1 1 
##$CPDPRG= <waltz16>
##$CPDPRG1= <>
##$CPDPRG2= <waltz16>
##$CPDPRG3= <>
##$CPDPRG4= <mlev>
##$CPDPRG5= <mlev>
##$CPDPRG6= <mlev>
##$CPDPRG7= <mlev>
##$CPDPRG8= <mlev>
##$CPDPRGB= <>
##$CPDPRGT= <>
##$D= (0..31)
0 1 0 0 0 0 0 0 0 0 0 0.03 2e-05 3e-06 0 0 0 0 0 0 0 0 0 0 0 0 0 0 0 0 
0 0 
$$ [...]
##$SUBNAM3= <"">
##$SUBNAM4= <"">
##$SUBNAM5= <"">
##$SUBNAM6= <"">
##$SUBNAM7= <"">
##$SUBNAM8= <"">
##$SUBNAM9= <"">
##$SW= 501.771253377433
##$SWIBOX= (0..15)
0 1 3 0 0 0 0 0 0 0 0 0 0 0 0 0 
##$SW_h= 40650.406504065
##$TD= 32768
##$TD0= 1
##$TE= 0
##$TE2= 300
##$TE3= 300
##$TEG= 300
##$TL= (0..7)
0 120 53 12 22 120 120 120 
##$TP= (0..7)
150 150 150 150 150 150 150 150 
##$TP07= 0
##$TPNAME0= <>
##$TPNAME1= <>
##$TPNAME2= <>
##$TPNAME3= <>
##$TPNAME4= <>
##$TPNAME5= <>
##$TPNAME6= <>
##$TPNAME7= <>
##$TPOAL= (0..7)
0.5 0.5 0.5 0.5 0.5 0.5 0.5 0.5 
##$TPOFFS= (0..7)
0 0 0 0 0 0 0 0 
##$TUNHIN= 0
##$TUNHOUT= 0
##$TUNXOUT= 0
##$USERA1= <user>
##$USERA2= <user>
##$USERA3= <user>
##$USERA4= <user>
##$USERA5= <user>
##$V9= 5
##$VALIST= <valist>
##$VCLIST= <CCCCCCCCCCCCCCC>
##$VD= 0
##$VDLIST= <DDDDDDDDDDDDDDD>
##$VPLIST= <PPPPPPPPPPPPPPP>
##$VTLIST= <TTTTTTTTTTTTTTT>
##$WBST= 1024
##$WBSW= 4
##$XGAIN= (0..3)
0 0 0 0 
##$XL= 0
##$YL= 0
##$YMAX_a= 1772
##$YMIN_a= -2328
##$ZGOPTNS= <>
##$ZL1= 120
##$ZL2= 120
##$ZL3= 120
##$ZL4= 120
##$ABSF1= 248.5645
##$ABSF2= -253.2056
##$ABSG= 5
##$ABSL= 3
##$ALPHA= 0
##$AQORDER= 0
##$ASSFAC= 0
##$ASSFACI= 0
##$ASSFACX= 0
##$ASSWID= 0
##$AUNMP= <proc_1d>
##$AZFE= 0.1
##$AZFW= 0.5
##$BCFW= 0
##$BC_mod= 2
##$BYTORDP= 0
##$COROFFS= 0
##$CY= -3
##$DATMOD= 1
##$DC= 0
##$DFILT= <>
##$DTYPP= 0
##$F1P= 0
##$F2P= 0
##$FCOR= 1
##$FTSIZE= 65536
##$FT_mod= 6
##$GAMMA= 0
##$GB= 0
##$INTBC= 1
##$INTSCL= 5.30512e-09
##$ISEN= 30
##$LB= 1
##$LEV0= 0
##$LPBIN= 0
##$MAXI= 10000
##$MC2= 0
##$MEAN= 0
##$ME_mod= 0
##$MI= 50
##$NCOEF= 0
##$NC_proc= -8
##$NLEV= 6
##$NOISF1= 182.463
##$NOISF2= 159.3651
##$NSP= 0
##$NTH_PI= 0
##$NZP= 0
##$OFFSET= 248.5645
##$PC= 4
##$PHC0= -9217.936
##$PHC1= 130.2694
##$PH_mod= 1
##$PKNL= yes
##$PPARMOD= 0
##$PSCAL= 0
##$PSIGN= 0
##$REVERSE= no
##$SF= 81.014009
##$SI= 65536
##$SIGF1= 159.3651
##$SIGF2= -187.1042
##$SINO= 113.3802
##$SIOLD= 16384
##$SREGLST= <1H.CDCl3>
##$SSB= 0
##$STSI= 65536
##$STSR= 0
##$SW_p= 40650.406504065
##$SYMM= 0
##$S_DEV= 0
##$TDeff= 32768
##$TDoff= 0
##$TI= <>
##$TILT= no
##$TM1= 0
##$TM2= 0
##$TOPLEV= 0
##$USERP1= <user>
##$USERP2= <user>
##$USERP3= <user>
##$USERP4= <user>
##$USERP5= <user>
##$WDW= 1
##$XDIM= 65536
##$YMAX_p= 489228370
##$YMIN_p= -107396610
$$ End of Bruker specific parameters
$$ ---------------------------------
##NTUPLES= NMR SPECTRUM
##VAR_NAME=  FREQUENCY,     SPECTRUM/REAL,   SPECTRUM/IMAG
##SYMBOL=    X,             R,               I
##VAR_TYPE=  INDEPENDENT,   DEPENDENT,       DEPENDENT
##VAR_FORM=  AFFN,          ASDF,            ASDF
##VAR_DIM=   65536,         65536,           65536
##UNITS=     HZ,            ARBITRARY UNITS, ARBITRARY UNITS
##FACTOR=    0.620285442955139, 1,           1
##FIRST=     20137.2065510759, 0,            0
##LAST=      -20513.1999529892, 0,           0
##MIN=       -20513.1999529892, -107396610,  0
##MAX=       20137.2065510759, 489228370,    0
$$ Real data points
##PAGE= N=1
##DATA TABLE= (X++(R..R)), XYDATA
$$ [...]
$$ plain form
13028 4139975 8087603 10466639 9029448 6371781 5692108 6544024 6016872 3347340 1521336
13019 1521336 3123029 5872576 4959498 -184904 -4720785 -5185229 -3930045 -4387561 -5378816
13010 -5378816 -4007691 -1640512 -2105774 -5039272 -5972842 -3156143 188471 1160408 606555
13001 606555 -38725 -1550057 -4520208 -7099490 -7373055 -6026977 -4923925 -4826195 -5910062
12992 -5910062 -8394665 -10914429 -10425320 -6080615 -1512938 -554840 -1848036 -771961
12984 -771961 3625389 6831064 4727885 -1377418 -6868162 -8891579 -7802607 -5346559
12976 -5346559 -3401690 -3338640 -4588236 -4701104 -2734380 -1381659 -3171559 -5813529 -5072827
12967 -5072827 -1650898 -250902 -1096484 1602945 9617870 14943021 9841411 -1181885
$$ packed form
13028D139975L947628K379036j437191k657667o79673Q51916n27152k669532j826004
13019A521336J601693K749547r13078n144402m535881m64444J255184m57516r91255
13010e378816J371125K367179m65262k933498r33570K816699L344614R71937n53853
13001F06555o45280j511332k970151k579282k73565J346078J103052R7730j083867
12992e910062k484603k519764M89109M344705M567677R58098j293196J076075
12984g71961M397350L205675k103179o105303n490744k023417J088972K456048
12976e346559J944869O3050j249596j12868J966724J352721j789900k641970P40702
12967e072827L421929J399996q45582K699429Q014925N325151n101610j1023296
$$ plain form
12959 -1181885 -6419131 -2327670 3205771 2997958 -973592 -3115419 -2278173 -1036529
12951 -1036529 -1052584 -2441745 -5006078 -7450055 -7435431 -4337252 -179376 3170528 5531524
12942 5531524 6626098 5779707 4237380 4518075 6363400 6663565 4582443 3155211 4306859
12933 4306859 5911316 5500897 3403965 720983 -1972782 -2568639 1237131 6703448
12925 6703448 7516660 3154087 752665 3664251 4687976 -2896345 -12972062 -13686103
12917 -13686103 -4083219 5027709 6232779 3329119 2648049 3877096 3067514 -39229
12909 -39229 -1970447 -891906 1188158 1595247 893664 2551567 8046849 13359800 13014746
12900 13014746 7581054 3244867 2745143 1623070 -3523773 -8088236 -5805826 1667532
$$ packed form
12959a181885n237246M091461N533441k07813l971550k141827Q37246J241644
12951a036529j6055j389161k564333k443977J4624L098179M157876L349904K360996
12942E531524J094574q46391j542327K80695J845325L00165k081122j427232J151648
12933D306859J604457m10419k096932k682982k693765n95857L805770N466317
12925F703448Q13212m362573k401422K911586J023725p584321j0075717p14041
12917a3686103R602884R110928J205070k903660o81070J229047q09582l106743
12909c9229j931218J078541K080064M07089p01583J657903N495282N312951l45054
12900A3014746n433692m336187m99724j122073n146843m564463K282410P473358
$$ plain form
12892 1667532 7394638 8863889 8996235 9153799 7576557 4431577 2500178 2332468 1670630
12883 1670630 106936 -314316 514208 363270 -818052 -443710 1885034 3297277 2367472
12874 2367472 1103888 1210315 1765526 1583635 981085 594734 889909 2588859 4985250
12865 4985250 4924994 852781 -3485795 -3575257 -1051431 -1082353 -3745106 -3833988 574195
12856 574195 5152543 5921056 3695240 973262 -759765 59076 3693364 5933168 1826966
12847 1826966 -6443215 -11133366 -9400595 -5948507 -4022531 -1165674 3446437 5216375
12839 5216375 2110974 -444437 1964942 5390344 4590105 2082777 3372671 7422979
12831 7422979 9128407 8201891 8210435 8705370 5820706 315024 -1896042 1749035 6885564
$$ packed form
12892A667532N727106J469251J32346J57564j577242l144980j931399j67710o61838
12883A670630j563694m21252Q28524j50938j181322L74342K328744J412243r29805
12874B367472j263584J06427N55211j81891o02550l86351K95175J698950K396391
12865D985250o0256m072213m338576q9462K523826l0922k662753q8882M408183
12856E74195M578348P68513k225816k721978j733027Q18841L634288K239804m106202
12847A826966q270181m690151J732771L452088J925976K856857M612111J769938
12839E216375l105401k555411K409379L425402q00239k507328J289894M050308
12831G422979J705428r26516Q544M94935k884664n505682k211066L645077N136529
$$ plain form
12822 6885564 8533927 6609617 3720860 1134624 -1301080 -3603043 -5420401 -6140359
12814 -6140359 -5028005 -2370571 97732 1170897 1499958 1591831 200974 -3306083 -6800346
12805 -6800346 -8044136 -7792679 -7625279 -6564483 -3113939 931949 2517481 2227863 3251123
12796 3251123 5823933 6708333 4558024 1991602 1191913 768058 -1119710 -2957495 -1704574
12787 -1704574 2427888 5174900 2843173 -3111861 -7350277 -6849435 -4372125 -4091571
12779 -4091571 -5279590 -3874846 -30928 674182 -4617876 -11093396 -12603567 -9379892
12771 -9379892 -5787960 -3621870 -1991503 -1229841 -1927959 -1836229 1185955 4273307 2748592
12762 2748592 -2434259 -5694599 -5169431 -4689824 -6861738 -9532027 -10452535 -10318043 -9245174
$$ packed form
12822F885564J648363j924310k888757k586236k435704k301963j817358p19958
12814f140359J112354K657434K468303J073165L29061R1873j390857l507057l494263
12805f800346j243790K51457J67400J060796L450544M045888J585532k89618J023260
12796C251123K572810Q84400k150309k566422p99689m23855j887768j837785J252921
12787a704574M132462K747012k331727n955034m238416N00842K477310K80554
12779d091571j188019J404744L843918P05110n292058o475520j510171L223675
12771i379892L591932K166090J630367P61662o98118R1730L022184L087352j524715
12762B748592n182851l260340N25168M79607k171914k670289r20508J34492J072869
$$ plain form
12753 -9245174 -5236794 1055558 4506892 1996708 -2784158 -4608082 -3686288 -3352662
12745 -3352662 -3496378 -1399597 2017908 2166497 -2148531 -6028742 -4917829 -495634
12737 -495634 2692449 4254546 7628339 12940190 14510134 8149750 -1630708 -5846102
12729 -5846102 -2167311 2335099 884277 -4549031 -7406953 -5890665 -3721649 -3294469
12721 -3294469 -3193076 -2590277 -3154744 -4964631 -4739747 -932590 2472863 753126 -4539008
12712 -4539008 -6957085 -3544525 1232117 1373768 -2621098 -4085730 1193838 9067589
12704 9067589 12121055 9549486 7936727 11119953 13911429 9857550 1740608 -1830825
12696 -1830825 875374 2508197 -1518997 -5996897 -4730219 -575142 -424263 -3642909
$$ packed form
12753i245174M008380O292352L451334k510184m780866j823924R21794L33626
12745c352662j43716K096781L417505J48589m315028l880211J110913M422195
12737d95634L188083J562097L373793N311851J569944o360384r780458m215394
12729e846102L678791M502410j450822n433308k857922J516288K169016M27180
12721c294469J01393O02799n64467j809887K24884L807157L405453j719737n292134
12712d539008k418077L412560M776642J41651l994866j464632N279568P873751
12704I067589L053466k571569j612759L183226K791476m053879q116942l571433
12696a830825K706199J632823m027194m477900J266678M155077J50879l218646
$$ plain form
12688 -3642909 -3062190 2891408 6464505 1660368 -6556132 -8808661 -3939193 349718
12680 349718 -1196866 -4916586 -4961860 -1990219 -886583 -2138956 -1062819 3759455 6519147
12671 6519147 1902364 -6553886 -10059202 -5181537 2981230 7755853 7373296 4303361
12663 4303361 1655148 1440796 3830213 6698049 7422077 5757521 3564943 1948199
12655 1948199 767453 530980 1741223 2326398 -705303 -6277093 -9556950 -8539890
12647 -8539890 -6551231 -6344233 -5731117 -2084870 2324583 3403295 1301833 -402487
12639 -402487 56167 1605480 2900150 2567610 -1192102 -7275356 -9685640 -3756916 6350829
12630 6350829 11426560 8613547 4025471 3208726 4407077 3637397 1605871 1698983 4150191
$$ packed form
12688c642909N80719N953598L573097m804137q216500k252529M869468M288911
12680C49718j546584l719720m5274K971641J103636j252373J076137M822274K759692
12671F519147m616783q456250l505316M877665Q162767M774623l82557l069935
12663D303361k648213k14352K389417K867836P24028j664556k192578j616744
12655A948199j180746k36473J210243N85175l031701n571790l279857J017060
12647h539890J988659K06998O13116L646247M409453J078712k101462j704320
12639d02487M58654J549313J294670l32540l759712o083254k410284N928724J0107745
12630F350829N075731k813013m588076q16745J198351p69680k031526R3112K451208
$$ plain form
12621 4150191 6194879 6402537 5503003 3991655 1928788 442842 657353 1397194 390536
12612 390536 -2391936 -4909940 -6486601 -8445426 -10728753 -10567243 -6253876 -438730
12604 -438730 2553806 1860308 399292 434465 1218923 1463076 1582890 1976068 1243630
12595 1243630 -1406802 -3424321 -1606975 3130741 6911209 8458023 9528646 9522492 4986054
12586 4986054 -3033613 -6516506 -382741 8755212 9969886 2420203 -4060204 -2512857
12578 -2512857 3475939 6884665 5959207 3132290 221421 -1836529 -1993099 -902285
12570 -902285 -792533 -1235344 1264108 6713485 9062039 4485213 -1579586 -1275732 4348724
12561 4348724 7179819 4172863 1012957 2666786 6159661 5551022 223702 -4867639
$$ packed form
12621D150191K044688K07658q99534j511348k062867j485946K14511P39841j006658
12612C90536k782472k518004j576661j958825k283327J61510M313367N815146
12604d38730K992536o93498j461016L5173P84458K44153J19814L93178p32438
12595A243630k650432k017519J817346M737716L780468J546814J070623o154m536438
12586D986054q019667l482893O133765R137953J214674p549683o480407J547347
12578b512857N988796L408726r25458k826917k910869k057950j56570J090814
12570i02285J09752m42811K499452N449377K348554m576826o064799L03854N624456
12561D348724K831095l006956l159906J653829L492875o08639n327320n091341
$$ plain form
12553 -4867639 -5181160 -646118 4922401 7036581 4193233 -805480 -3859194 -3787594 -2520259
12544 -2520259 -1941169 -2548134 -4531809 -7535893 -9539308 -8688694 -6268907 -5145166 -5330058
12535 -5330058 -4281580 -1838692 -1184303 -3763784 -6594463 -6245891 -2758650 1738160
12527 1738160 5473077 6743989 4288155 -251253 -3027985 -2814846 -2132568 -2084433 -101978
12518 -101978 4529270 7203765 4271927 -592912 -1293223 1835563 3509596 2334666
12510 2334666 2168621 4648669 6196220 4094933 836455 -50636 857156 439890 -2469713
12501 -2469713 -6223747 -8481644 -7809686 -4548929 -1035898 446684 476852 1503606 3651746
12492 3651746 3930227 768141 -2985054 -3451148 -555833 2356664 2658994 559171 -2015757
$$ packed form
12553d867639l13521M535042N568519K114180k843348m998713l053714P1600J267335
12544b520259N79090o06965j983675l004084k003415Q50614K419787J123741j84892
12535e330058J048478K442888O54389k579481k830679L48572L487241M496810
12527A738160L734917J270912k455834m539408k776732K13139O82278M8135J982455
12518a01978M631248K674495k931838m864839p00311L128786J674033j174930
12510B334666j66045K480048J547551k101287l258478q87091R07792m17266k909603
12501b469713l754034k257897O71958L260757L513031J482582L0168J026754K148140
12492C651746K78481l162086l753195m66094K895315K912497L02330k099823k574928
$$ plain form
12483 -2015757 -2992070 -1153036 2819192 6354303 7223932 5833368 4422985 3996897 3055868
12474 3055868 -152793 -4917672 -8655261 -10162606 -10949574 -12427971 -13048785 -10374916
12466 -10374916 -5592197 -3008756 -4129679 -5243921 -3092249 -291976 -1724424 -7119848
12458 -7119848 -11252369 -11212911 -9558961 -9457225 -10138562 -8806666 -4612277 948788 5802009
12449 5802009 7986874 6137140 933723 -4613540 -7378343 -6346413 -2713956 1182523
12441 1182523 3134159 2728930 1919245 2592862 3726334 2670208 -883645 -4379704 -6041945
12432 -6041945 -6751927 -7766783 -8844837 -9461353 -9775635 -9466553 -7590169 -4517372 -2076430
12423 -2076430 -899288 353860 2277312 3492724 3201411 2555124 2119745 531196 -2393212
$$ packed form
12483b015757r76313J839034L972228L535111Q69629j390564j410383m26088r41029
12474C055868l208661m764879l737589j507345p86968j478397o20814K673869
12466a0374916M782719K583441j120923j114242K151672K800273j432448n395424
12458g119848m132521L9458J653950J01736o81337J331896M194389N561065M853221
12449E802009K184865j849734n203417n547263k764803J031930L632457L896479
12441A182523J951636m05229q09685O73617J133472j056126l553853l496059j662241
12432f041945p09982j014856j078054o16516l14282L09082J876384L072797K440942
12423b076430J177142J253148J923452J215412k91313o46287m35379j588549k924408
$$ plain form
12414 -2393212 -3653246 -887476 3421287 4502742 1454724 -1685637 -1095557 2549615
12406 2549615 5592691 6175951 6465108 9526137 14360566 16023341 12012353 6312006
12398 6312006 4160925 4735173 3438344 223451 -345816 2321056 3074639 220955 -415793
12389 -415793 4991488 10858498 10304831 5772099 4463029 6749451 6987622 3913256 2063452
12380 2063452 3113376 3543122 1903684 1307588 2908539 3410915 1396084 24533 616957
12371 616957 -494428 -4982841 -7902279 -4858516 551439 1800356 -1260201 -3638898
12363 -3638898 -3526764 -3634199 -5070434 -5380454 -3287112 -1017649 -712942 -1844507 -3408409
12354 -3408409 -5824955 -9071652 -10985036 -9191797 -3937277 1790726 4332568 1701726
$$ packed form
12414b393212j260034K765770M308763J081455l048018l140361N90080L645172
12406B549615L043076N83260K89157L061029M834429J662775m010988n700347
12398F312006k151081N74248j296829l214893n69267K666872P53583k853684o36748
12389d15793N407281N867010n53667m532732j309070K286422K38171l074366j849804
12380B063452J049924M29746j639438n96096J600951N02376k014831j371551N92424
12371F16957j111385m488413k919438L043763N409955J248917l060557k378697
12363c638898J12134j07435j436235l10020K093342K269463L04707j131565j563902
12354c408409k416546l246697j913384J793239N254520N728003K541842k630842
$$ plain form
12346 1701726 -4540701 -9284415 -7405895 1272203 10953772 14723911 10665572 3165779
12338 3165779 -1661729 -1794380 -492262 -1555273 -4199076 -4356695 -1062811 1371108
12330 1371108 -436418 -3090637 -575853 6709987 11584911 9521922 4071193 641683
12322 641683 -1061375 -4472448 -8916269 -10164507 -7485189 -4965462 -4972818 -4921990 -2392447
12313 -2392447 735510 2105927 3268672 6422709 9380672 8303869 4193875 2105600
12305 2105600 4041445 6763827 7083614 5402530 3128863 463204 -1597320 -472939
12297 -472939 4539261 10461679 14076610 14833483 12993712 8104695 1612337 -2149262
12289 -2149262 -805473 2471588 3332475 2069954 1776679 2931644 3934505 5300929
$$ packed form
12346A701726o242427m743714J878520Q678098R681569L770139m058339p499793
12338C165779m827508j32651J302118j063011k643803j57619L293884K433919
12330A371108j807526k654219K514784P285840M874924k062989n450729l429510
12322F41683j703058l411073m443821j248238K679318K519727p356N0828K529543
12313b392447L127957J370417J162745L154037K957963j076803m109994k088275
12305B105600J935845K722382L19787j681084k273667k665659k060524J124381
12297d72939N012200N922418L614931P56873j839771m889017o492358l761599
12289b149262J343789L277061Q60887j262521k93275J154965J002861J366424
$$ plain form
12281 5300929 8465332 11171125 9349153 4150693 2020030 5981311 11211723 11775755
12273 11775755 8009425 3976006 661783 -3898044 -8979415 -10298613 -5867581 427590
12265 427590 3245648 2240370 1672015 3844059 5657784 3329164 -1463687 -3354853
12257 -3354853 -803328 2037234 2188288 2489448 6162747 10105163 8680762 2810396
12249 2810396 -362580 2471984 6226636 5106384 703714 -994519 1820090 4920974
12241 4920974 4071942 -25872 -3275966 -3019480 -536184 817421 -640957 -3555993
12233 -3555993 -5841880 -7034525 -7510740 -7034360 -5954191 -6305216 -8953509 -10777285 -8128224
12224 -8128224 -2501721 1150048 1565248 1988610 3274056 1718578 -3826085 -7943666
$$ packed form
12281E300929L164403K705793j821972n198460k130663L961281N230412N64032
12273A1775755l766330m033419l314223m559827n081371j319198M431032O295171
12265D27590K818058j005278n68355K172044J813725k328620m792851j891166
12257c354853K551525K840562J51054L01160L673299L942416j424401n870366
12249B810396l172976K834564L754652j120252m402670j698233K814609L100884
12241D920974q49032m097814l250094K56486K483296J353605j458378k915036
12233c555993k285887j192645m76215M76380J080169l51025k648293j823776K649061
12224h128224N626503L651769M15200M23362J285446j555478n544663m117581
$$ plain form
12216 -7943666 -5739757 142048 4032141 5179444 6004739 5561071 1369495 -3678748
12208 -3678748 -3541083 1208836 2677386 -3032635 -9862359 -10615118 -6497558 -3275096
12200 -3275096 -2242526 -963215 -253251 -3381114 -8558198 -9101201 -3147278 2484938
12192 2484938 1650046 -2344333 -1971483 3401723 7074198 4733277 -637993 -4179606
12184 -4179606 -4901324 -4395934 -3599202 -3078038 -3623751 -4254696 -2201869 2671729 5909962
12175 5909962 3861463 -964684 -3118009 -1161449 1914536 3736745 4097425 2369087
12167 2369087 -2161015 -7024022 -7695347 -3196761 2465116 5370129 5334092 3874672 1925285
12158 1925285 831352 2302596 5464626 6696494 4389693 1443144 1020183 2176299
$$ packed form
12216g943666K203909N881805L890093J147303Q25295m43668m191576n048243
12208c678748J37665M749919J468550n710021o829724p52759M117560L222462
12200c275096J032570J279311P09964l127863n177084n43003N953923N632216
12192B484938q34892l994379L72850N373206L672475k340921n371270l541613
12184d179606p21718N05390P96732N21164n45713o30945K052827M873598L238233
12175E909962k048499m826147k153325J956560L075985J822209L60680j728338
12167B369087m530102m863007o71325M498586N661877K905013l6037j459420j949387
12158A925285j093933J471244L162030J231868k306801k946549m22961J156116
$$ plain form
12150 2176299 2059364 507387 -209608 830344 1941248 1008093 -2194880 -5247276 -4447881
12141 -4447881 1334339 7867653 9156211 4675575 119602 -275432 1379092 1508883
12133 1508883 920072 2037702 3405667 1794242 -1665952 -2206092 1891620 7163235
12125 7163235 9683969 8797678 6150095 3914374 3894499 5674954 6016944 2867945 -831433
12116 -831433 -766005 2207386 3553562 2744513 3830746 7071756 6148062 -2422794 -11786473
12107 -11786473 -12059485 -2838692 6664441 8981455 5163947 384926 -2408232 -2979073
12099 -2979073 -1787171 -127190 -236361 -2904774 -5986391 -6903874 -5653953 -3909364
12091 -3909364 -2388278 -1082536 -1071982 -3359694 -5901848 -4684710 1109616 7321148
$$ packed form
12150B176299j16935j551977p16995J039952J110904r33155l202973l052396P99395
12141d447881N782220O533314J288558m480636m555973l95034J654524J29791
12133A508883n88811J117630J367965j611425l460194n40140M097712N271615
12125G163235K520734q86291k647583k235721j9875J780455L41990l148999l699378
12116h31433O5428K973391J346176q09049J086233L241010r23694q570856r363679
12107a1786473k73012R220793R503133K317014l817508m779021k793158n70841
12099b979073J191902J659981j09171k668413l081617r17483J249921J744589
12091c909364J521086J305742J0554k287712k542154J217138N794326O211532
$$ plain form
12083 7321148 9749495 8845201 7513037 6290978 3751536 437337 -1348348 -1580481
12075 -1580481 -2588317 -4446400 -4211443 -1366798 -41576 -2833016 -5752290 -3410736
12067 -3410736 2909945 6902623 5880302 3136333 1881913 1690578 1863651 3423465
12059 3423465 5474520 3969425 -2269275 -7502407 -5475709 1856271 6486823 4618380
12051 4618380 384408 -938203 1043934 4091139 7381922 10318860 10357459 5915542
12043 5915542 -32937 -2915400 -2372364 -1705466 -2145652 -1720746 -55702 212106 -1629449
12034 -1629449 -2231514 497665 3727170 4521075 4661260 6535050 7639892 4697523 708471
12025 708471 1162896 4378348 3282216 -2589204 -5138416 -548070 4045712 1881136
$$ packed form
12083G321148K428347r04294j332164j222059k539442l314199j785685k32133
12075a580481j007836j858083K34957K844645J325222k791440k919274K341554
12067c410736O320681L992678j022321k743969j254420j91335J73073J559814
12059C423465K051055j505095o238700n233132K026698P331980M630552j868443
12051D618380m233972j322611J982137L047205L290783K936938L8599m441917
12043E915542n948479k882463N43036O66898m40186M24906J665044K67808j841555
12034a629449o02065K729179L229505P93905J40185J873790J104842k942369l989052
12025G08471M54425L215452j096132n871420k549212M590346M593782k164576
$$ plain form
12017 1881136 -2614978 -1756721 2092724 543267 -6004750 -7710472 -396746 7734480
12009 7734480 7898541 2093354 -2057448 -2415384 -2526947 -3986054 -4622750 -3373511 -1896233
12000 -1896233 -910925 1143585 4673254 7086139 5983568 2386533 -680479 -1665619
11992 -1665619 -1286573 -720982 -400182 -329407 -356953 65298 1411869 2902070 2531002
11983 2531002 -921339 -6077247 -9677814 -9171516 -4719742 691615 3083743 786207
11975 786207 -3289499 -4173910 -983625 1331070 -1192181 -4940322 -3174917 3744668
11967 3744668 8091628 5850191 2191411 2673752 4517582 2112098 -2856785 -3866660
11959 -3866660 -318464 1695808 -336514 -1723872 428868 1324009 -3863034 -11210072
$$ packed form
12017A881136m496114Q58257L849445j549457o548017j705722P313726Q131226
12009G734480J64061n805187m150802l57936j11563j459107o36696J249239J477278
12000a896233R85308K054510L529669K412885j102571l597035l067012r85140
11992a665619L79046N65591L20800P0775k7546M22251J346571J490201l71068
11983B531002l452341n155908l600567N06298M451774N411357K392128k297536
11975G86207m075706q84411L190285K314695k523251l748141J765405O919585
11967C744668M346960k241437l658780M82341J843830k405484m968883j009875
11959c866660L548196K014272k032322j387358K152740Q95141n187043p347038
$$ plain form
11951 -11210072 -12716139 -7442757 -2353568 -2338332 -4379613 -3138512 1282302 3948470
11943 3948470 2002702 -1797767 -2903835 -599208 1689380 1232361 -683275 -1039519
11935 -1039519 781584 2683969 2864804 1487886 -206731 -905921 231873 2390842
11927 2390842 2956374 484394 -2635636 -2754451 47266 2089100 1182529 -1290752 -3687520
11918 -3687520 -6120176 -8010257 -6978355 -2333338 2820211 5187372 5032735 4397689
11910 4397689 3675449 2196932 419260 -702194 -943485 362490 4391422 9403974
11902 9403974 10136387 4276340 -2741914 -3909595 -133002 1477609 -1804741 -5034759
11894 -5034759 -3720798 118711 2106493 1177808 -1502090 -5287213 -8664370 -8661640 -5126447
$$ packed form
11951a1210072j506067N273382N089189J5236k041281J241101M420814K666168
11943C948470j945768l800469j106068K304627K288588m57019j915636l56244
11935a039519J821103J902385J80835j376918j694617o99190J137794K158969
11927B390842N65532k471980l120030j18815K801717K041834r06571k473281k396768
11918c687520k432656j890081J031902M645017N153549K367161j54637o35046
11910D397689p22240j478517j777672j121454k41291J305975M028932N012552
11902I403974P32413n860047p018254j167681L776593J610611l282350l230018
11894e034759J313961L839509J987782r28685k679898l785123l377157K730L535193
$$ plain form
11885 -5126447 -2539272 -3821825 -5293154 -2329951 2478914 2506410 -2764361 -6828280
11877 -6828280 -5583954 -1651342 1990453 6390746 11548344 12636955 6404278 -2308564
11869 -2308564 -5971508 -4251041 -3164714 -5506273 -7718062 -6633890 -4127937 -3338169
11861 -3338169 -4240182 -5030671 -4872625 -3411705 -328163 2776006 2751361 -707660 -3548885
11852 -3548885 -2601553 68335 811277 138843 1256276 4322899 6169434 5416807 4174788
11843 4174788 4196500 4506383 3653027 1688382 -781004 -2940810 -2664086 1671421 6957420
11834 6957420 6554059 -1470312 -10059009 -10868932 -4674483 84223 -1322618 -4650837
11826 -4650837 -4165766 -1085168 -973939 -4956586 -7916201 -5711578 -674173 1880321
$$ packed form
11885e126447K587175j282553j471329K963203M808865K7496n270771m063919
11877f828280J244326L932612L641795M400293N157598J088611o232677q712842
11869b308564l662944J720467J086327k341559k211789J084172K505953P89768
11861c338169r02013p90489J58046J460920L083542L104169k4645l459021k841225
11852c548885R47332K669888P42942o72434J117433L066623J846535p52627j242019
11843D174788K1712L09883q53356j964645k469386k159806K76724M335507N285999
11834F957420m03361q024371q588697q09923O194449M758706j406841l328219
11826d650837M85071L080598J11229l982647k959615K204623N037405K554494
$$ plain form
11818 1880321 567976 -963601 755875 4799060 7341964 6127230 2521587 -407588
11810 -407588 -974515 120011 1192729 1225542 125181 -1731261 -3463301 -3750811 -2015722
11801 -2015722 561383 2183350 2423122 1858562 46727 -4046105 -9123281 -11438481
11793 -11438481 -9051042 -4349425 -718927 1478310 3713720 6090844 7902605 9627967
11785 9627967 11331464 10702547 6441210 2301644 3066149 6787110 6243802 -907608 -8593396
11776 -8593396 -10990697 -9877156 -10101589 -11806690 -11375276 -7515691 -2299231 2252229
11768 2252229 4995198 4328768 -440051 -6829742 -10975742 -11428352 -9524091 -7183145
11760 -7183145 -6112427 -7393455 -9445529 -8128002 -1689538 5824959 8993939 7471518
$$ packed form
11818A880321j312345j531577J719476M043185K542904j214734l605643k929175
11810d07588n66927J094526J072718L2813j100361j856442j732040k87510J735089
11801b015722K577105J621967K39772n64560j811835m092832n077176k315200
11793a1438481K387439M701617L630498K197237K235410K377124J811761J725362
11785I627967J703497o28917m261337m139566P64505L720961n43308p151410p685788
11776h593396k397301J113541k24433j705101M31414L859585N216460M551460
11768B252229K742969o66430m768819o389691m146000m52610J904261K340946
11760g183145J070718j281028k052074J317527O438464P514497L168980j522421
$$ plain form
11752 7471518 5018374 3611111 2272935 912450 1182753 3169092 4569260 3799102
11744 3799102 1341948 -2112643 -6084914 -8602018 -7044243 -1723329 3481662 5005563
11736 5005563 2771877 -723756 -3053895 -3476152 -3142118 -3658621 -4890839 -5335221 -5344161
11727 -5344161 -7533420 -12088516 -14536060 -11544007 -6587686 -5510813 -7924501 -7886001
11719 -7886001 -2773844 3255228 5225087 2739347 -1283355 -3726695 -2524169 1830536
11711 1830536 5400891 4521966 733003 -1055521 712481 2766320 2232038 -309661
11703 -309661 -2998020 -4214899 -2224624 2456144 4702933 -52840 -8089755 -10492898
11695 -10492898 -4930899 1553483 3079947 1968890 2581397 4299988 4611661 4055883
$$ packed form
11752G471518k453144j407263j338176j360485K70303J986339J400168p70158
11744C799102k457154l454591l972271k517104J557775N320914N204991J523901
11736E005563k233686l495633k330139m22257L34034n16503j232218m44382q940
11727e344161k189259m555096k447544K992053M956321J076873k413688L8500
11719g886001N112157O029072J969859k485740m022702k443340J202526M354705
11711A830536L570355q78925l788963j788524J768002K053839n34282k541699
11703c09661k688359j216879J990275M680768K246789m755773q036915k403143
11695a0492898N561999O484382J526464j111057O12507J718591L11673n55778
$$ plain form
11687 4055883 3732263 2057516 -1758223 -4575909 -3538810 -192197 2684245 4473851
11679 4473851 4067697 -1038690 -8936698 -12120824 -7557092 -2686030 -4797632 -9486713
11671 -9486713 -8071324 -2456052 -2071221 -7280772 -7279475 2898572 13217229 11967943
11663 11967943 1439126 -6106419 -4188971 2232815 5321519 3382994 538719 295507
11655 295507 1253451 -720314 -6606801 -12002785 -11951153 -6634517 -236042 4552926 7914523
11646 7914523 9535334 7611395 2107091 -3677746 -6007515 -3828652 974480 4791968
11638 4791968 4360372 -101282 -4303304 -4730936 -3173518 -3569941 -5614884 -5689488 -3644679
11629 -3644679 -3570014 -6881580 -9636123 -8764734 -6437521 -5395428 -4040807 74488 5029591
$$ packed form
11687D055883l23620j674747l815739k817686J037099L346613K876442J789606
11679D473851m06154n106387p898008l184126M563732M871062k111602m689081
11671i486713J415389N615272L84831n209551J297J0178047J0318657j249286
11663A1967943j0528817p545545J917448O421786L088704j938525k844275k43212
11655B95507R57944j973765n886487n395984N1632N316636O398475M788968L361597
11646G914523J620811j923939n504304n784837k329769K178863M803132L817488
11638D791968m31596m461654m202022m27632J557418l96423k044943p4604K044809
11629c644679P4665l311566k754543Q71389K327213J042093J354621M115295M955103
$$ plain form
11620 5029591 7062413 6333115 6053084 7113004 7580937 6931297 6810779 7410617 6701956
11611 6701956 4136631 2009811 1885978 2317017 1671291 915185 1589461 2839897 2807179
11602 2807179 1731362 1115923 608751 -1221480 -2988154 -958153 4975463 8964240
11594 8964240 5951768 -1112153 -4528907 -1714396 2139759 1836965 -1398261 -3280856
11586 -3280856 -2838465 -2125594 -1740117 -620787 315170 -1654952 -6327982 -9259527 -7186276
11577 -7186276 -2694999 -975003 -2819703 -3668819 -252913 4244480 3990217 -1338237
11569 -1338237 -5151676 -1899213 5803190 10333449 8181376 3047224 -61524 -770985
11561 -770985 -2071292 -5216976 -7864238 -6836447 -1850195 3470388 4735643 1755064
$$ packed form
11620E029591K032822p29298k80031J059920M67933o49640j20518N99838p08661
11611F701956k565325k126820j23833M31039o45726p56106O74276J250436l2718
11602B807179j075817o15439n07172j830231j766674K030001N933616L988777
11594H964240l012472p063921l416754K814511L854155l02794l235226j882595
11586c280856M42391P12871L85477J119330R35957j970122m673030k931545K073251
11577g186276M491277J719996j844700q49116L415906M497393k54263n328454
11569a338237l813439L252463P702403M530259k152073n134152l108748p09461
11561g70985j300307l145684k647262J027791M986252N320583J265255k980579
$$ plain form
11553 1755064 -661631 1397999 5555739 6634817 4524178 4115147 7094127 8991076
11545 8991076 6518947 2991695 2873165 4833019 4579319 1747160 -703936 -1999267
11537 -1999267 -3619948 -4861837 -3059836 1591291 5269141 5167894 2146531 -1421234
11529 -1421234 -3977159 -5004623 -5113168 -5637058 -6419522 -5120522 -821503 3335678 3878466
11520 3878466 1698254 -112953 -1142156 -2385323 -2043039 2146015 7209451 7345430
11512 7345430 2468265 -1119311 246522 3153753 3487997 2099317 1403652 926111 -236576
11503 -236576 -135269 2903215 6325955 6327245 3280160 894042 849682 1170252 -296406
11494 -296406 -2954271 -4285632 -2595690 1090495 3759618 3585902 1913784 891083
$$ packed form
11553A755064k416695K059630M157740J079078k110639m09031K978980J896949
11545H991076k472129l527252j18530J959854k53700k832159k451096j295331
11537a999267j620681j241889J802001M651127L677850j01247l021363l567765
11529a421234k555925j027464j08545n23890p82464J299000M299019M157181N42788
11520C878466k180212j811207j029203j243167L42284M189054N063436J35979
11512G345430m877165l587576J365833K907231L34244j388680o95665m77541j162687
11503b36576J01307L038484L422740J290l047085k386118m4360L20570j466658
11494b96406k657865j331361J689942L686185K669123j73716j672118j022701
$$ plain form
11486 891083 202227 -1424034 -2449395 -31124 4647568 6728414 4352405 890874
11478 890874 -823641 -1951576 -3243973 -2222073 1678823 3853565 1328493 -1116852
11470 -1116852 2228140 7818387 6848692 -1212240 -6764215 -3595450 2503266 2548594 -3158018
11461 -3158018 -6492305 -2817589 4332422 9195424 9822207 7412731 3478294 -93982
11453 -93982 -564885 2998889 7155864 6963414 2125378 -1904340 -448855 4415184 6730005
11444 6730005 4720680 2914603 5338329 9408894 9231015 3832559 -1082618 -473792
11436 -473792 3457120 4554070 1650069 577923 5492632 11321023 9335257 -408505
11428 -408505 -7655956 -5071817 2192048 4291373 138938 -3120793 -2111394 -1274673
$$ packed form
11486H91083o88856j626261j025361K418271M678692K080846k376009l461531
11478H90874j714515j127935j292397J021900L900896K174742k525072k445345
11470a116852L344992N590247r69695q060932n551975L168765O098716M5328n706612
11461c158018l334287L674716P150011M863002O26783k409476l934437l572276
11453i3982m70903L563774M156975j92450m838036m029718J455485M864039K314821
11444F730005k009325j806077K423726M070565j77879n398456m915177O08826
11436d73792L930912J096950k904001j072146M914709N828391j985766r743762
11428d08505p247451K584139P263865K099325m152435l259731J009399Q36721
$$ plain form
11420 -1274673 -4038924 -6786480 -4712250 1343244 7347360 11299725 12666185 10566866
11412 10566866 6481677 5257188 8993418 12922247 12000771 8552050 7759519 8337980
11404 8337980 4913715 -1483874 -3505379 800711 4258195 1670813 -2348985 -1294875
11396 -1294875 3320444 5758112 5330654 5383362 6032117 4849256 3157513 4544751 7436531
11387 7436531 6212755 568308 -3196009 -2098919 -670847 -2087444 -2283669 1931474
11379 1931474 5383923 2392529 -2750229 -1839801 3578550 4226682 -1883156 -6489213
11371 -6489213 -4943736 -3227194 -6746041 -10743240 -8406305 -2025411 1367588 834104
11363 834104 326461 26661 -2982325 -7098320 -7252870 -3359985 -418785 229814 2518644
$$ packed form
11420a274673k764251k747556K074230O055494O004116L952365J366460k099319
11412A0566866m085189j224489L736230L928829r21476l448721p92531N78461
11404H337980l424265o397589k021505M306090L457484k587382m019798J054110
11396a294875M615319K437668m27458N2708O48755j182861j691743J387238K891780
11387G436531j223776n644447l764317J097090J428072j416597j96225M215143
11379A931474L452449k991394n142758R10428N418351O48132o109838m606057
11371f489213J545477J716542l518847l997199K336935O380894L392999n33484
11363H34104n07643k99800l008986m115995j54550L892885K941200O48599K288830
$$ plain form
11354 2518644 7186925 8909761 4789547 -474402 -1692280 -398267 -723869 -2136031
11346 -2136031 -1000703 3222219 7662617 10294465 10959122 9477908 5961994 2145121
11338 2145121 -150884 -1110894 -1681882 -1647546 -845278 -580505 -1610072 -2418311 -1844568
11329 -1844568 -1523467 -2873186 -3575336 -767455 3475024 4111645 487194 -2484617 -1349233
11320 -1349233 1567648 2604768 2028077 1972446 1592906 -1896453 -7910761 -11767472 -10234637
11311 -10234637 -5357872 -1356711 325656 924712 940181 -179431 -1374593 -431725 2024097
11302 2024097 2333671 -475937 -1985832 1448231 6492031 7129812 3517805 1333295
11294 1333295 2581063 2816751 -950600 -5081991 -5258403 -3228865 -3324159 -5225147 -5030871
$$ packed form
11354B518644M668281J722836m120214n263949j217878J294013l25602j412162
11346b136031J135328M222922M440398K631848O64657j481214l515914l816873
11338B145121k296005r60010n70988L4336Q02268K64773j029567q08239N73743
11329a844568L21101j349719p02150K807881M242479O36621l624451k971811J135384
11320a349233K916881J037120n76691n5631l79540l489359o014308l856711J532835
11311a0234637M876765M001161J682367N99056J5469j119612j195162R42868K455822
11302B024097L09574k809608j509895L434063N043800O37781l612007k184510
11294A333295J247768K35688l767351m131391j76412K029538r5294j900988J94276
$$ plain form
11285 -5030871 -2066032 152406 -263821 -899293 738811 3416839 4392046 3651717 3936491
11276 3936491 6744360 9629246 8524877 2971475 -2228116 -2290861 1255546 2398131
11268 2398131 -797391 -3014770 718055 7415785 9807944 5823940 315719 -1944381
11260 -1944381 -687034 2652271 7496513 11870913 11482589 4727176 -3265687 -5385602
11252 -5385602 -1021988 3524267 3625661 1916373 3131868 6055353 4790957 -2023055
11244 -2023055 -7600219 -5132870 3129779 8525156 6741418 2206776 1342305 4949989
11236 4949989 8927375 9738354 6729548 900764 -5634607 -9540284 -8396021 -3616658
11228 -3616658 362798 494977 -2232923 -4882000 -6170955 -7138088 -8767508 -10130823
$$ packed form
11285e030871K964839K218438m16227o35472J638104K678028R75207p40329K84774
11276C936491K807869K884886j104369n553402n199591o2745L546407J142585
11268B398131l195522k217379L732825O697730K392159l984004n508221k260100
11260a944381J257347L339305M844242M374400l88324o755413p992863k119915
11252e385602M363614M546255J01394j709288J215495K923485j264396o814012
11244b023055n577164K467349Q262649N395377j783738m534642q64471L607684
11236D949989L977386Q10979l008806n828784o535371l905677J144263M779363
11228c616658L979456J32179k727900k649077j288955r67133j629420j363315
$$ plain form
11220 -10130823 -9378009 -6073300 -1809145 1476688 3051707 3092783 1800847 -490765
11212 -490765 -2906428 -4314744 -3584963 356701 7157573 13226062 13642096 7790533 1270997
11203 1270997 -232928 2501662 4552933 4121299 3618542 4144721 3407094 186302 -2859863
11194 -2859863 -2690804 307884 3426187 4521187 2969286 -142911 -2247390 -2014147
11186 -2014147 -1923181 -5085713 -9431102 -9188522 -3223572 2534076 3055408 373058 -982302
11177 -982302 -635355 -764481 -1213448 -521502 388009 -365289 -2040664 -2604991 -2047101
11168 -2047101 -1152980 984811 4561974 6316811 3624693 -363937 -657117 1660203
11160 1660203 1047993 -3133760 -4979261 -1144486 4091655 5666130 4875712 5810494 8029652
$$ packed form
11220a0130823P52814L304709M264155L285833J575019M1076j291936k291612
11212d90765k415663j408316P29781L941664O800872O068489M16034n851563o519536
11203A270997j503925K734590K051271m31634n02757N26179p37627l220792l046165
11194b859863J69059K998688L118303J095000j551901l112197k104479K33243
11186b014147R0966l162532m345389K42580N964950N757648N21332k682350j355360
11177i82302L46947j29126m48967O91946R09511p53298j675375n64327N57890
11168b047101Q94121K137791L577163J754837k692118l988630k93180K317320
11160A660203o12210m181753j845501L834775N236141J574475p90418R34782K219158
$$ plain form
11151 8029652 7337385 2424101 -3250278 -6076759 -5916786 -4827493 -4303961 -4387949 -4323898
11142 -4323898 -3736660 -3601271 -5444243 -8741387 -10135782 -6990889 -1232694 2458384
11134 2458384 2397760 1520987 2458392 3540356 1808742 -1949506 -4294616 -4368326 -4402411
11125 -4402411 -4760461 -2451341 3608673 9279633 10061330 6880073 3861200 2309891
11117 2309891 672729 -784272 327129 3932753 6434563 5283912 1848285 -1087204
11109 -1087204 -2185634 -1270132 1347602 4384488 6390248 7432150 8101907 7236271 3494862
11100 3494862 -893462 -1570680 1850682 4472287 2407166 -2374503 -5153920 -4169600
11092 -4169600 -1582861 -366540 -1499039 -3295695 -3256373 -1371335 -437662 -1500787 -1322088
$$ packed form
11151H029652o92267m913284n674379k826481J59973J089293N23532q3988O4051
11142d323898N87238J35389j842972l297144j394395L144893N758195L691078
11134B458384o0624q76773R37405J081964j731614l758248k345110p3710l4085
11125d402411l58050K309120O060014N670960P81697l181257l018873j551309
11117B309891j637162j457001J111401L605624K501810j150651l435627k935489
11109a087204j098430R15502K617734L036886K005760J041902O69757q65636l741409
11100C494862m388324o77218L421362K621605k065121m781669k779417R84320
11092d169600K586739J216321j132499j796656L9322J885038R33673j063125J78699
$$ plain form
11083 -1322088 2331174 5439375 2912411 -2740917 -4308603 -818361 1537569 -4739
11075 -4739 -824027 2479312 6841635 9044184 10431002 12018933 11676522 9898020 11402418
11066 11402418 16550235 18306670 13112314 7653793 8365549 11083318 8846738 3730113
11058 3730113 1919203 2102638 -1270903 -6600417 -7203863 -2977543 -245742 -705120 160698
11049 160698 3454763 4538945 1525451 -1745557 -2712626 -3068317 -3380501 -1567991 1569795
11040 1569795 1729711 -1915878 -4732965 -3541266 -488246 1496789 2269984 2239217 1272520
11031 1272520 820887 2527877 4232220 2306034 -1801818 -2920444 -435822 818143
11023 818143 -1317651 -3684206 -4403768 -5361382 -6364206 -3938019 1336148 3350563 45860
$$ packed form
11083a322088L653262L108201k526964n653328j567686L490242K355930j542308
11075d739q19288L303339M362323K202549J386818J587931l42411j778502J504398
11066A1402418N147817J756435n194356n458521P11756K717769k236580n116625
11058C730113j810910J83435l373541n329514o03446M226320K731801m59378Q65818
11049A60698L294065J084182l013494l271008r67069l55691l12184J812510L137786
11040A569795J59916l645589k817087J191699L053020J985035P73195l0767r66697
11031A272520m51633J706990J704343j926186m107852j118626K484622J253965
11023H18143k135794k366555p19562r57614j002824K426187N274167K014415l304703
$$ plain form
11014 45860 -2256828 1199844 5440884 3362464 -3239513 -6558736 -3561063 2077494
11006 2077494 6709220 9687279 10523621 8229932 4004546 1102356 1273153 3254868
10998 3254868 4865711 5177947 4794395 4829005 5314050 4769592 2617086 1458812 4374207
10989 4374207 9795059 12098090 8271191 1335254 -3881212 -5681319 -4976093 -2529599
10981 -2529599 1288617 5481215 8572900 9230955 6973340 3399399 1486488 1562215 -195571
10972 -195571 -5904233 -10651361 -8018876 172340 5550485 4591257 1933013 1357462 492341
10963 492341 -2754714 -5146886 -3907238 -2215797 -3767606 -5912562 -3837091 1058990
10955 1058990 2669010 -870556 -4615197 -3537027 1700443 6529904 7749166 5925890
$$ packed form
11014D5860k302688L456672M241040k078420o601977l319223K997673N638557
11006B077494M631726K978059Q36342k293689m225386k902190J70797J981715
10998C254868J610843L12236l83552L4610M85045n44458k152506j158274K915395
10989D374207N420852K303031l826899o935937n216466j800107P05226K446494
10981b529599L818216M192598L091685O58055k257615l573941j912911P5727j757786
10972a95571n708662m747128K632485Q191216N378145r59228k658244n75551q65121
10963D92341l247055k392172J239648J691441j551809k144956K075471M896081
10955A058990J610020l539566l744641J078170N237470M829461J219262j823276
$$ plain form
10947 5925890 3586173 2168493 1402810 1337392 2955752 5552059 5891210 2635498 -578873
10938 -578873 -38943 2207275 1954712 234287 1163594 3683779 2606217 -1918806 -3597438
10929 -3597438 -222691 2860814 2221618 1817539 5043631 8176816 6804972 2977831
10921 2977831 510224 -1725383 -5913940 -8988864 -6568489 -445167 3478445 2738152
10913 2738152 -676713 -4384139 -6365789 -4458047 295667 2474530 -775383 -4320213
10905 -4320213 -1761017 4826651 7627420 4018116 -1003836 -2631026 -1078343 1326730
10897 1326730 2980304 2502148 -421684 -3124714 -2311716 1425500 4510979 5568548
10889 5568548 6313638 7333196 6666439 3470102 173524 -340875 1914118 4191160 3616472
$$ packed form
10947E925890k339717j417680p65683o5418J618360K596307L39151l255712l214371
10938e78873N39930K246218k52563j720425R29307K520185j077562m525023j678632
10929c597438L374747L083505o39196m04079L226092L133185j371844l827141
10921B977831k467607k235607m188557l074924K420375O123322L923612p40293
10913B738152l414865l707426j981650J907742M753714K178863l249913l544830
10905d320213K559196O587668K800769l609304n021952j627190J552683K405073
10897A326730J653574m78156k923832k703030Q12998L737216L085479J057569
10889E568548P45090J019558o66757l196337l296578n14399K254993K277042n74688
$$ plain form
10880 3616472 -104824 -3783127 -3593621 149960 2787953 1389952 -1195369 -769990
10872 -769990 1964064 3035199 1625420 790678 1898627 2197536 -837143 -5294700 -6645311
10863 -6645311 -2832099 3332184 6704088 4886498 860709 -324381 2310398 4510205
10855 4510205 2661617 -1126874 -1832798 1725597 5336095 4707955 582857 -2425260
10847 -2425260 -1490844 1253935 2152318 1602585 3418986 8016916 9994782 5418280 -1704838
10838 -1704838 -4630016 -3190677 -2504357 -3886203 -3534923 -350997 1619166 198208
10830 198208 -1387915 -382360 1165465 464866 -2009080 -4745082 -7187394 -7758827 -4541573
10821 -4541573 314965 1892027 83053 359168 4658506 7493930 4383027 -1504882
$$ packed form
10880C616472l721296l678303J89506L743581K637993j398001k585321M25379
10872g69990K734054J071135j409779q34742J107949K98909l034679m457557j350611
10863f645311L813212O164283L371904j817590m025789j185090K634779K199807
10855D510205j848588l788491p05924L558395L610498o28140m125098l008117
10847b425260R34416K744779Q98383n49733J816401M597930J977866m576502p123118
10838a704838k925178J439339O86320j381846L51280L183926J970163j420958
10830A98208j586123J005555J547825p00599k473946k736002k442312n71433L217254
10821d541573M856538J577062j808974K76115M299338K835424l110903n887909
$$ plain form
10813 -1504882 -4718969 -4178394 -997006 4534458 9817774 9817149 4760684 2123193 5799919
10804 5799919 9355445 6167404 390876 272314 5169658 7500799 4772100 1780224
10796 1780224 2244316 4966558 7570826 8798878 8095068 6896826 8174240 11185708
10788 11185708 10485731 4407421 -364048 1616244 5540703 4175778 -30142 517020
10780 517020 5320477 6864678 3389459 893260 2258776 3344023 1218153 -1587810
10772 -1587810 -2949125 -4461078 -6778361 -7413929 -5198702 -2142330 501455 3492063
10764 3492063 6043456 5700123 2874631 1188645 2103803 2979176 1514041 -1091667 -2238473
10755 -2238473 -830686 1914802 2856146 -402829 -5309775 -5721566 -381345 3730994
$$ packed form
10813a504882l214087N40575L181388N531464N283316o25n056465k637491L676726
10804E799919L555526l188041n776528j18562M897344K331141k728699k991876
10796A780224M64092K722242K604268J228052p03810j198242J277414L011468
10788A1185708o99977o078310m771469J980292L924459j364925m205920N47162
10780E17020M803457J544201l475219k496199J365516J085247k125870k805963
10772a587810j361315j511953k317283o35568K215227L056372K643785K990608
10764C492063K551393l43333k825492j685986R15158Q75373j465135k605708j146806
10755b238473J407787K745488R41344l258975m906946m11791N340221M112339
$$ plain form
10747 3730994 859157 -4624991 -4530586 1227328 5683348 5496519 3665639 2997040 3438913
10738 3438913 4958832 7122728 7078234 3586962 911286 2565250 4231507 474271
10730 474271 -4598358 -2772857 4203038 6664200 2774400 929765 4858460 7618908
10722 7618908 4184117 -284145 -71082 1884369 627830 -1918785 -1196693 1989174
10714 1989174 3708985 3457465 3502194 4603538 6204618 8116712 9092123 6764694 1560849
10705 1560849 -2438283 -2633942 -620868 1772759 5062859 8864938 10500727 9306483
10697 9306483 8281490 9046831 9236682 7333552 5732938 5968327 5060758 328517 -5544942
10688 -5544942 -8092439 -7153339 -5808421 -5287265 -4425970 -2915113 -1970161 -2110514 -2252558
$$ packed form
10747C730994k871837n484148R4405N757914M456020j86829j830880o68599M41873
10738C438913J519919K163896m4494l491272k675676J653964J666257l757236
10730D74271n072629J825501O975895K461162l889800j844635L928695K760448
10722G618908l434791m468262K13063J955451j256539k546615P22092L185867
10714A989174J719811k51520M4729J101344J601080J912094R75411k327429n203845
10705A560849l999132j95659K013074K393627L290100L802079J635789j194244
10697I306483j024993P65341J89851j903130j600614K35389r07569m732241n873459
10688e544942k547497R39100J344918N21156Q61295J510857R44952j40353j42044
$$ plain form
10679 -2252558 -910787 2441029 6548130 8759417 7508485 4484951 2807859 3078946
10671 3078946 3031776 1152581 -1184118 -1549371 750656 3753512 4258585 1144693 -2447673
10662 -2447673 -2291808 1194724 3580779 3391690 3651309 4794287 2474771 -3554091 -5260007
10653 -5260007 2285809 11139740 10552083 2617471 -1415961 2302713 7154037 8124984
10645 8124984 6932930 4948763 722091 -3899542 -3996862 -212466 663571 -3769866 -7576028
10636 -7576028 -5726167 -724426 2736092 3698316 2775562 -338029 -4199709 -5100627 -1917337
10627 -1917337 2131442 4175871 4636395 4632581 4090378 3024953 1597612 -698912 -2981748
10618 -2981748 -2043010 2780453 6733912 6387227 5509890 8182548 10463418 6959034 1636965
$$ packed form
10679b252558J341771L351816M107101K211287j250932l023534j677092K71087
10671C078946m7170j879195k336699l65253K300027L002856N05073l113892l592366
10662b447673J55865L486532K386055j89089K59619J142978k319516o028862j705916
10653e260007P545816Q853931n87657p934612m033432L718674M851324R70947
10645H124984j192054j984167m226672m621633r7320L784396Q76037m433437l806162
10636g576028J849861N001741L460518R62224r22754l113591l861680r00918L183290
10627a917337M048779K044429M60524l814n42203j065425j427341k296524k282836
10618b981748R38738M823463L953459l46685q77337K672658K280870l504384n322069
$$ plain form
10609 1636965 2211544 6611919 6032167 27263 -2943767 -13623 2562462 1573557 1470308
10600 1470308 4653099 7367204 7705755 8193348 8365919 4401754 -1870303 -3506277 -218377
10591 -218377 409411 -4085638 -7101214 -4911037 -2208947 -2300439 -1966916 45014 -493531
10582 -493531 -3985932 -3950589 1906748 6584988 4574163 -501293 -3201777 -3138605 -1033416
10573 -1033416 3559895 7311024 4831627 -1397674 -2124494 4388254 9075762 6757531
10565 6757531 3722008 6010879 10303636 11959233 12786248 14977047 15500480 11973464
10557 11973464 7125430 3485267 466660 -962413 1587093 5754034 6815005 6436389
10549 6436389 9264131 11648604 6060522 -3556940 -4975198 2933823 8909989 8667779
$$ packed form
10609A636965N74579M400375n79752o004904k971030K930144K576085r88905j03249
10600A470308L182791K714105L38551M87593J72571l964165o272057j635974L287900
10591b18377O27788m495049l015576K190177K702090r1492L33523K011930n38545
10582d93531l492401L5343N857337M678240k010825n075456k700484O3172K105189
10573a033416M593311L751129k479397o229301p26820O512748M687508k318231
10565F757531l035523K288871M292757J655597Q27015K190799N23433l527016
10557A1973464m848034l640163l018607j429073K549506M166941J060971l78616
10549F436389K827742K384473n588082r617462j418258P909021N976166k42210
$$ plain form
10541 8667779 9267221 12002025 8820831 72264 -2306190 4679709 8789389 3353207
10533 3353207 -2741409 -2601276 -1495703 -2279551 1757034 11567482 17016286 14536820
10525 14536820 13087211 15837863 14312609 7283827 5546232 10895509 11485530 5254165
10517 5254165 5187568 13667787 16231052 9254018 7372014 14228692 14635758 5996217 5982240
10508 5982240 17150621 18349331 5173468 1461427 14403765 19484256 9182557 10691988
10500 10691988 31602483 38938874 21761580 18257337 43604224 54065155 30645984
10493 30645984 27267577 71172058 95543339 65615405 91539914 274870569 489228370
10486 489228370 485928698 229038965 -37931874 -107396610 -40419683 -8352899 -41197516
$$ packed form
10541H667779N99442K734804l181194q748567k378454O985899M109680n436182
10533C353207o094616J40133J105573p83848M036585R810448N448804k479466
10525A4536820j449609K750652j525254p028782j737595N349277N90021o231365
10517E254165o6597Q480219K563265o977034j882004O856678M07066q639541j3977
10508E982240J1168381J198710j3175863l712041J2942338N080491j0301699J509431
10500A0691988K0910495P336391j7177294l504243K5346887J0460931k3419171
10493C0645984l378407M3904481K4371281k9927934K5924509J83330655K14357801
10486D89228370l299672k56889733k66970839o9464736O6976927L2066784l2844617
$$ plain form
10479 -41197516 -53803121 -26054472 -16236057 -36413268 -38090532 -11466282 20457
10472 20457 -15816509 -23131435 -10112151 -6617958 -22016134 -27894907 -13451476 -3739487
10464 -3739487 -11033281 -15926143 -8722701 -6563421 -16923024 -22408332 -14315622 -7542821
10456 -7542821 -10879008 -13014741 -8015845 -6287258 -11138999 -11005071 -3219515 -557853
10448 -557853 -6846829 -10038939 -5944325 -5149787 -10156373 -9318982 -399004 2831431 -4982290
10439 -4982290 -11469381 -9181925 -6629680 -8966356 -8105344 -821395 2413563 -3882596
10431 -3882596 -9802413 -7466644 -3334708 -4645335 -7911128 -8806810 -10316933 -14002631
10423 -14002631 -15297803 -13110057 -12381635 -13231445 -10037576 -4154753 -3732378 -8092036
$$ packed form
10479d1197516j2605605K7748649R818415k0177211j677264K6624250J1486739
10472B0457j5836966p314926J3019284L494193j5398176n878773J4443431R711989
10464c739487p293794m892862P203442K159280j0359603n485308Q092710O772801
10456g542821l336187k135733M998896J728587m851741J33928P785556K661662
10448e57853o288976l192110M094614P94538n006586Q37391Q919978L230435p813721
10439d982290o487091K287456K552245k336676Q61012P283949L234958o296159
10431c882596n919817K335769M131936j310627l265793q95682j510123l685698
10423a4002631j295172K187746P28422q49810L193869N882823M22375m359658
$$ plain form
10415 -8092036 -7249468 -298308 1650787 -4706548 -8421451 -3511503 1238234 -1372188
10407 -1372188 -5860271 -6860837 -8667576 -13878255 -16008234 -11855539 -8645199 -10635482
10399 -10635482 -10984791 -5369818 -1359564 -4981538 -9622957 -8195194 -5536122 -8275802
10391 -8275802 -12194544 -10711419 -7590272 -9918977 -14962632 -14716364 -8652481 -2500157
10383 -2500157 1536890 4924947 6743323 5050585 1649241 -353867 -996648 -1205182
10375 -1205182 91342 2688489 3334959 997040 -632720 828954 2862741 3355627
10367 3355627 3811354 4346118 1859007 -3360860 -5726396 -2884439 222441 -358993 -1828055
10358 -1828055 -1173086 -678652 -2346443 -3379476 -1987943 -1285949 -2593546 -1558626 3535570
$$ packed form
10415h092036Q42568O951160J949095o357335l714903M909948M749737k610422
10407a372188m488083j000566j806739n210679k129979M152695L210340j990283
10399a0635482l49309N614973M010254l621974m641419J427763K659072k739680
10391h275802l918742J483125L121147k328705n043655K46268O063883O152324
10383b500157M037047L388057J818376j692738l401344k003108o42781k08534
10375a205182J296524K597147O46470k337919j629760J461674K033787M92886
10367C355627M55727N34764k487111n219867k365536K841957L106880n81434j469062
10358a828055O54969M94434j667791j033033J391533P01994j307597J034920N094196
$$ plain form
10349 3535570 6175768 869343 -7456263 -10044064 -6005729 -1129702 1302593 2345676
10341 2345676 2765695 2155823 1091279 351269 -275221 -168731 2130086 5235113 5235457
10332 5235457 1745525 -905927 -598956 -290016 -1561515 -1276536 1938231 3802185 1228796
10323 1228796 -2219772 -2196843 -110138 664223 658995 1912805 3636432 4463167 5387658
10314 5387658 6797557 6356316 3269618 710941 669916 447916 -2459527 -6120708 -7923792
10305 -7923792 -8351395 -8123927 -6092175 -2776797 -1243306 -1854643 -1343985 687574 763244
10296 763244 -458742 2916728 11010276 14580366 8554044 1103242 1524328 6231744
10288 6231744 5915257 794412 -1527902 389378 923043 -1655039 -3005645 -1359261
$$ packed form
10349C535570K640198n306425q325606k587801M038335M876027K432295J043083
10341B345676M20019o09872j064544p40010o26490J06490K298817L105027L44
10332E235457l489932k651452L06971L08940j271499K84979L214767J863954k573389
10323A228796l448568K2929K086705P74361n228J253810J723627Q26735R24491
10314E387658J409899m41241l086698k558677m1025k22000k907443l661181j803084
10305g923792m27603K27468K031752L315378J533491o11337N10658K031559P5670
10296G63244j221986L375470Q093548L570090o026322p450802M21086M707416
10288F231744l16487n120845k322314J917280N33665k578082j350606J646384
$$ plain form
10280 -1359261 84223 -1223 946692 3583908 4989378 3831372 2181234 1638605 2068584
10271 2068584 3978467 7535945 9651014 6983307 1730102 -501723 1269277 2339972
10263 2339972 -244900 -3967892 -5635245 -5689393 -6164175 -7567613 -9262303 -10555483 -10417100
10254 -10417100 -7990505 -3874874 462187 4054095 5735053 3635973 -1910332 -6261714
10246 -6261714 -4749162 1294746 5968600 6136771 4258998 3795858 4895332 5428206 3936916
10237 3936916 752359 -2137699 -2122979 1368330 5282273 6014941 4032774 3030051 4146653
10228 4146653 3903910 -504772 -6244627 -7946333 -4806697 -1361521 -612209 304813 5032826
10219 5032826 10957648 11580412 5652982 -698158 -2314793 -911009 -90346 848103 3799413
$$ packed form
10280a359261J443484q5446R47915K637216J405470j158006j650138n42629M29979
10271B068584J909883L557478K115069k667707n253205k231825J771000J070695
10263B339972k584872l722992j667353n4148m74782j403438j694690j293180J38383
10254a0417100K426595M115631M337061L591908J680958k099080n546305m351382
10246f261714J512552O043908M673854J68171j877773m63140J099474N32874j491290
10237C936916l184557k890058J4720L491309L913943P32668j982167j002723J116602
10228D146653k42743m408682n739855j701706L139636L445176P49312R17022M728013
10219E032826N924822O22764n927430o351140j616635J403784Q20663R38449K951310
$$ plain form
10210 3799413 6423817 5418657 2637460 2058645 2628086 527548 -2853100 -2414337 1565860
10201 1565860 3395869 1625666 953600 2892594 2599928 -1941120 -5310126 -3566246
10193 -3566246 -878843 -2011079 -4139520 -2124066 2776775 5572189 5372994 4781437
10185 4781437 4257213 2592660 952262 1442907 3065584 3137813 1330845 -934294 -3129639
10176 -3129639 -4691955 -4030814 -1603285 -1063599 -3957304 -6530563 -5739230 -4904937 -8349360
10167 -8349360 -13283305 -12966531 -6569692 -242861 1431767 272647 411973 3141033
10159 3141033 6412229 6929742 2769696 -4140114 -8956338 -9154708 -7376316 -7085476 -7488260
10150 -7488260 -5498121 -829612 4016072 7394183 9088886 8505906 5418379 1852120
$$ packed form
10210C799413K624404j005160k781197n78815N69441k100538l380648M38763L980197
10201A565860J830009j770203o72066J938994k92666m541048l369006J743880
10193c566246K687403j132236k128441K015454M900841K795414j99195n91557
10185D781437n24224j664553j640398M90645J622677P2229j806968k265139k195345
10176c129639j562316O61141K427529N39686k893705k573259P91333Q34293l444423
10167h349360m933945L16774O396839O326831J674628j159120J39326K729060
10159C141033L271196N17513m160046o909810m816224j98370J778392K90840m02784
10150g488260J990139M668509M845684L378111J694703n82980l087527l566259
$$ plain form
10142 1852120 620924 2253969 4843712 5988436 3936836 -1233763 -6305910 -7134414
10134 -7134414 -3649885 -142921 732286 969982 2583963 3932471 3275671 2089953 1548707
10125 1548707 -592879 -5705434 -10126304 -9594720 -5399359 -2108050 -1365611 -1702525 -2290010
10116 -2290010 -3033829 -2840689 -1394993 -906839 -2938542 -5487526 -6097545 -5397517 -4651001
10107 -4651001 -2831031 421324 2019188 -482388 -4731457 -7218576 -8206912 -9338250
10099 -9338250 -9573238 -7710810 -5847680 -5994821 -6291930 -4829984 -3758028 -4922323 -5178062
10090 -5178062 -1441157 3131498 3867529 2245920 2758491 5172547 6218835 6022662 6350285
10081 6350285 5549068 2213740 628432 4669601 9308716 7039709 302848 -2303192
$$ packed form
10142A852120j231196J633045K589743J144724k051600n170599n072147q28504
10134g134414L484529L506964Q75207K37696J613981J348508o56800j185718n41246
10125A548707k141586n112555m420870N31584M195361L291309P42439l36914n87485
10116b290010p43819J93140J445696M88154k031703k548984o10019P00028P46516
10107d651001J819970L252355J597864k501576m249069k487119r88336j131338
10099i338250k34988J862428J863130j47141k97109J461946J071956j164295k55739
10090e178062L736905M572655P36031j621609N12571K414056J046288j96173L27623
10081F350285q01217l335328j585308M041169M639115k269007o736861k606040
$$ plain form
10073 -2303192 -502774 -2053092 -8069537 -10295588 -5248604 -103160 -627662 -3215009
10065 -3215009 -3697279 -4733837 -8345894 -9388892 -3804239 3116881 4387060 2170676
10057 2170676 3032166 6026709 4138290 -3514292 -8887672 -5963986 1195144 4070295
10049 4070295 105284 -5354964 -6313810 -2638133 1551595 4189056 6930583 10138352
10041 10138352 10160550 4764738 -1679382 -3017096 358030 2868112 2317653 1566631 1893926
10032 1893926 702729 -2972747 -6058358 -6363028 -5312831 -4033598 -1173544 3327831
10024 3327831 6330329 5524586 2176828 -1430299 -3926137 -3710481 -286590 2508737
10016 2508737 -267406 -6829933 -9525184 -5478781 -530683 289280 -3569 2913511
$$ packed form
10073b303192J800418j550318o016445k226051N046984N145444n24502k587347
10065c215009m82270j036558l612057j042998N584653O921120J270179k216384
10057B170676Q61490K994543j888419p652582n373380K923686P159130K875151
10049D070295l965011n460248r58846L675677M189728K637461K741527L207769
10041A0138352K2198n395812o444120j337714L375126K510082n50459p51022L27295
10032A893926j191197l675476l085611l04670J050197J279233K860054M501375
10024C327831L002498q05743l347758l607127k495838K15656L423891K795327
10016B508737k776143o562527k695251M046403M948098Q19963k92849K917080
$$ plain form
10008 2913511 6250361 4468082 -1460351 -5252152 -3997759 -502726 1899837 2277854
10000 2277854 370023 -4008352 -9465948 -13565070 -15029050 -13988393 -10938318 -7022060
9992 -7022060 -4137230 -3031911 -2325719 -738911 999150 1557763 706699 -1335521 -4208800
9983 -4208800 -6065167 -4452438 11559 3485481 4172213 4953902 8527386 12747358 13957127
9974 13957127 12805264 12968666 14963373 14979422 10594906 5022109 3818874 7953717 11849315
9965 11849315 9686137 3044571 -531427 2262648 5306943 1588611 -6169712 -9093704
9957 -9093704 -4987271 -804676 -1606988 -3843666 -2274454 2226421 5526036 6438747 6167469
9948 6167469 4927699 2736457 907911 -151652 -2007393 -4665847 -5123823 -2058310
$$ packed form
10008B913511L336850j782279n928433l791801J254393L495033K402563L78017
10000B277854j907831m378375n457596m099122j463980J040657L050075L916258
9992g022060K884830J105319P06192J586808J738061N58613q51064k042220k873279
9983d208800j856367J612729M463997L473922O86732P81689L573484M219972J209769
9974A3957127j151863J63402J994707J6049m384516n572797j203235M134843L895598
9965A1849315k163178o641566l575998K794075L044295l718332p758323k923992
9957i093704M106433M182595q02312k236678J569212M500875L299615R12711k71278
9948F167469j239770k191242j828546j059563j855741k658454m57976L065513
$$ plain form
9940 -2058310 1248291 1468285 -407191 -1961057 -3146636 -4110971 -2836118 1207047 4101601
9931 4101601 2329849 -1709075 -2918971 -448798 1995803 1204013 -2948232 -8161687
9923 -8161687 -10691193 -7966108 -2324674 666916 -525852 -1579939 153128 1280675
9915 1280675 -961307 -2882161 -216854 4463439 5715914 3000647 -930984 -5768599
9907 -5768599 -11770555 -15405105 -13297925 -8139138 -4785145 -3162391 -936592 170612
9899 170612 -2202531 -4387200 -1290434 4658246 7147017 6271451 6564331 6985106 2861763
9890 2861763 -3291265 -3688414 1622982 4253305 1161070 -2028923 -2978929 -6044610 -10793293
9881 -10793293 -9808954 -2944012 -741778 -6152559 -5641250 10619924 30302932 33860550
$$ packed form
9940b058310L306601K19994j875476j553866j185579r64335J274853M043165K894554
9931D101601j771752m038924j209896K470173K444601p91790m152245n213455
9923h161687k529506K725085N641434K991590j192768j054087J733067J127547
9915A280675k241982j920854K665307M680293J252475k715267l931631m837615
9907e768599o001956l634550K107180N158787L353993J622754K225799J107204
9899A70612k373143k184669L096766N948680K488771q75566K92880M20775m123343
9890B861763o153028l97149N311396K630323l092235l189993r50006l065681m748683
9881a0793293R84339O864942K202234n410781N11309J6261174J9683008L557618
$$ plain form
9873 33860550 20724744 7176436 2919325 3437404 3317324 3616943 5140274 5665040
9865 5665040 5929226 9324206 13891071 12937125 5571125 -922569 -1294704 1847923 4232561
9856 4232561 5351476 5668025 4496164 2868200 3246209 4827665 4332014 2338588 2917791
9847 2917791 5906156 6026617 1371966 -3696002 -6021575 -7353920 -8319091 -5789371 449124
9838 449124 5057607 4899078 3301948 3130190 2186517 -639455 -1709505 225992 449833
9829 449833 -2783064 -3357810 1959232 5649402 884843 -6127441 -5476270 406513 1574284
9820 1574284 -2470307 -3189954 1261109 3482300 712546 -745031 2459179 5038342
9812 5038342 3094008 396364 433848 546539 -1547243 -2911164 -1671419 -1299348 -4054969
$$ packed form
9873C3860550j3135806j3548308m257111N18079j20080K99619J523331N24766
9865E665040K64186L394980M566865r53946p366000o493694l72135L142627K384638
9856D232561J118915L16549j171861j627964L78009J581456m95651j993426N79203
9847B917791K988365J20461m654651n067968k325573j332345r65171K529720O238495
9838D49124M608483j58529j597130j71758r43673k825972j070050J935497K23841
9829D49833l232897n74746N317042L690170m764559p012284O51171N882783J167771
9820A574284m044591p19647M451063K221191k769754j457577L204210K579163
9812E038342j944334k697644L7484J12691k093782j363921J239745L72071k755621
$$ plain form
9803 -4054969 -6466846 -5700623 -4191049 -3651992 -1144081 3928172 5738250 1131505 -3381692
9794 -3381692 -834659 5163125 6349059 2781210 1646203 5365399 8867864 8275959
9786 8275959 5668283 4613532 5726289 7140327 6368769 2396092 -1945906 -2089233 1463084
9777 1463084 2414686 -1805761 -4866738 -1269906 3776948 1807597 -5179231 -7371882
9769 -7371882 -2100451 2925024 2024805 -1044951 -508690 3195635 5918199 6119155 5695658
9760 5695658 6890245 9753763 11206020 7432203 -600200 -6189565 -4899210 -800075
9752 -800075 -179688 -2227929 -2253236 -1245198 -3970437 -8794004 -8602220 -2733094 908239
9743 908239 -1955320 -5784478 -4663596 -768640 703249 -924382 -3444935 -5838810
$$ packed form
9803d054969k411877P66223J509574N39057K507911N072253J810078m606745m513197
9794c381692K547033N997784J185934l567849j135007L719196L502465n91905
9786H275959k607676j054751J112757J414038p71558l972677m341998j43327L552317
9777A463084R51602m220447l060977L596832N046854j969351o986828k192651
9769g371882N271431N025475r00219l069756N36261L704325K722564K00956m23497
9760E695658J194587K863518J452257l773817q032403n589365J290355M099135
9752h00075O20387k048241k5307J008038k725239m823567J91784N869126L641333
9743I08239k863559l829158J120882L894956J471889j627631k520553k393875
$$ plain form
9735 -5838810 -7031142 -5403028 -2828055 -4130754 -9173336 -11008053 -6041360 -502753
9727 -502753 -1526414 -6576928 -7931862 -4228609 -983319 -1424114 -3003513 -2808664 -1377677
9718 -1377677 -285340 587248 2125233 4035299 4675757 2670129 -1071612 -3637355 -3696631
9709 -3696631 -3392809 -4153133 -2794541 3464708 9809205 8491300 733284 -3792241 -1046923
9700 -1046923 2085672 -64679 -3101347 -1343996 2362445 2846570 2093263 4276634 6619890
9691 6619890 4321829 629508 2168356 6620984 5332329 -2295147 -7088466 -4076388
9683 -4076388 1168688 2855454 3026628 5032224 6361546 3832116 688824 2057432
9675 2057432 6227132 6645528 1685701 -2964898 -2398820 1252638 2691683 797033 -1005460
$$ packed form
9735e838810j192332J628114K574973j302699n042582j834717M966693N538607
9727e02753j023661n050514j354934L703253L245290m40795j579399J94849J430987
9718a377677J092337Q72588J537985J910066O40458k005628l741741k565743n9276
9709c696631L03822p60324J358592O259249O344497j317905p758016m525525K745318
9700a046923L132595k150351l036668J757351L706441M84125p53307K183371K343256
9691F619890k298061l692321J538848M452628j288655p627476m793319L012078
9683d076388N245076J686766J71174K005596J329322k529430l143292J368608
9675B057432M169700M18396m959827m650599N66078L651458J439045j894650j802493
$$ plain form
9666 -1005460 -841805 -1292295 -4750580 -8726955 -8985494 -5918834 -3808438 -4020216 -3420838
9657 -3420838 -379674 2449089 3321045 4658941 8139170 10958878 10794260 10351327 12335267
9648 12335267 13452785 8849630 91333 -6518593 -7720893 -4750368 549660 5844199
9640 5844199 7086498 3284724 475098 4424109 11148541 11940423 6400986 2122525
9632 2122525 1912251 921691 -2167258 -1317689 5606407 11095551 9193668 4408294 2781143
9623 2781143 1431464 -4683513 -11528311 -11406076 -6116042 -4419534 -7651108 -8127278 -2827106
9614 -2827106 1205727 -1591759 -6849772 -8288340 -7271342 -8188562 -9577106 -7140571
9606 -7140571 -2584899 -1852174 -5303975 -6651986 -2584346 2651919 4376420 3953390 5000247
$$ packed form
9666a005460J63655m50490l458285l976375k58539L066660K110396k11778N99378
9657c420838L041164K828763Q71956J337896L480229K819708j64618m42933J983940
9648A2335267J117518m603155q758297o609926j202300K970525N300028N294539
9640E844199J242299l801774k809626L949011O724432P91882n539437m278461
9632B122525k10274r90560l088949Q49569O924096N489144j901883m785374j627151
9623B781143j349679o114977o844798J22235N290034J696508l231574m76170N300172
9614b827106M032833k797486n258013j438568J016998r17220j388544K436535
9606g140571M555672P32725l451801j348011M067640N236265J724501m23030J046857
$$ plain form
9597 5000247 7166811 7515320 5510207 2981912 792327 -1226328 -2261430 -1385376 550349
9588 550349 2352270 4524461 7405114 9000915 7722042 5533866 4816838 3835802 -253320
9579 -253320 -5193755 -5682198 -1440480 2018945 1314887 -1026722 -1654194 -521897 1196730
9570 1196730 2839723 2975574 1021972 611546 5720247 12784288 13540414 7302838 2544675
9561 2544675 3371203 3332503 -2111265 -6111121 -1665979 5144677 3616780 -4636846 -8363295
9552 -8363295 -4147994 -217962 -2484459 -6792477 -7454185 -5419536 -4566200 -5726325 -7578519
9543 -7578519 -9332729 -10276662 -9756491 -8564455 -7546341 -5358163 -1225824 1328872 -1548697
9534 -1548697 -7202674 -9152534 -6314961 -3638244 -3395967 -2371080 906560 2486970
$$ packed form
9597E000247K166564L48509k005113k528295k189585k018655j035102Q76054J935725
9588E50349J801921K172191K880653J595801j278873k188176p17028r81036m089122
9579b53320m940435m88443M241718L459425p04058k341609o27472J132297J718627
9570A196730J642993J35851j953602m10426N108701P064041P56126o237576m758163
9561B544675Q26528l8700n443768l999856M445142O810656j527897q253626l726449
9552h363295M215301L930032k266497m308018o61708K034649Q53336j160125j852194
9543g578519j754210r43933N20171J192036J018114K188178M132339K554696k877569
9534a548697n653977j949860K837573K676717K42277J024887L277640J580410
$$ plain form
9526 2486970 -605233 -5158841 -5961527 -1880172 4185147 8476556 8435740 4625384 1120036
9517 1120036 984986 1846699 -313143 -4165727 -4954461 -2436644 -725971 -564949 1233624
9508 1233624 4156838 3493962 -793220 -2386831 1388029 5176761 4647537 2860848 3512204
9499 3512204 4620162 3715814 2970225 3952992 3351150 -406530 -2148209 1978384 6878081
9490 6878081 6175711 2780296 3781254 8534386 10548404 8917743 8821310 11251108 11072234
9481 11072234 6539147 2988820 4395984 7258251 6125385 1110508 -3011335 -2690572
9473 -2690572 1183597 4259782 2541807 -3010702 -6478403 -4002945 705981 1425367
9465 1425367 -1676891 -3154648 -1467487 -962531 -3716878 -5465970 -2503748 2162195
$$ packed form
9526B486970l092203m553608q02686M081355O065319M291409m0816l810356l505348
9517A120036j35050Q61713k159842l852584p88734K517817J710673J61022J798573
9508A233624K923214o62876m287182j593611L774860L788732n29224j786689O51356
9499C512204J107958r04348p45589R82767o01842l757680j741679M126593M899697
9490F878081p02370l395415J000958M753132K014018j630661r6433K429798j78874
9481A1072234m533087l550327J407164K862267j132866n014877m121843L20763
9473b690572L874169L076185j717975n552509l467701K475458M708926P19386
9465A425367l102258j477757J687161N04956k754347j749092K962222M665943
$$ plain form
9457 2162195 3236435 340211 -2884476 -4388603 -4751064 -4236878 -2432465 -225935 730264
9448 730264 320514 -449096 -1639226 -3773260 -5372071 -3827949 693242 4545205 4863884
9439 4863884 2779975 1253392 1319317 1921416 2117310 1721863 755884 6781 1119341
9430 1119341 4077414 5744695 3742027 846886 1695003 5301729 5722764 1402161 -1461961
9421 -1461961 2045703 8004247 9626562 6784722 4054161 2345675 -936219 -4980652
9413 -4980652 -5760733 -3167962 -1606756 -2654329 -3045480 -1270838 -372359 -2020837 -3015165
9404 -3015165 -396568 4197040 7795437 9942070 11101927 10883812 9843018 9494684 8909714
9395 8909714 5206998 -1007652 -5049872 -4796445 -3339762 -3091095 -2283857 251271 2245617
$$ packed form
9457B162195J074240k896224l224687j504127l62461N14186J804413K206530R56199
9448G30264m09750p69610j190130k134034j598811J544122M521191L851963L18679
9439D863884k083909j526583O5925O02099J95894l95447r65979p49103J112560
9430A119341K958073J667281k002668k895141Q48117L606726M21035m320603k864122
9421a461961L507664N958544J622315k841840k730561j708486l281894m044433
9413d980652p80081K592771J561206j047573l91151J774642Q98479j648478r94328
9404c015165K618597M593608L598397K146633J159857k18115j040794l48334n84970
9395H909714l702716o214650m042220K53427J456683K48667Q07238K535128J994346
$$ plain form
9386 2245617 3047362 6040991 12127600 15991219 13357386 7335723 3120170 1158583
9378 1158583 222241 1884785 6053172 7101572 1525950 -4602421 -3377531 2951785
9370 2951785 5576811 2242562 -1489707 -2609368 -3764378 -6147291 -7392638 -7483379 -9417283
9361 -9417283 -12634668 -12599668 -8560891 -5180631 -4465076 -2601858 2374039 5931232 3896749
9352 3896749 -1055205 -3992783 -4840080 -6444752 -8397653 -7510031 -3464089 -223659 -1441952
9343 -1441952 -6377794 -10727863 -10910840 -7677109 -5292364 -6437042 -8701989 -7752646 -3227484
9334 -3227484 856590 1453740 -139502 -690496 1104405 3814139 5203911 4627081 3766033
9325 3766033 4283653 4816628 2589133 -1351430 -2017566 2286682 6364933 5243235 1496240
$$ packed form
9386B245617Q01745K993629O086609L863619k633833o021663m215553j961587
9378A158583r36342J662544M168387J048400n575622o128371J224890O329316
9370B951785K625026l334249l732269j119661j155010k382913j245347r0741j933904
9361i417283l217385L5000M038777L380260P15555J863218M975897L557193k034483
9352C896749m951954k937578q47297j604672j952901Q87622M045942L240430j218293
9343a441952m935842m350069j82977L233731K384745j144678k264947R49343M525162
9334c227484M084074N97150j593242n50994J794901K709734J389772n76830q61048
9325C766033N17620N32975k227495l940563o66136M304248M078251j121698l746995
$$ plain form
9316 1496240 1017412 4380831 7676995 9635556 11786786 12727481 8773329 703404 -5858052
9307 -5858052 -7737173 -7038537 -6026125 -4190310 -1618228 -576691 -1872627 -3238111
9299 -3238111 -2877368 -1738892 -1414119 -2411545 -4664886 -7100616 -7291953 -4600040 -2589229
9290 -2589229 -4779113 -9372857 -12132689 -12579914 -12617482 -11296193 -6942471 -2571680 -2372460
9281 -2372460 -4288472 -3414028 -1190944 -2613768 -5379698 -2091996 6154280 9407791
9273 9407791 4473341 -137787 1236655 2887715 -613190 -4631883 -3572391 -649354
9265 -649354 -564863 -542940 2725530 4537424 26783 -5524202 -4056338 2303458 5253032
9256 5253032 3409665 1976447 2568070 2740106 3139900 5960791 8223002 5456130 427708
$$ packed form
9316A496240m78828L363419L296164J958561K151230R40695l954152q069925o561456
9307e858052j879121O98636J012412J835815K572082J041537j295936j365484
9299c238111L60743J138476L24773r97426k253341k435730j91337K691913K010811
9290b589229k189884m593744k759832m47225l7568J321289M353722M370791J99220
9281b372460j916012Q74444K223084j422824k765930L287702Q246276L253511
9273I407791m934450m611128J374442J651060l500905m018693J059492K923037
9265f49354Q4491K1923L268470J811894m510641n550985J467864O359796K949574
9256E253032j843367j433218N91623J72036L99794K820891K262211k766872n028422
$$ plain form
9247 427708 -451349 2177395 2327501 -425509 -1087999 567454 -321870 -3790883 -4470722
9238 -4470722 -1694690 -584290 -1739396 249381 5663113 7063055 1619489 -3422945
9230 -3422945 -2563149 -611263 -3359235 -7434288 -6791834 -3323452 -3090890 -5965674 -6569290
9221 -6569290 -3192928 881935 3567359 5568404 6437169 4257764 -392664 -4066807
9213 -4066807 -4582719 -2897609 -809566 898975 1896637 1706403 192392 -1847418 -2543120
9204 -2543120 -46737 4827233 7766686 5247336 -636684 -4558890 -4897007 -4515452 -4624361
9195 -4624361 -2901079 796080 2188850 -798527 -3751693 -2241650 1033138 416670
9187 416670 -3800660 -5830213 -2905607 1346134 2552990 998279 43122 1351760 3291274
$$ packed form
9247D27708q79057K628744J50106k753010o62490J655453q89324l469013o79839
9238d470722K776032J110400j155106J988777N413732J399942n443566n042434
9230c422945Q59796J951886k747972m075053O42454L468382K32562k874784o03616
9221f569290L376362M074863K685424K001045Q68765k179405m650428l674143
9213d066807n15912J685110K088043J708541R97662j90234j514011k039810o95702
9204b543120K496383M873970K939453k519350n884020l922206l38117L81555j08909
9195d624361J723282L697159J392770k987377k953166J510043L274788o16468
9187D16670m217330k029553K924606M251741J206856j554711r55157J308638J939514
$$ plain form
9178 3291274 3532106 2210625 1751566 3401029 5331869 5613105 5493909 7006662 8508003
9169 8508003 6454476 1375587 -2027401 -1088312 2504809 6662189 10399371 11230979 7065927
9160 7065927 1851346 2553724 8238316 9567777 2874452 -3171342 -628860 5564182
9152 5564182 6175760 1890143 -326665 21958 -1580493 -3677122 -714514 5025232 4713210
9143 4713210 -2620050 -7485036 -4357720 906386 1714513 -89964 -444085 -597151 -2674669
9134 -2674669 -4005366 -1867579 910621 574380 -1371117 -1484361 -74058 1018976 2465207
9125 2465207 4654653 4744828 1382387 -1373194 25766 2465738 1479280 -1012238 -646486
9116 -646486 1017935 -469000 -3328009 -1657349 4054357 6768173 3984186 1122769
$$ packed form
9178C291274K40832j321481m59059J649463J930840K81236j19196J512753J501341
9169H508003k053527n078889l402988R39089L593121M157380L737182Q31608m165052
9160G065927n214581P02378N684592J329461o693325o045794K542482O193042
9152E564182O11578m285617k216808L48623j602451k096629K962608N739746l12022
9143D713210p333260m864986L127316N264106Q08127j804477l54121j53066k077518
9134b674669j330697K137787K778200l36241j945497j13244J410303J093034J446231
9125B465207K189446R0175l362441k755581J398960K439972r86458k491518L65752
9116f46486J664421j486935k859009J670660N711706K713816k783987k861417
$$ plain form
9108 1122769 1892741 2719889 117160 -2755513 -1251856 3749084 8206306 10525950 10882519
9099 10882519 8406965 3368217 -451160 100049 2732085 2928262 550730 -627374
9091 -627374 929711 2750232 2704908 1710551 1408009 1694403 1515142 528128 -655149
9082 -655149 -926095 644448 3663172 6210485 6654102 5180201 2796428 -92848 -2931113
9073 -2931113 -4174118 -3125776 -1713323 -2311090 -4319982 -5078961 -3918642 -3007043 -3896334
9064 -3896334 -5320736 -5196256 -3376125 -1660073 -1824166 -3821032 -5361714 -3808857 602815
9055 602815 4391007 5085235 4607353 6198894 9201586 10100016 8230450 6634084 6777924
9046 6777924 6352168 3653585 426311 -1645609 -3770579 -6835219 -8582681 -7021730
$$ packed form
9108A122769P69972Q27148k602729k872673J503657N000940M457222K319644L56569
9099A0882519k475554n038748l819377N51209K632036J96177k377532j178104
9091f27374J557085J820521m5324r94357l02542K86394j79261r87014j183277
9082f55149k70946J570543L018724K547313M43617j473901k383773k889276k838265
9073b931113j243005J048342J412453n97767k008892p58979J160319R11599q89291
9064c896334j424402J24480J820131J716052j64093j996866j540682J552857M411672
9055F02815L788192O94228m77882J591541L002692Q98430j869566j596366J43840
9046F777924m25756k698583l227274k071920k124970l064640j747462J560951
$$ plain form
9038 -7021730 -3784618 -908573 2620511 7184716 8750537 4333180 -1213703 -774149
9030 -774149 3623880 2817630 -5066357 -10505538 -6508990 925360 2292579 -1299457 -1245472
9021 -1245472 4590358 9365842 8180632 3918977 811326 -1430881 -4357616 -6609042
9013 -6609042 -6395282 -4893804 -4160055 -4064285 -3883902 -4741262 -7744583 -11307845 -12855919
9004 -12855919 -12051168 -10176334 -7502223 -3613440 413461 2490048 2078687 655659
8996 655659 -213228 -10425 1083525 2385166 2889689 2334726 1700153 1861622 2480842
8987 2480842 2976686 3404861 3348424 1519334 -1840845 -3679456 -1613275 2262131 3582987
8978 3582987 1263418 -1635448 -2317638 -1007505 685616 1533505 471900 -2769640 -6013773
$$ packed form
9038g021730L237112K876045L529084M564205J565821m417357n546883M39554
9030g74149M398029q06250p883987n439181L996548P434350J367219l592036N3985
9021a245472N835830M775484j185210m261655l107651k242207k926735k251426
9013f609042K13760J501478P33749R5770J80383q57360l003321l563262j548074
9004a2855919Q04751J874834K674111L888783M026901K076587m11361j423028
8996F55659q68887K02803J093950J301641N04523n54963o34573J61469O19220
8987B480842M95844M28175n6437j829090l360179j838611K066181L875406J320856
8978C582987k319569k898866o82190J310133J693121Q47889j061605l241540l244133
$$ plain form
8969 -6013773 -5923098 -2002924 2523767 4649185 4523405 3761443 2936123 1834607 392796
8960 392796 -1510749 -3379653 -2899627 1704955 7276954 7470948 1113122 -4875144 -4237524
8951 -4237524 298079 1817837 -596659 -2206335 -1380311 -1220268 -2336132 -1127500 2647052
8942 2647052 3308064 -1877117 -6974057 -5667670 -720954 938494 -845788 -599996 2478754
8933 2478754 3238327 13947 -2254161 -663830 734835 -1462997 -3351910 -12229
8925 -12229 5660089 6488530 1121890 -5204383 -8828500 -10788745 -11800947 -9860499 -4633858
8916 -4633858 118143 982651 -999898 -2609597 -2593559 -1882001 -1557959 -2146984 -3595991
8907 -3595991 -5053292 -5873312 -6882176 -8815171 -9937790 -8198371 -5641022 -6659474
$$ packed form
8969f013773R0675L920174M526691K125418j25780p61962q25320j101516j441811
8960C92796j903545j868904M80026M604582N571999J93994o357826n988266O37620
8951d237524M535603J519758k414496j609676Q26024J60043j115864J208632L774552
8942B647052O61012n185181n096940J306387M946716J659448j784282K45792L078750
8933B478754P59573l224380k268108J590331J398665k197832j888913L339681
8925a2229N672318Q28441n366640o326273l624117j960245j012202J940448N226641
8916d633858M752001Q64508j982549j609699J6038P11558L24042n89025j449007
8907c595991j457301q20020j008864j932995j122619J739419K557349j018452
$$ plain form
8899 -6659474 -10937891 -12636195 -8823709 -4336301 -4756276 -8289198 -9115670 -6190274 -3675594
8890 -3675594 -3901441 -4796552 -4314426 -3354289 -3625871 -5465241 -8133985 -10191304 -10010579
8881 -10010579 -8008148 -7200027 -8978288 -9977025 -6682423 -1712851 -998760 -5222282 -8826921
8872 -8826921 -7940301 -4727871 -2880113 -3059215 -4334437 -6295328 -7892120 -7365204 -5019418
8863 -5019418 -3316039 -3042157 -2350313 -577358 328798 -664517 -2195527 -3666430 -5964221
8854 -5964221 -7686046 -5278594 642452 3711935 73242 -5596622 -6290063 -1817460
8846 -1817460 2400943 3272014 2467226 2371402 3369245 4445592 3921661 756766 -3002286
8837 -3002286 -3250969 520193 3389942 1638160 -1739523 -1615455 2021079 5500439 7677803
$$ packed form
8899f659474m278417j698304L812486M487408m19975l532922q26472K925396K514680
8890c675594k25847q95111M82126R60137k71582j839370k668744k057319J80725
8881a0010579K002431Q08121j778261r98737L294602M969572P14091m223522l604639
8872h826921Q86620L212430J847758j79102j275222j960891j596792N26916K345786
8863e019418J703379K73882O91844J772955R06156r93315j531010j470903k297791
8854e964221j721825K407452N921046L069483l638693n669864o93441M472603
8846a817460M218403Q71071q04788r5824R97843J076347n23931l164895l759052
8837c002286k48683L771162K869749j751782l377683J24068L636534L479360K177364
$$ plain form
8828 7677803 9990382 11897135 10973645 7002258 2320464 -1169321 -2430087 -410971
8820 -410971 4045260 7424285 7990089 8428052 10430309 10288886 5023078 -777721 -937745
8811 -937745 2315143 1902508 -2645377 -5574576 -5350369 -5470868 -5204814 186922 8500672
8802 8500672 10460408 3987909 -1459980 435112 3679946 1783967 -777074 2461912
8794 2461912 7389825 6071598 695230 -41160 4561719 6813125 3616338 136791
8786 136791 245740 2015913 3797321 6767348 9643729 8245182 2915212 -83112 2368539
8777 2368539 5374413 3464620 -2015295 -6403943 -8223632 -8302615 -6026459 -890160 4322745
8768 4322745 5948985 4233318 2907570 4501862 7898907 9855729 7728241 1725135
$$ packed form
8828G677803K312579J906753r23490l971387m681794l489785j260766K019116
8820d10971M456231L379025N65804M37963K002257j41423n265808n800799j60024
8811i37745L252888m12635m547885k929199K24207j20499K66054N391736Q313750
8802H500672J959736o472499n447889J895092L244834j895979k561041L238986
8794B461912M927913j318227n376368p36390M602879K251406l196787l479547
8786A36791J08949J770173J781408K970027K876381j398547n329970k998324K451651
8777B368539L005874j909793n479915m388648j819689p8983K276156N136299N212905
8768D322745J626240j715667j325748J594292L397045J956822k127488o003106
$$ plain form
8760 1725135 -4562279 -7076079 -5343729 -2070818 1367496 6157694 11938866 15102800
8752 15102800 13604106 10458177 9316333 8974314 5995932 1070060 -1562481 -504488
8744 -504488 1182674 1210789 1068282 2567351 4746872 6091933 7117484 8452432 8468668
8735 8468668 5478299 975952 -1955357 -2743161 -3318344 -4421664 -4541619 -2699566 140515
8726 140515 2878007 5075447 5317904 1606962 -4955645 -9287101 -7463591 -1251753 4435610
8717 4435610 6916186 6422355 3541424 -683835 -3468634 -2943710 -1576192 -3183564 -6837558
8708 -6837558 -7852254 -4943349 -1833141 -991366 -767328 -330423 -2091462 -6331178 -8577207
8699 -8577207 -6348104 -3874186 -5227250 -6982106 -3746558 2339756 4668185 2764209
$$ packed form
8760A725135o287414k513800J732350L272911L438314M790198N781172L163934
8752A5102800j498694l145929j141844l42019k978382m925872k632541J057993
8744e04488J687162K8115j42507J499069K179521J345061J025551J334948J6236
8735H468668k990369m502347k931309p87804n75183j103320j19955J842053K840081
8726A40515K737492K197440K42457l710942o562607m331456J823510O211838N687363
8717D435610K480576m93831k880931m225259k784799N24924J367518j607372l653994
8708f837558j014696K908905L110208Q41775K24038M36905j761039m239716k246029
8699h577207K229103K473918j353064j754856L235548O086314K328429j903976
$$ plain form
8691 2764209 2323987 5107993 6336523 3305569 -261691 -696106 575736 924507 311882
8682 311882 -1185636 -4555240 -7912449 -6501860 166639 5987702 6520621 4802727 5088619
8673 5088619 5863011 4097886 1910562 3022016 6137173 7948564 9436837 12434178
8665 12434178 12939416 6054738 -3846615 -6671737 -782253 4753870 3700601 223667
8657 223667 -58703 1323283 850420 239470 2554205 5721805 5826573 3489738 1492802
8648 1492802 -933111 -5633607 -9642179 -8053095 -2013342 1883400 400158 -3024019
8640 -3024019 -4264514 -3281665 -1782472 -66665 1955309 3200439 2493714 -101805 -3340735
8631 -3340735 -4946297 -2615570 2987860 7429611 7560065 6097641 7446384 10127897
$$ packed form
8691B764209m40222K784006J228530l030954l567260m34415J271842L48771o12625
8682C11882j497518l369604l357209J410589O668499N821063N32919j717894K85892
8673E088619P74392j765125k187324J111454L115157J811391J488273K997341
8665A2434178N05238o884678r901353k825122N889484N536123j053269l476934
8657B23667k82370J381986m72863o10950K314735L167600J04768k336835j996936
8648A492802k425913m700496m008572J589084O039753L896742j483242l424177
8640c024019j240495R82849J499193J715807K021974J245130p06725k595519l238930
8631c340735j605562K330727N603430M441751J30454j462424J348743K681513
$$ plain form
8623 10127897 8463552 1866859 -3218603 -2356784 1193781 2661819 2856686 5034433
8615 5034433 8340389 9315427 8050898 8097290 10651988 12695480 11376488 7592654 4580251
8606 4580251 4482210 6485162 7497485 5231641 1284121 -138866 2553113 6224400 7448343
8597 7448343 6803054 6668816 7008254 6277425 4844827 4171427 3675210 1832110 -285377
8588 -285377 -167732 1558961 1340696 -1957109 -5172615 -5305871 -3053850 -826660 138437
8579 138437 -546486 -3043833 -5891861 -6163980 -3062494 200201 93663 -2822949 -5072058
8570 -5072058 -4825869 -3197859 -1599268 -234653 539764 -354287 -2865961 -5145891 -6228842
8561 -6228842 -7904152 -11647055 -14634837 -12169390 -4656758 1360384 1238062 -1791287
$$ packed form
8623A0127897j664345o596693n085462Q61819L550565J468038J94867K177747
8615E034433L305956R75038j264529M6392K554698K043492j318992l783834l012403
8606D580251r8041K002952J012323k265844l947520j422987K691979L671287J223943
8597G448343o45289j34238L39438p30829j432598o73400m96217j843100k117487
8588b85377J17645J726693k18265l297805l215506j33256K252021K227190R65097
8579A38437o84923k497347k848028k72119L101486L262695j06538k916612k249109
8570e072058K46189J628010J598591J364615P74417q94051k511674k279930j082951
8561f228842j675310l742903k987782K465447P512632O017142j22322l029349
$$ plain form
8553 -1791287 -1829387 1274852 3210546 2866840 2795717 2570663 -1409349 -7929094 -9689517
8544 -9689517 -3638684 3339329 3793097 -224831 -1940764 -466053 -203678 -2566826 -4905955
8535 -4905955 -6035919 -6791291 -6442707 -4322331 -3444387 -6347376 -8973718 -5772327 262477
8526 262477 800488 -4489956 -6536055 -579784 7066708 9041374 6011758 1951566 -2318478
8517 -2318478 -6101413 -5987494 -1695854 738071 -2640311 -7011475 -6401247 -3363033 -4295503
8508 -4295503 -8706816 -10436984 -7491533 -3739964 -1845076 -776343 17241 -392294 -1196431
8499 -1196431 -588114 185929 -1940777 -6430376 -9266242 -8788874 -7357091 -6787285 -6052519
8490 -6052519 -4307381 -2759388 -2459373 -2768899 -2630412 -1315471 1869113 6241314 8592343
$$ packed form
8553a791287l8100L104239J935694l43706p1123k25054l980012o519745j760423
8544i689517O050833O978013M53768m017928j715933J474711K62375k363148k339129
8535d905955j129964p55372L48584K120376Q77944k902989k626342L201391O034804
8526B62477N38011n290444k046099N956271P646492J974666l029616m060192m270044
8517b318478l782935J13919M291640K433925l378382m371164O10228L038214r32470
8508d295503m411313j730168K945451L751569J894888J068733P93584m09535q04137
8499a196431O08317P74043k126706m489599k835866M77368J431783N69806P34766
8490f052519J745138J547993L00015l09526J38487J314941L184584M372201K351029
$$ plain form
8481 8592343 6165524 595426 -3700003 -4658189 -3486475 -1238995 2098919 5255252
8473 5255252 5986089 4467595 3456666 4189277 4601207 2685580 -279631 -1008703 2123267
8464 2123267 7020626 9158421 5756718 -721847 -4694685 -3853182 -1202269 416416
8456 416416 2427896 6484006 9772718 8588658 4313895 1419784 1161460 1572479 2056750
8447 2056750 3202620 3370047 661370 -2450091 -1664400 2370388 4959993 4625969 3936876
8438 3936876 3312631 339592 -3874142 -4144138 812782 5436147 4944302 1148331 -1670773
8429 -1670773 -2084850 -478165 2601106 4589106 2110589 -3268596 -5201242 -1447155
8421 -1447155 2192521 329094 -4355528 -6121617 -4538780 -2941865 -1969298 116937
$$ packed form
8481H592343k426819n570098m295429r58186J171714K247480L337914L156333
8473E255252P30837j518494j010929P32611M11930j915627k965211p29072L131970
8464B123267M897359K137795l401703o478565l972838Q41503K650913J618685
8456D16416K011480M056110L288712j184060m274763k894111k58324M11019M84271
8447B056750J145870J67427k708677l111461P85691M034788K589605l34024o89093
8438C936876o24245k973039m213734k69996M956920M623365m91845l795971k819104
8429a670773m14077J606685L079271J988000k478517n379185j932646L754087
8421a447155L639676j863427m684622j766089J582837J596915R72567K086235
$$ plain form
8413 116937 2872496 4101496 3367060 1585170 -899892 -2794425 -1297510 3402727 6325250
8404 6325250 4487103 1948874 3125353 4863679 1818652 -3224450 -2605486 3520786
8396 3520786 6342882 1599495 -4263780 -4250507 -473067 719925 -1687894 -3646380 -2845570
8387 -2845570 -761355 427372 -499009 -3862632 -7900427 -8824324 -4927387 290590 1716404
8378 1716404 -1319418 -4948237 -6087256 -5282473 -4384225 -3996069 -3871721 -3787033 -3074457
8369 -3074457 -947487 1565273 1493231 -2522341 -7351915 -8152968 -4145291 326866 1213459
8360 1213459 -688117 -2097062 -2427676 -3970824 -7479585 -10432881 -10216059 -6720812 -1141168
8351 -1141168 5380943 10799662 12340281 9524840 5266249 2232984 -42830 -2559999
$$ packed form
8413A16937K755559J229000p34436j781890k485062j894533J496915M700237K922523
8404F325250j838147k538229J176479J738326l045027n043102O18964O126272
8396C520786K822096m743387n863275J3273L777440J192992k407819j958486Q00810
8387b845570K084215J188727r26381l363623m037795r23897L896937N217977J425814
8378A716404l035822l628819j139019Q04783Q98248L88156J24348Q4688P12576
8369c074457K126970K512760p2042m015572m829574q01053M007677M472157Q86593
8360A213459j901576j408945l30614j543148l508761k953296K16822L495247N579644
8351a141168O522111N418719J540619k815441m258591l033265k275814k517169
$$ plain form
8343 -2559999 -3575292 -933407 3695158 6257292 5610197 4355145 4368931 4422852 2906118
8334 2906118 519395 -778065 6628 2314448 4460202 4579439 2547736 862296 2066528
8325 2066528 5438693 7835805 7501079 5199538 2039926 -1461457 -4209574 -4873124 -3716085
8316 -3716085 -2112209 -478161 971822 163358 -4542236 -10042588 -10808056 -6562716 -3348292
8307 -3348292 -5109645 -8519968 -8791691 -6442456 -4752400 -4215369 -3742503 -4234698 -6217903
8298 -6217903 -6531155 -2631448 1744753 913423 -3933391 -6202739 -3805945 -1331430 -1724083
8289 -1724083 -2218469 -572666 495915 -1715984 -5038923 -5939619 -4514600 -3139684 -3004344
8280 -3004344 -4063867 -5410881 -4351749 848435 5967991 3987541 -4323877 -9171494
$$ packed form
8343b559999j015293K641885M628565K562134o47095j255052J3786N3921j516734
8334B906118k386723j297460P84693K307820K145754J19237k031703j685440J204232
8325B066528L372165K397112l34726k301541l159612l501383k748117o63550J157039
8316c716085J603876J634048J449983q08464m705594n500352p65468M245340L214424
8307c348292j761353l410323k71723K349235J690056N37031M72866m92195j983205
8298f217903l13252L899707M376201q31330m846814k269348K396794K474515l92653
8289a724083m94386J645803J068581k211899l322939r00696J425019J374916J35340
8280c004344j059523j347014J059132N200184N119556j980450q311418m847617
$$ plain form
8272 -9171494 -5043062 1114604 639950 -4027181 -4811451 -1425408 -355681 -3306700 -5881505
8263 -5881505 -6519426 -7821060 -9269560 -7354525 -3427597 -2977158 -6151125 -7393705 -5581868
8254 -5581868 -5463935 -7275918 -4955226 1920872 4705628 -563104 -5776732 -3911186
8246 -3911186 -354751 -2631995 -7072421 -6074639 -2355480 -4414871 -11574415 -15063272
8238 -15063272 -12349644 -9479508 -9282155 -7571877 -2539672 1237282 707447 -1318683
8230 -1318683 -2363238 -4120625 -7362016 -9009268 -7330633 -5022767 -4260387 -3105867
8222 -3105867 415339 4590988 7102309 8590926 10568383 12158146 11078901 6537089
8214 6537089 318575 -3905465 -3084853 1499025 4450719 2726590 -184918 142043 2090978
$$ packed form
8272i171494M128432O157666m74654m667131p84270L386043J069727k951019k574805
8263e881505o37921j301634j448500J915035L926928M50439l173967j242580J811837
8254e581868J17933j811983K320692O876098K784756n268732n213628J865546
8246c911186L556435k277244m440426R97782L719159k059391p159544l488857
8238a5063272K713628K870136J97353J710278N032205L776954n29835k026130
8230a318683j044555j757387l241391j647252J678635K307866P62380J154520
8222c105867L521206M175649K511321J488617J977457J589763j079245m541812
8214F537089o218514m224040Q20612M583878K951694j724129k911508L26961J948935
$$ plain form
8205 2090978 1391526 -1238247 -2012257 -1574684 -3358320 -5577213 -2874384 3823689 7211624
8196 7211624 4728689 2073354 3593556 6505510 7115353 5776243 3067028 -1976282
8188 -1976282 -7009424 -6789458 -1526233 2119823 1383923 1182902 4125683 5152614 1060957
8179 1060957 -2820856 -1516131 1644246 2465866 3715713 8029214 10379715 6450464
8171 6450464 1970334 3789422 7181174 3066185 -6071208 -9204830 -3741406 1990700
8163 1990700 2823685 2271318 2927624 1803485 -2071852 -4320061 -2779517 -918174 -658119
8154 -658119 1053937 5074845 6336570 1905103 -2671234 -303642 7706352 13296494
8146 13296494 11461879 5077241 692227 1474914 4217629 3352595 -1653963 -4997028
$$ packed form
8205B090978o99452k629773p74010M37573j783636k218893K702829O698073L387935
8196G211624k482935k655335J520202K911954O09843j339110k709215n043310
8188a976282n033142K19966N263225L646056p35900k01021K942781J026931m091657
8179A060957l881813J304725L160377Q21620J249847M313501K350501l929251
8171F450464m480130J819088L391752m114989r137393l133622N463424N732106
8163A990700Q32985n52367O56306j124139l875337k248209J540544J861343K60055
8154f58119J712056M020908J261725m431467m576337K367592Q009994N590142
8146A3296494j834615o384638m385014P82687K742715q65034n006558l343065
$$ plain form
8138 -4997028 -2733517 784607 -879003 -6161707 -7877800 -4509148 -1921842 -3288732
8130 -3288732 -4702445 -3085202 -1600146 -3445309 -5903292 -5120477 -2600067 -2231078 -3783306
8121 -3783306 -3852391 -1517188 831499 1448493 1078111 1245792 2631089 4768210 6296505
8112 6296505 6078751 4429760 2355522 -58086 -2960580 -5260680 -6157366 -7133421 -9242510
8103 -9242510 -9467043 -4207637 3827216 7368623 4198676 -4839 -75541 2385608 3488018
8094 3488018 2833933 1577833 -831472 -3991596 -4354116 -147667 4279169 3493433 -1636500
8085 -1636500 -5687329 -6014862 -4198885 -1759179 929029 2157096 52495 -3370980
8077 -3370980 -3528374 206178 2842291 422030 -4521465 -6523443 -4319827 -1573285
$$ packed form
8138d997028K263511L518124j663610n282704j716093L368652K587306j366890
8130c288732j413713J617243J485056j845163k457983P82815K520410L68989j552228
8121c783306o9085K335203K348687O16994l70382J67681J385297K137121J528295
8112F296505k17754j648991k074238k413608k902494k300100q96686r76055k109089
8103i242510k24533N259406Q034853L541407l169947m203515p0702K461149J102410
8094C488018o54085j256100k409305l160124l62520M206449M426836p85736n129933
8085a636500m050829l27533J815977K439706K688208J228067k104601l423475
8077c370980j57394L734552K636113k420261m943495k001978K203616K746542
$$ plain form
8069 -1573285 -992795 -635493 2649843 7910812 10634733 8500773 4276350 1971526 2067210
8060 2067210 2273299 1367526 -113903 -1947584 -4343998 -6526801 -7588481 -8062665 -8099260
8051 -8099260 -5317680 1773964 8979633 9802622 4135998 -1213637 -1892997 -880886 -1908182
8042 -1908182 -3298709 -2133146 -127879 -454950 -1687899 -116596 3583312 5005563
8034 5005563 2788563 409144 1063761 4118518 6746445 6355682 1811056 -4843615 -8368672
8025 -8368672 -5224065 1668415 6049568 5852804 4259593 3625232 2713530 783075 -108353
8016 -108353 884798 801075 -2727927 -7239608 -8788780 -7407613 -5855976 -4671482 -2505489
8007 -2505489 -622119 -2485129 -7870791 -11297738 -8589919 -2481102 739340 -1442815
$$ packed form
8069a573285N80490L57302L285336N260969K723921k133960m224423k304824R5684
8060B067210K06089r05773j481429j833681k396414k182803j061680m74184l6595
8051h099260K781580P091644P205669Q22989n666624n349635o79360J012111j027296
8042a908182j390527J165563K005267l27071j232949J571303L699908J422251
8034E005563k217000k379419O54617L054757K627927l90763m544626o654671l525057
8025h368672L144607O892480M381153j96764j593211o34361r11702j930455q91428
8016a08353R93151q3723l529002m511681j549172J381167J551637J184494K165993
8007b505489J883370j863010n385662l426947K707819O108817L220442k182155
$$ plain form
7999 -1442815 -5989793 -8611388 -7624474 -4384833 -2011687 -3071944 -6551137 -7864152
7991 -7864152 -4094415 1614902 3711545 1670843 209252 1882873 3572325 1843558
7983 1843558 -1963530 -4459873 -5019075 -5131862 -5426147 -6101661 -8026938 -10435054 -9794726
7974 -9794726 -4462709 1441041 2712232 271136 -418088 2658390 5945702 6195670 4374016
7965 4374016 2933450 2580680 2843207 3304225 3377879 2625174 1406301 -227360 -3183749
7956 -3183749 -6812191 -7733952 -4524344 -1474295 -3158685 -7108009 -7633416 -5571346 -6832902
7947 -6832902 -11080622 -10464438 -2425240 4572806 3178307 -2097134 -2893503 51196 140051
7938 140051 -2726770 -2255649 2880262 6745493 6470148 6825752 11170146 14440207 10378449
$$ packed form
7999a442815m546978k621595R86914L239641K373146j060257l479193j313015
7991g864152L769737N709317K096643k040702j461591J673621J689452j728767
7983A843558l807088k496343n59202j12787k94285o75514j925277k408116O40328
7974i794726N332017N903750J271191k441096o89224L076478L287312K49968j821654
7965D374016j440566l52770K62527M61018P3654p52705j218873j633661k956389
7956c183749l628442r21761L209608L050049j684390l949324n25407K062070j261556
7947f832902m247720O16184Q039198O998046j394499n275441p96369K944699Q8855
7938A40051k866821M71121N135911L865231k75345L55604M344394L270061m061758
$$ plain form
7929 10378449 1596279 -3466208 -2021931 222259 -1694815 -4753157 -2941857 3193448
7921 3193448 6246496 1453989 -7037709 -11499354 -9832403 -6257361 -3970477 -1359655
7913 -1359655 3408612 7799925 7867541 4021197 889726 1818884 5668997 9060758 9984772
7904 9984772 8730856 6521917 4111216 1511095 -1310837 -3794561 -5171222 -5326158
7896 -5326158 -4696217 -3333719 -809833 2769731 6337952 8782324 9839988 9828312 8801968
7887 8801968 6301608 2171706 -2235805 -4322900 -2808594 297307 1903755 1872913 2528690
7878 2528690 3941970 3053652 -1044772 -4505812 -4034176 -1578049 -382944 489236 3325679
$$ packed form
7929A0378449q782170n062487J444277K244190j917074l058342J811300O135305
7921C193448L053048m792507q491698m461645J666951L575042K286884K610822
7913a359655M768267M391313O7616l846344l131471R29158L850113L391761R24014
7904I984772j253916k208939k410701k600121k821932k483724j376661j54936
7896e326158O29941J362498K523886L579564L568221K444372J057664j1676j026344
7887H801968k500360m129902m407511k087095J514306L105901J606448l0842O55777
7878B528690J413280q88318m098424l461040M71636K456127J195105Q72180K836443
$$ [...]
##END NTUPLES=NMR SPECTRUM
##END=
