##TITLE=31Pdec_PR193_rmp
 D2O, 24 sc
 20.10.2020
##JCAMPDX= 6.0         $$ Bruker NMR JCAMP-DX V2.0
##DATA TYPE= NMR SPECTRUM
##DATA CLASS= NTUPLES
##ORIGIN= UXNMR, Bruker Analytische Messtechnik GmbH
##OWNER= root
$$ XWIN-NMR		Version 3.5
$$ Tue Oct 20 10:51:04 2020 Russian Standard Time (UT+4h)  she@DPX200
##.OBSERVE FREQUENCY= 81.013821
##.OBSERVE NUCLEUS= ^31P
##.ACQUISITION MODE= SIMULTANEOUS
##.ACQUISITION SCHEME= undefined
##.AVERAGES= 24
##.DIGITISER RES= 17
##SPECTROMETER/DATA SYSTEM= spect
##.PULSE SEQUENCE= zgpg30
##.SOLVENT NAME= CDCl3
##.SHIFT REFERENCE= (INTERNAL, CDCl3, 0, 182.463)
##AUDIT TRAIL= $$ (NUMBER, WHEN, WHO, WHERE, WHAT)
$$ ##TITLE= Audit trail, XWIN-NMR		Version 3.5
$$ ##JCAMPDX= 5.01
$$ ##ORIGIN= Bruker BioSpin GmbH
$$ ##OWNER= she
$$ F:/spectra/data/she/nmr/P31/1/pdata/1/auditp.txt
$$ ##AUDIT TRAIL=  $$ (NUMBER, WHEN, WHO, WHERE, WHAT)
(   1,<2020-10-20 10:49:56.23 +0400>,<she>,<DPX200>,
      <created by zg, POWCHK disabled, PULCHK disabled
       configuration hash MD5:
       00 E9 B6 7A A2 85 ED C7 34 08 36 98 17 FE 4E 26
       data hash MD5: 32K
       4A 86 07 BF BD 93 E4 03 77 45 24 3A B9 1A 4F 06>)
(   2,<2020-10-20 10:49:58.43 +0400>,<she>,<DPX200>,
      <Start of raw data processing
       efp BC_mod = 2 LB = 1 FT_mod = 6 PKNL = 1 PHC0 = -2804.838 PHC1 = 161.4014 SI = 64K 
       data hash MD5: 64K
       3A D9 2B 62 E6 01 56 E0 81 04 2D FE 69 B7 2C 05>)
(   3,<2020-10-20 10:50:13.92 +0400>,<she>,<DPX200>,
      <pk PHC0 = 0.472571 PHC1 = 0 
       data hash MD5: 64K
       2D 51 65 F1 51 32 2B BB 73 AE B1 D1 EB 37 52 90>)
(   4,<2020-10-20 10:50:28.48 +0400>,<she>,<DPX200>,
      <pk PHC0 = -3.4 PHC1 = 0 
       data hash MD5: 64K
       A3 8A 01 27 97 46 37 FA 88 E6 9C 72 72 EB 4B 1F>)
(   5,<2020-10-20 10:50:41.14 +0400>,<she>,<DPX200>,
      <abs ABSG = 5 
       data hash MD5: 64K
       4B 4E 9D 67 E8 17 0D F6 CA FA B2 E8 45 2F 04 50>)
$$ ##END=
$$ 
$$ hash MD5
$$ 87 1F 9A 08 25 9C AE 1A 04 93 13 60 52 22 E4 41
##$RELAX= 
##$RELAX= 
##$RELAX= 
##$RELAX= 
##$RELAX= 
##$RELAX= 
##$RELAX= 
##$RELAX= 
$$ Bruker specific parameters
$$ --------------------------
##$DU= <F:/spectra>
##$EXPNO= 1
##$NAME= <P31>
##$PROCNO= 1
##$TYPE= <nmr>
##$USER= <she>
##$AMP= (0..31)
100 100 100 100 100 100 100 100 100 100 100 100 100 100 100 100 100 100 
100 100 100 100 100 100 100 100 100 100 100 100 100 100 
##$AQSEQ= 0
##$AQ_mod= 1
##$AUNM= <au_zg>
##$AUTOPOS= <>
##$BF1= 81.014009
##$BF2= 200.13
##$BF3= 200.13
##$BF4= 200.13
##$BF5= 200.13
##$BF6= 200.13
##$BF7= 200.13
##$BF8= 200.13
##$BYTORDA= 1
##$CFDGTYP= 0
##$CFRGTYP= 5
##$CHEMSTR= <none>
##$CNST= (0..31)
1 1 145 1 1 1 1 1 1 1 1 1 1 1 1 1 1 1 1 1 1 1 1 1 1 1 1 1 1 1 1 1 
##$CPDPRG= <waltz16>
##$CPDPRG1= <>
##$CPDPRG2= <waltz16>
##$CPDPRG3= <>
##$CPDPRG4= <mlev>
##$CPDPRG5= <mlev>
##$CPDPRG6= <mlev>
##$CPDPRG7= <mlev>
##$CPDPRG8= <mlev>
##$CPDPRGB= <>
##$CPDPRGT= <>
##$D= (0..31)
0 1 0 0 0 0 0 0 0 0 0 0.03 2e-05 3e-06 0 0 0 0 0 0 0 0 0 0 0 0 0 0 0 0 
0 0 
$$ [...]
##$SUBNAM3= <"">
##$SUBNAM4= <"">
##$SUBNAM5= <"">
##$SUBNAM6= <"">
##$SUBNAM7= <"">
##$SUBNAM8= <"">
##$SUBNAM9= <"">
##$SW= 369.568048894756
##$SWIBOX= (0..15)
0 1 3 0 0 0 0 0 0 0 0 0 0 0 0 0 
##$SW_h= 29940.119760479
##$TD= 32768
##$TD0= 1
##$TE= 0
##$TE2= 300
##$TE3= 300
##$TEG= 300
##$TL= (0..7)
0 120 53 12 22 120 120 120 
##$TP= (0..7)
150 150 150 150 150 150 150 150 
##$TP07= 0
##$TPNAME0= <>
##$TPNAME1= <>
##$TPNAME2= <>
##$TPNAME3= <>
##$TPNAME4= <>
##$TPNAME5= <>
##$TPNAME6= <>
##$TPNAME7= <>
##$TPOAL= (0..7)
0.5 0.5 0.5 0.5 0.5 0.5 0.5 0.5 
##$TPOFFS= (0..7)
0 0 0 0 0 0 0 0 
##$TUNHIN= 0
##$TUNHOUT= 0
##$TUNXOUT= 0
##$USERA1= <user>
##$USERA2= <user>
##$USERA3= <user>
##$USERA4= <user>
##$USERA5= <user>
##$V9= 5
##$VALIST= <valist>
##$VCLIST= <CCCCCCCCCCCCCCC>
##$VD= 0
##$VDLIST= <DDDDDDDDDDDDDDD>
##$VPLIST= <PPPPPPPPPPPPPPP>
##$VTLIST= <TTTTTTTTTTTTTTT>
##$WBST= 1024
##$WBSW= 4
##$XGAIN= (0..3)
0 0 0 0 
##$XL= 0
##$YL= 0
##$YMAX_a= 23324
##$YMIN_a= -29702
##$ZGOPTNS= <>
##$ZL1= 120
##$ZL2= 120
##$ZL3= 120
##$ZL4= 120
##$ABSF1= 182.463
##$ABSF2= -187.1042
##$ABSG= 5
##$ABSL= 3
##$ALPHA= 0
##$AQORDER= 0
##$ASSFAC= 0
##$ASSFACI= 0
##$ASSFACX= 0
##$ASSWID= 0
##$AUNMP= <proc_1d>
##$AZFE= 0.1
##$AZFW= 0.5
##$BCFW= 0
##$BC_mod= 2
##$BYTORDP= 0
##$COROFFS= 0
##$CY= -3
##$DATMOD= 1
##$DC= 0
##$DFILT= <>
##$DTYPP= 0
##$F1P= 0
##$F2P= 0
##$FCOR= 1
##$FTSIZE= 65536
##$FT_mod= 6
##$GAMMA= 0
##$GB= 0
##$INTBC= 1
##$INTSCL= 5.30512e-09
##$ISEN= 30
##$LB= 1
##$LEV0= 0
##$LPBIN= 0
##$MAXI= 10000
##$MC2= 0
##$MEAN= 0
##$ME_mod= 0
##$MI= 50
##$NCOEF= 0
##$NC_proc= -4
##$NLEV= 6
##$NOISF1= 182.463
##$NOISF2= 159.3651
##$NSP= 0
##$NTH_PI= 0
##$NZP= 0
##$OFFSET= 182.463
##$PC= 4
##$PHC0= -2807.765
##$PHC1= 161.4014
##$PH_mod= 1
##$PKNL= yes
##$PPARMOD= 0
##$PSCAL= 0
##$PSIGN= 0
##$REVERSE= no
##$SF= 81.0140089999434
##$SI= 65536
##$SIGF1= 159.3651
##$SIGF2= -187.1042
##$SINO= 113.3802
##$SIOLD= 16384
##$SREGLST= <1H.CDCl3>
##$SSB= 0
##$STSI= 65536
##$STSR= 0
##$SW_p= 29940.119760479
##$SYMM= 0
##$S_DEV= 0
##$TDeff= 32768
##$TDoff= 0
##$TI= <>
##$TILT= no
##$TM1= 0
##$TM2= 0
##$TOPLEV= 0
##$USERP1= <user>
##$USERP2= <user>
##$USERP3= <user>
##$USERP4= <user>
##$USERP5= <user>
##$WDW= 1
##$XDIM= 65536
##$YMAX_p= 396078230
##$YMIN_p= -4460946
$$ End of Bruker specific parameters
$$ ---------------------------------
##NTUPLES= NMR SPECTRUM
##VAR_NAME=  FREQUENCY,     SPECTRUM/REAL,   SPECTRUM/IMAG
##SYMBOL=    X,             R,               I
##VAR_TYPE=  INDEPENDENT,   DEPENDENT,       DEPENDENT
##VAR_FORM=  AFFN,          ASDF,            ASDF
##VAR_DIM=   65536,         65536,           65536
##UNITS=     HZ,            ARBITRARY UNITS, ARBITRARY UNITS
##FACTOR=    0.456856943014862, 1,           1
##FIRST=     14782.0589164792, 0,            0
##LAST=      -15158.0608439998, 0,           0
##MIN=       -15158.0608439998, -4460946,    0
##MAX=       14782.0589164792, 396078230,    0
$$ Real data points
##PAGE= N=1
##DATA TABLE= (X++(R..R)), XYDATA
$$ [...]
39215 646808 539900 275538 23382 -108811 -247997 -548110 -891474 -987999 -749578 -411644
39205 -411644 -283812 -466804 -760947 -787207 -334082 302845 515444 110993 -352237 -239507
39195 -239507 327065 691148 612214 511066 706038 892083 646863 123073 -116528 170856
39185 170856 628652 751756 452848 134548 237225 740719 1180170 1191309 888179 555689
39175 555689 174988 -412867 -991196 -1077249 -609454 -97338 58302 -7048 -52645 -144954
39165 -144954 -333756 -330696 57668 488547 557328 472977 715202 1168011 1211386 685701
39155 685701 161391 99412 284309 331255 263507 243652 143882 -180037 -471147 -393889 -107645
39144 -107645 -60255 -292661 -410849 -257172 -144520 -287660 -403153 -109434 551703 1207323
39134 1207323 1520337 1265066 349409 -889399 -1648338 -1386996 -532935 -25354 -160295
39125 -160295 -361730 -172840 96869 18234 -182124 -28776 328352 275182 -304676 -811105
39115 -811105 -747303 -269652 207453 498254 556230 346031 77068 173581 679978 1035974
39105 1035974 824258 432081 496211 919040 1004223 501782 -60166 -177011 17776 151993
39095 151993 199899 353644 593934 728271 715011 660775 566303 331051 13209 -122683
39085 -122683 99358 516395 751711 593332 221393 21120 161392 423140 484300 280533
39075 280533 -392 -170579 -151641 55030 317714 387891 194675 49899 286332 746373
39065 746373 960889 825405 703953 782897 751628 332605 -256286 -659334 -879302 -1071631
39055 -1071631 -1110812 -778799 -238467 89503 74351 -40225 -64992 -53701 -64023 -33209
39045 -33209 68962 208575 429082 790728 1150943 1231938 938270 427133 -107974 -514714
39035 -514714 -615308 -363908 -60916 -94459 -433798 -685570 -684683 -672134 -800520 -854261 -641465
39024 -641465 -305033 -13803 314516 695585 808833 423506 -144161 -407080 -366934 -373222
39014 -373222 -467635 -382542 -169181 -260065 -735264 -1027953 -685549 -57944 174921 -69513
39004 -69513 -264166 -96597 149994 122082 -79557 -117652 73767 242463 159476 -199080
38994 -199080 -725278 -1222319 -1427180 -1229111 -884083 -790168 -990015 -1106889 -865864 -461336
38984 -461336 -257254 -317767 -433375 -453087 -364304 -177997 7352 -62324 -501004 -980309
38974 -980309 -1043636 -706528 -412235 -376814 -356765 -160568 4680 -95424 -333656 -462058
38964 -462058 -482698 -507430 -466938 -257772 -29817 -41282 -308821 -610388 -734083 -560454
38954 -560454 -75758 481906 684254 393027 17177 13004 298024 470154 417682 315439
38944 315439 168460 -153468 -468436 -377062 113903 506756 482781 263525 154476 113764
38934 113764 -10445 -136364 -94286 103044 329876 502976 543889 404456 234376 265488
38924 265488 420634 342470 -41548 -324549 -212020 22149 -33794 -320404 -464408 -335919
38914 -335919 -108125 90102 264124 407300 536424 750026 995352 935360 353791 -431642
38904 -431642 -875719 -833465 -590331 -379792 -206401 -70568 -11099 59720 242342 385548
38894 385548 254357 -42911 -129524 98496 320921 256829 3410 -176437 -175757 -78457 -60799
38883 -60799 -286214 -715842 -1043998 -1031629 -850551 -841599 -1002777 -1041572 -885483 -754039
38873 -754039 -717065 -598557 -387611 -319851 -425988 -418118 -195066 -48321 -148993 -236595
38863 -236595 -95340 42286 -86668 -272190 -134229 290331 626942 674114 532689 380411
38853 380411 387144 675896 1095459 1222442 869025 379862 130296 -13392 -349750 -702198
38843 -702198 -620003 -102699 371187 514168 479982 440571 352884 206688 112832 68903 -20626
38832 -20626 -55903 155834 473499 514399 259383 131904 327819 507851 383027 187885
38822 187885 259592 497735 609276 617221 721330 834654 681850 296875 42798 101844
38812 101844 237912 142022 -193370 -527379 -664870 -628442 -591707 -650465 -648668 -328037 276529
38801 276529 725170 625202 123174 -249624 -216571 -51146 -170497 -583158 -875718 -707196
38791 -707196 -190549 262668 394988 297690 189606 170956 258779 479044 746673 792270
38781 792270 458698 5929 -156265 -27050 1753 -224553 -346788 -24147 526595 782074
38771 782074 554206 142792 -79572 -31818 116836 212345 287417 458136 643096 522754
38761 522754 -36376 -631853 -722089 -354679 -117517 -302992 -558610 -534395 -403277 -428404
38751 -428404 -453515 -257698 -60605 -167021 -380851 -327776 -158091 -310851 -680070 -681068
38741 -681068 -188155 242066 245780 146915 307525 523702 459602 280295 406242 867695
38731 867695 1288088 1373067 1119185 667305 227325 52800 235541 562234 736444 676197
38721 676197 481804 246611 46843 -18118 57010 128753 94047 13505 -50068 -135724 -205098
38710 -205098 -79364 266944 562532 591929 472999 363650 161869 -187196 -357181 -62571
38700 -62571 359922 316794 -143443 -340199 59792 607213 798262 728610 704052 633690
38690 633690 262556 -258255 -514704 -430028 -290353 -210584 741 387580 660093 639578
38680 639578 580695 800649 1179015 1290081 949615 408036 29252 -40004 111394 301211
38670 301211 379709 328220 255648 220345 99443 -227017 -606633 -739258 -586240 -416284
38660 -416284 -371238 -257919 61950 341717 285226 17728 -107571 -40437 4707 43707
38650 43707 329911 805574 993898 640141 100572 -163878 -186125 -293721 -557656 -778948
38640 -778948 -859775 -836993 -639476 -164027 419410 753896 733546 603218 565586 519744
38630 519744 286672 -80117 -327966 -267158 63738 446651 676424 715926 617769 324387
38620 324387 -249667 -859155 -945839 -291399 554804 864055 627321 467482 708922 994729
38610 994729 901132 484736 37798 -316162 -545234 -553244 -371368 -241512 -243355 -91589
38600 -91589 402493 915129 1017637 811339 745347 910459 958018 715943 444289 369678
38590 369678 351782 203544 32391 18405 77188 8771 -162724 -258851 -262502 -292271 -295326
38579 -295326 -63825 362395 576429 286844 -237576 -453117 -222423 47945 3583 -179066
38569 -179066 -95015 275212 522500 357672 -37677 -273991 -188574 73920 277427 281103
38559 281103 99291 -129375 -280332 -379645 -512571 -594265 -416548 -7609 257118 82415
38549 82415 -351710 -628294 -614558 -500755 -388292 -143902 280334 651153 735977 621556
38539 621556 582822 708010 799207 636069 242874 -129020 -247304 -110431 81490 149528
38529 149528 91643 18790 25184 177055 526406 1010021 1399888 1506392 1399711 1274585
38519 1274585 1132234 808020 323021 -56778 -224149 -444599 -958199 -1552386 -1810049
38510 -1810049 -1695073 -1585276 -1703498 -1806234 -1562972 -1024367 -525029 -252625 -119000
38501 -119000 -6060 62376 25101 -81990 -156345 -118996 50739 299263 510565 621586
38491 621586 725841 940751 1155924 1081361 630593 99062 -163939 -118964 65155 290673
38481 290673 475819 395818 -56939 -515191 -458893 40471 322416 59114 -245381 8730
38471 8730 637289 972727 826968 647341 764779 978370 982753 801087 613882 463114
38461 463114 334533 316886 470189 662694 693892 495111 132809 -261723 -504294 -468774
38451 -468774 -286181 -269329 -512878 -714391 -540919 -63006 323206 332679 33725 -279838
38441 -279838 -365349 -244237 -201014 -485548 -976398 -1266408 -1131086 -753578 -424993 -228695
38431 -228695 -132902 -159895 -264927 -243969 -1576 242375 256893 156464 166059 172202 -116707
38420 -116707 -608117 -828426 -562180 -129448 114232 226860 409328 557683 410728 39646
38410 39646 -122888 202380 782052 1118879 979147 591576 340515 338287 362099 188576
38400 188576 -117585 -298736 -198339 113202 423571 511733 304830 12323 -17480 281009
38390 281009 546863 454536 162603 42792 121478 158179 169253 387882 684264 576738
38380 576738 19964 -333979 -10217 575421 716907 404769 194592 296965 375973 219712
38370 219712 58204 85631 109291 -104922 -435080 -575547 -433024 -187827 -67810 -143066
38360 -143066 -250680 -118916 306515 712603 787503 651871 623533 624500 275892 -337688
38350 -337688 -524918 78178 850642 912162 237658 -446213 -714993 -831394 -1063782 -1198120
38340 -1198120 -984308 -652067 -608373 -834006 -940139 -740889 -446868 -285782 -226576 -178284
38330 -178284 -213510 -394016 -520501 -317269 136410 393088 158555 -332478 -603483 -485271
38320 -485271 -200469 29371 223523 447670 596692 521682 276258 100360 179525 483047
38310 483047 804203 917115 743935 413266 122384 -58732 -184049 -265622 -252860 -186784
38300 -186784 -196558 -276259 -242634 -16448 226988 310514 275458 199667 8427 -302500 -453461
38289 -453461 -217431 137597 98385 -415852 -947713 -1089832 -869070 -515381 -186663 -8971
38279 -8971 -49945 -107095 159290 700204 994688 723931 238025 66410 229944 386791
38269 386791 429184 493325 505337 220255 -251566 -413800 -36014 515236 787453 799182
38259 799182 870097 1123113 1402924 1548384 1520539 1346986 1122346 986443 942730 795413
38249 795413 448276 161123 260486 638489 825668 614283 333567 360973 593630 642840
38239 642840 413755 200873 224249 352628 374248 300364 231382 114988 -110450 -243124
38229 -243124 -12908 424569 519819 33219 -544763 -552243 3691 475118 401178 -19285
38219 -19285 -346202 -462155 -514479 -535054 -422304 -218977 -121244 -189899 -278243 -300230 -361751
38208 -361751 -526996 -646769 -585820 -484902 -580365 -814829 -856730 -551280 -163054 -60598
38198 -60598 -280108 -530999 -573907 -466622 -436197 -593166 -798758 -790324 -443883 77911
38188 77911 468447 567037 446562 226324 -56508 -321216 -359659 -63261 347085 517254
38178 517254 365235 117527 -32790 -97812 -121275 -79270 -39213 -190841 -560306 -850438
38168 -850438 -744330 -287751 166589 336779 237931 104136 170258 459584 731860 739637
38158 739637 562975 515970 664272 687939 385358 53231 89035 411162 616830 599448
38148 599448 626342 823438 967341 871662 653123 483714 355039 249689 311368 638972
38138 638972 1054245 1253779 1113607 737545 309988 9135 -42121 123200 308949 340299
38128 340299 233545 155041 266192 612069 1067469 1369755 1298949 862676 263700 -267378
38118 -267378 -536607 -420538 -38897 206632 46537 -241844 -141535 393117 893936 1079481
38108 1079481 1156279 1276642 1185607 731552 307579 330376 576532 544896 276219 237378
38098 237378 457589 399291 -174737 -752439 -788908 -472858 -393444 -679081 -883461 -664281
38088 -664281 -197708 159841 319031 372610 263955 -153173 -732937 -1017983 -766480 -302490
38078 -302490 -118759 -266307 -404198 -350247 -232404 -116318 108329 379764 415367 195453
38068 195453 101024 310519 443582 154482 -267344 -325505 -67092 87087 54633 91373
38058 91373 201254 124869 -92134 -82676 210354 412395 363985 380752 647296 813264 509765
38047 509765 -69119 -428939 -401589 -243143 -263245 -554139 -954855 -1160202 -1008287 -704574
38037 -704574 -550848 -462681 -112306 387311 404090 -362416 -1343051 -1740956 -1415142 -795610
38027 -795610 -202013 341639 786579 985864 932091 781764 647158 550127 513625 519981
38017 519981 462508 296604 133627 50145 -47211 -228631 -394564 -463249 -483454 -414411 -89378
38006 -89378 394122 602115 397947 289649 712305 1279978 1291206 745661 240262 -7861
37996 -7861 -331679 -782109 -848041 -255137 532911 937731 941608 815834 596362 246290
37986 246290 25708 212911 593112 667711 357993 117474 259373 493194 339469 -175255
37976 -175255 -517305 -343353 61274 210427 91948 95275 321540 393083 99440 -179277
37966 -179277 -7757 470297 818700 955072 1052807 1032013 717484 381154 492311 906649
37956 906649 930373 325340 -333563 -505492 -339277 -228820 -234250 -256443 -310995 -293356 61769
37945 61769 615964 708852 76551 -562952 -427703 181181 319605 -233398 -762297 -715773
37935 -715773 -338697 -95070 -37834 23902 145834 270786 354796 304474 6136 -462382
37925 -462382 -821571 -862897 -608964 -237294 -5955 -150010 -602856 -916188 -755201 -391013
37915 -391013 -360121 -699719 -918644 -719211 -325199 -40589 92023 89099 -92805 -307982
37905 -307982 -248115 73567 222876 -38267 -371123 -361297 -93271 80270 87112 120717 250636
37894 250636 352119 313298 88961 -315318 -725274 -855965 -693269 -586806 -717410 -744962
37884 -744962 -330360 245211 430051 203840 32300 104314 163829 137119 338415 818710
37874 818710 1015905 455062 -509272 -1075678 -976383 -685773 -681313 -863414 -837098 -521829
37864 -521829 -243680 -264922 -429881 -399653 -147957 -19775 -238743 -548236 -521409 -118431
37854 -118431 281818 359407 141279 -173811 -430589 -502833 -293551 127662 523819 705010
37844 705010 639129 364756 -1752 -171060 108231 632535 827674 434423 -143353 -379558
37834 -379558 -245815 -24600 208833 504536 625401 233382 -503812 -958877 -819388 -429465
37824 -429465 -197265 -33683 350571 869306 1129452 960295 572345 202507 -158635 -614690
37814 -614690 -1075662 -1244030 -928444 -351210 -20891 -173908 -439219 -275469 310960 778665
37804 778665 792435 584689 460670 361350 196962 223667 634974 1031674 839809 172564
37794 172564 -255717 -104599 217235 277704 214118 323984 478263 339822 -67663 -393181
37784 -393181 -449257 -348576 -212270 -33908 168161 302970 344791 348491 312743 179603
37774 179603 -13718 -116849 -29477 199323 422040 470916 255074 -90072 -211140 126862
37764 126862 717291 1092574 1042927 785429 585887 420514 140459 -189243 -323966 -181153
37754 -181153 25043 35007 -174046 -407503 -473005 -308724 37571 424990 612939 397848
37744 397848 -129190 -557052 -547973 -231875 -52102 -219951 -504405 -604752 -519823 -420518
37734 -420518 -345462 -229708 -118102 -112138 -146971 -54553 136461 185135 -4858 -201834 -147327
37723 -147327 82517 162367 -85592 -497942 -758988 -694995 -380352 -30901 176816 231169
37713 231169 280033 483400 821667 1046132 877795 298816 -381614 -786421 -767158 -436028
37703 -436028 -15464 249752 155698 -270627 -663694 -618905 -148393 331200 490602 372265
37693 372265 166317 -28742 -133984 -64685 73989 42239 -118738 -55903 273948 343545
37683 343545 -178363 -751348 -629377 9377 273935 -132090 -519094 -286386 262270 501252
37673 501252 357705 196389 214014 366155 620662 891686 933634 654596 342276 245467
37663 245467 144892 -277421 -831523 -1030177 -803941 -544133 -448840 -288210 87804 422493
37653 422493 427257 193229 22373 34569 110789 95401 -73392 -336575 -534430 -543555 -438185
37642 -438185 -413573 -527402 -639204 -618354 -461967 -186162 212658 617022 797089 700930
37632 700930 609277 830079 1278869 1505969 1169538 409718 -286587 -567164 -512023 -431783
37622 -431783 -444518 -383674 -121507 208329 414604 503383 565741 560798 429433 311613 389823
37611 389823 577440 636225 573377 623095 817594 893414 706660 446050 311333 251764
37601 251764 167411 104501 74185 -66084 -327171 -407901 -61900 514997 911863 984634
37591 984634 884643 756593 670711 727964 943584 1106726 1020900 791743 607013 374299
37581 374299 -50622 -391290 -205308 362083 607398 225279 -254059 -260648 34808 126571
37571 126571 -28864 -137474 -231646 -603946 -1139905 -1302524 -887737 -319051 -39546 -41721
37561 -41721 -181388 -495114 -880730 -862214 -152745 749371 1008329 452692 -259876 -473885
37551 -473885 -167442 275410 541302 504162 189044 -174740 -277423 -84514 104280 93812
37541 93812 82992 326247 709343 924933 928836 918979 926834 755743 362922 11232 -77663
37530 -77663 -2009 30615 15703 77273 204131 269400 271202 349896 533847 647720 573886
37519 573886 470586 570035 823151 940672 809661 667303 748088 932203 936072 730504
37509 730504 513999 316171 -77535 -753385 -1494587 -2079422 -2487507 -2674265 -2452472 -1857705
37499 -1857705 -1353668 -1292644 -1347045 -926878 -95872 438405 340711 137181 393974 823764
37489 823764 690946 -81424 -743712 -723489 -346957 -294026 -620256 -723372 -250079 358028
37479 358028 433538 -39961 -446621 -373190 -70004 24905 -104756 -177304 -127698 -151453 -299356
37468 -299356 -362983 -216412 -13387 45201 -55111 -220802 -387983 -506228 -551903 -634338
37458 -634338 -917489 -1341261 -1589075 -1451768 -1071702 -695029 -343228 73417 427215 420140
37448 420140 2364 -435010 -409339 145147 790411 1025646 783554 438897 338027 431736
37438 431736 440436 263637 73347 58135 236129 502174 718117 780425 731029 741787 830848
37427 830848 703067 130150 -590465 -903483 -733492 -582195 -792375 -1088538 -1039665 -651123
37417 -651123 -246647 -23787 3388 -171815 -497354 -765945 -804814 -666386 -477919 -253321
37407 -253321 279 185531 293461 469532 731137 866363 802604 773043 870095 785126
37397 785126 342895 -63958 -50712 55479 -322001 -1039896 -1386783 -1136248 -767957 -585489
37387 -585489 -316514 179033 440738 50562 -695663 -1176395 -1210311 -1062945 -910878 -673396
37377 -673396 -295617 69768 162059 -184887 -831407 -1292492 -1124646 -441396 166849 306323
37367 306323 138331 154 -16010 43195 197424 390744 390722 88005 -273753 -381464 -213328
37356 -213328 54680 319887 543802 644454 587336 447375 255615 -28628 -285205 -241120
37346 -241120 112056 381789 281835 24272 -38011 90195 175342 139142 15965 -243909
37336 -243909 -601445 -761951 -524278 -130895 51907 26977 21561 66181 89827 214877
37326 214877 516972 676226 356231 -205993 -494995 -478747 -514798 -589301 -317221 253111
37316 253111 525614 245978 -110511 -113072 27541 -26921 -150983 -99042 -12290 -118102
37306 -118102 -255176 -173669 -56042 -256328 -686900 -930859 -875577 -800373 -856849 -856935 -631053
37295 -631053 -296760 -103706 -216899 -658885 -1260603 -1671369 -1621428 -1197445 -717228 -371874
37285 -371874 -154349 -68672 -168226 -376803 -486741 -396794 -210476 -59241 53072 197775
37275 197775 404799 617229 707179 567848 255616 -13484 -89075 -48184 -53305 -132445 -202340
37264 -202340 -225877 -224211 -198179 -153623 -150180 -233012 -377182 -549762 -707494 -692417 -344837
37253 -344837 164672 371025 86355 -311578 -427545 -422010 -654959 -973510 -866949 -274584
37243 -274584 284955 466152 501887 700394 965152 1046594 923450 678848 288260 -199905
37233 -199905 -515584 -482614 -303915 -273219 -357379 -315148 -94040 144006 282512 291012 103361
37222 103361 -285811 -656844 -742372 -557576 -358936 -301867 -329907 -366770 -399733 -373616 -226342
37211 -226342 -81307 -206043 -673842 -1191830 -1377123 -1152823 -797785 -623044 -652230 -657844
37201 -657844 -509690 -383526 -488637 -656138 -466418 136744 645967 615153 256682 125753
37191 125753 369736 637713 664944 579202 596274 740933 957833 1217410 1402196 1341521
37181 1341521 1089769 944996 1042671 1121562 847808 222704 -455069 -884527 -920837 -624159
37171 -624159 -277587 -175440 -261222 -169350 239022 632461 704101 631950 727880 868477
37161 868477 707936 318018 110874 137115 6333 -351838 -397473 206036 929181 1026393
37151 1026393 590406 388262 715704 1010292 757899 258681 134913 430447 663228
37142 663228 615028 576461 768595 961433 868458 605538 485182 552504 613726 607326 643913
37131 643913 710137 621939 316147 -43180 -304066 -464234 -524315 -439861 -302181 -311818 -427599
37120 -427599 -293711 261799 862103 995345 660969 303210 174067 93183 -133134 -371712
37110 -371712 -387435 -207565 -88423 -197853 -445087 -601945 -544115 -374431 -283862 -278243
37100 -278243 -145522 223335 611843 740892 649602 598576 659885 647821 431835 70488
37090 70488 -350971 -747059 -909382 -691136 -357489 -374797 -725933 -831654 -369156 232681
37080 232681 447019 426746 647799 1019207 942588 251013 -446451 -519527 -38038 447956
37070 447956 565759 364269 107986 19589 120501 220540 158609 71369 243029 645071
37060 645071 855971 565584 -27485 -469187 -546193 -377680 -153830 29509 152350 255157
37050 255157 411416 602528 665291 472943 140188 -36438 164858 697916 1227530 1305397
37040 1305397 742910 -108550 -613379 -502026 -111524 129071 219472 375450 528622 415353
37030 415353 86569 -64657 161131 529384 751819 804741 747406 523106 133854 -228867
37020 -228867 -435483 -586833 -728092 -652666 -293250 -65083 -376382 -913170 -929192 -297787
37010 -297787 244156 112983 -327690 -349029 128397 579043 715345 729970 725064 474682
37000 474682 -47130 -370992 -123833 368427 468811 85856 -252120 -169857 84426 76696
36990 76696 -190992 -341293 -177875 74435 112720 -37581 -76373 166783 504477 614330
36980 614330 424038 182933 154292 331335 498149 488441 315313 112750 34764 155459
36970 155459 363572 399632 126828 -251992 -390446 -222023 -27639 -28931 -96101 -3487
36960 -3487 164615 94390 -289238 -661261 -697610 -484178 -382615 -565659 -835282 -878615
36950 -878615 -562798 21113 632551 938337 687354 3867 -601886 -721935 -508791 -451024
36940 -451024 -725587 -1020391 -1023037 -794481 -533970 -257391 61905 254041 153720 -79151
36930 -79151 -125841 80489 380850 736359 1205737 1607005 1603295 1222284 918097 937995
36920 937995 964488 640740 155895 -43895 61508 74968 -176731 -396689 -290442 29874
36910 29874 278353 411556 589552 818341 860960 551173 55794 -283955 -328537 -243759
36900 -243759 -212633 -176148 25908 349722 574992 633394 703332 900779 1060426 966884
36890 966884 678250 458773 459141 604229 746526 795626 725016 571822 421776 312052
36880 312052 178118 -31303 -241845 -341269 -314491 -192273 54584 427980 763685 849645
36870 849645 688312 504624 475448 565535 645279 653570 607897 549867 530836 588848 694531
36859 694531 749304 661634 421965 117640 -116377 -190294 -109707 92971 423925 816933
36849 816933 1020440 827372 453723 410371 849599 1303055 1300399 1004804 910106 1092625
36839 1092625 1172832 947799 634120 446001 326639 204058 157652 175131 60441 -219217
36829 -219217 -362244 -133162 270785 469480 349442 72286 -189064 -302144 -121798 347617
36819 347617 816737 984720 917214 937005 1148507 1281916 1060747 567963 159501 81684
36809 81684 235395 310263 139040 -102492 -92843 251406 671185 857950 765929 608896
36799 608896 627804 886235 1233126 1469821 1592156 1772344 2017778 2057135 1809946 1734647
36789 1734647 2271409 3130579 3816540 4834571 7394415 11396981 14558142 14497244 11361927
36780 11361927 7514310 4836117 3296884 2123509 1199726 785432 695432 526653 320798
36771 320798 391220 714367 977985 1053874 996610 742350 239322 -248112 -400399 -342386
36761 -342386 -465032 -768460 -803108 -326924 357152 838105 1046569 1115590 1075061 895993
36751 895993 660168 491860 418857 416365 469924 489513 302077 -119466 -512841 -566193 -267005
36740 -267005 93341 232920 120405 -58917 -107969 -5850 91984 88874 148672 508850
36730 508850 1067384 1366087 1116789 574232 219089 224546 437774 730595 1078763 1381574
36720 1381574 1528578 1628986 1849876 2019318 1773177 1188954 857294 1104287 1524110
36711 1524110 1595603 1415700 1396655 1503763 1330747 828339 412929 316093 321332 260945
36701 260945 312384 599863 891911 944163 840843 769629 737733 728391 849044 1081819 1175456
36690 1175456 1054443 1037067 1322364 1556362 1320649 814163 568729 629680 526037 21907
36680 21907 -574924 -894372 -893021 -721578 -572555 -679642 -1082877 -1374308 -1098174 -443100
36670 -443100 -66405 -151280 -186081 124901 324601 -35055 -598102 -708312 -381289 -199702
36660 -199702 -407571 -668076 -694604 -619408 -639181 -683550 -596835 -403446 -253727 -241127 -327063
36649 -327063 -345855 -114407 330352 669822 653938 444249 397958 568218 673165 551894
36639 551894 371038 298919 215432 -93913 -580279 -916825 -821350 -335338 206440 466059
36629 466059 361668 40037 -326938 -585545 -506831 59997 845189 1260949 1050936 596685
36619 596685 353491 262182 48866 -165773 -30529 411389 767765 913305 1049738 1155206
36609 1155206 940058 465413 235415 432254 579861 304467 -37868 65009 440880
36600 440880 480980 25597 -492712 -702871 -645201 -476575 -228825 48855 195798 109896
36590 109896 -138029 -400448 -550648 -507696 -288199 -2763 284808 603028 892456 950427
36580 950427 710552 396459 203167 30427 -216043 -296849 4395 362773 223583 -395795
36570 -395795 -870214 -781180 -337840 100397 462459 733164 714469 347807 -9207 34373
36560 34373 406393 718789 754280 556973 193726 -278070 -673989 -781763 -599385 -304070
36550 -304070 -23266 201206 281585 119199 -218589 -494877 -492532 -152216 394842 835155
36540 835155 838375 390692 -110914 -275294 -170482 -182083 -480639 -848384 -1017439 -952665
36530 -952665 -772636 -607904 -599827 -835506 -1178591 -1326495 -1153325 -871582 -747292 -779911
36520 -779911 -794554 -738810 -708440 -720686 -646614 -410495 -127797 31334 41521 -775 -65158
36509 -65158 -247606 -602554 -982215 -1130293 -941803 -576698 -304761 -278270 -451711 -656866
36499 -656866 -736106 -657665 -517482 -388635 -210307 67388 281269 209211 -50577 -121389
36489 -121389 107390 261138 41399 -257062 -152138 280394 516472 379127 231095 303301
36479 303301 342135 160732 89604 484277 1066727 1191645 663786 -54349 -402306 -225739
36469 -225739 214356 490516 330697 -88556 -270992 -49388 71387 -426990 -1224127 -1458366
36459 -1458366 -868997 -111205 192742 166253 161305 66665 -354099 -787524 -672753 -83475
36449 -83475 290358 119870 -125315 78635 559930 765771 538021 203012 20029 -101873
36439 -101873 -325052 -593570 -721612 -635155 -450020 -364304 -476047 -651021 -615699 -279370
36429 -279370 86928 140342 -81561 -178410 95737 503626 619165 324360 -114109 -371191
36419 -371191 -323820 -48684 270460 424501 306239 12441 -245436 -353408 -366278 -378806
36409 -378806 -408971 -419516 -376227 -261975 -94913 54287 122702 132825 142940 135460 54006
36398 54006 -55189 -72379 -1901 9483 -77330 -80079 134547 384030 356718 29221 -270300
36387 -270300 -235901 96916 425573 471897 179304 -269035 -566002 -492765 -106704 291286
36377 291286 427243 294821 103818 7893 -58736 -251471 -585187 -916199 -1130289 -1225191
36367 -1225191 -1173282 -858463 -283961 265687 457879 274247 -14750 -185183 -186276 81
36357 81 359378 703122 806945 728237 705501 723533 556805 320709 484269 1080176 1400730
36346 1400730 917225 102844 -196331 92155 348994 262879 57046 -187230 -680612 -1302687
36336 -1302687 -1522868 -1167397 -680570 -384585 -49553 509936 969897 1005247 779069 535693
36326 535693 176381 -326153 -559891 -253434 166511 169471 -66089 -51534 104791 -84460
36316 -84460 -530218 -605548 -151759 263852 213214 -97717 -361000 -606036 -877581 -986585
36306 -986585 -846595 -642022 -450657 -125211 248177 258444 -171317 -494898 -283167 149344
36296 149344 269181 110036 56754 144568 131498 98376 389173 960303 1313126 1178717
36286 1178717 840430 619185 409352 -30319 -574212 -807313 -534112 -9505 351287
36277 351287 387909 283794 285067 401905 441362 285988 12934 -260738 -476958 -530850
36267 -530850 -282893 179909 491370 426863 231221 289131 587850 787022 746923 659757
36257 659757 641835 525426 174638 -253899 -527798 -617342 -581860 -346135 173528 779544
36247 779544 1057200 790348 198551 -302565 -513995 -561241 -617460 -619823 -353648 195485
36237 195485 702831 812326 519290 135215 -92103 -191481 -306254 -475497 -644864 -777920
36227 -777920 -853913 -826735 -700803 -616315 -735440 -1015522 -1189800 -1041195 -649579 -297307
36217 -297307 -150613 -114374 -12641 170319 280861 176232 -135304 -488615 -651978 -494354
36207 -494354 -142139 94595 53396 -82921 -45133 128408 141384 -122066 -408507 -409704
36197 -409704 -115444 217770 331769 153535 -165549 -373163 -404499 -520571 -951244 -1424511
36187 -1424511 -1376458 -716564 -24680 212910 211478 428807 822474 1000268 900757 819095
36177 819095 829816 698329 412966 308762 493862 584526 274682 -160840 -237571 94153
36167 94153 478533 657320 624015 377715 -122215 -713580 -1029772 -885118 -510406 -272924
36157 -272924 -255981 -251467 -118903 19312 -9094 -163344 -274816 -308656 -348233 -340214 -101615
36146 -101615 334198 624024 554523 385934 516056 936707 1297142 1419387 1446535 1503118
36136 1503118 1517973 1431055 1307351 1174955 982260 773451 671083 632147 486269 289448
36126 289448 332583 652641 848920 636451 342446 536043 1276628 2014657 2209332 1826821
36116 1826821 1232297 775926 538692 396451 276132 301229 605131 1044813 1282825 1184920
36106 1184920 938612 715442 449056 77275 -222946 -240136 -14801 248798 417791 441626
36096 441626 312146 172413 257102 531772 621992 342703 45576 114904 360122 339664
36086 339664 108180 106586 359804 379777 5392 -213258 221168 1015399 1490593 1445476
36076 1445476 1209872 1013328 755424 405748 214547 340962 534802 447297 152182 90161
36066 90161 469604 970054 1184605 1141880 1114062 1052387 648231 973 -271983 123948
36056 123948 623059 543218 71759 -44709 354383 638078 377545 -44062 -39259 415059
36046 415059 880473 991521 659252 47758 -440720 -449486 -118459 64196 2192 130423
36036 130423 571977 716136 123489 -630222 -682750 -139720 151696 -83471 -283032 -119856
36026 -119856 3687 -210566 -375454 -102066 319368 427121 330829 409049 598549 552036
36016 552036 294235 167636 238596 274896 249983 356712 532693 496263 306317 344019
36006 344019 602023 563146 65249 -264401 100789 689068 618752 -144081 -745248 -615648
35996 -615648 -90249 243216 272629 213117 179479 215961 413601 672142 635944 232011
35986 232011 9917 482205 1283675 1516715 918960 153664 -162806 -169380 -231261 -228308
35976 -228308 131247 607603 639576 193981 -126630 86267 536919 698772 444291 4266
35966 4266 -400665 -640059 -618375 -416606 -329276 -490512 -596827 -302792 198364 343679
35956 343679 -35333 -465474 -465467 -120301 179222 317116 462976 623238 548694 178482 -97736
35945 -97736 144961 772182 1142936 824453 96779 -398639 -411461 -252085 -215659 -162714
35935 -162714 115088 381661 218363 -270309 -470949 -109244 319974 239125 -204948 -384669
35925 -384669 -60465 394859 586604 529260 432463 380785 357112 355137 335015 232715 118984
35914 118984 206716 619643 1292138 2142586 3137354 4068450 4483657 4072100 3060588 2064981
35904 2064981 1556647 1534159 1636856 1489708 1006025 440090 105389 29497 -5339 -84444
35894 -84444 -39361 207619 419503 363986 169872 114319 189308 168410 27604 -24575 56775
35883 56775 55766 -104367 -163073 80540 403132 466080 366676 547771 1116855 1566550 1384987
35872 1384987 751056 307250 292453 288210 -31837 -295290 39027 776465 1135078 789558
35862 789558 255014 95353 239984 350961 414885 562870 645665 475193 276579 405996
35852 405996 742513 847564 662903 550020 631050 600385 296112 -8153 -57204 36300
35842 36300 90020 144622 245848 253534 103897 -4316 86495 234093 245923 164954 118294
35831 118294 114798 185748 474090 952869 1287720 1229122 941031 715218 586119 469123
35821 469123 417739 434516 276069 -183270 -604392 -614013 -411814 -483042 -816167 -925707
35811 -925707 -642951 -339843 -250924 -96731 362291 829076 886445 628243 493698 615105
35801 615105 683495 440633 22942 -246875 -236848 -90659 -15009 -52772 -74310 19913 142495
35790 142495 134627 6581 -55686 55607 225174 278414 197667 103457 81734 103626 93022
35779 93022 20831 -71942 -126898 -126455 -78578 28546 172645 204921 -31039 -411957 -544882
35768 -544882 -236247 191130 281506 45455 -113089 -29521 9768 -224873 -512073 -495382
35758 -495382 -167729 196252 450166 678189 955108 1223144 1406119 1483023 1432457 1228390
35748 1228390 913928 594744 356949 258413 358651 633018 868203 805001 459646 182970
35738 182970 277650 613496 754163 463583 -31593 -314425 -205654 131536 400307 386054
35728 386054 69211 -317678 -398994 -16013 504263 622576 199270 -312191 -368155 83810
35718 83810 605763 750175 465446 101496 51591 312029 432488 62741 -516127 -697976
35708 -697976 -384756 -110358 -213535 -362972 -203290 2319 -121296 -275516 129541 962576
35698 962576 1424840 1129974 496941 -25196 -475710 -910190 -1055640 -842495 -769309 -1225794
35688 -1225794 -1801029 -1807253 -1290746 -989004 -1342558 -2018306 -2447953 -2434726 -2107697 -1603272
35678 -1603272 -1018183 -536585 -396851 -688534 -1212125 -1579782 -1528502 -1161546 -818519 -703443
35668 -703443 -742855 -800412 -847632 -864884 -768914 -554859 -354004 -242932 -153781 -72112 -125059
35657 -125059 -332084 -471979 -379630 -186308 -65017 62042 305040 481267 345447 48424
35647 48424 3688 290834 529582 441891 254025 355500 727362 928260 633017 32092
35637 32092 -389698 -424152 -359705 -566964 -994623 -1252612 -1118915 -728579 -296041 58703
35627 58703 206225 99120 47592 474388 1202087 1447352 865574 163895 183589 722658
35617 722658 890254 426256 -34343 -7908 209422 144849 -177193 -449697 -557590 -529925
35607 -529925 -314968 100082 534543 811937 972417 1125220 1235570 1205180 1038370 810324
35597 810324 580607 410418 338649 291327 158933 -2255 -11142 164310 350894 415981
35587 415981 384697 296869 158994 60322 109280 229171 255391 241022 367878 521758 317515
35576 317515 -322926 -945425 -1087922 -753696 -219814 312927 698042 795695 686571 653387
35566 653387 721343 528379 -68555 -588879 -516564 -40877 219065 50942 -238927 -433322
35556 -433322 -633688 -872879 -947893 -752856 -436697 -113062 282543 706383 855444 520541
35546 520541 -55102 -360108 -124971 424656 785248 636259 152848 -153642 14490 398877
35536 398877 506657 205883 -180926 -342347 -303238 -235686 -172728 -57069 61396 46106
35526 46106 -144341 -405581 -603879 -664124 -558433 -303568 -6945 157930 111681 -6952
35516 -6952 24052 221024 350969 254533 91304 112358 279648 322042 143249 -47796 -37848
35505 -37848 159943 407165 571402 527037 251168 -26742 -3502 299321 546944 558425
35495 558425 486860 455933 343893 77360 -179025 -308031 -403558 -464437 -277036 160768
35485 160768 469512 432669 334433 424647 473839 299043 286293 776641 1276524 1011062
35475 1011062 88624 -615456 -662459 -419569 -243582 -61153 111015 -32985 -489715 -750979
35465 -750979 -519644 -140626 -53145 -253176 -520864 -731021 -726992 -357284 137759 249478
35455 249478 -75552 -342538 -339086 -439751 -785223 -859752 -374547 84977 -64025 -429186
35445 -429186 -286756 233424 420367 155501 -28451 56584 4968 -401021 -843056 -991921
35435 -991921 -827087 -394039 215161 614508 422558 -117645 -342383 -58645 286812 374270
35425 374270 362798 373610 248287 35490 124179 591314 939447 816693 525313 462856
35415 462856 511459 391317 221374 267451 436313 472912 425654 491427 600805 568092 476019
35404 476019 506774 551285 401280 191800 210533 353968 236709 -160591 -392050 -170344
35394 -170344 275881 562237 556102 345878 109223 104645 485069 979924 1046113 522366
35384 522366 -94472 -225600 125017 492799 578247 491120 447101 495339 587797 707731
35374 707731 816270 791913 555226 212728 -41667 -174679 -343853 -609378 -721599 -367287
35364 -367287 362019 915939 812861 149194 -513693 -720948 -495406 -190713 -100840 -234179
35354 -234179 -386116 -375368 -216839 -81745 -105453 -251466 -346787 -223002 135501 512814
35344 512814 574781 186054 -381522 -676306 -520214 -131056 185345 297249 201879 -52481
35334 -52481 -313952 -397612 -319147 -279262 -320837 -224505 116678 463407 571456 534571 537247
35323 537247 488609 227218 -72487 -69804 234533 500963 534379 456110 410553 396890 387939
35312 387939 347331 168724 -111131 -119031 445930 1232369 1510062 1097185 583491 502575
35302 502575 715451 813024 710818 560271 414279 294869 323254 491280 550416 403332
35292 403332 344149 601929 900581 832404 464877 197739 172830 205736 182780 137898 8550
35281 8550 -307468 -682648 -887223 -955428 -1092631 -1251361 -1159617 -780107 -385215 -126279
35271 -126279 135187 486288 758254 767747 521127 119125 -303068 -527617 -443410 -314533
35261 -314533 -518698 -941863 -1005862 -451028 273992 632514 682349 833566 1170098 1375084
35251 1375084 1233757 903264 688193 753830 1063863 1449423 1716049 1760837 1612293 1387708
35241 1387708 1263214 1391342 1679916 1742782 1343765 842747 830880 1283133 1519137 1185552
35231 1185552 816120 1064489 1754443 2167254 2049756 1817772 1813900 1852565 1616721 1162223
35221 1162223 840352 871941 1120627 1256530 1141059 1028005 1238217 1629478 1684803 1267016
35211 1267016 929144 1170400 1704028 1891016 1646014 1376427 1171793 690200 -98195
35202 -98195 -656458 -587047 -133281 268623 546032 816156 981786 844275 453674 78883
35192 78883 -82271 -11186 189812 339994 293700 110749 -5878 21566 104631 213867
35182 213867 401713 585804 610588 571961 729330 1001041 950442 455207 -17691 -67169
35172 -67169 95335 73723 -100756 -169428 -133917 -102307 76271 525102 896975 759638
35162 759638 303562 114610 291068 353589 72406 -185866 -94315 156063 250186 206990
35152 206990 175245 107081 -78179 -252305 -260935 -156986 -37017 166344 507353 798070
35142 798070 781910 456635 73814 -113641 -28419 184452 230786 -49776 -418317 -453959
35132 -453959 -100561 244752 280969 160461 148702 221383 225884 189567 202256 195807 106169
35121 106169 74937 224257 395771 372130 191535 -8112 -246472 -503308 -502391 -86851
35111 -86851 382502 453094 256157 262134 479786 486518 234830 165949 384066 384507 -90016
35100 -90016 -519299 -371948 73095 188220 -62925 -194692 7056 299422 492992 666975
35090 666975 901988 1202891 1656302 2267879 2661932 2372166 1503217 727952 518817 703024
35080 703024 880340 944342 1016322 1145990 1309680 1546343 1915646 2416965 3041733 3782840
35070 3782840 4516506 5002557 5074205 4736459 4083665 3268148 2527983 2042721 1753776 1514013
35060 1514013 1362440 1388906 1407288 1171104 926608 1248563 2149609 2845201 2718324 2097651
35050 2097651 1691715 1628841 1546194 1343650 1265353 1338869 1280775 982267 645382 395700
35040 395700 156285 -47602 -51883 88850 70034 -206628 -452349 -401356 -135111 132722
35030 132722 350802 567956 771045 909907 951710 873665 751360 805720 1107578 1279922
35020 1279922 857978 5 -546153 -334878 263907 626971 617042 509510 470666 428782
35010 428782 302114 84259 -200070 -445029 -496234 -376675 -309536 -371032 -334197 -44818
35000 -44818 270919 310696 114520 -69331 -152176 -162842 -7247 401554 863376 1058120
34990 1058120 971101 893027 1003330 1168612 1149545 836371 308637 -188317 -381786 -232000
34980 -232000 8085 99781 64561 19520 -30359 -66835 38594 254180 260671 -87909 -395667
34969 -395667 -210815 278965 472940 183348 -219640 -439897 -536101 -529818 -242627 301428
34959 301428 728797 791197 658330 541868 362043 42609 -156682 53744 493889 633286
34949 633286 207694 -465277 -809594 -551513 37093 422875 339154 -8200 -269820 -331526
34939 -331526 -252259 -34100 283456 447765 243914 -150651 -388830 -452771 -549762 -580649
34929 -580649 -209831 473088 875235 679309 264849 112967 181078 150041 -45995 -249471
34919 -249471 -374038 -377076 -161163 231661 526626 544324 416362 285683 62795 -288610
34909 -288610 -517457 -432421 -223781 -129109 -35814 233127 483993 421004 175251 124264
34899 124264 280538 292390 28429 -237157 -250201 -43609 263877 620162 914079 967273
34889 967273 765334 521229 428703 470640 494857 372098 85405 -243074 -444862 -492799
34879 -492799 -521198 -608312 -679808 -691890 -699272 -626298 -232064 489552 1110997 1225587 915071
34868 915071 536684 258702 56347 -67376 -151247 -343015 -600157 -576531 -139415 288060
34858 288060 304068 152849 291595 620564 723808 629465 646217 611028 92650 -664515
34848 -664515 -822395 -145181 627464 858136 782406 883038 1128859 1245998 1219007 1096601
34838 1096601 749089 233234 -14895 228664 562951 545081 318982 244339 278809 224044
34828 224044 252214 612702 1034260 1009496 576693 274216 339118 451918 325081 90457
34818 90457 -35778 -125385 -382798 -795797 -1071082 -870043 -141851 704766 1084772 832420
34808 832420 382321 202924 233219 113164 -208260 -427194 -376256 -237125 -226459 -301362
34798 -301362 -248443 49638 465671 717813 666229 500821 470063 468772 217285 -135063
34788 -135063 -66774 467556 782915 439873 -31463 63638 479721 442211 -95893 -395461
34778 -395461 -61264 525478 952293 1227258 1346162 1115085 659680 477309 667672 695104
34768 695104 274204 -86049 109259 500425 423232 -66888 -338467 -122675 291118 656031
34758 656031 954899 1019463 578150 -171100 -535848 -124075 665185 1151314 1090183 686432
34748 686432 178926 -279400 -491368 -308822 121515 419115 333052 -68348 -560343 -946814
34738 -946814 -1042279 -675254 91905 816402 975616 485303 -217144 -668630 -808034 -809262
34728 -809262 -686195 -327155 146597 371798 189367 -122845 -205354 -46345 104076 132377
34718 132377 180269 395151 730388 1028761 1194678 1226743 1137919 913144 562862 196874
34708 196874 -4784 54944 272506 431045 415750 304070 248025 328965 534968 801944
34698 801944 1032051 1128695 1074982 958125 873788 817707 706758 502956 279469 141457
34688 141457 99867 67142 -7982 -51693 39667 252576 468208 586184 565060 405735 222518
34677 222518 259767 625738 1025322 1015270 574435 147032 31769 48470 -23178 -35276
34667 -35276 194204 449912 428359 266726 325791 590966 750466 778101 945652 1278175
34657 1278175 1501643 1571397 1739807 2001153 1998965 1666473 1439999 1570271 1704197 1481315
34647 1481315 1098539 884834 717703 339202 -67413 -150266 -34924 -162939 -575688 -847007
34637 -847007 -710773 -331869 50611 357539 516192 428721 156831 -136922 -436514 -785742
34627 -785742 -1002956 -833296 -379149 -2899 229207 601516 1162364 1514334 1384802 1031794
34617 1031794 835327 811283 815472 924866 1232331 1456977 1198138 563809 188936 535730
34607 535730 1395618 2158275 2400197 2136287 1652462 1231237 1002959 964023 1079533 1332079
34597 1332079 1676555 2021305 2302343 2525853 2698838 2795781 2867812 3111081 3710494 4628391
34587 4628391 5619409 6419435 6848207 6802252 6308147 5591201 4944965 4478498 4096000 3752820
34577 3752820 3567501 3572574 3520712 3169466 2705221 2613412 3048236 3561325 3625594 3263021
34567 3263021 2925972 2857484 2862124 2730140 2585216 2638013 2791990 2737873 2382858 1973711
34557 1973711 1765843 1732269 1690042 1622694 1737192 2161224 2673318 2872945 2656050 2386374
34547 2386374 2464650 2827511 3074672 3042155 2971999 3058208 3128710 2974560 2761354 2828480
34537 2828480 3192461 3530969 3627818 3584018 3579419 3663043 3844348 4190222 4707127 5240350
34527 5240350 5619067 5893950 6386966 7482192 9313719 11636418 14078420 16521096 19017926
34518 19017926 21205052 22078949 20793019 17687096 14166187 11434260 9606040 8150636
34510 8150636 6827335 5854042 5372098 5185290 5077148 5076665 5261196 5479389 5449746 5071014
34500 5071014 4499586 3946910 3527887 3305748 3311178 3401088 3225759 2551448 1619369 991391
34490 991391 972176 1336241 1681165 1842516 1835344 1626970 1233123 893885 841990 940139
34480 940139 828635 413624 -65908 -429196 -678430 -722416 -391932 125455 284075 -100646
34470 -100646 -472465 -243975 378155 722918 633341 579800 814593 988100 802618 551851
34460 551851 643912 929189 947702 654169 423320 396025 313821 83055 10477 228066
34450 228066 317051 -71881 -515584 -284637 567859 1151563 890529 217335 -149641 -171120
34440 -171120 -284531 -523774 -411327 271706 1082794 1449091 1290227 926826 608284 377195
34430 377195 281872 443082 838846 1185565 1200428 977792 935582 1263228 1567233 1336605
34420 1336605 719950 454468 878154 1406423 1316905 735691 373200 465327 542259 256293
34410 256293 -113812 -165018 69372 330169 582806 958872 1430353 1781572 1816593 1503879
34400 1503879 1075553 1018671 1678602 2741917 3408406 3260749 2681921 2213794 1850308
34391 1850308 1304028 672077 349876 387045 393211 126789 -183318 -194479 145290 639646
34381 639646 1057506 1203609 984255 554572 277255 379739 684171 787234 526187 185832
34371 185832 152137 381906 400027 -44533 -512756 -381922 257610 638189 339777 -161074
34361 -161074 -208234 169137 471230 479449 338457 114355 -216590 -449821 -345854 -127868
34351 -127868 -273463 -742404 -922154 -518037 -28696 -51300 -485807 -775333 -672618 -395416
34341 -395416 -172414 781 190526 410021 702018 1106414 1488459 1579758 1286237 854694
34331 854694 647996 803673 1169637 1523076 1759777 1873938 1872730 1797532 1749034 1755667 1662523
34320 1662523 1331706 944033 858467 1095680 1227177 952029 544167 477227 792690 1129657
34310 1129657 1241543 1174950 1046783 977788 1166162 1658780 2079532 1968709 1416845 989905
34300 989905 982934 1141587 1197808 1232498 1320901 1252694 915685 632082 759342 1164886 1417833
34289 1417833 1353700 1163290 1038959 1000947 1003564 995690 927646 846995 894978 1078809 1179714
34278 1179714 1025350 706479 394084 134673 -17895 92465 453746 738266 699389 525370
34268 525370 506404 546559 366138 36692 -99742 21489 128033 91063 77801 192408
34258 192408 336552 492754 786146 1162022 1343436 1246245 1122501 1135153 1092023 799200
34248 799200 416925 243694 350690 620088 933520 1121647 957305 469655 88583 170136
34238 170136 480201 453732 -68890 -642591 -766433 -391691 159464 569347 733658 746337
34228 746337 774426 882503 950194 825114 542499 295800 200399 201296 217382 248088 299103
34217 299103 315155 255499 174472 172186 285502 433592 455642 256364 -24762 -74432 228015
34206 228015 573036 561838 285172 301044 916039 1714406 2013232 1647657 1068461 735362
34196 735362 678863 685836 669071 714594 895662 1189265 1546362 1949565 2381103 2754974
34186 2754974 2905162 2698403 2197077 1647497 1244252 987964 859976 986003 1406434
34177 1406434 1787501 1690407 1154066 675567 508086 340064 -107635 -523762 -434988 27988
34167 27988 253735 -13660 -389185 -451313 -260411 -141403 -231798 -401362 -432572 -179809
34157 -179809 282816 626607 585152 336563 318897 625536 891808 858208 669650 450137
34147 450137 9167 -696687 -1177940 -956679 -280497 192663 296709 433194 775660 949600
34137 949600 659924 182829 -28578 82013 255338 343101 391361 433644 422622 311285
34127 311285 92488 -149866 -179638 214201 878912 1348211 1380615 1240853 1270950 1419649
34117 1419649 1452701 1395355 1394957 1300499 841421 208042 -30337 282930 619153 513737
34107 513737 194311 120589 228427 111166 -217509 -287596 73302 452432 487986 359997
34097 359997 372739 421966 285572 194534 593271 1362582 1781676 1421778 696712 290840
34087 290840 340927 494554 565989 728541 1076452 1359984 1290819 895655 431891 102857
34077 102857 -18359 81880 337481 579523 689439 748449 900656 1096026 1137194 997648
34067 997648 899250 972201 1009479 747106 291970 32728 118016 257397 145801 -101815
34057 -101815 -120166 203721 607771 832253 930763 1119631 1438728 1696152 1722124 1551918
34047 1551918 1317987 1078936 884379 934989 1428856 2155752 2492621 2062215 1260664 816044
34037 816044 887815 982338 784836 622108 897807 1465568 1876195 1945383 1740275 1281857
34027 1281857 668225 280332 410459 804478 993819 963707 1041706 1238278 1238691 1029844
34017 1029844 969558 1156743 1273626 1177109 1108905 1151742 1035638 730337 672793 1061862
34007 1061862 1437799 1380608 1172951 1286242 1584977 1578298 1201575 824167 646124 555911
33997 555911 473812 435727 433840 489795 720185 1030345 1003013 474600 -50643 -24312 357041
33986 357041 515425 430084 587352 1085175 1442908 1370615 1159235 1160280 1337833 1494943
33976 1494943 1578174 1624740 1686101 1849225 2083559 2133766 1866172 1576942 1558542 1541954
33966 1541954 1102287 473693 297188 584988 663582 257870 -105604 -22450 164250 34427
33956 34427 -220088 -223160 -27963 171422 518845 1173883 1818778 1991441 1725094 1437838
33946 1437838 1339501 1325050 1331908 1438987 1649646 1843933 1935810 1923968 1838451 1727652 1610797
33935 1610797 1416677 1115836 889220 931106 1114661 1159740 1103249 1214133 1447829 1467171
33925 1467171 1273700 1279618 1588695 1759792 1544553 1331710 1528601 1983729 2385178 2768924
33915 2768924 3217200 3475886 3346700 3138330 3273088 3689409 4014450 4081729 3934419 3588245
33905 3588245 3150632 2933424 3108205 3447545 3658101 3738385 3821519 3964300 4249345 4734812
33895 4734812 5180470 5270764 5201446 5466423 5962265 6058700 5765203 5930034 6884023 7821177
33885 7821177 8096318 8231889 8940198 9997333 10856268 11579764 12395297 13154274 14025445
33876 14025445 15812538 18714138 21750132 24346033 27364907 31544005 36274447 41228906
33868 41228906 47650304 56411599 66599024 78167818 94076980 117174168 147464765
33861 147464765 186237596 239130513 306408332 369347938 396078230 368637611 301399160
33854 301399160 227738711 171005434 132751554 104720126 82649448 66588434 55350022
33847 55350022 46308158 38455814 32225553 27380094 23225124 19907936 17781325 16245535
33839 16245535 14515661 12779547 11506869 10373336 8886779 7383618 6448580 5937249
33831 5937249 5401228 4899814 4625186 4310543 3769348 3456399 3722386 4033215 3723481
33822 3723481 3073948 2825857 2974954 2863979 2258491 1576929 1152932 917288 774681
33813 774681 752220 767926 672223 520751 503723 661939 900475 1140765 1249711 1042882
33803 1042882 608295 375378 571931 858064 810160 527726 419180 595072 825270 924870
33793 924870 837350 479792 -147151 -775896 -1084215 -1034638 -812088 -554581 -344666 -308628
33783 -308628 -491411 -744902 -912350 -991120 -1002713 -927706 -900256 -1168349 -1662915 -1918594
33773 -1918594 -1660058 -1141675 -653853 -104256 539839 847743 543450 189056 530620
33764 530620 1309378 1494168 752047 -63011 -142691 216380 224876 -219953 -545920 -460823
33754 -460823 -302850 -414015 -648555 -715550 -694229 -889116 -1287939 -1494478 -1263774 -839894
33744 -839894 -595838 -539950 -421201 -176591 47751 252406 570716 848441 654175 -80732
33734 -80732 -763296 -769008 -163145 461138 681145 526419 233511 12958 -26762 32131
33724 32131 -37285 -301853 -526850 -507493 -363420 -278303 -151499 169501 465086 341713
33714 341713 -193331 -714579 -930126 -912738 -774948 -486377 -103512 160516 243238 324276
33704 324276 453139 367757 -94902 -643404 -871181 -804617 -802715 -967631 -993436 -688436
33694 -688436 -351295 -386221 -695429 -762200 -353703 148663 264987 24406 -189884 -232396
33684 -232396 -283713 -392400 -319507 51131 476480 704310 786358 842253 775039 488627
33674 488627 179378 104238 194603 197076 86701 23579 -26159 -266147 -641696 -774547 -460011
33663 -460011 1282 128705 -204933 -681205 -897628 -733094 -398390 -199229 -268251 -508918
33653 -508918 -728125 -742992 -430195 142832 643376 767521 662099 784637 1237487 1554925
33643 1554925 1351867 869131 579763 531181 443130 232059 18295 -221854 -551856 -720873
33633 -720873 -395667 264341 713629 724657 555117 396184 149772 -140565 -150943 200098
33623 200098 518414 490107 304295 255366 289338 267372 340202 656788 949209 840569
33613 840569 413028 55666 -140380 -394039 -685903 -687541 -360124 -190309 -552303 -1112331
33603 -1112331 -1202192 -666494 -16250 261863 245081 288161 440476 439279 222858 121016
33593 121016 394493 815075 938665 683879 395629 375045 587101 844199 1034164 1086736
33583 1086736 931681 639451 470574 631579 1032582 1377784 1450636 1251986 921254 599697
33573 599697 350374 165541 38814 -7180 -2027 -69666 -285534 -525349 -577159 -399600
33563 -399600 -158430 -7242 57967 118076 209169 304123 348674 315841 262383 273849 300880
33552 300880 157816 -213565 -596264 -751084 -701388 -612635 -528098 -423658 -380539 -446396
33542 -446396 -439090 -175889 183946 316559 177648 -31421 -249193 -548614 -810232 -801603
33532 -801603 -575192 -394313 -264637 39244 462893 650240 505250 319068 250684 157696
33522 157696 37746 96598 224349 -2839 -555302 -794769 -418868 54804 173650 289610
33512 289610 839772 1462345 1560182 1315857 1338593 1583226 1469093 955642 663498 884190
33502 884190 1228412 1404565 1662475 2208334 2729065 2806556 2434871 1902553 1460678 1248947
33492 1248947 1263292 1298132 1175098 1026927 1050341 1061327 741118 280169 224044 608702
33482 608702 829327 548132 169677 144101 323201 361597 296959 313035 293209 53959
33472 53959 -241913 -316813 -217026 -153410 -96468 107908 376207 487248 435309 408850 545209
33461 545209 919416 1546547 2132409 2121636 1384971 609160 556143 1138806 1694391 1928430
33451 1928430 1983080 1777478 1099142 379483 493292 1481916 2274775 2162699 1826903 2234738
33441 2234738 3122030 3465338 3107893 2909578 3323602 3795830 3798250 3617074 3725551 4060007
33431 4060007 4382190 4787036 5344046 5742030 5862807 6275265 7522223 9253836 10728334
33422 10728334 11895678 13313364 15272070 17774818 21141415 25784116 31645195 38871076
33414 38871076 48612866 61305268 73708171 79647649 75363319 63392142 49975487
33407 49975487 39347166 31726472 25855786 21258254 17798461 14924253 12313363 10311151
33399 10311151 9059947 7974659 6639184 5481925 4962507 4730148 4227335 3601123 3343785
33390 3343785 3411952 3362457 3121547 3011135 3123541 3178742 2976112 2607900 2232741 1915554
33380 1915554 1678065 1515546 1395217 1342118 1432943 1634828 1774578 1693900 1298045 544017
33370 544017 -347950 -808074 -487749 152931 371478 229468 467298 1203884 1588782 1097402
33360 1097402 380776 275605 636023 806215 699484 659495 647963 344132 -169857 -503744
33350 -503744 -593418 -671475 -761936 -719325 -594455 -493632 -307253 -27951 -1943 -340194
33340 -340194 -480240 16185 624835 584552 102193 -56212 104700 -88185 -659233 -845683
33330 -845683 -365854 177093 354985 449992 683169 796385 709579 758112 944944 774135
33320 774135 188413 -148914 79740 317541 145486 1079 306110 657353 574485 367929
33310 367929 512954 752385 606788 273432 215067 280802 50806 -298559 -299273 -84220
33300 -84220 -157760 -477760 -562318 -359849 -226754 -144671 238437 802018 959891 552265
33290 552265 59988 -154217 -203782 -218445 -138381 -43481 -104013 -143072 166157 639493 772636
33279 772636 642688 870272 1519055 1825048 1349789 665733 445465 524003 412492 190875
33269 190875 250767 530986 640799 510260 366984 248249 46677 -105581 2018 205660
33259 205660 150437 -116394 -186982 64320 308572 305633 232444 321754 478339 452648 210726
33248 210726 -52632 -184347 -224115 -292318 -373184 -245646 281953 1027096 1458782 1216904
33238 1216904 540592 34274 50984 439511 840342 1044827 1054284 956276 821618 653393
33228 653393 407626 110631 -73069 3016 225691 245507 -169463 -829976 -1265651 -1222722
33218 -1222722 -973201 -1010698 -1422601 -1736861 -1521500 -962483 -585709 -507728 -332625 162742
33208 162742 634296 661546 318442 -21601 -208239 -316862 -308118 -74349 225073 248997
33198 248997 -46109 -309373 -276869 -109037 -121127 -361442 -604381 -653740 -523694 -354700
33188 -354700 -213687 17765 499930 1111196 1386119 989990 218704 -239885 -101722 210825
33178 210825 178024 -162589 -381296 -275830 -42976 73586 22516 -148019 -353548 -404822
33168 -404822 -124691 366834 679171 578382 234316 -47686 -150267 -74480 216305 636744
33158 636744 844758 598584 170138 54119 281492 404338 221679 88849 305920 608572
33148 608572 609499 430290 461790 692663 747339 514924 279937 211373 147504 -31555 -196748
33137 -196748 -238883 -197590 -28954 378937 835001 909616 578769 385655 666460 1018350
33127 1018350 933762 609011 609261 961511 1156315 976659 763427 791008 868091 719238
33117 719238 378589 18983 -297461 -501767 -412253 25260 545365 789029 630196 195513
33107 195513 -301400 -656182 -742902 -589633 -307033 65589 501328 793893 673810 198798
33097 198798 -197358 -178104 143436 433273 535120 510723 458599 455547 550838 674494 659194
33086 659194 464286 252839 148377 76536 -29757 -48085 146006 466375 755865 974330
33076 974330 1076201 905214 455878 55413 -14640 67948 -39674 -273844 -296899 -129501
33066 -129501 -157704 -439578 -507641 -86288 428301 536126 339680 278483 401074 377314
33056 377314 141689 32984 212887 352101 92400 -445619 -827942 -817999 -543821 -263804
33046 -263804 -118515 -60707 50416 226340 222359 -193345 -814731 -1118192 -958861 -842491
33036 -842491 -1201170 -1657380 -1467005 -585141 229420 415213 187475 -54755 -362724 -903403
33026 -903403 -1405961 -1450133 -1094543 -742914 -512735 -199698 204569 448487 499113 625110
33016 625110 898819 1021516 790756 390967 63340 -197987 -466490 -689388 -805743 -780022
33006 -780022 -452505 264614 952405 944179 246382 -310630 -181027 147761 -24101 -528596
32996 -528596 -693851 -417284 -154029 -63328 71677 181129 -39247 -387071 -263929 303038
32986 303038 511267 -46482 -747570 -863359 -503474 -176595 36648 306258 481488 325433
32976 325433 54970 59034 246897 212249 -76811 -267434 -230374 -190198 -269448 -351841 -405426
32965 -405426 -525382 -638863 -571562 -435857 -541853 -859653 -980369 -726140 -415767 -369561
32955 -369561 -493366 -529979 -418993 -229528 -22548 41736 -238787 -715950 -845331 -336606
32945 -336606 356344 520808 35378 -575705 -857695 -862269 -853109 -891881 -876266 -812042 -842090
32934 -842090 -1012280 -1136398 -975115 -533300 -102435 36378 -102878 -275397 -276585 -59145
32924 -59145 317860 687057 788191 507634 93482 -92682 -47335 -96942 -365659 -576365
32914 -576365 -502341 -312761 -265151 -317982 -303084 -255042 -263508 -181079 155976 513958 465318
32903 465318 20075 -316364 -221355 27781 -7482 -318938 -520539 -384088 -60167 193280
32893 193280 278612 210697 -11212 -336828 -548568 -404074 43437 411218 415102 245296
32883 245296 313699 641240 745681 244435 -638436 -1335089 -1544655 -1381407 -1049702 -657129
32873 -657129 -336630 -263955 -416358 -472369 -120810 553038 1091945 1112835 697894 290324
32863 290324 188432 229697 75127 -279449 -491332 -378308 -176875 -165048 -253161 -160464
32853 -160464 145023 400477 361681 -3268 -536659 -949268 -976260 -657681 -354755 -324242
32843 -324242 -430494 -456265 -457654 -513761 -377489 166680 741372 716017 112564 -370243
32833 -370243 -354014 -267676 -589078 -1076260 -1148613 -733423 -322419 -320906 -661087 -994474
32823 -994474 -1032486 -738405 -341350 -124646 -136823 -203402 -218570 -220978 -177705 -610 153984
32812 153984 -24529 -450049 -577845 -156946 341672 403359 211752 246105 434184 301309
32802 301309 -159031 -385707 -92676 315350 355516 95590 -59079 71462 322433 467951
32792 467951 447970 384121 442583 626428 730774 607328 400518 360843 505081 661183
32782 661183 758620 815587 707955 272180 -347628 -758092 -785254 -634004 -532189 -469770
32772 -469770 -348369 -131633 234443 804631 1428797 1765813 1611856 1082050 449897 -24214
32762 -24214 -145555 67841 282613 169175 -163459 -345950 -352647 -533035 -962022 -1193385
32752 -1193385 -870796 -226219 277213 502564 599432 683860 809849 1019404 1182393 1013070
32742 1013070 467395 -104266 -397383 -479073 -477992 -291423 110294 424263 424345 342809 460895
32731 460895 601064 462007 200290 178316 326174 279495 17548 -165223 -217242 -304315
32721 -304315 -301498 81063 654476 853410 574797 313271 324969 288705 29764 -70416
32711 -70416 223633 455827 141489 -440572 -648568 -373970 -28152 140020 203631 185809
32701 185809 34925 -80179 98613 479415 681882 550996 282984 49614 -153640 -263637
32691 -263637 -121520 204984 378707 221187 -42969 -106040 37939 146999 26981 -315190
32681 -315190 -685156 -808756 -564676 -161237 61947 47644 66654 300893 589037 701272
32671 701272 672266 684560 757761 752764 609289 386477 100359 -287254 -691850 -882517
32661 -882517 -722609 -352211 -57128 1379 -124200 -303277 -472787 -639233 -798592 -905735
32651 -905735 -906925 -753653 -392536 173679 764020 1039705 778814 145189 -418653 -612936
32641 -612936 -525755 -428543 -435543 -459452 -415420 -311492 -151308 89099 339123 432665 322175
32630 322175 175162 134989 92045 -133041 -448542 -563415 -411470 -268740 -361739 -570103
32620 -570103 -652616 -576740 -446151 -277398 -84928 -48839 -299339 -593886 -528421 -94398
32610 -94398 271680 265364 56515 -60829 -83240 -173627 -342620 -483259 -579221 -657857 -634830
32599 -634830 -416347 -101497 96529 100564 8394 -65318 -60303 49344 212109 299795 281719
32588 281719 320801 546998 813518 860604 677463 512455 526293 602152 528818 254731
32578 254731 -65066 -210725 -108307 58588 31279 -179289 -284018 -153006 -49851 -223658
32568 -223658 -469699 -401778 -31207 270165 317825 273670 284998 329276 433636 677130
32558 677130 918104 885262 615526 428649 392519 251507 10003 65735 501969 780976
32548 780976 552675 275603 477174 815174 603790 27201 -30702 600007 977723 381154
32538 381154 -642090 -1054469 -696525 -305003 -397678 -711903 -761594 -505422 -284961 -324937
32528 -324937 -480666 -442904 -112279 265826 364563 132811 -205310 -466572 -638339 -676727
32518 -676727 -434763 56981 451839 458741 227230 135141 283965 447661 471851 460521
32508 460521 544492 697094 841901 952224 981238 883263 787517 954536 1423405 1868620
32498 1868620 1986784 1903602 1977796 2251181 2334372 1907610 1172269 682207 779063 1276049
32488 1276049 1685711 1699967 1419234 1137955 997965 951716 1015630 1339293 1905537 2351626
32478 2351626 2337196 2018662 1884109 2103567 2321525 2177690 1752051 1327964 981126 668444
32468 668444 519250 687066 998474 1110141 1021727 1083185 1406355 1606725 1325801 759909
32458 759909 417965 488574 676837 605916 194660 -335344 -680164 -681235 -427096 -135419
32448 -135419 73704 212263 241046 38752 -345521 -583508 -387451 152081 681486 936907
32438 936907 864842 543874 171089 131 82882 171574 77353 -6706 201808 585296
32428 585296 759623 627871 432020 267534 -30829 -426234 -528609 -129223 445443 777014
32418 777014 889290 1060846 1322377 1452713 1337375 1038708 607267 103881 -260295 -290583
32408 -290583 -99006 22174 12527 82985 322820 522952 486280 313306 243855 338401 446203
32397 446203 426021 288405 125154 -37593 -275279 -628062 -942620 -945370 -548529 -21801
32387 -21801 243775 125601 -153060 -308646 -272178 -183412 -188967 -276879 -300754 -169197 24013
32376 24013 127751 154933 242781 403975 507047 534306 616307 714137 559310 125511 -112565
32365 -112565 271671 1018729 1467302 1392964 1184522 1202394 1353470 1385385 1259189 1076345
32355 1076345 882861 689627 506398 266664 -101345 -473755 -608421 -482101 -334782
32346 -334782 -321876 -357506 -362700 -394574 -425254 -277714 56192 281507 165245 -168015 -460868
32335 -460868 -633325 -714668 -688004 -582241 -524971 -547640 -537706 -501974 -604199 -792507 -728560
32324 -728560 -324394 -6314 -127756 -433997 -478255 -276414 -124715 -36416 138790 233153
32314 233153 -50088 -559737 -829783 -737344 -531203 -271085 196266 700973 797699 468042
32304 468042 220157 325244 479290 407099 266913 218992 133287 34698 303583 1015487
32294 1015487 1541328 1295939 543105 -13895 -135129 -54276 114236 393834 535315 189764
32284 189764 -501078 -973632 -962364 -767730 -757025 -944000 -1133889 -1196922 -1118086 -978265
32274 -978265 -913163 -942871 -911234 -758887 -702811 -901127 -1117164 -1047192 -835497 -877751 -1207608
32263 -1207608 -1479517 -1493389 -1321202 -973338 -409446 126249 281305 165061 247991 604242
32253 604242 780497 564244 316303 289121 186821 -209661 -489941 -193480 433866 796877
32243 796877 789209 737222 721413 538385 238322 107764 92128 -204889 -802243 -1115448
32233 -1115448 -712590 55382 479720 332382 3143 -72065 145556 404242 499748 427540
32223 427540 293022 182107 146995 237965 430572 532307 319215 -171880 -628976 -819132
32213 -819132 -800588 -698422 -497076 -232677 -146091 -343819 -484910 -180774 381522 621607
32203 621607 364677 32793 -44990 -71168 -306926 -544095 -403637 64949 456998 592260
32193 592260 681507 909542 1137600 1110990 783119 341471 26599 -1567 288592 785377
32183 785377 1273413 1529459 1404532 870484 62557 -729379 -1207427 -1272219 -1063839 -769635
32173 -769635 -437119 -34843 358049 571843 598943 669470 925282 1125258 907383 333910
32163 333910 -86864 -18906 294015 402480 234822 79024 117020 242362 296496 248887
32153 248887 135600 -357 -105442 -188066 -336750 -508892 -418064 106642 722411 861272
32143 861272 431845 -86844 -307973 -357797 -510440 -726859 -770432 -551382 -155188 286751
32133 286751 591147 588898 368274 250255 351483 398127 167770 -142459 -242815 -181871
32123 -181871 -127515 24626 395950 673896 447337 -64826 -180406 268804 665883 516687
32113 516687 124543 24076 171624 176625 66252 251907 776588 1115251 860890 219326
32103 219326 -372855 -788349 -1082993 -1102034 -651676 -6420 216713 -147023 -511052 -332587
32093 -332587 71223 -50731 -747506 -1196500 -819750 -95430 90910 -415893 -991382 -1157100
32083 -1157100 -1075369 -1095182 -1219510 -1191933 -863038 -321858 174936 326767 21357 -478204
32073 -478204 -749357 -679258 -541191 -556126 -617149 -561417 -470695 -510080 -646879 -730592 -721884
32062 -721884 -668202 -586069 -539960 -682342 -1003847 -1198092 -1038768 -760895 -744060 -898563
32052 -898563 -762546 -242828 159532 44961 -318753 -421789 -253006 -238654 -546355 -851534
32042 -851534 -857727 -705909 -685783 -802778 -917659 -1170257 -1877034 -2922958 -3583884 -3231294
32032 -3231294 -2085104 -990053 -478917 -341890 -164094 50209 22414 -262099 -498032
32023 -498032 -485967 -315320 -110281 115107 266633 126867 -303280 -638617 -550721 -255413
32013 -255413 -266108 -681330 -1016671 -839055 -312692 76231 158427 169024 247604 170437
32003 170437 -270365 -838280 -1073383 -893218 -693315 -762094 -854619 -582799 -63744 178741
31993 178741 -22229 -178792 188153 867216 1245399 1106510 771019 510873 262594 8724
31983 8724 1550 338020 648365 570682 307627 302770 516238 504113 187176 12073 212872
31972 212872 412700 246308 -37592 6587 304986 430080 303640 237463 327540 308996
31962 308996 91940 -16493 185238 439345 429522 259103 257329 505924 824604 1081892
31952 1081892 1254789 1272819 1058977 693069 335835 30434 -241770 -377112 -253424 -4009
31942 -4009 45139 -237827 -639399 -877041 -869372 -698483 -476839 -320037 -299931 -335867 -247888
31931 -247888 5361 245641 295506 170961 -5180 -151586 -205734 -93909 143191 303674
31921 303674 255346 135670 166696 339653 462806 471929 469847 453158 259302 -107661 -334195
31910 -334195 -184884 122987 187353 -13828 -123948 2611 44843 -259045 -593114 -413488
31900 -413488 268035 819868 789573 445647 325747 501811 603683 437267 207228 103975
31890 103975 16457 -200501 -450251 -597351 -730610 -952005 -1050393 -724005 -107361 259154
31880 259154 88153 -283433 -329000 57859 551747 830364 823025 628364 389911 225770
31870 225770 144568 72583 54625 288434 779159 1115410 896630 321791 -4154 118630
31860 118630 253733 49351 -204844 -45393 432382 709734 566676 262271 37469 -149671
31850 -149671 -318190 -277488 42357 331313 229828 -204588 -584291 -689118 -681536 -820441
31840 -820441 -1117828 -1338648 -1250362 -806210 -141100 512939 904880 885964 567834 294331
31830 294331 288043 331353 9865 -660853 -1097843 -824995 -88780 450576 500588 313997
31820 313997 179536 93688 -32105 -160699 -234442 -259894 -200584 15531 327734 586941
31810 586941 793573 1045917 1232134 1093213 681337 416526 519865 693768 563079 156381
31800 156381 -257327 -530363 -604000 -403219 -45874 106804 -73236 -189311 146191 689656
31790 689656 861213 521702 81453 -69293 104078 421673 637525 540626 216642 83038
31780 83038 346987 607902 382024 -175750 -537584 -593171 -607689 -550506 -170893 280582
31770 280582 183740 -447452 -845291 -639190 -387417 -565898 -744852 -348812 349470 674833
31760 674833 559708 403862 250777 -133731 -534226 -419772 170213 555256 362516 -17828
31750 -17828 -93741 108355 293580 341677 255313 11360 -282575 -356883 -147814 23734
31740 23734 -135205 -489193 -703948 -705141 -668313 -675182 -640866 -541491 -474412 -458309 -361874
31729 -361874 -117278 124102 175061 98887 168359 501658 862626 936905 730862 531333
31719 531333 490011 454114 269267 40579 -51433 -32410 -47000 -102573 -102824 -72140 -132872
31708 -132872 -262280 -265085 -43645 235748 316904 125115 -184560 -405760 -451350 -343164
31698 -343164 -100360 247251 522664 467739 93231 -216224 -190185 -90193 -279372 -533671
31688 -533671 -328068 207733 298300 -301187 -821616 -593069 -26753 97208 -193404 -317885
31678 -317885 -194172 -211730 -348967 -166530 330341 609951 490997 387209 525789 594767
31668 594767 375058 97984 -63590 -264347 -490113 -391388 64231 336921 94124 -245618
31658 -245618 -134561 382500 929469 1324203 1461730 1144220 468445 -41338 -116268 -117648
31648 -117648 -306919 -296292 190389 572488 215137 -454971 -538788 -82160 88346 -170134
31638 -170134 -93882 587160 1046803 589989 -317324 -783645 -669149 -476478 -491639 -577996
31628 -577996 -571717 -429669 -136282 215140 406361 406881 500985 857895 1192923 1128501 706355
31617 706355 274486 32322 -48990 -5672 143792 298959 380712 453934 582728 697956
31607 697956 775938 963861 1302601 1507081 1304488 857987 566121 555497 675101 876296
31597 876296 1215314 1514332 1445279 1046020 780247 913563 1143384 1065885 742128 522828
31587 522828 506843 499149 413373 387401 491275 603835 638811 645238 599540 355416 -41686
31576 -41686 -225970 52002 503077 592149 195412 -289785 -458232 -254307 167671 620055
31566 620055 848942 646688 154632 -209719 -286419 -356452 -603292 -724716 -409383 77423
31556 77423 218448 -9779 -185675 -169633 -283973 -701514 -1111851 -1172757 -941951 -665527
31546 -665527 -425390 -199098 -35797 26545 44359 23320 -127761 -371888 -478037 -329058
31536 -329058 -106842 -28537 -89571 -205704 -388648 -601771 -655525 -464036 -228888 -151998
31526 -151998 -138915 -24215 74181 -86825 -461549 -742799 -766243 -648237 -538625 -451030
31516 -451030 -348900 -235603 -144233 -129660 -220032 -300560 -174133 141539 344352 255619
31506 255619 119357 243583 499952 503603 202019 -71111 -118039 -100032 -181498 -282801
31496 -282801 -313925 -376226 -560321 -746201 -774868 -672947 -559982 -454730 -315848 -184147
31486 -184147 -146337 -198745 -246947 -228479 -186401 -227161 -401924 -604256 -632492 -422162 -155179
31475 -155179 -30292 8030 150832 372378 399898 78187 -400205 -709880 -743268 -689513
31465 -689513 -805628 -1107261 -1276080 -986676 -385894 -35659 -193774 -403438 -149048 297669
31455 297669 227336 -372194 -691790 -294151 217953 133309 -317703 -438865 -213878 -242279
31445 -242279 -656209 -856070 -473173 32637 57342 -311152 -529735 -395358 -204552 -243034
31435 -243034 -473221 -723697 -903262 -947205 -747050 -277763 260088 542517 431425 173415
31425 173415 196602 616015 1011057 877052 300361 -56395 237114 811113 963679 529119
31415 529119 -39843 -382169 -611098 -880798 -977426 -671065 -239193 -217751 -662750 -1042359
31405 -1042359 -957312 -641728 -554520 -724097 -779559 -514745 -131036 93973 157980 265202
31395 265202 520137 784476 836639 657927 513042 647564 923589 954606 672538 496434
31385 496434 724512 1012195 819998 224726 -179125 -163250 -137190 -406631 -672123 -570171
31375 -570171 -289138 -220238 -293570 -155314 156297 233620 -12588 -166402 78455 492932
31365 492932 656632 436930 -16118 -477766 -687611 -447216 87980 399742 138314 -433032
31355 -433032 -721753 -460455 84419 470220 464586 145751 -176784 -154490 293491 817624
31345 817624 917461 450535 -206750 -537637 -371376 13223 201135 26136 -324908 -556178
31335 -556178 -568222 -473289 -358897 -189846 19379 116469 22270 -114924 -134949 -100985 -126829
31324 -126829 -119436 18695 40821 -387477 -1053512 -1255458 -692739 65965 300005 36880
31314 36880 -133872 45222 227279 47541 -411853 -812408 -909718 -631988 -81861 431014
31304 431014 592866 441899 330326 438779 539050 353047 -63955 -439501 -595458 -510810
31294 -510810 -274246 -117901 -270469 -591074 -597377 -117116 325984 129644 -543246 -934591
31284 -934591 -634547 38123 583076 835757 867290 752244 593811 492582 352668 -22913
31274 -22913 -540691 -819365 -714829 -515878 -434168 -255906 211153 672003 726347 495142
31264 495142 417398 530347 415755 -115172 -697079 -892163 -693509 -419547 -343585 -539251
31254 -539251 -880826 -1084689 -937459 -586090 -423930 -593231 -790765 -685708 -342475 -77386
31244 -77386 -60340 -229935 -460823 -619923 -562867 -277669 36564 217412 385866 730834
31234 730834 1115619 1180486 856896 492199 358108 300284 63464 -251955 -329663 -128447
31224 -128447 48401 -27949 -260263 -435015 -483139 -466848 -484087 -658720 -1042471 -1425603
31214 -1425603 -1438961 -1006361 -531733 -435800 -641273 -754638 -646477 -542253 -561431 -509085
31204 -509085 -231810 98090 230210 179142 140183 193004 264613 309041 368859 481741 609902
31193 609902 630774 378929 -194273 -860375 -1254830 -1260473 -1115716 -1053991 -996344 -738682
31183 -738682 -303594 64544 171506 12148 -263675 -408014 -229871 155156 349070 101201
31173 101201 -396416 -772009 -865242 -695613 -272035 282888 602489 429181 10259 -200443
31163 -200443 -165598 -223346 -469381 -603837 -449105 -215573 -123613 -112237 -73509 -56711 -78220
31152 -78220 -31465 45132 -84385 -446274 -706057 -657062 -557547 -693123 -881003 -765400
31142 -765400 -399200 -143664 -116327 -123864 -76575 -84696 -142942 -93502 19308 -102385 -540129
31131 -540129 -885700 -658108 112452 886890 1173353 981442 728668 759532 996855 1083939
31121 1083939 833012 437353 215906 255781 371827 325881 19471 -426556 -710117 -586891
31111 -586891 -164457 167827 197065 119034 197342 393634 529801 616432 741028 775996
31101 775996 527026 102473 -190728 -286889 -365235 -426235 -253923 107025 222340 -167040
31091 -167040 -732898 -958780 -748487 -394480 -112378 102563 240081 209169 62471 53871
31081 53871 330279 674098 706972 352488 -27833 -51157 201486 279526 -37430 -440264
31071 -440264 -527458 -345558 -235816 -267264 -177754 113478 315087 235848 117666 235021
31061 235021 401500 220113 -278257 -612702 -515906 -304225 -403027 -706622 -691795 -149681
31051 -149681 465955 576060 202163 -86966 87090 513969 813972 957444 1137784 1354714
31041 1354714 1449078 1432288 1433282 1365137 1007371 443055 56531 18635 115498 188718 373883
31030 373883 727201 980465 923679 721533 571085 348575 -64776 -388550 -305160 -24492
31020 -24492 -16578 -276401 -341327 -48991 197700 49669 -296925 -422299 -215993 94206
31010 94206 237764 85066 -274507 -522614 -373336 41914 248071 7856 -374169 -482714
31000 -482714 -330588 -259136 -434021 -664849 -682416 -428413 -80256 112467 39284 -170666
30990 -170666 -311470 -370577 -505307 -729805 -841962 -771832 -763243 -988564 -1177412 -940514
30980 -940514 -373636 -1490 -100400 -385392 -468605 -356154 -306082 -382094 -390344 -211435 -2474
30969 -2474 -25472 -356902 -793667 -1020107 -887054 -556116 -335357 -338539 -357057 -132102 287469
30958 287469 559692 441514 83009 -139079 -45870 180425 285995 298307 458937 818014
30948 818014 1075472 952243 606146 474442 708433 970374 870527 429050 -33030 -317182
30938 -317182 -464082 -532231 -503127 -420438 -398470 -412778 -277041 45862 277476 148957
30928 148957 -215811 -448087 -416428 -345256 -436415 -583546 -563325 -368827 -221109 -308671
30918 -308671 -611928 -953048 -1142857 -1090654 -829728 -460865 -81290 223286 365527 317468
30908 317468 189354 177578 405989 833284 1274640 1471553 1245771 732463 386043 529496
30898 529496 894232 851399 174607 -655394 -1019412 -814330 -393634 -78382 49256 25278
30888 25278 -68783 -123286 -122202 -166833 -250355 -176453 113625 339510 276298 154260 313369
30877 313369 615096 627854 323208 117268 206424 343349 364636 452775 686347 784808
30867 784808 564751 253369 51370 -241464 -802755 -1306608 -1283267 -752063 -119770 366384
30857 366384 691355 777311 538831 152427 -87702 -117439 -22880 218719 564075 674173
30847 674173 331130 -67746 12640 354890 216102 -510377 -1049450 -879231 -459261 -451033
30837 -451033 -771175 -917947 -820156 -794858 -908214 -921547 -762910 -601844 -520437 -481814
30827 -481814 -534059 -674879 -620460 -137273 445266 512702 221 -480881 -455548 -116320
30817 -116320 122128 207605 314262 414748 333375 98404 -50294 24279 226293 383054
30807 383054 379123 164281 -226468 -646415 -915766 -943025 -756630 -475609 -276548 -291178
30797 -291178 -465273 -604382 -631427 -690263 -885414 -1040452 -899926 -507340 -163578 -12102
30787 -12102 94470 246985 262676 6599 -287002 -324213 -270324 -560275 -1142543 -1344778
30777 -1344778 -752939 111620 388367 -46948 -555313 -691443 -661131 -747369 -818977 -685621
30767 -685621 -514206 -514813 -516280 -259016 114069 285005 318819 540695 933491 1116337 929079
30756 929079 607875 329060 2215 -375300 -568743 -493836 -411077 -529784 -711278 -764872
30746 -764872 -756858 -797815 -769906 -515124 -111921 246484 483078 581384 506247 358079 378338
30735 378338 596300 703178 505559 257595 267630 413728 379438 171362 42109 53205
30725 53205 83671 149242 331866 482618 385794 170721 183943 474472 753436 824174 699783
30714 699783 369796 -131053 -482938 -391978 -117051 -145477 -333838 -35322 764978 1184160
30704 1184160 693249 -48069 -183295 79914 -52668 -596506 -770559 -264446 299254
30695 299254 326987 7373 -174218 -140327 -83428 -11293 173156 363095 373613 259747
30685 259747 229658 318805 386844 382178 390313 440248 455248 404740 350591 329805 322054 331113
30673 331113 350458 243878 -143453 -675912 -926362 -658887 -182190 339 -175241 -311157
30663 -311157 -165104 12738 -105133 -432550 -628563 -581645 -479014 -491424 -637153 -888598
30653 -888598 -1161853 -1258700 -1092304 -922258 -1045690 -1271149 -1085510 -420733 152075 184241
30643 184241 -54962 -11633 412977 860609 1032385 888470 493505 -14465 -385409 -453860
30633 -453860 -313809 -116329 155102 483973 599090 292695 -168220 -318326 -123622 23658
30623 23658 -85675 -244150 -237233 -134621 -84227 -115795 -243568 -485136 -676797 -545135
30613 -545135 -97930 293851 344647 172082 30938 -46514 -147021 -177081 89490 682671
30603 682671 1299883 1537752 1252324 711483 353870 332613 363872 128676 -277048 -467356
30593 -467356 -261375 148985 460101 470620 123022 -393001 -644961 -386963 41866 85498
30583 85498 -278873 -541666 -427714 -222416 -234739 -383757 -493099 -568535 -563036 -284116
30573 -284116 192729 412930 160135 -171956 -146075 143267 409389 687881 1055081 1201525
30563 1201525 862206 420640 467534 901633 1090693 860691 674462 767644 745567 261441
30553 261441 -411744 -774171 -709868 -460021 -268831 -261088 -428335 -556875 -374153 97624
30543 97624 520567 649054 545453 354481 146969 50982 211422 496522 560657 348458
30533 348458 222879 417664 681352 682837 465658 245891 49236 -152563 -202907 2516
30523 2516 240333 259340 181802 261238 409252 357714 165283 118085 175205 -15264 -493578
30512 -493578 -833682 -756571 -503925 -405751 -434806 -442436 -514191 -755939 -955373 -827255 -466971
30501 -466971 -201623 -66595 186866 556587 664589 311209 -174098 -366118 -302199 -348009
30491 -348009 -644107 -955593 -1030223 -880922 -703052 -674747 -844426 -1081785 -1152458 -968445
30481 -968445 -726846 -653199 -669515 -529519 -251671 -147125 -364333 -666625 -774023 -694746
30471 -694746 -572207 -412620 -154804 135642 324841 373127 326309 263641 331090 632802
30461 632802 975612 961390 515691 80290 39051 193542 122171 -151902 -245944 -46331
30451 -46331 168268 209013 196516 255894 313763 264724 97003 -166613 -442880 -564172 -525441
30440 -525441 -627492 -1036673 -1350416 -1073964 -451520 -248032 -652921 -1008359 -805166 -343542
30430 -343542 -101067 -22709 110486 87726 -380898 -1011175 -1213494 -880760 -424307 -111811
30420 -111811 166691 480979 634662 462498 84214 -227098 -276238 -46540 289519 493733
30410 493733 504428 472257 476920 396142 196760 120038 347930 695470 897371 994487 1133464
30399 1133464 1187889 957008 601573 474358 579928 589993 372054 130776 16665 -46093
30389 -46093 -98680 -46246 112331 234735 271124 291958 253828 18817 -345535 -559883 -491162
30378 -491162 -279610 -82113 51270 34950 -197375 -427827 -272563 296065 817164 881733
30368 881733 578846 269159 137059 124299 128771 112972 119834 242384 453340 487839 129997
30357 129997 -382768 -552252 -288489 -51173 -183456 -457302 -520839 -469392 -606779 -844527
30347 -844527 -765128 -261079 245409 316962 4600 -289716 -323164 -247431 -355827 -693194
30337 -693194 -986340 -956238 -618617 -227017 -2652 -9493 -202959 -451342 -561373 -444660
30327 -444660 -239623 -142547 -176726 -264291 -408983 -591488 -595105 -228532 325857 682795
30317 682795 744724 718853 684602 514053 240411 110377 183322 239149 167216 72630 -78627
30306 -78627 -473206 -964962 -1052719 -583592 -40953 142284 123576 194881 248764 114573
30296 114573 10233 159464 293709 69686 -287090 -315082 -78047 -8484 -146489 -154643
30286 -154643 -16248 -74280 -344504 -421821 -201324 -96664 -318469 -482847 -258557 59074
30276 59074 24937 -244270 -287781 -49250 29357 -354384 -958352 -1291348 -1109944 -561626
30266 -561626 13589 332158 300010 19084 -294410 -441070 -365124 -179613 -37291 13175
30256 13175 -4477 -106475 -288879 -397921 -283138 -98287 -182153 -559447 -855200 -840018
30246 -840018 -731229 -746833 -725745 -516831 -404389 -701703 -1163114 -1283496 -1018482 -722310
30236 -722310 -512205 -236844 -805 -124378 -533300 -754425 -646324 -605045 -854788 -1036138
30226 -1036138 -780462 -286237 -4174 -47483 -219584 -415818 -720133 -1200556 -1761730 -2141464
30216 -2141464 -2077279 -1649487 -1368445 -1615679 -2072259 -2097966 -1631333 -1223572 -1163745 -1146589
30206 -1146589 -938631 -764028 -769054 -683837 -373490 -197701 -397343 -596751 -398623 -67086
30196 -67086 -95509 -424669 -625819 -594884 -524077 -389017 -10121 489819 772558 754847
30186 754847 602439 386308 135442 64584 311431 585962 521775 248767 175833 339597
30176 339597 437869 388924 363954 359530 240378 124816 215175 330732 157274 -124496 -74000
30165 -74000 204782 195906 -68739 32823 616745 947194 533884 -133951 -400093 -357897
30155 -357897 -420100 -516525 -351618 -69548 -12911 -75711 79873 325682 197753 -320139
30145 -320139 -691768 -567281 -199570 -39693 -243815 -645351 -949962 -920157 -586072 -268799
30135 -268799 -200551 -197832 43239 425132 555552 356052 212577 435019 851907 1075578
30125 1075578 972848 744073 655505 776429 906765 750558 242805 -321832 -578499 -449143
30115 -449143 -106344 293518 646140 782583 601501 302158 215859 372978 479056 362218
30105 362218 196183 197385 322944 373668 221870 -130419 -528320 -652031 -284426 304110
30095 304110 513633 129117 -390029 -560993 -533276 -737345 -1098777 -1107460 -649214 -241228
30085 -241228 -248782 -309842 101644 815976 1112246 653650 -108746 -512623 -342059 190453
30075 190453 803234 1259730 1334249 963791 399496 -382 -130119 -160924 -266692 -498559
30065 -498559 -876249 -1363778 -1724691 -1636085 -1060883 -356338 84687 181011 100249 20856
30055 20856 49975 198043 291977 70464 -461676 -906948 -900079 -559296 -305928 -315389 -382369
30044 -382369 -291645 -69837 155529 321540 396791 373947 354945 462107 601293 509059
30034 509059 131985 -236075 -335670 -283288 -345567 -518911 -581424 -499665 -512648 -763444 -1067513
30023 -1067513 -1162805 -1043043 -903833 -843796 -766710 -559498 -246192 44808 169224 11833
30013 11833 -432047 -945076 -1156715 -856308 -222649 349626 627229 641328 468038 113220
30003 113220 -320171 -549550 -371551 84971 507169 717978 703494 432793 -104211 -697352
29993 -697352 -1017576 -997005 -899607 -915536 -893889 -631010 -232936 34907 136021 240686
29983 240686 369213 341185 118838 -71424 -87774 -112674 -336675 -561935 -399693 168169
29973 168169 694887 808170 620384 458379 368477 134851 -264383 -489900 -240473 330181
29963 330181 740866 680825 280147 -90763 -196451 -100016 -18880 -58541 -97136 46083
29953 46083 336273 500769 346540 28393 -124600 -31125 50763 -89614 -291701 -243574
29943 -243574 49653 230341 69137 -207911 -223946 31591 202100 61619 -215388 -358799
29933 -358799 -360185 -352428 -299985 -69855 253786 409632 339550 257537 254097 112696 -293879
29922 -293879 -662999 -600207 -173494 160074 139324 -58102 -156739 -94712 69113 304370
29912 304370 528667 568482 370685 140161 116999 290917 458874 495479 445138 405676
29902 405676 443351 575305 708165 629095 204750 -399383 -821240 -855579 -613586 -319570
29892 -319570 -75239 117652 230625 239598 233179 352337 606137 846398 953415 953316 901445
29881 901445 749443 437769 64437 -184208 -287251 -443730 -807788 -1259048 -1514025 -1405507
29871 -1405507 -990324 -460894 -42525 99041 -12335 -150937 -135965 -73157 -201130 -491575
29861 -491575 -590649 -250825 328351 729838 790969 686034 597196 508856 374717 304766
29851 304766 427183 630265 618905 278731 -134452 -272033 -100296 94576 95606 -7395
29841 -7395 -36013 -29832 -167887 -438191 -578398 -408761 -110305 -74524 -489842 -1106832 -1417887
29830 -1417887 -1115101 -427468 38621 -111904 -651319 -998452 -863354 -482070 -230590
29821 -230590 -221607 -362124 -585828 -821700 -856918 -489297 168811 726364 912951 825619
29811 825619 745701 841366 1106507 1442229 1661008 1509654 887790 57718 -524312 -646443
29801 -646443 -487881 -279658 -7751 386161 687017 601291 240484 71745 283802 509607
29791 509607 372606 36278 -70097 133984 378224 518830 636988 707083 562715 248183
29781 248183 53087 95359 174788 142010 100571 112296 20914 -249839 -511443 -618210 -679348
29770 -679348 -762122 -692340 -409540 -209471 -299090 -384079 -87227 443678 755587 725842
29760 725842 544834 252702 -188638 -487749 -286135 174039 249606 -143116 -376129 -110774
29750 -110774 163980 -63280 -529069 -675725 -511247 -439957 -503406 -368027 27590 333109
29740 333109 322137 161590 80550 95559 147231 248016 398222 535641 631939 716948 809608
29729 809608 934387 1130402 1291679 1120111 483526 -254791 -547441 -290246 119051 325709
29719 325709 326954 237329 101508 44494 271886 726500 1001312 807192 330310 -67577
29709 -67577 -298766 -472253 -567346 -494908 -374786 -417452 -540013 -416415 18341 393595
29699 393595 381189 139648 85276 351341 697798 910547 1052221 1252717 1446003 1473577
29689 1473577 1346355 1205283 1034224 630664 -33668 -600117 -677850 -348877 -96632 -198486
29679 -198486 -391429 -257232 206135 574314 517138 176647 -6651 242410 781874 1212946
29669 1212946 1250525 945191 560850 266067 6221 -297504 -513196 -393252 82246 581609
29659 581609 736288 520963 213611 15956 -131445 -333315 -529574 -626752 -672949 -689026
29649 -689026 -451031 239160 1075041 1404721 1006762 382792 65770 -39414 -293979 -587690
29639 -587690 -458211 140758 690484 792618 589766 401098 335395 417986 715550 1108466
29629 1108466 1266840 1093908 887438 818532 609133 75217 -364227 -224915 221235 242353
29619 242353 -297156 -750872 -636239 -230796 -22407 -27033 23006 132970 70339 -199573
29609 -199573 -421720 -387549 -170363 -827 6343 -12142 179193 571249 796722 532850
29599 532850 -26323 -344783 -207606 64753 128508 27961 -61089 -190262 -469580 -748022
29589 -748022 -767641 -541177 -325278 -274227 -324692 -372991 -383049 -352646 -313451 -320732 -349986
29578 -349986 -303944 -208216 -230198 -374528 -378598 -116978 118129 29919 -190543 -153088 87275
29567 87275 98686 -258453 -661019 -857074 -951590 -1051371 -1017039 -754368 -437547 -238682
29557 -238682 -86595 120116 289738 307170 218328 82727 -142881 -412682 -519463 -406600
29547 -406600 -319255 -425627 -524049 -394789 -219857 -312015 -575134 -601417 -243884 245823
29537 245823 624765 872807 984994 884643 641950 504157 563184 586209 314601 -205006
29527 -205006 -696475 -947267 -939783 -802400 -728011 -858509 -1147285 -1366166 -1314203 -1018144
29517 -1018144 -711440 -618001 -734580 -818030 -643647 -285583 -25308 59272 219687 601703
29507 601703 894280 717833 259427 133462 549952 979271 826899 168621 -429860 -631017
29497 -631017 -566598 -449639 -273050 22034 305895 364600 168316 -106690 -304369 -404833
29487 -404833 -396062 -195901 171575 456441 465428 407056 661567 1167029 1373216 972099
29477 972099 344487 8743 -59798 -161347 -191607 201670 854414 1091174 640153 38183
29467 38183 -111776 126969 302678 222343 5060 -223253 -351957 -210549 211651 619437
29457 619437 744553 668163 579476 417614 42094 -420496 -718183 -828134 -878708 -868502
29447 -868502 -772268 -758333 -931803 -1004136 -639987 -43370 251344 134827 757 61980
29437 61980 96347 -26094 -70685 105509 276245 277513 309778 518500 652688 493328 294660
29426 294660 393540 634135 620750 369829 254767 382543 463351 304832 53283 -100495
29416 -100495 -120653 17239 338943 654432 641753 285890 -24486 16189 274468 452573
29406 452573 486350 473343 396318 164593 -161278 -397654 -459842 -423884 -417022 -536716 -769271
29395 -769271 -879578 -546186 201196 834570 891300 579970 490419 749700 887546 621391
29385 621391 306444 325958 431458 138411 -454413 -761083 -564059 -262578 -193465 -191239
29375 -191239 -27949 135232 51869 -166051 -255342 -220963 -197835 -101761 172969 361697
29365 361697 119614 -335562 -385021 92421 471915 248877 -268446 -437535 -116773 336214
29355 336214 646108 791531 744201 461361 117791 -13352 58281 78467 -9836 13807
29345 13807 209850 297272 91128 -150853 -71245 272658 505011 445433 255691 93595
29335 93595 -108441 -433404 -752705 -862003 -740875 -533180 -325689 -101355 90646 91243
29325 91243 -146886 -411875 -461461 -357305 -395247 -671738 -902786 -796551 -465765 -277553
29315 -277553 -360384 -488354 -465870 -373488 -309437 -117504 377070 972671 1226199 994633
29305 994633 575320 237631 -93913 -502846 -701950 -348282 369272 846642 806610 572895
29295 572895 497359 479960 294632 77772 135401 451110 762897 1017117 1342571 1614400
29285 1614400 1489170 957640 453643 254518 148786 -86155 -248250 -77389 237098
29276 237098 316419 178573 149322 280486 280026 25510 -250267 -365777 -426039 -521106 -521228
29265 -521228 -375788 -336308 -605020 -944472 -942093 -584630 -281489 -317232 -539968 -653045
29255 -653045 -576401 -381719 -70321 347187 640737 517411 48483 -301593 -229438 866
29245 866 -79541 -493983 -801829 -689555 -285719 141960 479765 636144 447573 -29456
29235 -29456 -372094 -245407 138700 305103 138514 -82736 -176641 -222488 -261329 -209757
29225 -209757 -142111 -312490 -748487 -1089784 -990684 -488308 128670 591619 698140 377724
29215 377724 -98346 -227945 150288 580695 531511 41540 -447773 -744830 -1023305 -1328767
29205 -1328767 -1371163 -952394 -331751 38406 13558 -167156 -229164 -132867 -4259 78065
29195 78065 154924 281530 432222 554344 668693 825559 965963 944186 739639 533996
29185 533996 476732 460006 272118 -54650 -217201 -23759 319558 431228 226409 19103
29175 19103 96174 329870 390214 277749 363186 799307 1182214 1064906 610372 365605
29165 365605 472992 539163 332059 146086 265580 474697 446664 320872 457370 769842
29155 769842 766905 272736 -294226 -495437 -430245 -518042 -883930 -1175816 -989615 -362220
29145 -362220 222679 322279 -28040 -441108 -687257 -885682 -1146453 -1268774 -992035 -397613
29135 -397613 161424 456008 523649 493272 457015 465151 485542 421172 291681 281545 458612
29124 458612 607655 549893 444367 497762 561753 380462 89427 31236 158053 108879
29114 108879 -127695 -170171 43712 69032 -297989 -623469 -533158 -334113 -496554 -893606
29104 -893606 -1071710 -1006894 -1026273 -1123279 -948066 -502269 -294734 -622984 -1107113 -1186892
29094 -1186892 -816626 -414462 -276261 -287027 -197567 -15224 -13351 -346775 -750886 -777667
29084 -777667 -347308 127946 258074 93645 -124472 -372451 -707503 -927094 -757415 -307000
29074 -307000 42672 161409 200320 131919 -249196 -765614 -816725 -182097 549838 720256
29064 720256 444701 302551 425358 394482 -27258 -543326 -781941 -738328 -623274 -538046
29054 -538046 -446963 -296523 -58745 207661 306493 96901 -233658 -321225 -118717 28045
29044 28045 -66763 -88770 300596 860232 997154 539822 -39859 -210268 76559 485063
29034 485063 693348 573284 175514 -288148 -538537 -449336 -163199 46103 -18656 -374942
29024 -374942 -812533 -941518 -506914 240872 690709 546332 185916 153142 457358 656667
29014 656667 534463 345527 351174 429599 312347 4374 -227949 -199695 13310 204030
29004 204030 239345 145219 51547 58379 139562 185113 128209 1954 -118526 -199559 -275444
28993 -275444 -380500 -419321 -169411 429663 1006713 1033894 473894 -106830 -239994 -84351
28983 -84351 -1912 56952 304864 514867 270060 -255449 -395637 45445 529105 649912
28973 649912 667817 876588 1003952 689343 149722 -108485 28706 293393 482896 528180
28963 528180 363490 88995 15446 203721 255580 -65863 -368200 -258428 -69746 -341690
28953 -341690 -859697 -929770 -458535 -25288 67372 74664 115994 -45291 -385536 -493356
28943 -493356 -284504 -205567 -473169 -718303 -667150 -577856 -671839 -706086 -493042 -314253
28933 -314253 -403066 -505477 -378388 -244479 -303757 -283460 6870 143973 -272082 -838946
28923 -838946 -877619 -447649 -160041 -191310 -178923 20886 157995 154574 230869 432941 568690
28912 568690 627135 752945 821418 575866 173560 17279 37874 -210215 -665524 -695660
28902 -695660 -152768 217239 -155576 -758848 -681734 196453 1213509 1815798 1919140 1582173
28892 1582173 879923 112890 -283523 -167416 171849 343621 191711 -162984 -465127
28883 -465127 -528175 -404590 -329790 -436008 -586125 -546524 -249977 148727 394307 311057
28873 311057 -12258 -233542 -110429 196890 378084 450916 668677 979263 994671 592015
28863 592015 123538 -138437 -338476 -584530 -604338 -217846 225655 319329 209237 268275
28853 268275 417406 303126 -22028 -175807 -140683 -294364 -689627 -859216 -509021 59395
28843 59395 421725 508185 377630 -66889 -783827 -1318751 -1241099 -723344 -336985 -337488 -457475
28832 -457475 -387057 -159335 13381 56164 42778 4302 -128874 -388314 -644313 -691551
28822 -691551 -490023 -261982 -232288 -276000 -6655 667762 1242656 1125661 426122 -52988
28812 -52988 239100 878971 966261 258034 -542365 -725435 -458075 -424626 -813307 -1127386
28802 -1127386 -1014979 -798753 -928390 -1272665 -1356941 -1114498 -946762 -1043782 -1071445 -690458
28792 -690458 -73559 328879 351212 196145 55002 -100041 -322004 -486535 -402831 -59428
28782 -59428 338196 570330 575585 405966 95840 -321148 -687797 -767777 -503417 -135558
28772 -135558 50926 42730 27557 53584 -47028 -341992 -587431 -489451 -97063 241318
28762 241318 315843 278258 344390 428382 276389 -74100 -221449 95136 601380 794327
28752 794327 543054 171969 93 36109 136010 213519 213307 82042 -124705 -266202 -336359
28741 -336359 -499181 -811301 -1063965 -1000026 -565957 81382 635598 713290 182021 -492499
28731 -492499 -589183 -16671 500377 385459 -10556 21935 531342 955726 982447 805365
28721 805365 609472 350051 84499 41253 246256 455470 543278 625843 754537 823505
28711 823505 807276 749063 528648 42344 -405528 -374361 9427 143143 -158445 -414548
28701 -414548 -294936 -107096 -196316 -412844 -525315 -648087 -847174 -800920 -326168 175187
28691 175187 289893 225692 343532 436398 98839 -464915 -665082 -391784 -35494 217687
28681 217687 475700 624750 400145 -23211 -153140 51238 147007 14989 50405 393815
28671 393815 629919 522663 444096 708253 1003086 913096 580125 386377 315231 101016
28661 101016 -220581 -373122 -315522 -256298 -265858 -209207 -23643 202605 384487 457730 314466
28650 314466 -71139 -518914 -818880 -943968 -935370 -725779 -298773 95334 146888 -119157
28640 -119157 -356740 -293934 16578 287589 231329 -187153 -609526 -553397 6686 497177
28630 497177 412029 -38789 -235529 23530 360796 450604 416358 488856 599520 532845
28620 532845 297462 126560 176512 375089 545288 582352 510131 419389 370585 357785 357007
28609 357007 361428 342801 237776 26366 -225640 -456079 -682101 -925357 -1116813 -1144266
28599 -1144266 -963010 -636627 -330393 -250805 -448508 -666335 -584072 -273203 -151355 -353307
28589 -353307 -457394 -106239 384484 442448 85560 -130163 32341 190854 6755 -308591
28579 -308591 -380181 -217923 -105140 -172670 -336196 -481466 -488392 -232855 206118 478074
28569 478074 342526 26545 -35662 231350 463105 328760 -113702 -561125 -799163 -828213
28559 -828213 -750529 -607368 -347470 18351 282509 219156 -66475 -174366 68188 318054
28549 318054 169482 -262502 -503309 -375950 -161789 -104042 -103930 -19509 55496 13474 -16927
28538 -16927 101484 208891 61201 -232897 -285615 34107 384389 364605 -22246 -437136
28528 -437136 -632667 -688594 -835873 -1120306 -1287975 -1047864 -455357 61407 146951 -92374
28518 -92374 -282194 -288639 -320974 -537273 -802413 -920006 -865370 -649631 -189063 467465
28508 467465 966355 987474 657591 363437 243629 168802 155841 405368 864015 1134152
28498 1134152 995785 711744 609929 641291 598824 517948 541247 571479 414473 165586
28488 165586 103588 242650 327262 264849 213804 192805 -35751 -545861 -1015211 -1114726 -904171
$$ [...]
##END NTUPLES=NMR SPECTRUM
##END=
