##TITLE=31Pdec_PR193_ph10
 D2O, 24 sc
 3.8.2020
##JCAMPDX= 6.0         $$ Bruker NMR JCAMP-DX V2.0
##DATA TYPE= NMR SPECTRUM
##DATA CLASS= NTUPLES
##ORIGIN= UXNMR, Bruker Analytische Messtechnik GmbH
##OWNER= root
$$ XWIN-NMR		Version 3.5
$$ Mon Aug  3 12:14:25 2020 Russian Standard Time (UT+4h)  she@DPX200
##.OBSERVE FREQUENCY= 81.013821
##.OBSERVE NUCLEUS= ^31P
##.ACQUISITION MODE= SIMULTANEOUS
##.ACQUISITION SCHEME= undefined
##.AVERAGES= 24
##.DIGITISER RES= 17
##SPECTROMETER/DATA SYSTEM= spect
##.PULSE SEQUENCE= zgpg30
##.SOLVENT NAME= CDCl3
##.SHIFT REFERENCE= (INTERNAL, CDCl3, 0, 182.463)
##AUDIT TRAIL= $$ (NUMBER, WHEN, WHO, WHERE, WHAT)
$$ ##TITLE= Audit trail, XWIN-NMR		Version 3.5
$$ ##JCAMPDX= 5.01
$$ ##ORIGIN= Bruker BioSpin GmbH
$$ ##OWNER= she
$$ F:/spectra/data/she/nmr/P31/1/pdata/1/auditp.txt
$$ ##AUDIT TRAIL=  $$ (NUMBER, WHEN, WHO, WHERE, WHAT)
(   1,<2020-08-03 12:13:15.35 +0400>,<she>,<DPX200>,
      <created by zg, POWCHK disabled, PULCHK disabled
       configuration hash MD5:
       00 E9 B6 7A A2 85 ED C7 34 08 36 98 17 FE 4E 26
       data hash MD5: 32K
       18 74 7B E7 16 70 4C 4E 7B ED 51 42 2D 74 B3 41>)
(   2,<2020-08-03 12:13:21.04 +0400>,<she>,<DPX200>,
      <Start of raw data processing
       efp BC_mod = 2 LB = 1 FT_mod = 6 PKNL = 1 PHC0 = -3299.795 PHC1 = 1451.202 SI = 64K 
       data hash MD5: 64K
       31 87 42 0F 1A 05 7D A3 E7 D9 55 D0 F1 4A F6 0D>)
(   3,<2020-08-03 12:13:54.59 +0400>,<she>,<DPX200>,
      <pk PHC0 = -324.6854 PHC1 = 389.9998 
       data hash MD5: 64K
       F4 B5 91 D6 05 85 59 B5 B9 E5 28 E5 10 2D EB CC>)
(   4,<2020-08-03 12:13:58.35 +0400>,<she>,<DPX200>,
      <abs ABSG = 5 
       data hash MD5: 64K
       98 B9 D9 35 B5 BC 7E 9E 91 FD BB D5 E5 CD 1D E2>)
$$ ##END=
$$ 
$$ hash MD5
$$ 9A 58 E8 11 08 45 C7 5E DB 04 07 29 41 F0 5B 08
##$RELAX= 
##$RELAX= 
##$RELAX= 
##$RELAX= 
##$RELAX= 
##$RELAX= 
##$RELAX= 
##$RELAX= 
$$ Bruker specific parameters
$$ --------------------------
##$DU= <F:/spectra>
##$EXPNO= 1
##$NAME= <P31>
##$PROCNO= 1
##$TYPE= <nmr>
##$USER= <she>
##$AMP= (0..31)
100 100 100 100 100 100 100 100 100 100 100 100 100 100 100 100 100 100 
100 100 100 100 100 100 100 100 100 100 100 100 100 100 
##$AQSEQ= 0
##$AQ_mod= 1
##$AUNM= <au_zg>
##$AUTOPOS= <>
##$BF1= 81.014009
##$BF2= 200.13
##$BF3= 200.13
##$BF4= 200.13
##$BF5= 200.13
##$BF6= 200.13
##$BF7= 200.13
##$BF8= 200.13
##$BYTORDA= 1
##$CFDGTYP= 0
##$CFRGTYP= 5
##$CHEMSTR= <none>
##$CNST= (0..31)
1 1 145 1 1 1 1 1 1 1 1 1 1 1 1 1 1 1 1 1 1 1 1 1 1 1 1 1 1 1 1 1 
##$CPDPRG= <waltz16>
##$CPDPRG1= <>
##$CPDPRG2= <waltz16>
##$CPDPRG3= <>
##$CPDPRG4= <mlev>
##$CPDPRG5= <mlev>
##$CPDPRG6= <mlev>
##$CPDPRG7= <mlev>
##$CPDPRG8= <mlev>
##$CPDPRGB= <>
##$CPDPRGT= <>
##$D= (0..31)
0 1 0 0 0 0 0 0 0 0 0 0.03 2e-05 3e-06 0 0 0 0 0 0 0 0 0 0 0 0 0 0 0 0 
0 0 
##$DATE= 1596442394
##$DBL= (0..7)
120 120 120 11 120 120 24 19 
##$DBP= (0..7)
150 150 150 150 150 150 150 150 
##$DBP07= 0
##$DBPNAM0= <>
##$DBPNAM1= <>
##$DBPNAM2= <>
$$ [...]
##$SUBNAM3= <"">
##$SUBNAM4= <"">
##$SUBNAM5= <"">
##$SUBNAM6= <"">
##$SUBNAM7= <"">
##$SUBNAM8= <"">
##$SUBNAM9= <"">
##$SW= 369.568048894756
##$SWIBOX= (0..15)
0 1 3 0 0 0 0 0 0 0 0 0 0 0 0 0 
##$SW_h= 29940.119760479
##$TD= 32768
##$TD0= 1
##$TE= 0
##$TE2= 300
##$TE3= 300
##$TEG= 300
##$TL= (0..7)
0 120 53 12 22 120 120 120 
##$TP= (0..7)
150 150 150 150 150 150 150 150 
##$TP07= 0
##$TPNAME0= <>
##$TPNAME1= <>
##$TPNAME2= <>
##$TPNAME3= <>
##$TPNAME4= <>
##$TPNAME5= <>
##$TPNAME6= <>
##$TPNAME7= <>
##$TPOAL= (0..7)
0.5 0.5 0.5 0.5 0.5 0.5 0.5 0.5 
##$TPOFFS= (0..7)
0 0 0 0 0 0 0 0 
##$TUNHIN= 0
##$TUNHOUT= 0
##$TUNXOUT= 0
##$USERA1= <user>
##$USERA2= <user>
##$USERA3= <user>
##$USERA4= <user>
##$USERA5= <user>
##$V9= 5
##$VALIST= <valist>
##$VCLIST= <CCCCCCCCCCCCCCC>
##$VD= 0
##$VDLIST= <DDDDDDDDDDDDDDD>
##$VPLIST= <PPPPPPPPPPPPPPP>
##$VTLIST= <TTTTTTTTTTTTTTT>
##$WBST= 1024
##$WBSW= 4
##$XGAIN= (0..3)
0 0 0 0 
##$XL= 0
##$YL= 0
##$YMAX_a= 8195
##$YMIN_a= -4854
##$ZGOPTNS= <>
##$ZL1= 120
##$ZL2= 120
##$ZL3= 120
##$ZL4= 120
##$ABSF1= 182.463
##$ABSF2= -187.1042
##$ABSG= 5
##$ABSL= 3
##$ALPHA= 0
##$AQORDER= 0
##$ASSFAC= 0
##$ASSFACI= 0
##$ASSFACX= 0
##$ASSWID= 0
##$AUNMP= <proc_1d>
##$AZFE= 0.1
##$AZFW= 0.5
##$BCFW= 0
##$BC_mod= 2
##$BYTORDP= 0
##$COROFFS= 0
##$CY= -3
##$DATMOD= 1
##$DC= 0
##$DFILT= <>
##$DTYPP= 0
##$F1P= 0
##$F2P= 0
##$FCOR= 1
##$FTSIZE= 65536
##$FT_mod= 6
##$GAMMA= 0
##$GB= 0
##$INTBC= 1
##$INTSCL= 5.30512e-09
##$ISEN= 30
##$LB= 1
##$LEV0= 0
##$LPBIN= 0
##$MAXI= 10000
##$MC2= 0
##$MEAN= 0
##$ME_mod= 0
##$MI= 50
##$NCOEF= 0
##$NC_proc= -7
##$NLEV= 6
##$NOISF1= 182.463
##$NOISF2= 159.3651
##$NSP= 0
##$NTH_PI= 0
##$NZP= 0
##$OFFSET= 182.463
##$PC= 4
##$PHC0= -3624.48
##$PHC1= 1841.202
##$PH_mod= 1
##$PKNL= yes
##$PPARMOD= 0
##$PSCAL= 0
##$PSIGN= 0
##$REVERSE= no
##$SF= 81.0140089999434
##$SI= 65536
##$SIGF1= 159.3651
##$SIGF2= -187.1042
##$SINO= 113.3802
##$SIOLD= 16384
##$SREGLST= <1H.CDCl3>
##$SSB= 0
##$STSI= 65536
##$STSR= 0
##$SW_p= 29940.119760479
##$SYMM= 0
##$S_DEV= 0
##$TDeff= 32768
##$TDoff= 0
##$TI= <>
##$TILT= no
##$TM1= 0
##$TM2= 0
##$TOPLEV= 0
##$USERP1= <user>
##$USERP2= <user>
##$USERP3= <user>
##$USERP4= <user>
##$USERP5= <user>
##$WDW= 1
##$XDIM= 65536
##$YMAX_p= 321761373
##$YMIN_p= -22411355
$$ End of Bruker specific parameters
$$ ---------------------------------
##NTUPLES= NMR SPECTRUM
##VAR_NAME=  FREQUENCY,     SPECTRUM/REAL,   SPECTRUM/IMAG
##SYMBOL=    X,             R,               I
##VAR_TYPE=  INDEPENDENT,   DEPENDENT,       DEPENDENT
##VAR_FORM=  AFFN,          ASDF,            ASDF
##VAR_DIM=   65536,         65536,           65536
##UNITS=     HZ,            ARBITRARY UNITS, ARBITRARY UNITS
##FACTOR=    0.456856943014862, 1,           1
##FIRST=     14782.0589164792, 0,            0
##LAST=      -15158.0608439998, 0,           0
##MIN=       -15158.0608439998, -22411355,   0
##MAX=       14782.0589164792, 321761373,    0
$$ Real data points
##PAGE= N=1
##DATA TABLE= (X++(R..R)), XYDATA
$$ [...]
38641 -2557547 -2797319 -3676806 -3296244 -992320 1774173 2664792 1117435 -811624 -1302973
38632 -1302973 -1556799 -3730601 -6715213 -6840446 -3220888 496922 1014742 -478005 -854457
38623 -854457 302815 964235 404406 223378 1655550 3596017 3829350 1533432 -1702052
38614 -1702052 -3250349 -2016976 477547 2035366 2371328 2735862 3368199 3041491 1348887
38605 1348887 -360240 -1047118 -1429303 -2421127 -3444872 -3356502 -2054796 -249491 1472179
38596 1472179 2560170 2424148 1245921 38613 -719134 -1540754 -2495462 -2595125 -1429953
38587 -1429953 -118036 402041 738425 1459225 1442940 -458025 -3023260 -3956743 -3241754
38578 -3241754 -3167020 -4742757 -5967324 -4590240 -1277765 1253655 1548294 437234 -1057050
38569 -1057050 -3154642 -5858750 -7463311 -6265490 -3297909 -1421152 -1542643 -1750634
38561 -1750634 -828323 -410521 -2261677 -5345821 -7349019 -7400926 -5521003 -1519225 3064830
38552 3064830 4257608 499880 -3569433 -2507042 1943388 3287699 260680 -1513518
38544 -1513518 1160806 4152082 3059527 -281308 -2158530 -3281439 -6030903 -8784022
38536 -8784022 -8045891 -4211837 -625102 1559044 3232551 3485362 627501 -3490625
38528 -3490625 -4717523 -2370296 152986 861796 1458052 3327535 4763918 3648709
38520 3648709 344483 -3397098 -6460502 -8300085 -8454867 -6911184 -3933904 344355
38512 344355 4955549 7553546 6811587 4573213 3287156 2192661 -1008321 -5373992
38504 -5373992 -7201331 -5309677 -2251664 150544 2740917 5642357 6788183 5423859
38496 5423859 3642411 2665218 961124 -1900061 -3064745 -907794 1419045 462201
38488 462201 -1941884 -1428173 2188094 4985160 4893974 3649798 2820473 1539842 -1013456
38479 -1013456 -3818568 -5854243 -7558514 -9321377 -10230282 -9436111 -7553163 -5810277
38471 -5810277 -4753358 -4409011 -4753897 -5289549 -4885419 -2828426 203352 2569245 2950940
38462 2950940 1268571 -1349167 -3519749 -4685168 -5054529 -4643851 -3294497 -1786455
38454 -1786455 -1448342 -1861150 -677333 2692377 4936289 2937565 -1187720 -2518970
38446 -2518970 -504633 228994 -2772906 -5692148 -4251040 -295437 1233537 -198110
38438 -198110 -762646 879406 1639354 -73839 -959418 1997688 6161648 6503533 2420265
38429 2420265 -2157654 -4529140 -5559624 -6322936 -5926231 -3744590 -1044873 1075295
38421 1075295 3124165 5074930 5060872 2377395 -76427 868094 3970208 5228757 3774655
38412 3774655 2865450 4480498 6124748 4708171 1164485 -1194515 -1461062 -1587891 -2540596
38403 -2540596 -2687859 -751035 1629246 1746426 -592006 -2702696 -2215639 228803 1763405
38394 1763405 462115 -2510072 -4026079 -2419638 460027 1343413 -178575 -687587
38386 -687587 2623673 7504174 8733166 4742246 -146286 -1151433 1401739 3722621
38378 3722621 3824392 2433378 -35033 -3785339 -7021067 -6817945 -3705863 -1938059
38370 -1938059 -3405518 -4557785 -2037187 1558997 1315468 -2434805 -4493142 -2273563
38362 -2273563 1259057 2735098 2727300 3394339 4694384 5075892 4123660 2564949 855702
38353 855702 -550172 -496747 1567159 4036289 4433620 2220829 -777839 -2783486 -3860448
38344 -3860448 -4965247 -6040022 -5917169 -4026478 -1376275 619089 1663122 2105030
38336 2105030 1490252 -933993 -4190447 -5744151 -4417083 -1678550 759495 2947067
38328 2947067 5144189 6224965 5637062 5386013 7514358 10538852 11088417 8675345 6184006
38319 6184006 5644650 6134981 6254496 6151090 6133516 5314823 2999151 267506 -968706
38310 -968706 -114627 1370531 1350516 -543972 -1879406 -53211 3754086 5339951 3186954
38301 3186954 741075 1098779 2518798 2354938 2352228 5416265 9361026 9400275 5792283
38292 5792283 3366659 3855572 4433909 3824701 3666991 3330544 158212 -3700720 -1895208
38283 -1895208 5956683 11665586 9819230 5207582 4398086 6217718 6212735 4886612 4941089
38274 4941089 4970704 2871368 1731611 5097044 9396621 8510098 3581607 792845 1166579
38265 1166579 459588 -1804717 -1470143 1805502 3184468 1059582 -467412 552963
38257 552963 390946 -3454453 -7873859 -9483029 -8928865 -7213058 -3212291 1920571 3110794
38248 3110794 -1853151 -7999313 -9510565 -6870192 -4080743 -2233238 73919 2622364
38240 2622364 4025573 4563372 5129710 4814587 2513512 -371140 -1466918 -542002 975569
38231 975569 2257422 3094801 3199749 3038265 3625950 4264212 2825638 -343005 -1722164
38222 -1722164 289174 2702282 2728278 1929872 2497789 2650967 -165422 -4037365 -5157854
38213 -5157854 -3975144 -3989799 -5337698 -4552827 -870312 1993119 1600000 364105 1422602
38204 1422602 3931565 4779002 3085022 779236 -356844 -425535 -481126 -1124240 -2181332
38195 -2181332 -3154986 -3736733 -4057882 -4621300 -5870914 -7371773 -7373388 -4210151 1098977
38186 1098977 4813615 4546207 2386646 1934903 3140193 2870255 117230 -2757334 -4139579
38177 -4139579 -4854456 -5015012 -3140508 88904 1149661 -1070393 -3036662 -2134552 -746560
38168 -746560 -1614976 -2800060 -1344847 1033323 573613 -2266899 -3842410 -3248691 -2765785
38159 -2765785 -3274548 -3475307 -3145997 -3226053 -2979102 -713286 2945150 5754132 7154917
38150 7154917 7575468 5696163 653965 -3871731 -2706878 3449297 8271732 8035755
38142 8035755 5244951 3279398 2042057 610032 101449 1505668 3541431 4615694
38134 4615694 4593617 3413033 520053 -3187527 -5495291 -6057316 -6873112 -8675777 -9624954
38125 -9624954 -8559955 -6663989 -4890744 -2818434 -1234183 -2530866 -6782041 -10368522
38117 -10368522 -10401391 -8012668 -5756925 -4454386 -4077427 -4755395 -5086764 -2444658 2946960
38108 2946960 7047068 7239269 5751562 5593134 5995336 4704644 2338495 1365311 2393560
38099 2393560 3998748 4807896 3932597 1182055 -1638344 -2067504 -1052279 -2426609 -6532410
38090 -6532410 -8495242 -5753907 -2815592 -4223750 -6991954 -5669991 -1619478 -586319
38082 -586319 -3047140 -4111352 -2403616 -1819855 -3673660 -4013153 -909551 1618128 48082
38073 48082 -3107493 -3560536 -1178945 1587580 3809432 5167752 3820463 -1025913 -6265790
38064 -6265790 -8146931 -7238288 -7076643 -8659849 -9215158 -6300201 -833974 4024136 5373244
38055 5373244 2223917 -3562519 -7917843 -7718472 -3815577 -126981 515759 -970186
38047 -970186 -1527900 268653 2518875 2377079 -47440 -1320608 895544 4279426 4723340
38038 4723340 2167676 803731 3006290 5983210 6044426 3721753 2170599 2098471 1277030
38029 1277030 -1279627 -3411693 -2736835 431408 4009422 6607275 7866274 7185900
38021 7185900 3818109 -1264796 -4725878 -3568586 1306006 5509777 6017553 4584230
38013 4584230 4904939 7170259 7695664 4209984 -759367 -3038137 -1823070 -19004
38005 -19004 -382485 -2729055 -4660458 -4039696 -871346 2617115 3865270 2230808 -862223
37996 -862223 -3777024 -5731248 -6190503 -4894387 -3091789 -3004227 -4793748 -5502058 -2655693
37987 -2655693 2146162 5135967 5186736 4603251 5177401 5571532 3470795 -930868 -4599590
37978 -4599590 -4492471 -455812 4383539 6239131 4216914 1130879 323599 2128268
37970 2128268 4259402 5130409 5377227 6055413 6759275 6261693 4260185 1763832 10492
37961 10492 -559435 -292495 471837 1850062 3694439 4771732 3795306 1489363 171290
37952 171290 513463 386597 -1647219 -3473817 -2460610 -201 220624 -1995259 -2985882
37943 -2985882 -1123669 752516 331407 -373054 1206293 3599722 3797414 2278809 1980978
37934 1980978 3462247 4567456 4273460 3626035 3215770 2781233 2930568 4049661 3937061
37925 3937061 297699 -4474148 -5311347 -1864629 804388 255805 218674 3468215 6386345
37916 6386345 4934878 1687433 1462882 3229459 2555400 -101383 -471019 1086792 -345057
37907 -345057 -5007386 -6798080 -3315883 -515836 -3116044 -6449909 -3745800 2843660
37899 2843660 5313012 1637102 -2320438 -2375427 -1196882 -2577376 -5615388 -7058741
37891 -7058741 -6040754 -3940558 -1620354 1030302 3871759 6117699 6453749 3412788
37883 3412788 -2837758 -8952764 -10825372 -8350692 -5770221 -6222622 -7987917 -7660212
37875 -7660212 -5119467 -3049858 -2616608 -2230280 -627992 1037101 1049537 -306973 -1193729
37866 -1193729 -643085 521654 1147305 1157606 995370 445913 -814203 -1690814 -291460
37857 -291460 3218465 5844767 5311337 3375603 3656991 6548364 8495237 6723949 2644505
37848 2644505 -429580 -1252363 -935158 -540447 -175120 72693 78147 620349 2768625
37839 2768625 5712787 6513282 3238834 -2219965 -5789009 -5619522 -3531644 -1757500
37831 -1757500 -773 2842926 5507694 5508692 3245067 2145108 3897814 6102461 6135100
37822 6135100 4943936 4774385 5123011 3901182 1441196 127300 362140 -34968 -2101012
37813 -2101012 -4095817 -4233238 -2765097 -692405 1450062 2810759 2358195 765862
37805 765862 297378 1816948 3566368 3787610 2888138 2128367 1881917 2152617 3058630
37796 3058630 3707374 2366286 -874362 -3153810 -2057303 1382448 4193603 4949650
37788 4949650 4655180 5076227 6948334 8912235 8117803 3567197 -1181647 -1371887 2320016
37779 2320016 3927141 510248 -3425594 -2666003 1035179 2133478 -297643 -2181467
37771 -2181467 -1385196 -252981 -1080439 -3177813 -5078047 -6226775 -5866918 -3470219 -890810
37762 -890810 -863823 -2626504 -2346881 1091107 4158671 3979667 2140850 1185946 559559
37753 559559 -1157351 -2589264 -1498529 1164241 2273203 752496 -1788161 -3811999
37745 -3811999 -4716911 -3682259 -406304 3235994 4821986 4636929 4849380 5473932 4120305
37736 4120305 521001 -1749171 -23126 3196116 3251801 -535469 -4260886 -4557517 -1915816
37727 -1915816 1370511 4233667 6587218 7719128 6830189 4748175 3554738 4290467
37719 4290467 5958126 6943179 6605812 5327683 3874637 3089408 3448963 4407739 4753220
37710 4753220 4080309 3338255 3417270 3842105 3586440 2648542 1930018 1865331 2118118 2551886
37700 2551886 3525313 4920777 5583160 4334138 1518468 -732954 -116235 3610801 8050593
37691 8050593 10244885 9287230 6383692 2782318 -910673 -3279094 -2172262 2199134
37683 2199134 5747623 4355737 -1178794 -5998677 -6891818 -5261852 -4209032 -4627112
37675 -4627112 -5169326 -4753111 -3819410 -3481788 -4134620 -4873720 -4341280 -2511333 -1262193
37666 -1262193 -2263909 -4475657 -4934504 -2254564 1739160 4288770 4699643 4485858 5132689
37657 5132689 6300983 6144552 3375501 -832632 -3456253 -2746058 -240635 1298652
37649 1298652 1515612 2617510 5852194 9245904 9525561 5610624 -189620 -4060313
37641 -4060313 -3865613 -1061756 754283 -251074 -2269625 -2643534 -1511383 -1104843 -2161981
37632 -2161981 -3094396 -2533761 -718014 1627236 3753460 4185901 1797788 -2051123 -4604888
37623 -4604888 -5274709 -5764691 -6347480 -5076634 -1790604 334483 -749647 -2746446 -2772591
37614 -2772591 -1881006 -2765110 -4813814 -4986500 -2720358 -560449 -31070 153882 1458862
37605 1458862 3559119 5444346 6501273 6202012 4547176 3014805 3231545 4474900
37597 4474900 4331165 2116866 -224151 -1028590 -796043 -549673 -236981 245515 95865
37588 95865 -1084032 -2261924 -2422594 -1990240 -1712760 -1207144 36592 1078121 607278
37579 607278 -744092 -850218 898037 2444156 1656144 -885128 -2686229 -2508096 -1644663
37570 -1644663 -1874128 -3047405 -3399920 -1868172 660122 2431625 2626839 1911610 1469134
37561 1469134 1587180 1231705 -625427 -3190288 -4194568 -2616423 -58657 1609724
37553 1609724 2812952 4695170 6058252 4688217 1606606 751465 3418925 6009703
37545 6009703 5016720 1618708 -848532 -1564745 -1624957 -796734 1741553 4538181 5150475
37536 5150475 3929642 3511859 4705017 5821663 6123093 6861905 8389314 9112124 8208192
37527 8208192 6835521 5744597 4256180 2721071 3255789 6178726 8016806 5492957
37519 5492957 97688 -3682150 -3943974 -3043174 -3923722 -6581817 -8470459 -7335223 -3377981
37510 -3377981 849010 2718749 2038574 1062408 1833709 4090434 6098926 6755821 6173550
37501 6173550 4783419 2805338 592704 -1125271 -1707173 -1361068 -1277769 -2531545 -4689987
37492 -4689987 -6177669 -6356631 -6217597 -6244557 -4968251 -1267437 3004938 4947823 4582009
37483 4582009 4397917 5191524 5284244 4286405 4413102 6631283 8335754 6999043 3994951
37474 3994951 2422482 2715238 2841373 1654678 -505883 -3722144 -8184907 -12035449
37466 -12035449 -12225410 -8389787 -3923969 -2054242 -2163584 -1314039 1424916 3791681
37458 3791681 3585727 1660567 583723 1086653 1590734 1361209 1948057 4178336 5718178
37449 5718178 4016974 364210 -1878198 -2220333 -2734388 -3135224 -531281 4831924 7943109
37440 7943109 5592568 1034355 -872680 -153562 71609 -716583 -584196 615795 1201083
37431 1201083 1032393 1272152 1392355 3376 -1724099 -1063016 1893950 4259769 4750324
37422 4750324 4626925 4242857 2465793 7825 -638013 427664 143537 -2109740 -2793795
37413 -2793795 9528 3027660 2884970 1300185 1660283 3193817 2626127 -202755 -2551687
37404 -2551687 -3651655 -5400326 -8411285 -10859958 -11402022 -10216501 -7121746 -1867959
37396 -1867959 3307307 4735307 2012102 -1175623 -2076449 -1928326 -2554172 -2953578 -1799708
37387 -1799708 -928430 -3046998 -7198669 -9794749 -9746932 -9395456 -10072020 -9897847 -7243632
37378 -7243632 -3755999 -1912761 -1307572 259519 2850386 4045992 2738834 1222198
37370 1222198 2439556 6190958 9226159 8963957 6405151 4975092 6498235 8798703
37362 8798703 8041344 3389683 -1880210 -4441041 -4624891 -4747672 -5102078 -3925734 -834272
37353 -834272 2314736 4246927 5479472 6019775 4407512 450823 -3247132 -4283730
37345 -4283730 -3327002 -2318112 -1507810 -243986 884087 1022851 960259 1702548 2261192
37336 2261192 1361350 252760 872765 2013028 701383 -2778172 -4740306 -3408628
37328 -3408628 -1082937 -275657 -961816 -2730831 -6212343 -10483202 -12131397 -9435490
37320 -9435490 -5254128 -3302787 -3396432 -2829161 -879658 697641 688558 -412453 -1608317
37311 -1608317 -1964152 -792060 1106506 1508570 -163450 -1165237 1065232 4977774
37303 4977774 6908300 5945408 4134876 2720128 1281772 260204 954036 2502585
37295 2502585 1954866 -1517325 -4962441 -5533678 -4006676 -3012751 -3456749 -4311681 -4869351
37286 -4869351 -5562048 -6815762 -8074528 -8132943 -6466377 -4409817 -4324931 -6691059 -8799452
37277 -8799452 -7781381 -4227536 -947621 1131464 3237884 5231287 5072775 2567711
37269 2567711 504464 585225 1012663 7264 -904490 400034 2785548 3616101 2890486
37260 2890486 2613250 2945895 2039428 -537614 -2975292 -4026552 -4315999 -4567681 -4610341
37251 -4610341 -4453637 -4364920 -3540201 -786035 2830872 4040964 1211859 -3286760 -5574959
37242 -5574959 -4039079 30279 4218994 6479150 6066797 4210715 3197903 3977806
37234 3977806 5280960 5548863 4690122 3319135 1608652 11030 -169548 1422552 2681356
37225 2681356 1297797 -1747068 -3040100 -1468584 -18057 -1555789 -4400869 -4259792
37217 -4259792 -116653 4279394 5638080 5551060 7441146 10482114 10073748 4836175 -530080
37208 -530080 -1588554 -308472 -1255236 -3829476 -3377388 361638 1722010 -2073099 -5875270
37199 -5875270 -4244578 -80106 -390946 -5652400 -9111305 -6446145 -903803 2194848
37191 2194848 1629640 -722268 -3237949 -4609158 -3580277 -1108241 -370905 -2198458
37183 -2198458 -2797403 1128781 6912454 8934683 6008457 2276301 1016548 968445 -504643
37174 -504643 -3474415 -6029675 -6832888 -5705922 -3047173 -32504 1461091 385560
37166 385560 -2290823 -4598768 -5470603 -5152931 -4084221 -2056789 1179151 4538533 5450009
37157 5450009 2199999 -3302570 -6517807 -5227153 -2413547 -2530774 -5737238 -8093660
37149 -8093660 -7213930 -4978993 -3915529 -3545325 -2094433 114970 1301658 1276946 1616533
37140 1616533 3076478 4782867 6063769 7340445 8801471 9718894 9768308 9762521 10159375
37131 10159375 9868560 7751900 4659216 2490617 1310022 -997312 -5435932 -9513773
37123 -9513773 -9593500 -5255196 127673 3295218 4141410 4249221 3920873 2273374 -385797
37114 -385797 -2226607 -2338684 -2064779 -3005231 -4580281 -4738959 -2892895 -1039661 -1423563
37105 -1423563 -3602316 -4684589 -2614342 1533855 5000749 6215971 5173883 1846857
37097 1846857 -3559258 -8614540 -9564882 -5767326 -1314450 -295374 -1951640 -2674326
37089 -2674326 -1258871 699838 2492360 4711870 6161354 4296868 -247928 -3202904
37081 -3202904 -2498521 -1339035 -2983136 -5214340 -3394450 2463247 7197360 6999586
37073 6999586 3749817 2242447 4611308 8090373 7859741 2356713 -4185061 -5797098
37065 -5797098 -1832753 2051322 1174309 -2319274 -3159264 -227508 3270422 5422882
37057 5422882 7156594 8327202 6679212 2068207 -1871057 -2363840 -1079417 -816120
37049 -816120 -981751 723146 3683775 4833058 3483719 2534707 3953647 5571707 4222133
37040 4222133 642187 -1041793 1409212 5564299 7509302 6253164 3680215 1327900
37032 1327900 -762888 -2363122 -2554932 -1542339 -1033082 -1795659 -2495576 -2155633 -2081066
37023 -2081066 -3653997 -5653580 -5901653 -4690534 -4363398 -5839379 -7511061 -7482545 -5301066
37014 -5301066 -1729632 1625373 2816974 1366008 -692229 -1081195 -92608 470153 259397
37005 259397 100835 -450024 -2478237 -4902309 -5263274 -3579861 -2576208 -3527818 -4612966
36996 -4612966 -4126234 -2709045 -1560638 -960922 -1327768 -3083401 -4736939 -4077965 -2148961
36987 -2148961 -2592693 -5721920 -7094964 -4161645 -457201 -151847 -2023742 -2668625 -2526404
36978 -2526404 -4017792 -5960546 -5087980 -2054551 -755921 -1809485 -1625017 1423720
36970 1423720 4488840 5186792 4914813 5362411 5304942 3381204 1397506 2066531 4924124
36961 4924124 6840658 5911974 3267298 1456486 1983777 4015812 5148722 4005067
36953 4005067 1865306 723886 383049 -669397 -2072768 -2032948 -1045751 -1924441 -4988318
36944 -4988318 -6403063 -3417228 1315946 3304498 2292766 1888522 4130065 7225024
36936 7225024 8464790 7092682 4171595 1398334 197401 536645 562529 -1343448 -4215389
36927 -4215389 -5446353 -3965455 -1170442 1224400 2777802 3554582 3347745 2453742 2069629
36918 2069629 2827552 3532884 2518306 217093 -735185 1288178 4184535 3981484 -135234
36909 -135234 -4003125 -3160517 1418621 4367805 2713838 -854485 -2459911 -2201529 -2603018
36900 -2603018 -3767838 -3332729 -871483 833133 -229025 -2426218 -2937050 -1427834
36892 -1427834 158396 401472 -363195 -922965 -162716 2267634 5199863 6390040 4876916
36883 4876916 2554062 2162294 3858069 5111398 4179137 2219824 1193393 916671 -329324
36874 -329324 -2718536 -4048201 -2508443 761893 2767778 1900597 -643764 -2496074
36866 -2496074 -2437673 -1049522 274394 598898 98735 -195064 570311 2101253 3152357
36857 3152357 2774777 1183838 -611322 -1642234 -1349896 260475 2345107 3548333
36849 3548333 3246853 2190961 1274595 113842 -2013152 -3981906 -3295916 425972 3897806
36840 3897806 3686567 512225 -1762462 -1149586 441700 448670 -1182527 -2997533 -4217035
36831 -4217035 -4363582 -2403525 1511627 4478464 3560611 -180279 -2731233 -2252114 -772416
36822 -772416 -450104 -799115 -747048 -1028591 -2713131 -4971915 -6065856 -5412259 -3355119
36813 -3355119 -288307 2556419 3029430 616233 -2247741 -3246235 -3173295 -3910303 -5108478
36804 -5108478 -5441291 -5531411 -6450058 -6712097 -4665537 -2925101 -5671079 -11391613 -13414599
36795 -13414599 -9025318 -3087207 -281081 1257104 4800195 7998480 6474658 1872046
36787 1872046 240388 2919444 4675658 1971378 -1684968 -981554 3815761 7394180
36779 7394180 5690275 -294606 -5978835 -7180377 -3456762 1506474 3386711 1486578
36771 1486578 -1256332 -2359276 -2182954 -1854689 -998539 925626 2575117 2116533 83077
36762 83077 -1093191 -432680 360936 -522634 -2555352 -3854043 -3617690 -2376902 -339497
36753 -339497 2889389 6546763 8183023 6220542 2334119 -202633 -328453 122634 -486463
36744 -486463 -1601288 -2080512 -2010874 -1894517 -1548903 -1052128 -1364519 -2546977 -2714040
36735 -2714040 -504509 2646171 4676856 6049472 8166308 9722046 8084330 4289850
36727 4289850 2973759 6041370 9443069 8217983 2566930 -3139001 -5669450 -5085033
36719 -5085033 -2947044 -907866 -615383 -2685034 -5369724 -5764990 -2902011 1166842
36711 1166842 3656695 3833512 3266819 3647817 4709526 4661680 2805764 887055 828296
36702 828296 1817798 1455179 -384972 -1151272 388345 2281364 2838258 3401456 5407055
36693 5407055 6786273 4465413 -521469 -3642319 -2534891 681805 2941624 3379226
36685 3379226 2351372 -62279 -3276503 -5781766 -6776019 -6868712 -6379441 -4597805 -1682301
36676 -1682301 541391 1081148 1444207 3100174 4650187 3520315 -442729 -5059699
36668 -5059699 -8806219 -11601429 -13016834 -12039198 -8943257 -5511082 -2907967 -906374
36660 -906374 507985 640796 -145623 -52246 1690497 3599519 4390626 4976598 6345566
36651 6345566 7003557 4939243 1351084 -204163 1569061 4217917 5017455 3772991
36643 3772991 1556986 -1093116 -3516714 -4449195 -3844408 -3643229 -4912379 -5497964 -2628605
36634 -2628605 3001753 7919067 10034450 9836783 7912214 4191010 82863 -1621140
36626 -1621140 -442130 511803 -1182069 -3579539 -3220079 -373319 1189417 -644299
36618 -644299 -3733919 -4608540 -2239904 1623511 4518098 5008843 3348577 1111395 -152123
36609 -152123 -17577 1232407 3408199 5817661 6620315 4567385 1338503 243351 2116071
36600 2116071 4283698 4349461 3088076 2306176 1749528 338008 -742548 1012933 5390934
36591 5390934 8905889 9159487 7818715 7894952 9406840 9523015 6591277 2374284 -100579
36582 -100579 157423 1617796 2411369 2078159 1170626 41725 -1313797 -2657942 -3648543
36573 -3648543 -4537456 -5746999 -6498513 -5065105 -1293436 2104625 2224361 -436634 -2520908
36564 -2520908 -1946531 -69870 541410 -944888 -3477431 -5549928 -5895213 -3970095 -926628
36555 -926628 840906 431634 -51528 1719793 4505801 4380281 -325229 -6540380 -9578254
36546 -9578254 -7611807 -2466082 2788904 5945537 6304311 4854610 3872517 5050323
36538 5050323 7422570 7935726 4879837 332954 -1815086 -315186 2054054 2101886 141852
36529 141852 -937391 203854 1962342 2520424 2058566 1621063 1515749 1783960 2595031
36520 2595031 3043421 1439771 -1595761 -2464559 455379 3118332 689060 -4983942
36512 -4983942 -7145064 -3515071 689853 505251 -2436664 -3904031 -3467923 -3017394 -1637043
36503 -1637043 3222571 10255378 14299655 12368105 6598101 632268 -4143859 -7789634
36495 -7789634 -9677729 -8935165 -6077305 -3064065 -1809017 -2536417 -3262466 -1699996 1433855
36486 1433855 2208379 -1743912 -7345634 -9370561 -7002676 -4286555 -4119086 -5049340 -4945510
36477 -4945510 -4557069 -5228827 -5423309 -2511213 2763374 6253256 5191044 1303587 -1536650
36468 -1536650 -1713132 -908629 -1053632 -1542337 -488273 1992145 3719038 3956688 4557357
36459 4557357 6154023 5752910 1030396 -4775224 -6198174 -3187683 -1191207 -3100150
36451 -3100150 -5371847 -3863227 231486 2857438 2681524 1324113 13014 -1108990
36443 -1108990 -1516501 -605554 1141796 2830066 4052859 4150011 2414582 415460 1717434
36434 1717434 7000795 11618607 10914198 6346205 3223938 3631498 5012940 5087167 4575991
36425 4575991 4785282 5441246 5628640 4837214 2787470 -73947 -2098875 -2207491 -1592733
36416 -1592733 -1759595 -1826858 -250996 1799796 1979890 1029271 1850495 4391723 5342808
36407 5342808 3546129 1873354 2544953 4206790 5164827 5971152 6865226 6093225 3243707
36398 3243707 1154917 1661905 2212257 -101174 -3585563 -4639792 -3431549 -2832867 -2956194
36389 -2956194 -1205073 2391292 4265687 2710326 451830 102952 94308 -2402602 -6523270
36380 -6523270 -8582100 -7268901 -5349655 -5588647 -6846511 -5731648 -1402543 3125230
36372 3125230 4933562 4752022 5042414 5860465 5232690 3293602 2734372 4146048 4279437
36363 4279437 1225229 -1616298 -187057 3639304 4353826 887575 -2126455 -1595851
36355 -1595851 -50799 -788470 -2733815 -2852928 -1019594 511851 779864 470828 -172448
36346 -172448 -1141832 -1292160 214670 1849781 1808031 1476183 3573078 6975766 7215110
36337 7215110 3187816 -280730 1280003 6122063 9369190 9387728 7702521 4655070
36329 4655070 -370920 -5006744 -4939577 8430 4680943 5139377 3134235 2070211 1754474
36320 1754474 43480 -2873226 -5332080 -7588755 -10616244 -12551758 -10344847 -4875182
36312 -4875182 -620094 375104 606800 2111138 3023837 1368710 -686403 442785 4239211
36303 4239211 6374953 4291493 202181 -1796698 -161341 2899295 3771331 740428
36295 740428 -4563179 -8828632 -10067876 -8718271 -6334391 -4403937 -4259566 -6327021
36287 -6327021 -8813347 -8766479 -5475481 -1588914 29299 -761486 -2432008 -4038993 -4956632
36278 -4956632 -3972330 -801706 2320332 2625594 107965 -2726502 -3972071 -3625899 -2304975
36269 -2304975 -610298 228967 -1026902 -3761794 -5568964 -4920310 -2999983 -2218632 -3205246
36260 -3205246 -3818465 -1562108 2884964 5439921 3265203 -877170 -1299934 3120863
36252 3120863 6972251 5452655 756525 -1383673 694169 3949713 6080407 7341613
36244 7341613 7360287 4723505 726851 -627040 1614207 2997878 -324178 -5914720
36236 -5914720 -8487706 -7175839 -5840837 -6828651 -8004049 -6755245 -4116917 -3062331
36228 -3062331 -4142337 -4912227 -3556443 -1341421 -609971 -1409223 -1634106 -340586 882938
36219 882938 660619 388381 2426728 6551987 9986175 10736117 9387542 7738467 7169378
36210 7169378 8289433 10551093 11957950 10544872 6439620 1450843 -3032804 -6253477
36202 -6253477 -6889234 -4247621 -878372 -1152653 -5914273 -10634688 -10375165 -5050652 1362603
36193 1362603 5128490 5015927 2192805 -324713 414581 4008029 6367395 4353972
36185 4353972 -332669 -3572308 -3868305 -2850921 -1791492 -315806 1535948 2488267
36177 2488267 1917243 803677 108942 -481450 -1510465 -2440273 -2156565 -409201 1649747
36168 1649747 2433170 1730562 1540326 4143162 8901315 12231494 11760860 9244814 7890043
36159 7890043 7984738 7264797 4889891 2625834 2091819 3066487 4807967 6876427 8076027
36150 8076027 6822084 3746749 2072215 3774643 6644668 6889432 3937731 958479
36142 958479 752576 2626273 3829450 3220354 2632981 4432845 8140945 10350229 8502204
36133 8502204 3954571 150557 -1677974 -3128479 -4879335 -4724936 -880467 4381574
36125 4381574 6687957 4860773 2381553 3185559 7229207 10788184 10461576 6478214
36117 6478214 2430759 1879353 4861110 7756612 6969042 2621017 -1804409 -3246635
36109 -3246635 -1856865 -166437 -292260 -2183573 -4061705 -4257599 -2809401 -1307691
36101 -1307691 -1104823 -2016379 -2967355 -3145486 -1909945 1306953 5484686 7238743 3884144
36092 3884144 -2667543 -7450045 -8422281 -8370084 -9834336 -11187313 -10045588 -7838996 -7456977
36083 -7456977 -8059185 -6316525 -2194982 659524 534275 -400693 -589259 -1497086 -3940554
36074 -3940554 -5787135 -5509274 -4677736 -4535331 -3500011 -983481 -191902 -3229657 -6467600
36065 -6467600 -5577538 -2924186 -4423443 -10089938 -13446145 -10600645 -4694283 -396834
36057 -396834 1206178 919217 -708314 -1875149 -766 4025538 5643460 2843565
36049 2843565 -891625 -2053652 -1790567 -2440102 -3160360 -2508621 -2027132 -3131480 -3169520
36040 -3169520 725466 5682266 5939456 940611 -4024408 -5315799 -4831895 -5638626 -7459479
36031 -7459479 -8145399 -7144663 -5872116 -5926821 -7800440 -10467708 -12085173 -11886348 -10961490
36022 -10961490 -10291573 -9092355 -6543692 -3894568 -2843191 -2887563 -2523666 -2099844 -2922205
36013 -2922205 -4237474 -3908340 -1880977 -386192 -693090 -1984709 -3375867 -4753018
36005 -4753018 -5684906 -5740041 -5792017 -6871631 -8029318 -7598610 -6121198 -5496366 -5713162
35996 -5713162 -5256848 -4374564 -4770510 -6100921 -6023944 -3996077 -1892625 -595069 787712
35987 787712 1949899 1091853 -1739280 -4287039 -5631252 -6719381 -7033374 -4814383 -1370194
35978 -1370194 -595891 -2736685 -3305319 -272098 2461295 1552792 -562731 -551307 160851
35969 160851 -1002082 -2388016 -1419259 -142490 -1942225 -4930463 -4328234 -127055 3203935
35960 3203935 3960872 4610054 5972150 5508629 2407555 -428436 -930571 -307331 451699
35951 451699 2490034 5670911 6983500 4801053 1823413 1279607 2484244 2559383 690537
35942 690537 -1707555 -3629717 -4988253 -5444910 -4810121 -4049140 -4133126 -4208627 -2437073
35933 -2437073 1365736 5081991 6426497 5032202 2402707 398271 -111276 441566
35925 441566 932651 446126 -1010858 -2226597 -1558236 1090047 3220802 2132900 -1313521
35916 -1313521 -3086383 -1020309 2446543 4014480 3922906 4254203 4590205 2682412 -1137210
35907 -1137210 -3553333 -2621668 187979 2747300 4476372 5131218 3936575 1118004
35899 1118004 -1614725 -3134984 -3807480 -3724110 -2141351 326344 1145897 -886354 -3504378
35890 -3504378 -3801737 -1890835 41364 1272988 3040046 5750587 7619406 6727592
35882 6727592 3546652 797777 1011241 4427468 9089474 12520802 13011644 9915197
35874 9915197 4121673 -1448371 -3485047 -1632850 996882 1859842 2050981 3663704
35866 3663704 5790272 5867436 3954425 2541262 2476392 2250673 1356326 1075405 1390265
35857 1390265 327564 -2566763 -4908419 -4766353 -2790917 -239634 2344405 3647403
35849 3647403 2060651 -932994 -1146841 2618409 6365066 6464950 4246069 2587145 1359160
35840 1359160 -438023 -1136099 848609 3038278 2114574 -494701 -778319 1235909 1816938
35831 1816938 76525 -774987 735199 1967786 1065237 53449 949870 2208743 1564654
35822 1564654 -223706 -1143802 -1512588 -3035775 -5380777 -6279270 -4863468 -2979603 -2868202
35813 -2868202 -4653380 -6524244 -6939151 -6295095 -6152793 -6766892 -6255461 -3171656 817850
35804 817850 2395012 569211 -2375078 -3947408 -3828945 -2943748 -1913979 -1155292 -1123354
35795 -1123354 -1648896 -1933833 -1540425 -366891 2246494 6619815 10683951 11035875 7133430
35786 7133430 2583120 843412 1222267 754045 -1330138 -2981958 -2392717 159606 3069688
35777 3069688 4488223 3218640 217819 -1263406 1017333 4931098 5914981 2568025
35769 2568025 -1695717 -3276231 -2577692 -2149727 -2481058 -2012093 -540950 53202 -1098552
35760 -1098552 -2227464 -1452584 684679 2487644 3503753 3994759 3181573 335598 -2783669
35751 -2783669 -3147218 -581903 1647201 1337171 225962 872193 2693708 3359000 2715330
35742 2715330 2611980 3336312 2968813 629542 -1930046 -2786631 -2126878 -1131466 -42111
35733 -42111 1455685 2834206 2935931 1376210 -920102 -2519645 -2666330 -1929685 -1651859
35724 -1651859 -2394420 -3131449 -2483508 -411617 2020617 4148438 5984090 7342979 7920904
35715 7920904 8127959 8565327 8641705 7092136 4203414 2230767 2908858 5298581 6621564
35706 6621564 4903919 887742 -2232592 -1573460 2037960 4246395 2172885 -1659197
35698 -1659197 -2493246 249725 2575962 1984829 663445 1453444 3541686 4133954 2326720
35689 2326720 -690432 -3641515 -5461165 -5052998 -2711754 -627845 -210175 -49502 1779805
35680 1779805 4674191 6558785 6644159 5156841 1806549 -3011862 -6773165 -7475285 -6878380
35671 -6878380 -8017736 -10082857 -9288546 -4894589 -608959 923178 1431972 3148928
35663 3148928 4926712 4783967 3759754 4051060 4830406 3279674 -643300 -3560657 -3250680
35654 -3250680 -1381381 -706231 -1452664 -1874230 -1133352 -18464 751165 1464587 2460549
35645 2460549 3254150 3128722 2023932 350478 -1619002 -3549595 -4559380 -3835476 -1912744
35636 -1912744 -633001 -1390716 -3711529 -5755852 -5954011 -4214535 -2053481 -1408427 -2504719
35627 -2504719 -3021242 -650070 3378553 5106728 3038863 621086 1763267 5348227
35619 5348227 6695509 3920165 173160 -765327 1257804 3833921 5282524 5320386 3749605
35610 3749605 482051 -3141363 -4523887 -2202574 2171567 4972760 4211213 1683787
35602 1683787 747704 2160618 3447929 2577373 427155 -1293691 -2533780 -3597465
35594 -3597465 -3317845 -1099125 644240 -874024 -4601097 -7198012 -7983918 -8585046 -8168146
35585 -8168146 -3868443 3070467 6478775 2972992 -3489169 -7440571 -8504994 -8951270
35577 -8951270 -8407576 -5496990 -2172916 -1572383 -2917919 -2933390 -1206730 239621 1684486
35568 1684486 5023115 8587292 7915716 2633939 -2172500 -2918579 -1514517 -711976 73242
35559 73242 1673288 1912808 -1037570 -4863238 -6131872 -5063837 -4094242 -3444016 -1391537
35550 -1391537 2206429 5620452 7678256 8112082 6556088 3585288 1577731 2021345
35542 2021345 3090381 2401958 781041 374803 554112 -617983 -1954525 -538751 2705083
35533 2705083 3343164 -106832 -4311317 -6536540 -7402710 -6908628 -2906497 3503284 5843414
35524 5843414 93641 -8556238 -11679632 -8242310 -4320668 -3634991 -3898101 -2664533
35516 -2664533 -1403817 -1992140 -3265112 -3402669 -2852010 -2705561 -2462527 -1420280 -346410
35507 -346410 143005 1086668 3109423 4482769 3371369 707179 -1265598 -2079625 -2409360
35498 -2409360 -1520798 1760729 5885512 7273530 4663984 511591 -2516752 -4301989
35490 -4301989 -5714996 -6325433 -5052580 -1910421 1961907 5144307 6309587 5056490
35482 5056490 2982773 2415332 3289176 3067690 909059 -215104 2337984 6345627 7170948
35473 7170948 3909788 127730 -1312822 -1081006 -581367 543154 2633349 4157082
35465 4157082 3589786 1661683 97290 -601279 -629879 470687 2839636 5029330 5542037
35456 5542037 4778584 3741676 1924281 -1207016 -3520917 -2081765 2109173 4206166
35448 4206166 1508279 -2926614 -4170499 -1255562 2483792 3673985 1846642 -1125429
35440 -1125429 -2900167 -2123674 770029 3970035 5875858 6091327 4803562 2138721
35432 2138721 -1217510 -3675804 -4114497 -3207657 -2540468 -2766699 -3405526 -3981101 -4343074
35423 -4343074 -4079336 -2686596 -497423 1316726 1917102 1510941 787469 99929 -582965
35414 -582965 -1218499 -1522050 -1367475 -1245792 -1950272 -3505750 -4742956 -4507452 -3099156
35405 -3099156 -1837811 -1356474 -1143630 -656873 131752 1308925 2937007 4140726 3469052
35396 3469052 608906 -3254235 -6960150 -9973233 -11369839 -10167825 -7422020 -6016909
35388 -6016909 -7053279 -8115638 -6629046 -3354661 -791475 440662 1523884 2846676
35380 2846676 3725731 4100620 4502369 4794541 4675779 4785894 5514166 5448010 3011132
35371 3011132 -947615 -4149866 -5780212 -6374206 -5764300 -3665450 -1608520 -1482588 -2480171
35362 -2480171 -2225290 -611577 353965 155624 -9243 -301379 -1772442 -2806694 -429570
35353 -429570 3972819 4926559 772061 -3162242 -2071254 1654683 2802360 971217
35345 971217 -436254 -466336 -1156308 -2772109 -2788582 48838 3622967 4936130 2929896
35336 2929896 -1082552 -4417416 -4997495 -3435270 -2146077 -1701659 -273138 2045528
35328 2045528 1612650 -3185922 -7644031 -6099746 235045 5111496 5707094 4684515
35320 4684515 4295380 3271156 334170 -3323867 -6335496 -8643156 -9645767 -7981937
35312 -7981937 -4305476 -1428815 -579695 -128809 1104523 2144741 2421485 2959026 3682310
35303 3682310 2649583 -279729 -2051799 -933151 390218 -959803 -3040021 -1711068
35295 -1711068 2986129 6515317 5808489 2836311 1734140 4195978 8251294 10373186
35287 10373186 8370974 3093425 -2217965 -4569801 -3536799 -1268029 -537106 -2439536
35279 -2439536 -5207797 -5470305 -1676556 3774352 6822650 5985344 3111772 313881
35271 313881 -1931890 -3472643 -3471598 -1741050 439143 1892422 2901115 4285436 6076931
35262 6076931 7567324 7806666 6071085 3042722 1211301 2293760 4443171 4261821
35254 4261821 1590757 -374918 -27534 823466 1017997 2289772 5247423 6414142 2710836
35245 2710836 -3110294 -5235206 -2315587 1016964 337822 -3469183 -6124218 -5268010
35237 -5268010 -2615980 -1162265 -1200288 -156908 3307057 6605740 6432154 3418147 774427
35228 774427 -942154 -3817830 -7175475 -6909840 -2065005 2352926 2151338 -199297 -132925
35219 -132925 1825458 1848629 -488854 -2072389 -1741776 -1486385 -2395672 -3223234 -3157148
35210 -3157148 -2907421 -2824192 -2420694 -1674179 -725358 1022126 3393020 4346742 3024759
35201 3024759 2314799 4991491 8642075 8422236 4083000 40907 -1223943 -1399667 -1710829
35192 -1710829 -623016 2551502 5580304 6434455 5517505 3708886 1233394 -505142
35184 -505142 778651 4644160 7421196 6716852 3878978 879225 -2359086 -6034650
35176 -6034650 -8626298 -8892128 -7733306 -6580160 -5638711 -4698626 -3806785 -2471675 -274602
35167 -274602 1347062 393073 -2365076 -4241806 -5008002 -6799364 -9184931 -8724615 -4871306
35158 -4871306 -1762873 -1858496 -2256202 -380234 1021150 -1359509 -5236310 -6096474 -4131867
35149 -4131867 -2867758 -2606831 -373310 4152248 7411128 7249764 5701755 5462462 6237166
35140 6237166 5709186 2675153 -1332509 -3008973 -548374 3486316 4232004 521807
35132 521807 -3384997 -3587528 -1314352 376699 1575964 3730256 5575547 5198318 4187853
35123 4187853 5013022 5775935 2911778 -1663623 -2101440 2091315 4291660 352164 -5307852
35114 -5307852 -6330865 -2912417 126632 665305 466079 705005 368293 -1133067 -2822612
35105 -2822612 -3989270 -4994526 -5796462 -5390924 -3523517 -1866053 -2407238 -4827182 -6306089
35096 -6306089 -4493343 -360159 2711923 2693190 726250 -995843 -1660832 -1413890 -272184
35087 -272184 1063161 901766 -968490 -1870069 361072 3674180 4279613 2198902 1329973
35078 1329973 3923119 7788091 9491144 7989706 4614101 1547941 692651 2041707
35070 2041707 3005543 1357747 -1350102 -1846036 -425864 -903344 -4641763 -7991314 -7199364
35061 -7199364 -3152082 512909 1807944 1241360 184982 19330 1372466 2941741
35053 2941741 2508812 -31664 -2338389 -2902651 -2544470 -2052237 -993097 138029 -441313
35044 -441313 -2452652 -2801977 -188639 2362577 1951465 11315 -837082 -1618360 -5086886
35035 -5086886 -10582454 -14396115 -14498311 -11944199 -8341921 -4723321 -2238877 -1287531
35027 -1287531 -498063 1157531 2261878 1410172 335311 1414044 3286241 2731013 201566
35018 201566 -681876 811703 1226821 -1527788 -5293728 -7580255 -8626141 -8866504 -6903728
35009 -6903728 -2349514 2149459 4113020 4089827 3262797 932640 -2983574 -5641167 -4942049
35000 -4942049 -3539134 -5264594 -8787516 -9008608 -4398414 1272081 4886716 7329612
34992 7329612 9498104 9271754 5409399 1321124 1162121 3860519 4800367 2638728 599394
34983 599394 854609 1456567 134976 -2157354 -3582793 -4681972 -6659816 -8291595 -7515101
34974 -7515101 -4971442 -2905883 -1210690 2068484 6209121 7355960 3769785 -1440346
34966 -1440346 -4485213 -5254211 -5571123 -5501061 -4069501 -2010043 -844075 -90951 1752109
34957 1752109 3830284 3405045 35197 -3197045 -3419248 -1014445 1835964 3897530
34949 3897530 5120414 5479237 4835582 3442531 1960757 1297936 2241682 4228664 4709822
34940 4709822 1500738 -3768381 -6354434 -3659754 1572053 4508976 3416211 210539
34932 210539 -2794774 -4484736 -3946681 -626704 3832808 6083906 4781712 2374083
34924 2374083 1680083 1878107 1689 -4050738 -6538444 -4688375 -478158 1835074
34916 1835074 631160 -2241329 -4529276 -5528274 -5478890 -5042646 -5322635 -6498412 -6451581
34907 -6451581 -2993320 2149060 4094583 681584 -4707606 -7643402 -7641619 -6662034 -5010871
34898 -5010871 -1901047 1314431 2081118 588160 -405035 135292 453410 -198772 183658
34889 183658 2954064 6275213 7764139 7668578 7557537 7505751 6594619 5032559 3813195
34880 3813195 3042559 2286932 1815420 1859256 1492410 169036 -331775 2201891 6745853
34871 6745853 9584821 8843655 6363052 4599954 3906612 3706243 3916646 3689173 1140321
34862 1140321 -3300913 -5317016 -1692279 4371197 6702749 4520824 3062533 5216849
34854 5216849 7306633 5578390 2449427 2229715 3895274 3208121 121270 -1533751
34846 -1533751 -1167127 -2436613 -6337879 -8816538 -7232609 -4294051 -2955175 -1960396
34838 -1960396 240362 1321640 -1061799 -4599958 -5882913 -5832866 -7009712 -8006690 -5698648
34829 -5698648 -1321448 1043444 925143 1095334 1716441 676533 -667157 1485998 5996041
34820 5996041 6982116 2982494 -621610 -765732 -1534550 -5978053 -9534969 -7194035 -2090962
34811 -2090962 -424176 -1498968 52625 4347237 6000548 3448356 1586346 3839704
34803 3839704 7283058 7686779 4954105 1382661 -1762689 -3647670 -2915971 165006
34795 165006 2692129 2313913 -116585 -2428320 -3840623 -4379659 -3506296 -1176873 1051901
34786 1051901 1690457 1181651 839794 975501 1304267 2043388 3082571 3040934 924617
34777 924617 -1796355 -2532668 -913995 824407 1050724 819131 1911808 3856319 4244772
34768 4244772 1944998 -1141227 -2136042 -429884 1917475 2774253 1944191 436952 -1076648
34759 -1076648 -2222041 -2177840 -343891 2295590 3664443 2938614 1678495 1914529 3340471
34750 3340471 3268910 -69222 -4688932 -6575913 -4591924 -2108852 -2371839 -3698950 -1960250
34741 -1960250 2692072 5045946 1767496 -4087178 -7480659 -7600247 -6967150 -6513954 -4996065
34732 -4996065 -2339041 -273674 308873 166570 36542 264284 1516147 3513810 3835381
34723 3835381 860169 -2678884 -2490180 996438 2847864 727526 -1990696 -1546320
34715 -1546320 1289288 3543263 4178781 3558271 1403938 -2036108 -4714046 -5187753 -4799213
34706 -4799213 -5331363 -6106379 -5532276 -3793876 -1689676 1336931 5190295 6907477 4012767
34697 4012767 -863242 -2462504 166261 2783501 2305962 403443 -316548 -249473 -831753
34688 -831753 -1281049 -24210 2086286 2740680 1922449 2213262 4852648 7411159 6723330
34679 6723330 3197904 466564 567228 1276259 -285171 -2642988 -1316829 4577994
34671 4577994 10064717 10393320 7058567 5184224 6547099 8308818 7872222 5688433
34663 5688433 3218408 1188579 325834 951974 1249500 -1078337 -4561082 -4696661 -465643
34654 -465643 3348832 2817032 531907 990045 2900184 982491 -5353165 -10115721 -8558588
34645 -8558588 -2995785 1021795 1417475 269529 -173126 348136 1155920 1918173 2801778
34636 2801778 4098048 5520038 5813509 3946590 811677 -1466729 -2107006 -2006289 -1227026
34627 -1227026 1651259 6548238 10408966 10588104 8114363 5629721 3634147 1184039
34619 1184039 -999547 -1155551 253899 784652 -554063 -2753365 -5472997 -9077214
34611 -9077214 -11810036 -10664929 -6275481 -3291557 -3877951 -4326211 -1015101 3429618
34603 3429618 3932018 802556 -857975 1115050 3321355 2323157 -1128748 -4470167
34595 -4470167 -6578764 -7245510 -6249375 -4510209 -3687067 -3235403 -615270 3780315 5025507
34586 5025507 78364 -6544316 -7488411 -2015535 3206054 2846534 -1296272 -4306323
34578 -4306323 -4532786 -3671965 -2714144 -823991 2122189 4206349 3464736 391830 -2102563
34569 -2102563 -1315757 2384514 5362280 4186312 -351830 -3624499 -2282429 1905969
34561 1905969 4365709 3080335 162524 -1567829 -1751876 -1805256 -2594619 -3770728 -4584089
34552 -4584089 -4590305 -4123863 -4452000 -6518075 -9059476 -9302477 -6531648 -3659425 -3782641
34543 -3782641 -6321294 -8415697 -9152968 -9991671 -11458500 -12147751 -11218985 -9317780 -6589796
34534 -6589796 -2543536 1290224 1599984 -2136467 -5940112 -6158400 -3652423 -1169499
34526 -1169499 740174 2394749 2211539 -893600 -4040443 -3430785 66383 2352806
34518 2352806 2366439 2540761 3331482 2296158 -539698 -1450305 773656 1829109 -1829144
34509 -1829144 -7157227 -8472190 -4979617 -1044185 -374186 -2813971 -5986476 -7637135
34501 -7637135 -6767380 -4158088 -1486460 696827 2988052 4924165 5037420 3816389
34493 3816389 3683528 4661067 3443586 -954330 -4191686 -2653834 622974 445861 -2488303
34484 -2488303 -3156497 -533106 1205747 -43479 -1149435 621414 3228616 3522981
34476 3522981 2106091 1824484 3316603 4501826 3682418 1428505 -487080 -1239913 -1854956
34467 -1854956 -3588298 -5342361 -4253077 -77668 2870200 645196 -4750962 -7747407
34459 -7747407 -6477498 -4385486 -4679976 -6574245 -7627542 -6789125 -4198425 -535276
34451 -535276 2532553 3468215 3010465 3048690 3235095 1375432 -2600670 -6080576 -7624474
34442 -7624474 -8193439 -7973096 -5587766 -1567158 1097399 1396275 1695432 2978598 2620197
34433 2620197 -659597 -3458146 -2551507 92589 623547 -1101533 -2726943 -3599335 -3996559
34424 -3996559 -2567073 1239203 4068287 2431670 -1735534 -3661562 -2780348 -2524107
34416 -2524107 -3749304 -3500492 -761250 1424674 875092 -866145 -2148186 -3792788
34408 -3792788 -5972789 -5994129 -2023957 3254381 5391587 3208228 -882104 -4235764
34400 -4235764 -5767077 -5458920 -3998153 -2508492 -1498868 -565249 212864 -335718 -2604795
34391 -2604795 -4668493 -4036654 -739088 2353769 2403138 -627842 -4076138 -5311683 -4358045
34382 -4358045 -3515380 -4259116 -5298795 -4387967 -1238499 2389620 4714143 4839710 2618148
34373 2618148 -667139 -2270861 -744658 1759715 2148540 826470 761348 2358511 2657754
34364 2657754 296777 -2259249 -3057131 -3943802 -6991062 -10222630 -10109078 -6892758 -4340524
34355 -4340524 -4778177 -6953805 -8526675 -8320277 -6128637 -2471123 1018082 2515903
34347 2515903 1733946 -239365 -2532193 -4640191 -5487918 -4268490 -2282245 -1975883 -3648688
34338 -3648688 -4941402 -4367063 -3477172 -4155868 -5349566 -4512245 -1541555 874990 866524
34329 866524 -562964 -1592202 -2039211 -2770003 -3872869 -4635443 -4566050 -3360415 -699550
34320 -699550 2581631 3981710 1898556 -1656286 -3014720 -1526961 16869 -80540 -296692
34311 -296692 570357 759085 -1176534 -2802647 -668081 4565016 8910560 10179939 9375430
34302 9375430 7672688 5364713 3716908 4396112 6385920 6533461 4044219 1560636
34294 1560636 832542 375806 -1172170 -2436651 -2032119 -1180083 -1273822 -1269810 -160861
34285 -160861 219945 -1792858 -3472782 -407496 6764048 11778791 9693026 2003406
34277 2003406 -5874995 -10161758 -10830125 -9948518 -9362438 -9438470 -9227448 -7895255 -5968957
34268 -5968957 -4798643 -4992074 -5925481 -6577069 -6256622 -4761239 -2492409 -417332 437544
34259 437544 -525140 -3191078 -6220975 -7180157 -4768745 -1199382 -445310 -3176006 -5352813
34250 -5352813 -3402118 972037 3258692 2100456 265336 325627 1962163 3618528
34242 3618528 4569083 4832934 4705518 4840544 5524747 5765132 4484055 2627945 2394958
34233 2394958 4014542 5009320 3486494 789669 -280701 906917 2182769 1470929
34225 1470929 -594010 -1487638 -34147 1971556 2006642 47684 -1728212 -2142985 -2038806
34216 -2038806 -1915238 -919620 832287 1444369 475070 508958 3014896 4936905 2833389
34207 2833389 -1183477 -1695351 2363836 6289580 6075507 2565073 -1501615 -4834378
34199 -4834378 -6586044 -5376888 -1498276 2181046 3444657 3207218 3416205 4244882 4661095
34190 4661095 4094110 2388751 -218393 -2225325 -2046339 -959814 -2292787 -6291776
34182 -6291776 -8691708 -6565857 -2849152 -2058136 -3752195 -3936347 -1629303 51123
34174 51123 -721482 -1811545 -934571 729025 459223 -2104233 -4566800 -4540979 -1784871
34165 -1784871 1971933 4637177 5395417 5146614 5298805 6116976 6428640 4993036 2123126
34156 2123126 -130331 172815 2507954 3978775 2493957 -819743 -3457368 -4903977
34148 -4903977 -6347105 -7694134 -7423601 -5455360 -3477391 -1936728 435999 3218760
34140 3218760 3552949 461807 -2952486 -3667257 -2439712 -1163007 585122 3429808
34132 3429808 5312322 4379070 2732154 3310850 4531147 2403404 -2718467 -5995138
34124 -5995138 -4959145 -2483809 -2065940 -3592000 -4948249 -5021975 -3891970 -2159409 -893571
34115 -893571 -541795 135702 2137821 3876014 3448680 2504817 4214111 7620913 8228786
34106 8228786 4707832 586028 -1821235 -4325956 -7636276 -8241098 -4232067 -179938
34098 -179938 -1436904 -6123465 -7703171 -4215039 -187207 412433 -1244951 -2186900 -2057196
34089 -2057196 -2463531 -3921652 -5145228 -4762659 -2924389 -1178541 -567169 788 2303481
34080 2303481 5503448 6261673 3315749 -117746 -491763 1267571 1594267 -450582 -2694999
34071 -2694999 -3860856 -4825046 -5871676 -5840804 -4787462 -4697244 -6166489 -6632910 -3845380
34062 -3845380 342178 1840751 -415162 -3084844 -2840428 -626952 -20676 -1968934
34054 -1968934 -3423627 -2120094 -501014 -2392982 -7063240 -9977912 -9232908 -7293594
34046 -7293594 -5556233 -1730102 4828097 9364723 7532369 2245717 92006 2392066
34038 2392066 4397640 2639501 -1425587 -5037795 -7134800 -7219293 -5051788 -2326121
34030 -2326121 -1500742 -2476480 -3432585 -4719038 -7936131 -11133702 -9923579 -4606473 -1145342
34021 -1145342 -2776285 -5351427 -4021647 -191658 1944868 2061818 2539360 3506671 3549134
34012 3549134 3291760 3924663 3781135 655509 -3744809 -5874232 -5860805 -6725314 -8857930
34003 -8857930 -9620026 -8114425 -6044409 -3847912 -295518 3769918 5656745 5453320
33995 5453320 6101642 7892816 7426592 3660764 442590 548613 1349642 -422914 -3139229
33986 -3139229 -3237968 -1046664 353500 328509 824107 2160661 2310451 424701 -1651494
33977 -1651494 -1831751 -130966 1548272 1116187 -1613616 -4015839 -3263825 -390247 571636
33968 571636 -1518457 -2995708 -1253377 1048775 683975 -744410 -207001 1188953 1188611
33959 1188611 2170472 7617297 14559709 16680433 14472157 14816273 19865981 24203058
33951 24203058 24842087 26031136 31106899 37639613 44721146 56796226 75310457 96257214
33943 96257214 123480125 172495428 245724427 310519123 321761373 269890829 192187290
33936 192187290 131851173 99139773 78833627 60647556 47638580 42039782 38653390
33929 38653390 33092421 26630628 21369016 17447366 15715319 17157087 19183409 17991569
33921 17991569 14881781 14671433 17324455 16966240 10659113 2778426 -1498927 -2386066
33913 -2386066 -2664109 -2788822 -1859199 -488273 148436 116687 -360280 -1707026 -3204620
33904 -3204620 -2786880 -220242 1916903 2008488 1648092 2498659 3651221 4046229 4623148
33895 4623148 5541118 4035611 -1663463 -8216684 -10366157 -7120472 -1959510 1876793
33887 1876793 3382566 2292631 -894984 -3613569 -3069234 139927 2484446 1917889
33879 1917889 13397 -479205 1362316 4159279 5565654 4312313 1813482 848134
33871 848134 1673530 1146645 -2577943 -6564935 -7098210 -5332503 -5190071 -6730641 -6150287
33862 -6150287 -2482214 435885 126798 -647005 1357999 4645992 5656919 4220832
33854 4220832 2861973 2093427 47323 -3413816 -5515032 -4440058 -2051549 -1266865
33846 -1266865 -2114779 -2112746 -30124 2544991 3806695 4228561 5054944 5484943 3751664
33837 3751664 816349 10973 1923683 2670732 -402775 -3968856 -3204975 696919 1851073
33828 1851073 -1934477 -6544560 -7931716 -6712706 -4783241 -1575519 3279416 6676506
33820 6676506 5319062 935260 -1226488 1115049 4846384 5622607 2487553 -1984342
33812 -1984342 -4665662 -4386567 -2226652 57127 1637298 2521358 2479455 1134949 -1030107
33803 -1030107 -2876744 -3687367 -3060068 -596575 2489441 2669797 -1724949 -6152215 -4071999
33794 -4071999 3649215 8381718 5109155 -594049 -847320 3429303 5210814 2544910
33786 2544910 462151 2026467 3766556 1806339 -2302387 -4589923 -4169345 -2870738
33778 -2870738 -1579349 251128 2481767 3930150 3838745 2384512 70644 -2425439
33770 -2425439 -4171694 -4641992 -4375241 -4407731 -4959258 -4911153 -2851533 1070561 4521023
33761 4521023 4990547 2596854 -7511 -753506 -18269 927536 1644611 1862853 951997
33752 951997 -544945 -541573 1772100 4351176 5316294 5735677 7141235 8111379 6279599
33743 6279599 2446678 -436541 -1484372 -1994418 -2186390 -1111856 733544 1984010
33735 1984010 3085863 5071629 6336455 4521194 1185877 273782 1930660 2513470
33727 2513470 1120231 934702 2936171 3763015 2033848 1469383 4570148 8029075 8285778
33718 8285778 7341736 8581483 10429003 9139073 5257972 2372881 1402405 871711 1201974
33709 1201974 3827056 7046630 7420907 4738231 1440674 -2008116 -6603894 -10361977
33701 -10361977 -9651427 -5352123 -2686551 -3854996 -5462587 -4674926 -3292106 -3472902
33693 -3472902 -3618059 -1566080 1335784 2622103 2816090 3970564 5806132 6349369 5320681
33684 5320681 4097879 2956951 896608 -1983939 -4108556 -4600198 -4230874 -4017765 -4111546
33675 -4111546 -4202024 -4015126 -3338510 -2372602 -1956308 -2576775 -3282356 -2608851 -655663
33666 -655663 904402 1324593 2100142 4637566 7347865 6881189 2607077 -1861430 -2845656
33657 -2845656 -1022712 118924 -591324 -812870 1318298 4412578 5850066 4707407
33649 4707407 1874737 -965596 -1821942 52698 2323130 1741415 -903688 -1100694 2543170
33640 2543170 5484780 4115415 1754981 3505879 7998744 9496463 6493144 2669735
33632 2669735 152162 -2301949 -4232596 -2614449 2405691 6112161 5635672 3336402
33624 3336402 1858010 345245 -2020933 -3188071 -2007511 -963867 -1909479 -2684453
33616 -2684453 -1377379 -321394 -1822368 -3220093 -977007 2802546 3077955 -437552
33608 -437552 -3369166 -3658016 -3446970 -4051615 -3895788 -2351698 -1472399 -2453440 -3663274
33599 -3663274 -3637534 -3236341 -3402897 -3256020 -1949021 -406878 246139 311967 285524 -399145
33589 -399145 -1962899 -2956305 -1961697 149838 1179703 561886 81377 1391933 3691101
33580 3691101 4570034 2998233 671376 -50590 1141443 2746111 3762990 4267697 4021624
33571 4021624 2508638 503101 -632273 -1671117 -4909855 -9793798 -12052413 -9104142
33563 -9104142 -3807383 -668594 -741693 -2584626 -5392944 -7927513 -7050697 -1631533 3899710
33554 3899710 4457863 1567923 1014281 4036104 6064554 4282819 1057766 -1209189
33546 -1209189 -3445222 -6087182 -6483763 -2916681 2203614 5734908 7491984 8344074
33538 8344074 7694689 5418207 3579209 3488427 3323985 1265062 -1200906 -1793859 -1260788
33529 -1260788 -1789115 -3123606 -3082024 -936239 2046338 4472697 5327721 3897913 1137401
33520 1137401 -274240 822542 2299209 2147144 1652899 2629612 3526880 1704865 -1759572
33511 -1759572 -3242586 -1941836 -447923 -21492 1106377 4030884 6888689 7496338
33503 7496338 5993886 3779433 1735913 549662 1081654 3171644 5116577 5288138
33495 5288138 3687655 1570293 258389 471840 1985368 3655544 4250019 3312991 1221406
33486 1221406 -856312 -965996 2016928 5897122 6253541 1837369 -2798907 -2430318 2328328
33477 2328328 6176433 5696174 1910186 -2736697 -6373282 -6891039 -3073694 2437221
33469 2437221 4588150 1868910 -1727015 -2166849 -398598 -97519 -2379738 -4971131
33461 -4971131 -5652335 -4643446 -3691771 -3716975 -3474979 -844569 3990411 7572925 6988347
33452 6988347 3821506 2002062 2350132 2360110 1324915 1862107 5208146 8575713 9119418
33443 9119418 7485018 5265984 1896547 -3138078 -7401990 -7961133 -5223011 -1732838
33435 -1732838 1270696 3536156 3887414 1852399 -70899 880582 3508988 4277200 2538741
33426 2538741 912840 823702 1141515 1449431 3141647 6243460 8088167 6691475 3437947
33417 3437947 1136819 923337 1971296 2843383 2330172 118367 -2793445 -5118890 -6550116
33408 -6550116 -7046840 -5808243 -2807272 -381188 -706103 -2393046 -2683608 -2416473 -4712544
33399 -4712544 -8484859 -8154524 -1742393 5223782 6921422 4669039 3486269 4252859
33391 4252859 3761459 870500 -1891975 -2441249 -1239890 557649 2041986 1903785 -246097
33382 -246097 -2142747 -1199454 1796701 4103721 5415158 7292413 8602306 5925946
33374 5925946 -519893 -5469906 -5021572 -1243393 1509173 1820061 607061 -1676341
33366 -1676341 -4306174 -4990978 -2455798 1024443 2358780 1705657 1259354 1220648 -50445
33357 -50445 -2465634 -3734062 -2618173 -441951 889745 733016 -360198 -1129673 -444354
33348 -444354 1025072 967673 -986228 -1268511 3260220 9866732 12278594 8477912 2882254
33339 2882254 232562 529904 1130582 862894 306141 109934 592057 1415864 866079
33330 866079 -2496864 -6790834 -8095388 -5858986 -3991381 -4900656 -5722631 -3058381 1585833
33321 1585833 4461827 5163615 5624662 5497285 3128079 245949 901668 5421031 9603695
33312 9603695 10718190 10416599 10575557 10145311 8117345 6291264 6471879 7289264 6388775
33303 6388775 3990929 1830239 115024 -1770730 -2549484 79580 5824783 11298132
33295 11298132 13639294 13171743 11999140 11167953 10003823 7772653 5212717 3911234
33287 3911234 4102345 3919720 1856308 -635593 -798834 1144417 1628483 -1339823 -5010926
33278 -5010926 -5434856 -2643158 -102169 99396 -870075 -1336763 -1462394 -2198069 -3518595
33269 -3518595 -4670105 -5355126 -5885542 -6454576 -6677484 -5869803 -3882555 -1708034 -782133
33260 -782133 -1361960 -2132595 -1876446 -907105 -198468 268218 1333750 3160786 4865520
33251 4865520 5685575 5851529 6075814 6365904 5527420 2379624 -1978441 -3922982 -1017124
33242 -1017124 4162773 6109110 2950471 -1331362 -2473380 -1247144 -983169 -1900945
33234 -1900945 -1190743 2051989 5212682 5748079 3969200 1786267 519571 278164 52756
33225 52756 -1542288 -4309492 -5861327 -4640030 -2550379 -2222587 -2693683 -1101583 1805053
33216 1805053 1869412 -2122111 -6227775 -6950466 -5439820 -4155957 -2858878 -736956 332162
33207 332162 -1922610 -6287517 -9488587 -10297449 -9723460 -8466486 -6781553 -5683804 -5661604
33198 -5661604 -5180031 -2879299 -64969 1510117 2798408 5207618 6670953 4081629
33190 4081629 -961359 -3372323 -1959099 -1078932 -3534763 -6107192 -4745600 -870785
33182 -870785 791361 -1301593 -4305244 -5312452 -4280474 -2910504 -2471428 -2834077 -2784203
33173 -2784203 -1476888 307847 1341204 2245882 4628319 7609460 8038448 5504615
33165 5504615 4111177 6753244 10276249 9809967 6025284 3856878 4841777 5383716 3172105
33156 3172105 815517 1176639 2798378 2799448 1675802 1938343 3538705 4049807 2885623
33147 2885623 2164554 2983482 3534276 2033907 -439972 -1469623 -435655 1196713 1902699
33138 1902699 1126784 -1122017 -4241936 -6620700 -6521957 -3907135 -783797 558305 -643359
33129 -643359 -3347317 -5492623 -5262720 -2771672 -710913 -1914706 -5508279 -6838864
33121 -6838864 -2672387 4377706 8275425 6117465 716607 -3239617 -3861796 -2481881
33113 -2481881 -1077164 -451279 -276754 59299 736593 1515675 2417997 3700118 4648513
33104 4648513 3583303 417144 -2051428 -1658190 -637479 -2605022 -6183790 -5931555
33096 -5931555 -603771 4188685 4134590 2571322 4526619 8073813 7360344 2406433 -442510
33087 -442510 1958880 5329771 4802323 1167669 -1976007 -3342032 -3497969 -2400482 -311209
33078 -311209 981932 430004 -419184 178755 1627283 2626617 3345281 3960814 3098937
33069 3098937 97996 -2963394 -3982164 -3998965 -5201747 -7334090 -8639889 -8736254 -7733812
33060 -7733812 -4319332 1707881 6419379 5524633 604707 -2706393 -2686859 -3039115 -5768281
33051 -5768281 -7619914 -5848324 -3029979 -2642644 -3257005 -1413634 1788474 1680099 -2810769
33042 -2810769 -7264745 -7967018 -6519924 -6373376 -7288607 -6104065 -2113786 1265274 967869
33033 967869 -1688023 -3151933 -2632087 -2616928 -4536989 -6471495 -6258330 -4738152 -4072816
33024 -4072816 -4391016 -4247591 -3297337 -2216658 -849015 1020891 1666418 -890118 -5217780
33015 -5217780 -7398518 -6005625 -3482684 -2121193 -1538722 -887988 -492268 6808 2155072
33006 2155072 5595603 7210101 5433657 2962654 2806860 3865201 3137770 575168
32998 575168 -1202063 -946872 77379 325003 -737188 -2733778 -3989505 -2285794 1965386
32989 1965386 4704116 2772617 -1746429 -4227858 -3255714 -899208 1380082 3497991
32981 3497991 4119562 1349999 -3373419 -5608122 -3398011 174283 1119934 -927949
32973 -927949 -3394065 -4077097 -2697754 -558053 551586 158466 -62541 1479749 3640201
32964 3640201 4018243 2693757 1968429 2351412 1691650 -931705 -3219202 -2982242 -1342985
32955 -1342985 -969303 -2446540 -3692911 -2251480 2216544 6836841 7372490 2915873
32947 2915873 -1842214 -1567638 2839532 5535623 3966237 1775085 2283713 3329743
32939 3329743 1360710 -2616144 -4644298 -3394133 -988006 375118 -153544 -2846032
32931 -2846032 -6817682 -9275545 -7719999 -2781019 2489363 5452797 5015593 1527221
32923 1527221 -2739589 -4464786 -2629855 100792 1007851 852144 1781816 3251490 2692468
32914 2692468 -457388 -3762145 -4625211 -2620150 374518 1216585 -2003026 -7110500
32906 -7110500 -9167814 -6291238 -2162722 -788777 -1309629 -928054 -355910 -2050426 -4621433
32897 -4621433 -3944795 227676 3236628 1916133 -1582644 -3463942 -2908370 -1914476 -2615332
32888 -2615332 -5411980 -8278040 -8236485 -5140628 -2690198 -3297236 -3880045 -508383 4528850
32879 4528850 5390651 1680374 -967455 287878 2034518 1526943 1168650 3175811 4790596
32870 4790596 2559643 -2226076 -5694327 -6000360 -3192129 2140578 7414427 8809447
32862 8809447 6332062 4520106 5369671 5031243 1168216 -1453471 1883264 7415109
32854 7415109 8184420 4604853 2593043 3360749 2986992 1360975 3084527 8164062 9658776
32845 9658776 3670799 -4629133 -8520645 -8016062 -6819982 -5668744 -3283008 -707201
32837 -707201 -86465 -909946 -1107317 -474591 -85065 164915 645801 174511 -2104445
32828 -2104445 -4346465 -4148578 -1809521 943863 3814928 6674249 7248589 3920260
32820 3920260 -61125 684405 6529568 12116875 13313402 11304158 8812055 6100828
32812 6100828 2902741 1051628 1950062 3292167 1651310 -2419641 -4859042 -3584992
32804 -3584992 -864304 229850 -657020 -2144972 -3595360 -4997411 -5620162 -4610712
32796 -4610712 -2662907 -1730071 -2916673 -5360034 -7147756 -6869689 -4691389 -2562641
32788 -2562641 -2726569 -4923584 -5666375 -1959106 4337106 7751608 5391390 155685
32780 155685 -3171228 -3377282 -2931682 -4027741 -6490273 -8968894 -10272659 -9645055 -7369082
32771 -7369082 -5176891 -4634732 -5015291 -4110236 -1275904 1664861 2723583 1604614 -890366
32762 -890366 -3741663 -5521575 -4899698 -2177421 905811 3522324 6353620 8923692
32754 8923692 8339646 2837847 -4598682 -8842595 -8737532 -8080188 -9888040 -12215457 -11457690
32745 -11457690 -8036982 -6076689 -7698578 -10260363 -10160454 -7349581 -4433689 -2715424
32737 -2715424 -1377725 -73025 203024 -663590 -1045411 -185320 69645 -2173009 -5750679
32728 -5750679 -7761798 -7256471 -5733280 -4397045 -2990015 -1436998 -614150 -783051 -854016
32719 -854016 -137779 384209 -406156 -1798999 -1966031 -340788 1592713 1969232 547905
32710 547905 -1127395 -1449888 -362473 1013765 1981907 2519729 1999868 -552218 -3936473
32701 -3936473 -4438177 -260224 4835617 5186179 418625 -3838826 -3054489 1025507 3536056
32692 3536056 2567377 234234 -844280 -146241 1092951 1371854 247002 -1140871 -1261988
32683 -1261988 -163293 670570 655979 927698 2217584 3419800 3245074 1939305 242357
32674 242357 -2009442 -4857264 -6969527 -7026429 -5601219 -4245893 -3397999 -2546566 -1700826
32665 -1700826 -1078176 145275 2959752 6322144 7355203 4364151 -985653 -4860391
32657 -4860391 -4561731 -963699 2148745 1667020 -1755595 -4812243 -5550127 -4978508 -4670921
32648 -4670921 -4707806 -4732296 -5046479 -5352230 -4204169 -1362462 863952 440658 -1564339
32639 -1564339 -2815672 -3031835 -3393101 -3835126 -3313525 -2047990 -1307076 -1474756 -2160831
32630 -2160831 -3382088 -4701610 -4367057 -1749655 436570 -748735 -3867393 -4787753
32622 -4787753 -2671790 -920322 -1824087 -3488719 -3022596 -195922 3080958 4929395
32614 4929395 4566636 3022428 2847902 5047141 6673201 4215240 -944908 -3873647
32606 -3873647 -3004622 -1855398 -3057352 -4752154 -4540893 -3163314 -2035956 -597413
32598 -597413 1311404 1506681 -1221359 -4379666 -5124742 -4077321 -3235050 -2512459 -1155409
32589 -1155409 -192807 -355919 255263 3103354 5796765 5250860 2525229 889180 689507
32580 689507 50295 -743694 55251 1388962 349882 -2678262 -4092797 -2588237 -593720
32571 -593720 301389 1383864 3412839 5013271 5742453 7245778 9805048 10862910 8656432
32562 8656432 4630098 818781 -2419628 -4637036 -4244766 -1231789 1551123 1879397
32554 1879397 865758 478230 636254 706714 1581766 3883309 5947603 6046986 5183700
32545 5183700 5382845 6456919 6680417 5608424 4101945 2460289 533256 -1057192
32537 -1057192 -1591282 -1450441 -1195175 -443267 892379 1557979 903488 565898 2218403
32528 2218403 4811212 6119393 5861195 5057421 3570191 1013926 -847718 228097
32520 228097 3169956 4530538 3409461 2520950 3711919 5106685 3915901 146941
32512 146941 -3636745 -4906217 -2803046 1544013 5760317 8229673 9368071 9874981
32504 9874981 8496879 3669800 -2949228 -7273859 -7573082 -6053657 -5086619 -4452903 -3402092
32495 -3402092 -2836024 -3593536 -4397324 -3426108 -845788 1554565 2237888 636004 -2536246
32486 -2536246 -4896497 -4178703 -1430096 -360755 -2251123 -3938747 -2721549 -651513
32478 -651513 -1145637 -3487361 -4238918 -2803665 -1763973 -2136828 -2064786 -601743 555395
32469 555395 30507 -1244114 -1947197 -1982157 -1444489 -267004 436028 -873786 -3220003
32460 -3220003 -3469380 -665395 2600929 4291865 5359321 6354976 5021017 298225
32452 298225 -4062715 -3839981 -568592 715996 -999760 -1836373 342544 2807421 2533892
32443 2533892 108697 -2499891 -4710872 -5882504 -4163991 509703 4443588 4000093
32435 4000093 103428 -3216840 -3361456 -241604 5224240 10836332 12936464 10065800
32427 10065800 6099894 6154649 9530873 10416621 6025626 238278 -2095483 -937742
32419 -937742 752533 1506656 1589237 1224095 1121131 2712103 5348705 5334910 661660
32410 661660 -5125636 -7072643 -5320395 -3879365 -4255443 -4682117 -5133000 -8007392 -12842234
32401 -12842234 -15068545 -12193623 -7464611 -4958123 -4314625 -3056491 -1160503 -127411
32393 -127411 185796 541032 8075 -2093447 -3669404 -2720813 -1232596 -2393363 -5052725
32384 -5052725 -5128698 -2033926 658357 1076792 1148261 2094361 2316818 1335398 1584530
32375 1584530 3954304 5297640 3262237 419167 318878 2034033 2134425 113391
32367 113391 -1699830 -2142124 -1624913 282497 4076515 7804478 8782286 7471866 6425261
32358 6425261 5799840 3487524 -343860 -2639843 -2027898 -513476 273753 1166620 2696432
32349 2696432 3609248 3589270 4198704 5411762 4548494 813175 -2390776 -2318629 -893656
32340 -893656 -765750 -607285 1546197 3070213 175138 -4925225 -6021661 -2034930 1453617
32331 1453617 835100 -765245 348219 2307597 1234577 -2510263 -5509932 -6472047
32323 -6472047 -6513313 -5845450 -3893512 -1875554 -1710791 -2576743 -1822233 536239 1452967
32314 1452967 -268738 -1790975 -484843 2053862 2338646 -132034 -2487035 -2319229
32306 -2319229 -41201 2460634 3930692 4148820 3388724 2187672 1190786 667829 290240
32297 290240 -302635 -789932 -388315 1051289 2489920 2695889 1690363 623244 165705
32288 165705 -192410 -910098 -1394053 -1064551 -683521 -1393746 -2740334 -2986985 -1569572
32279 -1569572 -104829 -520411 -2927813 -5671179 -6901046 -6003529 -4131308 -3280633 -4043639
32270 -4043639 -4494638 -2531120 800183 2058705 -74778 -2926494 -3511483 -2321080
32262 -2321080 -1859015 -2848317 -3887513 -3898133 -2745342 -74720 4000453 7126701 6236085
32253 6236085 1625656 -2598271 -3272058 -1673945 -1011246 -1932542 -2320383 -823174 1173125
32244 1173125 1307594 -857115 -2904754 -1519087 4063941 10466977 13073181 10922632
32236 10922632 7445118 5635256 4234902 424974 -5028955 -7941283 -5983918 -1531661
32228 -1531661 1414400 1422853 -82851 -1242425 -1218858 -126601 1223417 1768939 1223068
32219 1223068 483801 441558 695522 205282 -894024 -1002676 1004551 4088333 6039389
32210 6039389 6141787 5983379 7041072 8254920 7301973 3980981 548531 -1647025 -3725580
32201 -3725580 -6298743 -7263794 -4998661 -1987820 -1856659 -3600848 -2758926 1357258 3885321
32192 3885321 1511925 -2665867 -4265958 -4267226 -6555953 -10957196 -13194036 -11077446 -6611133
32183 -6611133 -1999595 2397949 5549073 5265327 1935453 -541350 337371 2453448
32175 2453448 2868415 2294480 3035409 4508292 4187079 2033412 618858 875190 778636
32166 778636 -1024325 -2870015 -2744669 -1505618 -1672755 -3772530 -5497513 -4639603 -1852894
32157 -1852894 132401 -222745 -1566132 -1696955 -655366 -514044 -2129726 -3765445 -3680445
32148 -3680445 -2435131 -1242807 421230 3395093 6008021 5477032 2238485 285234
32140 285234 2267736 6251883 8451889 7486194 4636171 1433008 -1224616 -2424140
32132 -2424140 -1582157 569046 2465283 3212885 3027313 2603923 2732421 3895393 5298524
32123 5298524 4957498 2062312 -1164784 -1587549 806484 2671092 1694766 -405753 -592201
32114 -592201 982691 1174575 -1556535 -4750713 -5074178 -2456596 339189 1505350 1743920
32105 1743920 2085444 2111061 1252866 404197 844796 2349282 3618047 3967837 3399447
32096 3399447 1727055 -817574 -2681392 -2523841 -1418841 -1608015 -3109152 -3716417 -2681024
32087 -2681024 -2055327 -3455612 -5528985 -5841854 -3678112 -29606 3451363 4680814
32079 4680814 2539145 -814514 -1471274 950589 2419856 857618 -75624 3113668
32071 3113668 7370423 7434520 4255875 3295699 5463409 6068150 3200535 737720 1173491
32062 1173491 1560345 -311874 -1224738 1713042 5144464 4325623 536800 -1615112 -1650432
32053 -1650432 -2275500 -2831912 -145186 4209958 3884451 -3167947 -10589870 -11308103 -5871616
32044 -5871616 -520320 448058 -2187982 -5214659 -6201991 -4772211 -2314180 -324957
32036 -324957 1235834 3169836 4935869 5051858 3600454 2246510 1496970 297325 -1127095
32027 -1127095 -792464 1439558 2451842 19532 -3736569 -5243714 -4208786 -3149403
32019 -3149403 -3327950 -3491691 -2210142 402172 3146324 4696413 4455957 3325621 2902392
32010 2902392 3191696 2334139 -428634 -3123943 -3934924 -4140130 -5970223 -8594351 -8791117
32001 -8791117 -5395382 -864694 1833487 2252797 2111922 3131577 5424165 7286053
31993 7286053 6812015 4278476 2178407 2228140 3543233 4664524 5590333 6186961 4644793
31984 4644793 218866 -4000239 -4358770 -1948908 -1241798 -3617472 -5752315 -4847374 -2070725
31975 -2070725 116218 939006 404836 -1682840 -4298036 -5314127 -4563313 -4400499 -5800010
31966 -5800010 -6532884 -5050239 -3484923 -4345716 -6553981 -7611515 -7806867 -9055380 -10824110
31957 -10824110 -10566321 -7706219 -4136058 -879956 2815759 6723213 8628395 7019692
31949 7019692 2955315 -1498673 -5184219 -7583995 -8060016 -6273042 -2717304 1498994
31941 1498994 4919801 6087113 4624284 1882108 -393639 -1858909 -3246381 -4764384
31933 -4764384 -5875417 -6123820 -5063672 -2176484 1623855 3298907 650255 -4352578
31925 -4352578 -7303892 -6262283 -2941436 471247 2982248 3512354 1408931 -1044256
31917 -1044256 -233142 3078886 3259100 -2314808 -8127360 -7162630 -535761 4113785 3130751
31908 3130751 885521 2346071 6001791 6935973 4235089 1850100 2676867 4627156
31900 4627156 3549808 -1182264 -5261533 -3996830 2037261 6872874 5439874 -788138
31892 -788138 -5837268 -6335510 -4306729 -2680277 -1063231 1961977 4662153 3759280 -269517
31883 -269517 -2896900 -1468982 1235446 1000570 -2230581 -4882637 -4690183 -2676656 -426767
31874 -426767 2177777 5540703 8259054 8015070 4317934 -573214 -3607181 -3438540 -944063
31865 -944063 2282013 5319926 7574964 7833286 5114778 772175 -1846880 -1121135 571401
31856 571401 7283 -2295676 -2949931 -931543 833666 -41056 -1892917 -1704011 580288
31847 580288 2479490 2477548 1082072 -701211 -1988088 -1867849 -666460 -712511 -3564306
31838 -3564306 -6797180 -6034645 -410044 6260708 10139755 10892632 9930902 7695848 4223860
31829 4223860 510845 -2491424 -5061467 -7492747 -8891385 -8551864 -7252623 -5641159
31821 -5641159 -2699144 2150355 6545255 7407450 5289879 3827367 4563244 4934584 2413699
31812 2413699 -1633168 -3893635 -3325120 -1550990 -106970 655183 423255 -1099956 -2788852
31803 -2788852 -2609888 -424276 1224635 321442 -1779098 -2235239 -692173 467176 -299023
31794 -299023 -1825613 -2517938 -2694419 -3404314 -4196133 -3723629 -1992253 -404336 318026
31785 318026 875123 1961456 3331551 4538497 5454122 5616058 4110225 870712 -2507546
31776 -2507546 -4020802 -3207124 -1506946 -748014 -1355951 -2021859 -1330282 237391 576615
31767 576615 -1303976 -3647769 -4010420 -2247270 -173451 1129239 1976995 2405362 1883297
31758 1883297 898152 756367 1224896 423890 -1998796 -3648596 -2806544 -1329596 -2276115
31749 -2276115 -5831941 -9457260 -11228062 -11214184 -10149320 -8555654 -6974942 -5595351
31741 -5595351 -3817784 -1329281 909878 2016531 2788626 4293801 5475274 4246398
31733 4246398 830071 -2119864 -2964562 -2613077 -2213778 -1526789 -490815 -184731 -638797
31724 -638797 417176 4340582 8264275 7714113 2522071 -2294073 -2319586 1451568 4657345
31715 4657345 4793254 2836275 820970 -157816 109197 999099 933402 -962535 -2876855
31706 -2876855 -2153400 354850 549517 -2759871 -4962944 -1889129 3439401 4467495
31698 4467495 367708 -3045994 -1768006 1772838 3751771 4106681 4435905 4624418 4344732
31689 4344732 4670891 5344159 3623342 -877417 -3389617 -120630 5428671 6888121
31681 6888121 3764661 761915 -209996 -1710610 -4722038 -6635690 -6330239 -6260155 -7750705
31672 -7750705 -8466717 -6616211 -4109841 -3432690 -4288216 -5098633 -5129172 -3771418 -692049
31663 -692049 1990959 1026610 -2815254 -4383016 -1040379 3471913 4554340 2852860
31655 2852860 1923584 2739564 3754760 4005840 3060899 249413 -3022925 -2866292 1669089
31646 1669089 5483740 3952485 55552 -62788 3226082 3766960 -483124 -4488568
31638 -4488568 -4128414 -1564860 -431205 -343946 791299 2499062 3025816 2635827 2703048
31629 2703048 3022921 2473157 1273241 555664 506901 595631 947380 2066019 3717779
31620 3717779 5204907 6307120 7202068 7973813 8652386 9004518 8023156 4754225 100992
31611 100992 -3426078 -4465940 -4229687 -4453022 -4987509 -4307496 -1673599 1902243 4338049
31602 4338049 3999321 1474672 -163499 1663030 5496247 7009021 4420922 894103
31594 894103 278839 2223946 3435661 2614905 1767540 2738972 4534105 4862405 3250602
31585 3250602 1726113 2552098 5594889 8107931 7406520 3747537 75830 -1159541
31577 -1159541 -310907 461810 -356410 -2591975 -5002004 -6265021 -5789484 -4076334 -2093445
31568 -2093445 -207769 1825678 3935318 5643836 6926115 8085651 8601354 7429828
31560 7429828 5023684 3681140 4827234 6943922 7404464 5707843 3710711 3039276
31552 3039276 3391527 3363643 2193327 613030 233151 1784921 3855874 4074138 1829053
31543 1829053 -1103508 -3046563 -4251330 -5373962 -5597932 -4039821 -2155027 -2513819
31535 -2513819 -5115995 -6943998 -5895302 -3570589 -3035641 -4885435 -6878757 -7010967
31527 -7010967 -5602651 -4183516 -3340732 -2304905 -284648 2320176 4081501 3898062
31519 3898062 2406696 1891036 3971423 7037614 7064179 2189502 -4194196 -6614082 -3622050
31510 -3622050 1161415 4195491 5656836 6898996 7102235 4943433 1697335 -325585
31502 -325585 -1368871 -3317175 -6014479 -7695333 -8561531 -10245587 -11614639 -9206338
31494 -9206338 -3009590 2052705 2381888 122043 -937946 -669327 -862899 -957873 756303
31485 756303 3293812 3975113 2475969 711794 -694853 -2691461 -4813835 -5067720 -3156194
31476 -3156194 -1157547 -339766 470643 2559509 5197264 6746344 6657737 5668891 4791459
31467 4791459 4405223 3897687 2483014 758984 396051 1438252 1461109 -996710 -3758039
31458 -3758039 -3991635 -2373626 -1330918 -318529 3288271 8673408 11095568 8235244
31450 8235244 3607180 1633265 1960966 1126473 -1881950 -4380208 -3849843 -1134957 533976
31441 533976 -954785 -4188830 -5501462 -3058759 927791 3047172 2836888 2323059 2260755
31432 2260755 1508453 75116 -171401 1437923 3280982 4356478 5600225 7027993
31424 7027993 6409535 2880130 -442910 -37096 3240151 5293741 3824726 271214
31416 271214 -2546136 -3006033 -1467595 194082 370630 -158368 1036001 4384787 7054801
31407 7054801 6655306 4559134 3735259 4580175 4855928 2933179 -540872 -3484826 -3748946
31398 -3748946 -839869 2569968 2500784 -1507186 -5276437 -5397435 -3501618 -2800030 -2795090
31389 -2795090 -824757 2959810 6096128 8190916 10742862 13148212 13009801 10392082
31381 10392082 7765419 5575731 2088871 -1903727 -2904565 -560556 917109 -725681
31373 -725681 -2215178 -421223 2584819 3659407 3958851 5734348 6832220 3801850
31365 3801850 -1165796 -2133045 1827421 5064100 3649181 579633 457758 2606319
31357 2606319 2608365 -1137694 -5221361 -5190070 -236093 5849970 7920918 4391111 -940160
31348 -940160 -3099424 -1764686 -874846 -2356745 -3322410 -1021513 2455865 3370986 2161563
31339 2161563 2345604 4435306 4952326 2082898 -1242500 -1494921 909456 3054332 3326043
31330 3326043 1746146 -1495280 -5228307 -6447572 -3357859 1167333 2111819 -1482470
31322 -1482470 -5445921 -6070671 -4134240 -2389439 -1657118 -1208768 -1087551 -1840397 -2940707
31313 -2940707 -3318679 -2856619 -2012087 -735055 930012 2041767 1999029 1810716 2761609
31304 2761609 4636337 6566527 8443110 9801317 8719700 4313278 -584032 -2013833
31296 -2013833 166178 2536598 2946316 2178639 975996 -1151597 -3549297 -4216362 -3084257
31287 -3084257 -2348030 -2302209 -289489 4353620 7834501 7115911 4502291 3733979 4178573
31278 4178573 2813993 -53314 -1490427 -1223612 -1638979 -2753167 -1750733 1746809
31270 1746809 4159666 3245758 1408650 1703493 3374248 3743633 2578875 2165066 3990274
31261 3990274 7073144 9015516 7840154 3705655 -576956 -1956268 -641994 261388
31253 261388 -857640 -2062434 -1209289 780329 1697466 1391564 1318622 1946190 2646466
31244 2646466 3369817 4483912 5420313 5165837 3769802 1998681 10813 -2251479 -3973098
31235 -3973098 -4308489 -3819017 -3568940 -3336831 -2376344 -1397900 -1740945 -2676723 -1702663
31226 -1702663 1888950 5420673 5712995 2630839 -832719 -1456061 1342237 4973804
31218 4973804 6144322 4229612 1491480 -499338 -2905786 -6512605 -8590084 -6059111
31210 -6059111 -864113 1587431 -499291 -3609577 -5100790 -6812388 -10242124 -12047118
31202 -12047118 -8283285 -950168 3812625 3322807 664636 -379504 544003 1769147
31194 1769147 2385312 2511139 2521016 2835781 3361337 2946055 708558 -2063250 -2893706
31185 -2893706 -1215168 1000220 1922196 1660842 1134246 770884 815817 1388856 1669583
31176 1669583 491965 -1679159 -2900098 -2528293 -2189461 -3091893 -4151960 -4094970 -3720260
31167 -3720260 -4276506 -4954049 -4221707 -2871668 -3320349 -5963212 -8455582 -8997709 -8278769
31158 -8278769 -7359942 -5612966 -2380267 605145 637062 -2169110 -4287023 -2719346 1546940
31149 1546940 4900621 5206577 3530844 2259037 2842095 5386638 8854235 10896930
31141 10896930 8937670 2937802 -3576247 -6739493 -6340796 -5344086 -5831826 -7029126
31133 -7029126 -7257246 -6043428 -3904217 -1650528 -466737 -1163364 -2669045 -2686781 -549301
31124 -549301 2003950 3500155 4357357 4872485 3711972 220934 -3413922 -4457482 -2993985
31115 -2993985 -1090449 183176 725121 -279836 -3084799 -5146361 -3490668 580387
31107 580387 2431790 506906 -1389152 254634 3516062 3854214 180858 -4358422
31099 -4358422 -6645478 -6353287 -4844861 -3242610 -1781969 20591 2593618 5134621
31091 5134621 5777501 3748733 688424 -1177081 -1549573 -1682120 -2245254 -3033405 -4255602
31082 -4255602 -6244941 -7812360 -6791984 -2980393 939066 2421053 1821428 894325
31074 894325 -378498 -3425023 -7712013 -10077455 -8649236 -5792266 -5172872 -6695231
31066 -6695231 -6808231 -3979494 -1095114 -939250 -1666536 500242 5301642 8416142 7413099
31057 7413099 4585187 2833880 1608713 -956564 -3854446 -3948461 -404064 3890374
31049 3890374 5570687 3976689 834374 -2034018 -4205204 -6470364 -9381533 -11777375
31041 -11777375 -11248722 -6794566 -610963 3721946 4716983 3866559 3329560 3771400 4469367
31032 4469367 4455388 3238493 1242893 -109862 535096 2927008 5280946 6158564 5676834
31023 5676834 4604261 3125118 1179594 -694614 -1926995 -2998779 -4716171 -6273506
31015 -6273506 -5458203 -1694931 2213060 2945669 868077 -414461 1092739 3318439
31007 3318439 3446751 1741479 232912 -832959 -2516159 -3877889 -2485702 1135625
30999 1135625 2683773 -457306 -5204212 -6599470 -4218968 -2128012 -2999144 -4933744
30991 -4933744 -4666802 -1928907 604435 825254 -447044 -644421 1415151 3928412 4040166
30982 4040166 1300254 -1604702 -1900122 344130 2867645 3842069 2938857 659605 -2075322
30973 -2075322 -4036873 -4616900 -4604120 -5117273 -5854603 -5286514 -2661147 806033 2845765
30964 2845765 2060748 -714640 -2819689 -2227681 100140 1207917 -187996 -2323456
30956 -2323456 -3277045 -3497108 -4112457 -4429309 -3198996 -1205953 -192114 140453 1543122
30947 1543122 3841314 4720743 3331335 1838800 2434821 4411812 5234444 3597134 775127
30938 775127 -561108 1112525 4287422 5663542 4068749 2026045 2076922 3061655 2348350
30929 2348350 396164 -103340 1101408 1758721 1726234 3486591 6980078 8036380 4275561
30920 4275561 -628806 -1403855 2232252 5978596 6376471 3675095 624645 186291 3142593
30911 3142593 6680357 7044270 4648176 4000401 7002723 9548866 7527043 3154026
30903 3154026 1506437 3010409 3808828 2264571 421192 -628175 -2170346 -4044359
30895 -4044359 -3579531 126171 4019251 4781692 2416737 -917028 -3376754 -3750879 -1597149
30886 -1597149 1678827 3643493 3595120 2824446 1829411 -285772 -2969812 -3667053 -1586034
30877 -1586034 588919 707101 528314 2602422 5578118 5625139 1862141 -2288016 -3258388
30868 -3258388 -962665 1943789 2997758 1838958 122055 -288686 595415 1023268 92633
30859 92633 -795927 -22527 1669623 2092445 576950 -1495392 -2965511 -4195861 -5769351
30850 -5769351 -7055422 -6746646 -4340575 -696153 2647439 4578883 5062264 4786665 4226927
30841 4226927 3299767 1916936 321281 -1331315 -3100466 -4616216 -5003879 -4075458 -3035170
30832 -3035170 -3223172 -4475579 -5409535 -5009206 -3192062 -164710 3662067 6951832 7709359
30823 7709359 5104631 748437 -2518883 -3221247 -2293324 -1490808 -1278438 -783314 494083
30814 494083 1832108 2380689 2303756 2321434 2739080 3444919 4136199 3920809 1726952 -1753210
30804 -1753210 -3597686 -1947352 921918 1152900 -1146405 -1614185 2254297 7309816
30796 7309816 8861096 6588162 3934278 2792365 1660826 -842877 -3209234 -3067853
30788 -3067853 -668213 1158075 344303 -2065243 -3281987 -2055818 49982 750158
30780 750158 -381894 -2090034 -3440381 -4278850 -3981347 -1711001 1340838 1768958 -2267931
30771 -2267931 -7885572 -9936038 -6742596 -1948337 -18291 -934211 -673237 3083061
30763 3083061 7329200 7343164 3175567 -75250 721233 2328130 303515 -3743628 -4155177
30754 -4155177 353038 5002988 6328492 6327345 7122398 6280268 1507341 -3458584 -2880097
30745 -2880097 2552607 6414649 5499502 3300572 3509673 4327498 1818600 -3639252 -7227378
30736 -7227378 -5437480 -75342 3788587 3219239 303597 -741245 1012296 2268080
30728 2268080 565038 -2017711 -2274035 -1057885 -1820060 -4778153 -6125774 -3461316
30720 -3461316 985834 3392685 2267584 -1238609 -4577670 -4793092 -828199 4252854
30712 4252854 5789898 3276877 1124571 2545581 5398009 5869595 3728177 1486720
30704 1486720 287768 -650974 -1616376 -1958674 -1575591 -896992 201667 1930533 3572930
30695 3572930 4304434 4336520 3990606 2673238 404905 -667211 1532000 5658305 7884129
30686 7884129 6357419 3105610 1189964 1264734 1416188 -353664 -3742715 -5944550 -4232578
30677 -4232578 760817 5051299 5341631 2299278 -991326 -2699152 -2973651 -2075551 64834
30668 64834 2535089 3583967 2528440 343054 -1753586 -3065003 -2748549 15574 4510996
30659 4510996 8349096 9843480 9945465 10963497 13559785 15700824 14722792 10057808
30651 10057808 3680676 -1783987 -4723650 -4475008 -1150983 3255596 4822161 1133012
30643 1133012 -5134252 -8248298 -5777466 -1100988 1200371 526659 -372347 566551 2957127
30634 2957127 5101747 5515060 4118855 2628926 2587779 2802227 856105 -2459615 -3385838
30625 -3385838 -1101395 336331 -1693808 -4036514 -3311434 -2025445 -4107938 -7252104
30617 -7252104 -5873352 -231980 3870558 4208128 4421964 6492814 7493522 5848337
30609 5848337 4784198 6576056 8561170 8230757 7583652 8667569 9074241 6176174 2308127
30600 2308127 1186546 1962760 1335364 -686138 -1522950 -638493 834994 3341187 7431802
30591 7431802 10524860 9583820 5984442 3471293 2428581 757838 -686624 997361
30583 997361 4609446 5348662 2434100 756642 3035970 5377089 3461894 -1056896
30575 -1056896 -3748236 -3745392 -3292323 -3251068 -2666250 -1532598 -870174 -636234 26616 898445
30565 898445 1008184 495551 475466 1229643 1816589 1407031 232440 -610967 -31872 1797808
30555 1797808 3014052 1885425 -943448 -3296057 -4321887 -4655965 -3936946 -891180
30547 -891180 3544519 6110196 5427037 3500241 1706053 -1299117 -5404761 -6472066
30539 -6472066 -1786403 4584395 6479994 4139488 3171028 5731940 7928648 6600571
30531 6600571 3673478 1903527 619079 -1528805 -2985862 -1835378 341053 529077
30523 529077 -1149435 -2019135 -1067368 416493 1762798 3243676 3566967 637572 -4119631
30514 -4119631 -5541935 -1081236 5046009 6866179 4142715 1525448 1079680 -160118
30506 -160118 -4284999 -8202619 -7962717 -4637200 -2342356 -1954990 -783994 1885822 3143669
30497 3143669 1369875 -902708 -1017405 -99496 -446040 -1399397 -787595 1110307 2112301
30488 2112301 1779864 1701118 2660084 4098759 5886231 7979857 8821112 7036768 4490278
30479 4490278 4342691 5967976 5537070 2434001 944794 3636517 7083538 7341923 6260626
30470 6260626 8005772 11499155 11432978 6410686 1229506 59439 1449973 1987556 1495455
30461 1495455 1828354 2803717 2600608 1322301 1192971 3082251 5209318 5985483 6220592
30452 6220592 7250787 8197633 6902047 3324686 247478 -141399 881184 460105 -1677160
30443 -1677160 -2733409 -832978 2255065 3541516 2605487 1217900 33551 -2058144
30435 -2058144 -5205205 -7448887 -7186637 -5125110 -2838453 -979409 -59925 -1205245
30427 -1205245 -4210050 -6239335 -4937083 -2058260 -1286681 -2749011 -2892800 -372123
30419 -372123 1451193 -230715 -2972577 -2708848 -49511 834901 -1126204 -2333591 -268402
30410 -268402 2660221 2745644 -12657 -2614724 -3146671 -2105736 -679620 328966 351491
30401 351491 -531149 -1210388 -750808 363178 1141692 1567146 1923429 1431662 -666862
30392 -666862 -2981337 -2920557 -181809 2310374 1705624 -1586212 -4650769 -5186880 -3287096
30383 -3287096 -743149 818151 1286183 1722913 2666539 3338100 3043984 2517491 2682181
30374 2682181 2764095 1329046 -1101992 -2506415 -2632778 -3579578 -6155131 -7733660 -5524585
30365 -5524585 -773873 2208070 856364 -3240621 -6642824 -7599782 -7014241 -6475354 -5849398
30356 -5849398 -3400160 1211687 4936802 4179204 -319026 -3637391 -2645061 318526
30348 318526 1294900 169886 -224968 907806 1449009 326317 -676328 41947 1411793
30339 1411793 1633936 945494 815030 1298604 849324 -1313918 -3812689 -4523832 -2968942
30330 -2968942 -837636 -11043 -441316 -655236 -211486 -329338 -1473964 -1936459 -468784
30321 -468784 958642 -378310 -3162649 -2870418 1732575 5956482 5143626 954296 -1253941
30312 -1253941 5107 1032236 -662507 -2366054 -548016 3327400 4458062 1334112
30304 1334112 -2306414 -2590644 -99629 1817524 1325009 -1005916 -4050385 -6653518
30296 -6653518 -7200870 -5185361 -2943763 -3225307 -4879432 -3898542 432429 3689158 2506805
30287 2506805 -478640 -927052 490976 -167237 -2998501 -3741856 -793610 1821485 334893
30278 334893 -3495474 -5575077 -5312915 -5226634 -6166449 -6016284 -3089514 1281319 4038224
30269 4038224 3466340 979326 4973 2281724 5186667 4385082 -355919 -4272818 -3889772
30260 -3889772 -1702599 -2064030 -4476954 -4644220 -1352225 1684009 1322383 -1196986 -3133686
30251 -3133686 -3800247 -3471923 -1574449 1480835 2729326 16179 -4115648 -4998670 -2069713
30242 -2069713 426513 -615646 -3350009 -4309759 -3044411 -1432713 -209620 1210282
30234 1210282 2349944 1960468 779194 1290150 3781303 4961930 2187118 -2581023
30226 -2581023 -5023832 -3676523 -906436 625903 332166 -1169410 -2927853 -3346424
30218 -3346424 -1217540 2107029 3442542 1610199 -1182830 -2760750 -3706619 -5069109
30210 -5069109 -5444061 -3045429 455318 1269820 -1301095 -3723922 -2927679 200938 3007849
30201 3007849 4540767 5116804 4057318 238641 -5405587 -9855582 -10858440 -8661778
30193 -8661778 -4736296 -92967 4468600 7586785 8181399 6895307 5581193 5089956
30185 5089956 4406844 2420469 -223699 -1830084 -1773026 -993983 -504190 -280968 253030
30176 253030 1462281 3396692 5664417 7144897 6708361 4773512 3438921 4323926 6631055
30167 6631055 7927527 6629497 3374942 291179 -749094 473987 2448730 3398551
30159 3398551 2864407 1500385 -335646 -2667610 -4533220 -4085274 -965828 2525765
30151 2525765 3749922 2498916 524589 -883311 -1671591 -2006955 -1848008 -1391812 -931876
30142 -931876 -339580 608294 1620161 2176522 2002178 817263 -1508235 -3845606 -4049659
30133 -4049659 -1639807 736969 236448 -2361985 -3583734 -1786919 1084056 2469351
30125 2469351 2223584 1990440 2643587 3149490 1734483 -1954753 -5882198 -7454132 -6520150
30116 -6520150 -5365693 -5204828 -4489685 -1974701 668178 1609327 2367138 5333635 8985138
30107 8985138 9379954 6191748 3353391 3162427 3514473 2123365 -133343 -1816261 -3560779
30098 -3560779 -5819545 -6716296 -4794846 -1926090 -981321 -2086558 -3262659 -3304112 -2106703
30089 -2106703 228075 2541771 2489330 -431707 -3039514 -1921804 2359861 6486367
30081 6486367 8431272 8194124 6104291 3050056 1118387 1192084 974092 -1705443 -4735835
30072 -4735835 -4337556 -1174684 63916 -2491527 -5217629 -4342723 -866785 1472827
30064 1472827 850196 -1614688 -3774054 -4059588 -2399757 -441481 107056 -410483 -386391
30055 -386391 335606 374313 -643949 -1666439 -2450947 -3735450 -4841572 -3922775 -1397659
30046 -1397659 -222992 -1507983 -2761681 -2104212 -1182929 -1636505 -1615535 991609 4120409
30037 4120409 4083793 1378386 240280 2720238 6449702 8376462 7766403 5138829 1029242
30028 1029242 -3315470 -6205750 -7351254 -7757743 -7453254 -5410007 -2246527 -574017
30020 -574017 -1430748 -2478477 -1310305 1234977 2838605 3178129 3423395 3399944 1922172
30011 1922172 -277194 -595658 1729642 4009303 3461258 841973 -719401 224360 2043503
30002 2043503 2556669 1547272 203046 -974336 -2498694 -4099625 -3733135 424367
29994 424367 6987175 11599435 11191615 7495396 5064244 5850134 7257880 6162257 3191157
29985 3191157 1343201 1284371 354485 -3392719 -8119984 -10313028 -8772920 -5301629 -2216652
29976 -2216652 -534499 -281895 -1224537 -2928876 -4811684 -6427779 -7415516 -7269660 -5672305
29967 -5672305 -3069532 -540262 940248 979439 -153964 -1570457 -2211580 -1739183 -762659
29958 -762659 153048 1285371 3052069 4919952 5669616 4557179 1815758 -1546231 -3974665
29949 -3974665 -4123527 -2287608 -590818 -783482 -2242890 -3087540 -2720556 -2014965 -1397784
29940 -1397784 -318623 1327072 2658865 2966563 2303768 853000 -1130128 -2749864
29932 -2749864 -3227593 -3282788 -4160676 -5082765 -3619603 647535 4789399 6149887 5606290
29923 5606290 5473794 5558483 3716786 -66031 -2659772 -1638066 1509731 3251292 2283697
29914 2283697 627273 545196 1639696 1828453 544199 -414000 504401 2390520 3178317
29905 3178317 2265968 689518 -648670 -1544991 -1689644 -800173 525069 1448937 2292577
29896 2292577 3883364 5668036 6171291 5393055 4903957 5214453 4920897 3118205 964922
29887 964922 31227 450463 1306943 1598579 630497 -984279 -853750 2406275 5960862
29878 5960862 5403637 1208457 -1035356 1713579 5813137 6850408 5938734 6516958 7951436
29869 7951436 6905035 3273462 74397 -1727448 -3771170 -5886075 -5569132 -2551240
29861 -2551240 -42010 -276956 -1951257 -3127759 -3723377 -3876198 -2665616 -170084 1339057
29852 1339057 40004 -2919203 -4808775 -4314303 -2513279 -1695626 -3236936 -5660996
29844 -5660996 -5420885 -1126964 3942521 5700517 4528762 3820405 4352832 4057280 2951224
29835 2951224 3526126 5472643 4900275 619585 -3344118 -3943218 -3491457 -4800142 -6020476
29826 -6020476 -4228863 -796235 1071506 1415878 1811672 1123780 -2097916 -4917635 -3157826
29817 -3157826 1643121 3802238 1901766 371815 2109036 4663203 5201108 4594498
29809 4594498 4517926 4500975 4165310 4851882 6629677 7000864 5148114 4169963 5984991
29800 5984991 7154094 3802880 -1596519 -2982515 828855 4965989 5625445 3987523
29792 3987523 2340909 575600 -1578348 -2302307 -388173 2119948 2724143 2278548 3182731
29783 3182731 4915821 4552756 1529333 -1235929 -1664500 -1206432 -1903890 -3197628 -3667681
29774 -3667681 -4085124 -6070747 -8634475 -8888459 -6263065 -3502146 -2847101 -3429762 -3478970
29765 -3478970 -3147802 -3567921 -4460991 -4525261 -3594760 -2814405 -2761550 -2556691 -1036419 1688342
29755 1688342 3857973 3372557 260276 -2220292 -481925 4771888 8518716 7201769
29747 7201769 2932298 287459 496514 1126346 426084 -852548 -1665154 -1921861 -1247168
29738 -1247168 960590 3594628 4293048 2734860 1400729 2016956 3258224 3274516 2572399
29729 2572399 2651377 3253231 2888448 1199078 -878818 -2610127 -3634437 -3354252 -1721199
29720 -1721199 -170174 -318710 -2045805 -4037682 -5666804 -6981140 -7496602 -6725345 -5517036
29711 -5517036 -5059303 -4806201 -3436797 -1765451 -2129171 -4239742 -4402377 -574423 4084271
29702 4084271 5239408 3469688 3251531 6296635 9208117 8695363 6291798 5788243 7640913
29693 7640913 8497709 5983670 1775594 -711978 -342959 939904 721345 -1280667 -3249468
29684 -3249468 -3588839 -2826417 -2744672 -3784222 -4475671 -4013673 -3898312 -5382186 -6493240
29675 -6493240 -4310624 -11154 1601998 -1249922 -4221245 -2726838 1508367 3045413
29667 3045413 421452 -2601668 -3263765 -3307689 -5059772 -7369965 -7699818 -6012137 -4076477
29658 -4076477 -2299074 181998 2866296 3820276 2413766 249913 -1060942 -1544564
29650 -1544564 -1737493 -1310519 200667 2160270 3458640 4047610 4785641 5635369 5024882
29641 5024882 1796088 -2642876 -5184669 -4309480 -1632023 381980 1294196 2149304 2821764
29632 2821764 1888541 -562755 -1969168 -391281 2720392 4432570 4231858 4226735 5620060
29623 5620060 6895124 6285682 4713828 4920688 7968556 11652015 12673027 9929592
29615 9929592 5371575 1890155 786708 1307607 2101691 2575013 2941893 3589683 4651178
29606 4651178 5793967 6143223 4760853 1594003 -2205516 -5194205 -6735402 -6952867
29598 -6952867 -5845494 -3075416 992566 4360563 4443790 861031 -3174286 -3627483 -343773
29589 -343773 2366143 1063159 -2117213 -2176425 1944434 6026082 6500237 4860582 4543100
29580 4543100 5808847 6285569 5156495 3920579 3483710 3249237 3213105 4328444 6054249
29571 6054249 5904784 2803741 -821268 -1840461 -186278 1636914 1969020 1420967 1320992
29562 1320992 2162476 3633905 5136944 6022044 5912595 4991012 3766160 2737793 2426104
29553 2426104 3140113 4256171 4400461 3155019 2076476 3002586 5579781 7551523 7573669
29544 7573669 6767392 7140117 9125945 11025694 10538466 6874082 1829687 -1422083 -1370237
29535 -1370237 124327 34460 -2094752 -3916626 -3882356 -3292360 -3796083 -4388441 -2560905
29526 -2560905 2314922 8331947 13311017 16167286 16368453 13960297 10559395 8726297
29518 8726297 9411595 10837210 10548426 7987945 4689865 2561595 2233151 2503429 1391694
29509 1391694 -1468179 -3600379 -2049927 2931500 7929629 10342764 10713560 10594229
29501 10594229 10023453 8392872 6269126 4774060 4200687 4549072 6186912 8430744
29493 8430744 8778672 5616656 895063 -1865638 -1616227 -26643 1368460 2006957 1152590
29484 1152590 -1210948 -2654221 -641703 3066324 3614546 -264188 -3851409 -2572736
29476 -2572736 1993584 4571499 2891019 -526578 -2241823 -1156307 1788070 5073293
29468 5073293 7237665 7142043 4404720 -110419 -4072900 -4805576 -2046882 790365 103911
29459 103911 -3107784 -4343978 -1991235 334354 -640251 -2839001 -2068775 1817950 5183317
29450 5183317 5960889 5619242 6025365 7111802 8024469 8488606 8486724 7961055 7052625 5622167
29440 5622167 2909697 -1029997 -4072095 -3898000 -1034280 1449091 1285841 -1063549
29432 -1063549 -3510249 -4088636 -1948721 2011797 5553016 7067673 6846071 5782018
29424 5782018 3918445 1362126 -696531 -1454295 -1760584 -2255590 -1719511 672356 3075638
29415 3075638 3579244 3564664 5360183 7913197 8464510 7441921 7431629 7962922 6286360
29406 6286360 3430413 3858447 7695853 8986244 4457526 -1177379 -2486484 -1240623
29398 -1240623 -2113075 -4127714 -2547808 2434458 5176694 2971204 -389958 -746132
29390 -746132 1087318 2089265 1719214 1303570 1066071 537871 773621 3471055 7783242
29381 7783242 10073540 7952750 3583641 1443826 2726774 3658271 665395 -4174089
29373 -4174089 -5387678 -1520163 2826005 3373595 1540964 1220383 2699661 3098765 1641957
29364 1641957 897881 2517106 4601670 4379504 1765323 -733237 -747858 1756679 4357659
29355 4357659 4291760 1437284 -1167566 -728124 1885980 3370865 2199463 7001 -1207963
29346 -1207963 -1557003 -2217938 -3028782 -2279029 969778 4837712 5795053 2744678 -643991
29337 -643991 466341 5862530 9844576 8094964 2746636 -1264308 -2750635 -4298708
29329 -4298708 -7079462 -9090899 -8582726 -6326878 -3885112 -1873616 -625511 -675281 -1755858
29320 -1755858 -2649869 -2620294 -2035992 -1529364 -1597567 -2764710 -4748026 -5693446 -3792800
29311 -3792800 337785 4127970 5603553 4342081 840089 -3253286 -5172629 -3613534
29303 -3613534 -744582 538289 486192 956029 1159300 -1133384 -4439074 -4212052 285523
29294 285523 4052135 3205544 -2809 -1391024 -600484 268848 835443 1860554 2600733
29285 2600733 2101094 1693050 3132752 5362350 5942542 4749350 3583307 2984575 2083138
29276 2083138 951808 645710 1435235 3034036 5551320 8010773 7481739 2827452 -1883580
29267 -1883580 -1517181 2991446 5559265 3171270 -839289 -2465387 -1790509 -416556
29259 -416556 1812176 4660671 5254591 1596648 -3499276 -5456413 -3907627 -2418068
29251 -2418068 -2782796 -2873328 -537313 3147462 5515974 5241538 2704368 -830764 -3359743
29242 -3359743 -3020926 -227299 2106926 1779233 -111116 -1142326 -1270479 -2573322 -5428481
29233 -5428481 -7126326 -5249056 -974974 2254245 2531386 811940 -827550 -852191 1496310
29224 1496310 6027283 11133818 14419976 14461973 11774769 8071181 4989744 3345523
29216 3345523 2856805 2477315 1517144 437362 113790 623590 1429662 2363023 3458892
$$ [...]
##END NTUPLES=NMR SPECTRUM
##END=
