##TITLE=31Pdec_PR193P
 D2O, 24 sc
 5.8.2020
##JCAMPDX= 6.0         $$ Bruker NMR JCAMP-DX V2.0
##DATA TYPE= NMR SPECTRUM
##DATA CLASS= NTUPLES
##ORIGIN= UXNMR, Bruker Analytische Messtechnik GmbH
##OWNER= root
$$ XWIN-NMR		Version 3.5
$$ Wed Aug  5 12:48:52 2020 Russian Standard Time (UT+4h)  she@DPX200
##.OBSERVE FREQUENCY= 81.013821
##.OBSERVE NUCLEUS= ^31P
##.ACQUISITION MODE= SIMULTANEOUS
##.ACQUISITION SCHEME= undefined
##.AVERAGES= 24
##.DIGITISER RES= 17
##SPECTROMETER/DATA SYSTEM= spect
##.PULSE SEQUENCE= zgpg30
##.SOLVENT NAME= D2O
##.SHIFT REFERENCE= (INTERNAL, D2O, 0, 182.463)
##AUDIT TRAIL= $$ (NUMBER, WHEN, WHO, WHERE, WHAT)
$$ ##TITLE= Audit trail, XWIN-NMR		Version 3.5
$$ ##JCAMPDX= 5.01
$$ ##ORIGIN= Bruker BioSpin GmbH
$$ ##OWNER= she
$$ F:/spectra/data/she/nmr/P31/1/pdata/1/auditp.txt
$$ ##AUDIT TRAIL=  $$ (NUMBER, WHEN, WHO, WHERE, WHAT)
(   1,<2020-08-05 12:47:58.84 +0400>,<she>,<DPX200>,
      <created by zg, POWCHK disabled, PULCHK disabled
       configuration hash MD5:
       00 E9 B6 7A A2 85 ED C7 34 08 36 98 17 FE 4E 26
       data hash MD5: 32K
       8E 79 6F 9A B6 37 74 68 10 22 1F 17 C6 4E 69 D2>)
(   2,<2020-08-05 12:48:01.23 +0400>,<she>,<DPX200>,
      <Start of raw data processing
       efp BC_mod = 2 LB = 1 FT_mod = 6 PKNL = 1 PHC0 = -3624.48 PHC1 = 1841.202 SI = 64K 
       data hash MD5: 64K
       E5 2A B4 E7 76 CE 5D 30 FB E3 31 4B C8 25 93 57>)
(   3,<2020-08-05 12:48:12.68 +0400>,<she>,<DPX200>,
      <pk PHC0 = 5.620161 PHC1 = 0 
       data hash MD5: 64K
       CC 51 3F 87 79 F6 17 28 6F E0 58 CC C9 A8 19 D8>)
(   4,<2020-08-05 12:48:16.62 +0400>,<she>,<DPX200>,
      <abs ABSG = 5 
       data hash MD5: 64K
       B5 28 6F 9D B7 0A 86 37 1A 30 19 F3 32 F1 1A A0>)
$$ ##END=
$$ 
$$ hash MD5
$$ 20 DB B4 44 9E 30 00 B8 63 28 EC BC C1 FA 72 6C
##$RELAX= 
##$RELAX= 
##$RELAX= 
##$RELAX= 
##$RELAX= 
##$RELAX= 
##$RELAX= 
##$RELAX= 
$$ Bruker specific parameters
$$ --------------------------
##$DU= <F:/spectra>
##$EXPNO= 1
##$NAME= <P31>
##$PROCNO= 1
##$TYPE= <nmr>
##$USER= <she>
##$AMP= (0..31)
100 100 100 100 100 100 100 100 100 100 100 100 100 100 100 100 100 100 
100 100 100 100 100 100 100 100 100 100 100 100 100 100 
##$AQSEQ= 0
##$AQ_mod= 1
##$AUNM= <au_zg>
##$AUTOPOS= <>
##$BF1= 81.014009
##$BF2= 200.13
##$BF3= 200.13
##$BF4= 200.13
##$BF5= 200.13
##$BF6= 200.13
##$BF7= 200.13
##$BF8= 200.13
##$BYTORDA= 1
##$CFDGTYP= 0
##$CFRGTYP= 5
##$CHEMSTR= <none>
##$CNST= (0..31)
1 1 145 1 1 1 1 1 1 1 1 1 1 1 1 1 1 1 1 1 1 1 1 1 1 1 1 1 1 1 1 1 
##$CPDPRG= <waltz16>
##$CPDPRG1= <>
##$CPDPRG2= <waltz16>
##$CPDPRG3= <>
##$CPDPRG4= <mlev>
##$CPDPRG5= <mlev>
##$CPDPRG6= <mlev>
##$CPDPRG7= <mlev>
##$CPDPRG8= <mlev>
##$CPDPRGB= <>
##$CPDPRGT= <>
##$D= (0..31)
0 1 0 0 0 0 0 0 0 0 0 0.03 2e-05 3e-06 0 0 0 0 0 0 0 0 0 0 0 0 0 0 0 0 
0 0 
##$DATE= 1596617278
##$DBL= (0..7)
120 120 120 11 120 120 24 19 
##$DBP= (0..7)
150 150 150 150 150 150 150 150 
##$DBP07= 0
##$DBPNAM0= <>
##$DBPNAM1= <>
##$DBPNAM2= <>
##$DBPNAM3= <>
$$ [...]
##$SUBNAM3= <"">
##$SUBNAM4= <"">
##$SUBNAM5= <"">
##$SUBNAM6= <"">
##$SUBNAM7= <"">
##$SUBNAM8= <"">
##$SUBNAM9= <"">
##$SW= 369.568048894756
##$SWIBOX= (0..15)
0 1 3 0 0 0 0 0 0 0 0 0 0 0 0 0 
##$SW_h= 29940.119760479
##$TD= 32768
##$TD0= 1
##$TE= 0
##$TE2= 300
##$TE3= 300
##$TEG= 300
##$TL= (0..7)
0 120 53 12 22 120 120 120 
##$TP= (0..7)
150 150 150 150 150 150 150 150 
##$TP07= 0
##$TPNAME0= <>
##$TPNAME1= <>
##$TPNAME2= <>
##$TPNAME3= <>
##$TPNAME4= <>
##$TPNAME5= <>
##$TPNAME6= <>
##$TPNAME7= <>
##$TPOAL= (0..7)
0.5 0.5 0.5 0.5 0.5 0.5 0.5 0.5 
##$TPOFFS= (0..7)
0 0 0 0 0 0 0 0 
##$TUNHIN= 0
##$TUNHOUT= 0
##$TUNXOUT= 0
##$USERA1= <user>
##$USERA2= <user>
##$USERA3= <user>
##$USERA4= <user>
##$USERA5= <user>
##$V9= 5
##$VALIST= <valist>
##$VCLIST= <CCCCCCCCCCCCCCC>
##$VD= 0
##$VDLIST= <DDDDDDDDDDDDDDD>
##$VPLIST= <PPPPPPPPPPPPPPP>
##$VTLIST= <TTTTTTTTTTTTTTT>
##$WBST= 1024
##$WBSW= 4
##$XGAIN= (0..3)
0 0 0 0 
##$XL= 0
##$YL= 0
##$YMAX_a= 59114
##$YMIN_a= -68349
##$ZGOPTNS= <>
##$ZL1= 120
##$ZL2= 120
##$ZL3= 120
##$ZL4= 120
##$ABSF1= 182.463
##$ABSF2= -187.1042
##$ABSG= 5
##$ABSL= 3
##$ALPHA= 0
##$AQORDER= 0
##$ASSFAC= 0
##$ASSFACI= 0
##$ASSFACX= 0
##$ASSWID= 0
##$AUNMP= <proc_1d>
##$AZFE= 0.1
##$AZFW= 0.5
##$BCFW= 0
##$BC_mod= 2
##$BYTORDP= 0
##$COROFFS= 0
##$CY= -3
##$DATMOD= 1
##$DC= 0
##$DFILT= <>
##$DTYPP= 0
##$F1P= 0
##$F2P= 0
##$FCOR= 1
##$FTSIZE= 65536
##$FT_mod= 6
##$GAMMA= 0
##$GB= 0
##$INTBC= 1
##$INTSCL= 5.30512e-09
##$ISEN= 30
##$LB= 1
##$LEV0= 0
##$LPBIN= 0
##$MAXI= 10000
##$MC2= 0
##$MEAN= 0
##$ME_mod= 0
##$MI= 50
##$NCOEF= 0
##$NC_proc= -4
##$NLEV= 6
##$NOISF1= 182.463
##$NOISF2= 159.3651
##$NSP= 0
##$NTH_PI= 0
##$NZP= 0
##$OFFSET= 182.463
##$PC= 4
##$PHC0= -3618.86
##$PHC1= 1841.202
##$PH_mod= 1
##$PKNL= yes
##$PPARMOD= 0
##$PSCAL= 0
##$PSIGN= 0
##$REVERSE= no
##$SF= 81.0140089999434
##$SI= 65536
##$SIGF1= 159.3651
##$SIGF2= -187.1042
##$SINO= 113.3802
##$SIOLD= 16384
##$SREGLST= <1H.CDCl3>
##$SSB= 0
##$STSI= 65536
##$STSR= 0
##$SW_p= 29940.119760479
##$SYMM= 0
##$S_DEV= 0
##$TDeff= 32768
##$TDoff= 0
##$TI= <>
##$TILT= no
##$TM1= 0
##$TM2= 0
##$TOPLEV= 0
##$USERP1= <user>
##$USERP2= <user>
##$USERP3= <user>
##$USERP4= <user>
##$USERP5= <user>
##$WDW= 1
##$XDIM= 65536
##$YMAX_p= 426033019
##$YMIN_p= -4658724
$$ End of Bruker specific parameters
$$ ---------------------------------
##NTUPLES= NMR SPECTRUM
##VAR_NAME=  FREQUENCY,     SPECTRUM/REAL,   SPECTRUM/IMAG
##SYMBOL=    X,             R,               I
##VAR_TYPE=  INDEPENDENT,   DEPENDENT,       DEPENDENT
##VAR_FORM=  AFFN,          ASDF,            ASDF
##VAR_DIM=   65536,         65536,           65536
##UNITS=     HZ,            ARBITRARY UNITS, ARBITRARY UNITS
##FACTOR=    0.456856943014862, 1,           1
##FIRST=     14782.0589164792, 0,            0
##LAST=      -15158.0608439998, 0,           0
##MIN=       -15158.0608439998, -4658724,    0
##MAX=       14782.0589164792, 426033019,    0
$$ Real data points
##PAGE= N=1
##DATA TABLE= (X++(R..R)), XYDATA
$$ [...]
$$ plain form
37069 2072267 1714654 1442322 1367001 1392464 1468409 1619502 1747331 1673081 1417189 1225562
37059 1225562 1268293 1459523 1582657 1474932 1144054 836929 887299 1320438 1740296 1816830
37049 1816830 1708916 1715765 1707974 1335851 704494 346777 491263 817725 1029741 1213371
37039 1213371 1465436 1604553 1507974 1387585 1454059 1579161 1547450 1399028 1272723 1137536
37029 1137536 941279 826695 931980 1138238 1267837 1385329 1647942 1986148 2185760
37020 2185760 2180374 2022052 1680272 1156435 728053 759292 1223977 1659161 1677882 1373956
37010 1373956 1157104 1302749 1708266 2005360 1889557 1411641 948254 819513 955895
37001 955895 1027827 880459 710061 766449 998185 1122303 1021204 908871 1007035 1192035
$$ packed form
37069B072267l57613k72332p5321K5463P5945J51093J27829p4250k55892j91627
37059A225562M2731J91230J23134j07725l30878l07125N0370M33139M19858P6534
37049A816830j07914O849p791l72123o31357l57717J44486L26462K12016J83630
37039A213371K52065J39117r6579j20389O6474J25102l1711j48422j26305j35187
37029A137536j96257j14584J05285K06258J29599J17492K62613L38206J99612
37020B185760n386j58322l41780n23837m28382L1239M64685M35184J8721l03926
37010A373956k16852J45645M05517K97094j15803m77916m63387j28741J36382
37001I55895P1932j47368j70398N6388K31736J24118j01099j12333R8164J85000
$$ plain form
36991 1192035 1184051 1039695 1134564 1551127 1837619 1657438 1381165 1605417 2257195 2672276
36981 2672276 2508501 2062578 1649801 1238053 870654 888576 1384273 1863961 1852005 1517705
36971 1517705 1327336 1362027 1387670 1361558 1421045 1512034 1453474 1296004 1243865 1277731 1203940
36960 1203940 1041318 1031231 1273930 1634905 1982333 2247623 2296165 2030792 1621568 1388622
36950 1388622 1467203 1774112 2199299 2585909 2656702 2290642 1796791 1593484 1696526 1857881
36940 1857881 2083356 2552151 3061234 3078963 2475034 1748108 1356669 1226577 1125539 1133372
36930 1133372 1432218 1890502 2163261 2081457 1757429 1437045 1370082 1650462 2054559 2207714
36920 2207714 2018013 1758245 1633342 1517339 1263535 1017904 1000835 1158777 1262287 1238803
$$ packed form
36991A192035p984j44356R4869M16563K86492j80181k76273K24252O51778M15081
36981B672276j63775m45923m12777m11748l67399J7922M95697M79688j1956l34300
36971A517705j90369L4691K5643k6112N9487R0989n8560j57470n2139L3866p3791
36960A203940j62622j0087K42699L60975L47428K65290M8542k65373m09224k32946
36950A388622P8581L06909M25187L86610P0793l66060m93851k03307J03042J61355
36940A857881K25475M68795N09083J7729o03929p26926l91439j30092j01038P833
36930A133372K98846M58284K72759q1804l24028l20384o6963K80380M04097J53155
36920B207714j89701k59768j24903j16003k53804k45631j7069J57942J03510k3484
$$ plain form
36910 1238803 1214791 1292826 1421169 1442324 1230975 880154 737445 1066026 1658503 2025621
36900 2025621 2002025 1882440 1898838 1916222 1799190 1713035 1795753 1829518 1556542 1114162
36890 1114162 857824 916089 1183044 1568799 1963414 2108990 1832386 1332740 984237 932096
36880 932096 1088021 1377585 1730567 1953181 1892123 1646319 1392469 1133565 858602 762206
36870 762206 976198 1238041 1204456 987127 974685 1191909 1273243 1076351 888343 949571
36860 949571 1163501 1375590 1571118 1683156 1569569 1328482 1285322 1483908 1528384 1165478
36850 1165478 721613 665334 951554 1116152 911467 573962 493739 812563 1341873 1754547
36840 1754547 1857131 1718834 1513063 1282632 988543 729686 677552 779556 787296 639435
$$ packed form
36910A238803k4012P8035J28343K1155k11349l50821j42709L28581N92477L67118
36900B025621k3596j19585J6398J7384j17032q6155Q2718L3765k72976m42380
36890A114162k56338N8265K66955L85755L94615J45576k76604m99646l48503n2141
36880I32096J55925K89564L52982K22614o1058k45804k53850k58904k74963r6396
36870G62206K13992K61843l3585k17329j2442K17224Q1334j96892j88008O1228
36860I49571K13930K12089J95528J12038j13587k41087m3160J98586M4476l62906
36850A165478m43865n6279K86220J64598k04685l37505q0223L18824N29310M12674
36840A754547J02584j38297k05771k30431k94089k58857n2134J02004P740j47861
$$ plain form
36830 639435 546176 604425 630431 530342 540130 867617 1330251 1587320 1542492 1314091 1034109
36819 1034109 909850 1223516 1942022 2533963 2548435 2230095 2170287 2460255 2629745 2391750
36809 2391750 1981724 1683058 1461151 1249015 1213890 1464597 1748823 1730703 1434120 1177703
36799 1177703 1157292 1285014 1379653 1342603 1167845 917972 708490 643655 753005 1000469
36789 1000469 1320023 1632623 1877506 2035826 2090076 2007157 1841436 1781224 1938988 2139111
36779 2139111 2112557 1898340 1817546 1989777 2117171 1887241 1403469 1049928 1053447 1320487
36769 1320487 1598987 1681599 1559436 1477663 1705720 2154069 2397696 2214566 1885665 1754086
36759 1754086 1707503 1406696 873894 486740 447316 622627 904657 1336966 1796720 1926681
$$ packed form
36830F39435r3259N8249K6006j00089R788L27487M62634K57069m4828k28401k79982
36819A034109j24259L13666P18506N91941J4472l18340n9808K89968J69490k37995
36809B391750m10026k98666k21907k12136l5125K50707K84226j8120k96583k56417
36799A177703k0411J27722R4639l7050j74758k49873k09482o4835J09350K47464
36789A000469L19554L12600K44883J58320N4250q2919j65721o0212J57764K00123
36779B139111k6554k14217q0794J72231J27394k29930m83772l53541L519K67040
36769A320487K78500Q2612j22163q1773K28057M48349K43627j83130l28901j31579
36759A754086m6583l00807n32802l87154l9424J75311K82030M32309M59754J29961
$$ plain form
36749 1926681 1580763 1070414 771478 700925 667768 634398 701534 879118 1089519 1306112
36739 1306112 1518368 1654952 1695511 1755718 1910428 2040951 2007296 1849225 1657198 1391588
36729 1391588 1036566 795680 875064 1147194 1276057 1131335 869420 682975 700210 1024328
36719 1024328 1569433 1925884 1735028 1195023 865607 969096 1233211 1419962 1570452
36710 1570452 1651293 1459868 1099324 1082485 1641631 2325559 2641411 2727205 2950190 3166987
36700 3166987 2940527 2315561 1808270 1665249 1644033 1549522 1507270 1617960 1768250 1911538
36690 1911538 2173414 2554024 2849954 2973463 3028843 2996291 2712945 2284997 2119218 2357326
36680 2357326 2649720 2701268 2666002 2746939 2790250 2612086 2384381 2308602 2208258 1876986
$$ packed form
36749A926681l45918n10349k98936p0553l3157l3370O7136J77584K10401K16593
36739A306112K12256J36584M0559O0207J54710J30523l3655j58071j92027k65610
36729A391588l55022k40886P9384K72130J28863j44722k61915j86445J7235L24118
36719A024328N45105L56451j90856n40005l29416J03489K64115J86751J50490
36710A570452Q0841j91425l60544j6839N59146O83928L15852Q5794K22985K16797
36700C166987k26460o24966n07291j43021k1216r4511m2252J10690J50290J43288
36690A911538K61876L80610K95930J23509N5380l2552k83346m27948j65779K38108
36680B357326K92394N1548l5266Q0937M3311j78164k27705p5779j00344l31272
$$ plain form
36670 1876986 1563513 1613807 1834220 1764260 1466914 1450180 1807943 2059402 1974871 1957434
36660 1957434 2312611 2653707 2464923 1914759 1636064 1863381 2222495 2333426 2239175 2155744
36650 2155744 2079141 1828241 1396061 1107973 1342764 2081452 2830094 3111813 2966983 2782807
36640 2782807 2694365 2460475 1971666 1517899 1367285 1395142 1389417 1439137 1679903 1885943
36630 1885943 1743075 1412725 1385554 1791776 2264774 2510537 2594900 2591582 2390275 2036043
36620 2036043 1847385 1927974 1916248 1551700 1183662 1303926 1785566 2052035 1909451 1737111
36610 1737111 1832041 2022678 2071881 2066660 2169732 2272153 2169321 1904888 1687607 1588178
36600 1588178 1552737 1624079 1897110 2276712 2509503 2494175 2382294 2315068 2218337 1966889
$$ packed form
36670A876986l13473N0294K20413o9960k97346j6734L57763K51459q4531j7437
36660A957434L55177L41096j88784n50164k78695K27317L59114J10931r4251q3431
36650B155744p6603k50900m32180k88088K34791P38688P48642K81719j44830j84176
36640B782807q8442k33890m88809m53767j50614K7857n725M9720K40766K06040
36630A885943j42868l30350k7171M06222M72998K45763Q4363l318k01307l54232
36620B036043j88658Q0589j1726l64548l68038J20264M81640K66469j42584j72340
36610A737111R4930J90637M9203n221J03072J02421j02832k64433k17281r9429
36600A588178l5441P1342K73031L79602K32791j5328j11881o7226r6731k51448
$$ plain form
36590 1966889 1661114 1602999 1963755 2518627 2775121 2429871 1708481 1177572 1170422 1467206
36580 1467206 1607820 1427586 1149789 1005881 957667 842489 639231 486466 516756 755776
36570 755776 1116746 1408722 1422136 1143196 873528 988620 1505537 1990805 2010948 1629000
36560 1629000 1323584 1415844 1729599 1888641 1798214 1672969 1681442 1775721 1865111 1947421 2014803
36549 2014803 2016277 1994996 2088725 2294975 2414499 2359393 2334512 2527449 2770258 2731408 2347661
36538 2347661 1865419 1549139 1538051 1851976 2287867 2445416 2167453 1853138 1985783 2441050
36528 2441050 2684017 2601339 2623826 2966950 3312001 3426584 3539548 3799947 3916569 3764645
36518 3764645 3836993 4516535 5307637 5466856 5118776 5011829 5327390 5518241 5305161 5017417
$$ packed form
36590A966889l05775n8115L60756N54872K56494l45250p21390n30909p150K96784
36580A467206J40614j80234k77797j43908m8214j15178k03258j52765L0290K39020
36570G55776L60970K91976J3414k78940k69668J15092N16917M85268K0143l81948
36560A629000l05416R2260L13755J59042r0427j25245Q473R4279Q9390Q2310O7382
36549B014803J474k1281R3729K06250J19524n5106k4881J92937K42809l8850l83747
36538B347661m82242l16280j1088L13925M35891J57549k77963l14315J32645M55267
36528B441050K42967q2678K2487L43124L45051J14583J12964K60399J16622j51924
36518C764645P2348O79542P91102J59219l48080j06947L15561J90851k13080k87744
$$ plain form
36508 5017417 4820627 4434365 3911462 3899980 4642726 5396121 5458298 5216291 5449945 6029650
36498 6029650 6162202 5722027 5438110 5705156 6021308 5850630 5377956 5060218 4951272
36489 4951272 4865179 4807278 4833193 4775489 4501683 4213732 4122525 4034001 3651392 3118399
36479 3118399 2829891 2804634 2703534 2445747 2323193 2420281 2400482 2082918 1811649 1930754
36469 1930754 2217326 2238448 2066627 2184082 2720759 3219730 3254349 2928143 2586168 2304691
36459 2304691 1925779 1451358 1118736 1077488 1196105 1271019 1308135 1478095 1818236 2097725
36449 2097725 2054602 1718268 1383680 1253314 1237174 1182820 1159253 1337469 1665647 1882095
36439 1882095 1858847 1730759 1638945 1550340 1428500 1391692 1537877 1738070 1783941 1681465
$$ packed form
36508E017417j96790l86262n22903j1482P42746P53395O2177k42007K33654N79705
36498F029650J32552m40175k83917K67046L16152j70678m72674l17738j08946
36489D951272q6093n7901K5915n7704k73806k87951r1207q8524l82609n32993
36479C118399k88508k5257j01100k57787j22554R7088j9799l17564k71269J19105
36469A930754K86572K1122j71821J17455N36677M98971L4619l26206l41975k81477
36459B304691l78912m74421l32622m1248J18617P4914L7116J69960L40141K79489
36449B097725m3123l36334l34588j30366j6140n4354k3567J78216L28178K16448
36439A882095k3248j28088r1814q8605j21840l6808J46185K00193M5871j02476
$$ plain form
36429 1681465 1638396 1776247 1980056 2043890 1886033 1609474 1388079 1295672 1262985 1241068
36419 1241068 1331924 1601453 1807500 1582404 971008 517505 632646 1095472 1408833 1445459
36409 1445459 1449406 1549759 1624434 1598043 1549788 1517332 1467332 1460727 1578499 1693463 1610926
36398 1610926 1435102 1460163 1663811 1690419 1444672 1300307 1509884 1778905 1731403 1506712
36388 1506712 1534642 1910027 2344037 2604369 2656743 2464014 2019004 1568474 1450236 1638529
36378 1638529 1747615 1579223 1381357 1412644 1514235 1372258 1052037 956778 1250012 1600413
36368 1600413 1635661 1445820 1403215 1585165 1686652 1546798 1423569 1538362 1639978 1375254
36358 1375254 910902 746133 967117 1171679 1186980 1335924 1781906 2113390 1951655 1584686
$$ packed form
36429A681465m3069J37851K03809O3834j57857k76559k21395r2407l2687k1917
36419A241068R0856K69529K06047k25096o11396m53503J15141M62826L13361L6626
36409A445459L947J00353P4675k6391m8255l2456n0000o605J17772J14964q2537
36398A610926j75824K5061K03648K6608k45747j44365K09577K69021m7502k24691
36388A506712K7930L75385M34010K60332N2374j92729m45010m50530j18238J88293
36378A638529J09086j68392j97866L1287J01591j41977l20221r5259K93234L50401
36368A600413L5248j89841m2605J81950J01487j39854j23229J14793J01616k64724
36358A375254m64352j64769K20984K04562J5301J48944M45982L31484j61735l66969
$$ plain form
36348 1584686 1556280 1902948 2245161 2393782 2364299 1988907 1136113 284890 231305 1045445
36338 1045445 1850183 1901799 1451460 1207343 1321123 1370123 1168274 1108265 1608236 2504049
36328 2504049 3159557 3108325 2507953 1969933 1969188 2440819 2938190 3086536 2819070 2297301
36318 2297301 1770115 1452961 1369595 1339419 1262585 1328917 1737309 2306888 2661516 2751714
36308 2751714 2845315 2994383 2923943 2568556 2298630 2365565 2475608 2244285 1806109 1594094
36298 1594094 1687537 1783937 1754270 1828392 2166082 2560052 2707351 2580433 2387244 2275896
36288 2275896 2206169 2072077 1852845 1617022 1419772 1261447 1165536 1204669 1356499 1427785
36278 1427785 1294493 1157587 1326855 1758402 2075514 2084243 1957777 1819839 1521919 1062208
$$ packed form
36348A584686k8406L46668L42213J48621k9483l75392q52794q51223n3585Q14140
36338A045445Q04738N1616m50339k44117J13780M9000k01849o0009M99971Q95813
36328B504049O55508n1232o00372n38020p45M71631M97371J48346k67466n21769
36318B297301n27186l17154q3366l0176p6834O6332M08392N69579L54628R0198
36308B751714R3601J49068p0440l55387k69926O6935J10043k31323m38176k12015
36298A594094R3443R6400k9667P4122L37690L93970J47299j26918j93189j11348
36288B275896o9727j34092k19232k35823j97250j58325r5911L9133J51830P1286
36278A427785j33292j36906J69268M31547L17112Q729j26466j37938k97920m59711
$$ plain form
36268 1062208 868038 1283671 1995711 2369337 2239747 1989566 1914185 1919062 1870750 1852785
36258 1852785 1924829 1915051 1654334 1270694 1086407 1263140 1618604 1792273 1621197 1363171
36248 1363171 1431340 1853191 2187742 2123420 1921859 1995870 2244458 2186200 1663548 1017882
36238 1017882 576288 351184 280758 366011 466063 344379 92513 163694 751930 1407966
36228 1407966 1530355 1062240 488547 281667 523054 952487 1248541 1338951 1467003 1815643
36218 1815643 2129784 2020122 1623359 1502865 1767126 1816603 1284900 724783 847691 1463106
36208 1463106 1807585 1704769 1690860 2017207 2242054 2003805 1603955 1498179 1651544 1771981
36198 1771981 1863756 2136389 2526577 2687874 2434292 1945059 1529890 1356021 1384690 1442266
$$ packed form
36268A062208j94170M15633P12040L73626j29590k50181p5381M877m8312j7965
36258A852785P2044r778k60717l83640j84287J76733L55464J73669j71076k58026
36248A363171O8169M21851L34551o4322k01561P4011K48588n8258n22652o45666
36238A017882m41594k25104p0426Q5253J00052j21684k51866P1181N88236O56036
36228A407966J22389m68115n73693k06880K41387M29433K96054R0410J28052L48640
36218A815643L14141j09662l96763j20494K64261M9477n31703n60117J22908O15415
36208A463106L44479j02816j3909L26347K24847k38249l99850j05776J53365J20437
36198A771981R1775K72633L90188J61297k53582m89233m15169j73869K8669N7576
$$ plain form
36188 1442266 1378238 1247854 1280298 1574995 1923783 2065204 2023862 2019719 2097089 2073551 1898324
36177 1898324 1833832 2106339 2488129 2459803 1838323 1073232 778844 1058569 1466563 1605421
36167 1605421 1530917 1497906 1557785 1611856 1681137 1837767 1955222 1838092 1594670 1566906
36157 1566906 1828585 2059313 2031035 1906400 1862487 1726258 1294453 795544 647928 848408
36147 848408 984315 864952 782538 1042672 1535562 1934550 2087003 2023320 1770882 1391323
36137 1391323 1091151 1053555 1181004 1197414 1016516 843291 874478 1050510 1185562 1236546
36127 1236546 1334131 1583577 1915458 2132924 2078803 1789463 1520970 1572776 2002482 2520477
36117 2520477 2742932 2568017 2245457 2069035 2093237 2200096 2330500 2502434 2634118 2533149
$$ packed form
36188A442266o4028j30384L2444K94697L48788J41421m1342m143P7370k3538j75227
36177A898324o4492K72507L81790k8326o21480p65091k94388K79725M07994J38858
36167A605421p4504l3011N9879N4071O9281J56630J17455j17130k43422k7764
36157A566906K61679K30728k8278j24635m3913j36229m31805m98909j47616K00480
36147H48408J35907j19363q2414K60134M92890L98988J52453o3683k52438l79559
36137A391323l00172l7596J27449J6410j80898j73225L1187J76032J35052N0984
36127A236546R7585K49446L31881K17466n4121k89340k68493N1806M29706N17995
36117B520477K22455j74915l22560j76422K4202J06859J30404J71934J31684j00969
$$ plain form
36107 2533149 2149403 1728459 1583908 1742865 1920496 1852469 1568410 1308397 1239024 1309031
36097 1309031 1353076 1274135 1113476 985381 982945 1139381 1428201 1751901 1944115 1857867
36087 1857867 1507843 1099848 857200 810529 808011 744062 707136 839210 1099187 1279613
36077 1279613 1276781 1224592 1267407 1286656 1016441 438864 -93743 -220009 36100 318104
36067 318104 321438 49452 -250454 -319940 -109507 158191 200542 8440 -140361 -91425
36057 -91425 -78148 -397609 -971681 -1483344 -1822694 -2072450 -2160390 -1983026 -1871845 -2365294
36047 -2365294 -3310109 -3752156 -3127276 -2100509 -1695788 -1959203 -2133833 -1915332 -1747008
36038 -1747008 -1870699 -1876557 -1439245 -848822 -457861 -136885 313115 669688 694368 669300
$$ packed form
36107B533149l83746m20944j44551J58957J77631o8027k84059k60013o9373P0007
36097A309031M4045p8941j60659j28095k436J56436K88820L23700J92214q6248
36087A857867l50024m07995k42648m6671k518o3949l6926J32074K59977J80426
36077A279613k832n2189M2815J9249k70215n77577n32607j26266K56109K82004
36067C18104L334k71986k99906o9486K10433K67698M2351j92102j48801M8936
36057i1425J3277l19461n74072n11663l39350k49756q7940J77364J11181m93449
36047b365294r44815m42047O24880J026767M04721k63415j74630K18501J68324
36038a747008j23691n858M37312N90423L90961L20976M50000L56573K4680k5068
$$ plain form
36028 669300 991357 1466688 1561571 1236558 989906 1079943 1210641 1090567 874119 863663
36018 863663 1084827 1356003 1573192 1756602 1938955 2107675 2170178 1974709 1516213 1110854
36008 1110854 1154246 1653132 2174815 2318266 2086051 1766017 1620956 1733941 1987550 2150527
35998 2150527 2135313 2169493 2513708 3008330 3158835 2737771 2050084 1503948 1175116 937345
35988 937345 770361 724487 759628 834240 1022499 1349341 1631032 1685922 1619236 1697357 1980557
35977 1980557 2253102 2307947 2172131 2043186 2069966 2188106 2170283 1911090 1633855 1652766
35967 1652766 1928664 2092267 1971408 1824070 1904038 2072138 2074072 1973850 2014806 2205934
35957 2205934 2353893 2405167 2447855 2424299 2149481 1641930 1197508 1084485 1318720 1734368
$$ packed form
36028F69300L22057M75331R4883l25013k46652R0037J30698j20074k16448j0456
36018H63663K21164K71176K17189J83410J82353J68720O2503j95469m58496m05359
36008A110854M3392M98886N21683J43451k32215l20034j45061J12985K53609J62977
35998B150527j5214L4180L44215M94622J50505m21064o87687n46136l28832k37771
35988I37345j66984m5874L5141P4612J88259L26842K81691N4890o6686P8121K83200
35977A980557K72545N4845j35816j28945K6780J18140j7823k59193k77235J8911
35967A652766K75898J63603j20859j47338P9968J68100J934j00222M0956J91128
35957B205934J47959N1274M2688k3556k74818n07551m44422j13023K34235M15648
$$ plain form
35947 1734368 2129632 2368059 2466260 2535321 2556708 2381821 2093757 2108352 2609720 3098302
35937 3098302 2918845 2139274 1474545 1376034 1644954 1958959 2278143 2589924 2723954 2667556
35927 2667556 2685456 2852903 2802572 2257920 1562039 1321095 1660669 2139188 2317232 2160717
35917 2160717 1930557 1883854 2074780 2321965 2387592 2228100 1984580 1738630 1480684 1347592
35907 1347592 1598947 2217590 2809392 3093654 3230389 3424233 3474149 3060802 2311889 1716645
35897 1716645 1544300 1654411 1834829 2021671 2175059 2202602 2076374 1883756 1756648 1835406
35887 1835406 2196146 2676115 2918641 2782086 2546562 2497293 2513418 2384199 2302983 2565182
35877 2565182 2895892 2679722 1942236 1504573 1887932 2574748 2775374 2538128 2550265 3031590
$$ packed form
35947A734368L95264K38427R8201O9061K1387j74887k88064J4595N01368M88582
35937C098302j79457p79571o64729r8511K68920L14005L19184L11781J34030n6398
35927B667556J7900J67447n0331n44652o95881k40944L39574M78519J78044j56515
35917B160717k30160m6703J90926K47185O5627j59492k43520k45950k57946j33092
35907A347592K51355O18643N91802K84262J36735J93844M9916m13347p48913n95244
35897A716645j72345J10111J80418J86842J53388K7543j26228j92618j27108P8758
35887A835406L60740M79969K42526j36555k35524m9269J6125j29219q1216K62199
35877B565182L30710k16170p37486m37663L83359O86816K00626k37246J2137M81325
$$ plain form
35867 3031590 3437605 3331077 3022771 3061563 3419291 3567768 3252144 2805236 2619086 2616698
35857 2616698 2468235 2136616 1899197 1879202 1884581 1790009 1779485 2031753 2397875 2614932
35847 2614932 2664923 2688857 2701987 2654701 2632960 2692046 2605822 2149265 1588386 1484574 1946796
35836 1946796 2450599 2528070 2298371 2139539 2158345 2245354 2405173 2708682 3036739 3165946
35826 3165946 3084092 2999161 3030981 3069068 2964566 2731292 2505431 2381177 2338566 2308708
35816 2308708 2262767 2207390 2121933 1988694 1899442 1995666 2222696 2303162 2112634 1931018
35806 1931018 2096048 2527163 2859763 2950944 2936770 2867419 2671185 2468123 2497992 2676756
35796 2676756 2648599 2376600 2228868 2329526 2328342 2068431 1962377 2316043 2749465 2786820
$$ packed form
35867C031590M06015j06528l08306L8792L57728J48477l15624m46908j86150k388
35857B616698j48463l31619k37419j9995N379r4572j0524K52268L66122K17057
35847B614932M9991K3934J3130m7286k1741N9086q6224m56557n60879j03812M62222
35836A946796N03803P7471k29699j58832J8806Q7009J59819L03509L28057J29207
35826C165946q1854q4931L1820L8087j04502k33274k25861j24254m2611k9858
35816B308708m5941n5377q5457j33239q9252R6224K27030Q0466j90528j81616
35806A931018J65030M31115L32600R1181j4174o9351j96234k03062K9869J78764
35796B676756k8157k71999j47732J00658j184k59911j06054L53666M33422L7355
$$ plain form
35786 2786820 2626490 2740529 3015270 2960830 2609414 2503908 2800946 3038377 2892450 2585589
35776 2585589 2398470 2320169 2364825 2696931 3176144 3274935 2800699 2290180 2298014 2634151
35766 2634151 2731402 2497479 2325937 2410821 2525320 2471079 2361560 2398044 2636446 3020711
35756 3020711 3425833 3644243 3542567 3274963 3167158 3345917 3613346 3697833 3506776 3145227
35746 3145227 2815301 2674771 2664015 2518420 2109589 1714564 1730546 2141491 2513073 2552194
35736 2552194 2422617 2422903 2604080 2856245 3140822 3405032 3426767 3031376 2423495 2052342
35726 2052342 2112849 2363434 2470620 2356619 2152388 1996383 2004299 2289024 2821137 3320036
35716 3320036 3463493 3231997 2920410 2775494 2748789 2682201 2612220 2723595 3028139 3268143
$$ packed form
35786B786820j60330J14039K74741n4440l51416j05506K97038K37431j45927l06861
35776B585589j87119p8301M4656L32106M79213R8791m74236n10519P834L36137
35766B634151R7251k33923j71542Q4884J14499n4241j09519L6484K38402L84265
35756C020711M05122K18410j01676k67604j07805J78759K67429Q4487j91057l61549
35746C145227l29926j40530j0756j45595m08831l95025J5982M10945L71582L9121
35736B552194j29577K86J81177K52165K84577K64210K1735l95391o07881l71153
35726B052342O0507K50585J07186j14001k04231j56005P916K84725N32113M98899
35716C320036J43457k31496l11587j44916k6705o6588o9981J11375L04544K40004
$$ plain form
35706 3268143 3210062 2911021 2600037 2412245 2385523 2604550 3082481 3496635 3356597 2606542
35696 2606542 1825613 1588299 1798027 1939288 1841756 1801927 1982741 2148828 2133636 2163700
35686 2163700 2468752 2879654 3092675 3075991 2928214 2598293 2105962 1813451 2041292 2548228
35676 2548228 2830883 2835529 2895843 3040430 2937158 2580669 2440673 2732305 3080803 3181980
35666 3181980 3284340 3654603 4022745 4010346 3761935 3681847 3808843 3899721 3895062 3848297
35656 3848297 3616980 3112276 2666072 2637807 2814890 2742240 2500027 2537863 2824183 2862797
35646 2862797 2592462 2533566 2863652 3077955 2885662 2744929 3037126 3328454 3078577 2619252
35636 2619252 2691770 3252701 3481506 2957006 2191478 1876371 2094890 2468938 2720853 2872286
$$ packed form
35706C268143n8081k99041l10984j87792k6722K19027M77931M14154j40038p50055
35696B606542p80929k37314K09728J41261r7532l9829J80814J66087j5192L0064
35686B163700L05052M10902K13021j6684j47777l29921m92331k92511K27841N06936
35676B548228K82655M646O0314J44587j03272l56489j39996K91632L48498J01177
35666C181980J02360L70263L68142j2399k48411q0088J26996R0878m659m6765
35656C848297k31317n04704m46204k8265J77083p2650k42213L7836K86320L8614
35646B862797k70335n8896L30086K14303j92293j40733K92197K91328k49877m59325
35636B619252P2518N60931K28805n24500p65528l15107K18519L74048K51915J51433
$$ plain form
35626 2872286 3091428 3483661 3922121 4090224 3857564 3552162 3611165 4006675 4326109 4413919
35616 4413919 4553329 4908390 5177814 5056228 4752824 4731451 5096198 5542976 5830605 5992988
35606 5992988 6104234 6142426 6166793 6371419 6805449 7215247 7347847 7297225 7344049 7508154
35596 7508154 7500159 7165879 6762172 6640944 6782749 6824728 6523312 6040190 5738935 5781724
35586 5781724 5960123 5902425 5467264 4939863 4756462 4999554 5302995 5349101 5270053 5339530
35576 5339530 5432833 5155939 4491853 3917782 3735340 3626920 3143990 2411845 2020956 2274174
35566 2274174 2806584 3000094 2628724 2031492 1696217 1721333 1759018 1541571 1315570 1508229
35556 1508229 2029815 2282491 1959310 1451710 1245458 1284154 1276592 1300913 1593306 1914452
$$ packed form
35626B872286K19142L92233M38460J68103k32660l05402N9003L95510L19434Q7810
35616D413919J39410L55061K69424j21586l03404k1373L64747M46778K87629J62383
35606E992988J11246L8192K4367K04626M34030M09798J32600n0622M6824J64105
35596G508154p995l34280m03707j21228J41805M1979l01416m83122l01255M2789
35586E781724J78399n7698m35161n27401j83401K43092L03441M6106p9048O9477
35576E339530R3303k76894o64086n74071j82442j08420m82930p32145l90889K53218
35566B274174N32410J93510l71370n97232l35275K5116L7685k17447k26001J92659
35556A508229N21586K52676l23181n07600k06252L8696p562K4321K92393L21146
$$ plain form
35546 1914452 1722405 1021234 505904 673668 1213878 1530438 1513594 1461872 1496877 1467403
35536 1467403 1352074 1367725 1599485 1805078 1746779 1549853 1535062 1752514 1883447 1661106
35526 1661106 1224965 907969 777988 630530 438006 503536 988888 1529992 1631177 1335584
35516 1335584 1160552 1361325 1612852 1554900 1337411 1360762 1664104 1884428 1770409 1453052
35506 1453052 1178712 1035873 1052462 1326410 1847100 2326782 2461610 2311058 2170107 2085959
35496 2085959 1816061 1338576 1038645 1157181 1381593 1336184 1208865 1418675 1842052 1959910
35486 1959910 1742271 1730750 2100290 2311429 2025754 1740935 2000205 2472364 2463473 2008946
35476 2008946 1753682 1913348 2062510 1947499 1845730 1977238 2111402 1985787 1716306
$$ packed form
35546A914452j92047p01171n15330J67764N40210L16560j6844n1722L5005k9474
35536A467403j15329J5651K31760K05593n8299j96926j4791K17452J30933k22341
35526A661106m36141l16996j29981j47458j92524O5530M85352N41104J01185k95593
35516A335584j75032K00773K51527n7952k17489K3351L03342K20324j14019l17357
35506A453052k74340j42839J6589K73948N20690M79682J34828j50552j40951q4148
35496B085959k69898m77485k99931J18536K24412m5409j27319K09810M23377J17858
35486A959910k17639j1521L69540K11139k85675k84819K59270M72159q891m54527
35476B008946k55264J59666J49162j15011j01769J31508J34164j25615k69481
$$ plain form
35467 1716306 1575542 1643002 1810940 1902840 1737393 1322914 976256 970704 1142221 1194642
35457 1194642 1259564 1644036 2104414 2026525 1408392 979746 1124724 1356294 1200304 956887
35447 956887 1102974 1482101 1655158 1644343 1754616 1978299 2133811 2314953 2635939 2773884
35437 2773884 2370687 1731893 1525259 1862441 2235005 2305371 2206815 2076996 1860707 1640697
35427 1640697 1645220 1812887 1803418 1555698 1414694 1589851 1891481 2125784 2358765 2648494
35417 2648494 2875651 2970434 2971858 2781968 2255887 1632618 1422301 1693685 1931579 1829789
35407 1829789 1750518 2068702 2507150 2568512 2296138 2121212 2172465 2209107 2098853 1915997
35397 1915997 1658895 1314909 1166753 1573120 2368758 2881452 2705604 2170508 1879510
$$ packed form
35467A716306j40764O7460J67938R1900j65447m14479l46658n552J71517N2421
35457A194642O4922L84472M60378p7889o18133m28646J44978K31570j55990k43417
35447I56887J46087L79127J73057j0815J10273K23683J55512J81142L20986J37945
35437B773884m03197o38794k06634L37182L72564P0366r8556j29819k16289k20010
35427A640697M523J67667r469k47720j41004J75157L01630K34303K32981K89729
35417B648494K27157R4783J424j89890n26081o23269k10317K71384K37894j01790
35407A829789p9271L18184M38448O1362k72374j74926N1253L6642j10254j82856
35397A915997k57102l43986j48156M06367P95638N12694j75848n35096k90998
$$ plain form
35388 1879510 2021417 2326305 2530928 2655088 2839811 3069894 3136610 2878323 2427512 2144460
35378 2144460 2262098 2658186 3024941 3172757 3093323 2844220 2517652 2253216 2134309 2112697
35368 2112697 2144265 2303908 2606681 2824663 2731851 2498912 2566892 3069825 3627399 3818076
35358 3818076 3641284 3361276 3092436 2776924 2475155 2404274 2630802 2901501 2892772 2562016
35348 2562016 2172740 2005274 2107241 2308367 2400472 2284200 2021927 1814432 1860526 2128750
35338 2128750 2308486 2149001 1853324 1915721 2455709 2935383 2775357 2108949 1620256 1688014
35328 1688014 2038335 2291102 2462351 2711893 2911698 2812061 2476274 2196763 2039583 1817351
35318 1817351 1529589 1479657 1827088 2312718 2620655 2788336 3019068 3249824 3201156 2822139
$$ packed form
35388A879510J41907L04888K04623J24160J84723K30083O6716k58287m50811k83052
35378B144460J17638L96088L66755J47816p9434k49103l26568k64436j18907k1612
35368B112697L1568J59643L02773K17982r2812k32939O7980N02933N57574J90677
35358C818076j76792k80008k68840l15512l01769p0881K26528K70699q729l30756
35348B562016l89276j67466J01967K01126R2105j16272k62273k07495M6094K68224
35338B128750J79736j59485k95677O2397N39988M79674j60026o66408m88693O7758
35328A688014L50321K52767J71249K49542J99805r9637l35787k79511j57180k22232
35318A817351k87762m9932L47431M85630L07937J67681K30732K30756m8668l79017
$$ plain form
35308 2822139 2425959 2329917 2534611 2811748 2959462 2901021 2659599 2345362 2117323 2080569
35298 2080569 2223628 2454299 2645932 2660933 2434933 2087865 1871058 1925111 2122422 2214567
35288 2214567 2126962 2047457 2186184 2467186 2536314 2156864 1567478 1307823 1638798 2267814
35278 2267814 2728055 2868019 2819551 2660510 2375248 2058138 1856524 1729285 1551320 1450315
35268 1450315 1692823 2167358 2356971 2015759 1567339 1599346 2198618 2993880 3601954 3787346
35258 3787346 3438918 2715411 2048699 1707427 1504967 1199786 968441 1130461 1592990
35249 1592990 1989600 2248824 2575835 2935280 3034064 2841147 2662394 2620387 2504857 2267768
35239 2267768 2232794 2606033 3133881 3457554 3500258 3323347 2938901 2501578 2370593 2685888
$$ packed form
35308B822139l96180r6042K04694K77137J47714n8441k41422l14237k28039l6754
35298B080569J43059K30671J91633J5001k26000l47068k16807N4053J97311R2145
35288B214567q7605p9505J38727K81002O9128l79450n89386k59655L30975O29016
35278B267814M60241J39964m8468j59041k85262l17110k01614j27239j77965j01005
35268A450315K42508M74535J89613l41212m48420L2007N99272P95262O08074J85392
35258C787346l48428p23507o66712l41272k02460l05181k31345J62020M62529
35249A592990L96610K59224L27011L59445R8784j92917j78753m2007j15530k37089
35239B267768l4974L73239N27848L23673M2704j76911l84446m37323j30985L15295
$$ plain form
35229 2685888 3109578 3250063 3137039 3033283 2994462 2899707 2749773 2649326 2603698 2566514
35219 2566514 2578216 2653708 2660405 2504624 2304397 2202465 2186741 2278686 2641597 3210412
35209 3210412 3466000 2997323 2158367 1730421 1969744 2408276 2604191 2630898 2686531 2649135
35199 2649135 2320845 1861710 1657071 1841812 2200122 2505294 2748033 2994603 3191864
35190 3191864 3227322 3097972 2874976 2511632 1864174 1000396 327871 217926 585056 1052650
35180 1052650 1458303 1908876 2366840 2552216 2357068 2036071 1852963 1833601 1971904 2297420
35170 2297420 2564878 2324725 1618862 1191150 1580753 2345392 2662429 2411494 2121600
35161 2121600 2074668 2082349 2052376 2143744 2317250 2286348 2031737 1918248 2189762 2710223
$$ packed form
35229B685888M23690J40485j13024j03756l8821r4755j49934j00447m5628l7184
35219B566514J1702P5492O697j55781k00227j01932j5724R1945L62911N68815
35209C210412K55588m68677q38956m27946K39323M38532J95915K6707N5633l7396
35199B649135l28290m59135k04639J84741L58310L05172K42739K46570J97261
35190C191864L5458j29350k22996l63344o47458q63778o72525j09945L67130M67594
35180A052650M05653M50573M57964J85376j95148l20997j83108j9362J38303L25516
35170B297420K67458k40153p05863m27712L89603P64639L17037k50935k89894
35161B121600m6932P681k9973R1368J73506l0902k54611j13489K71514N20461
$$ plain form
35151 2710223 3237644 3583308 3529559 3041256 2551533 2546939 2859850 2909737 2665885 2723760
35141 2723760 3287515 3764177 3659205 3244791 2966684 2776026 2503728 2359029 2506168
35132 2506168 2581485 2230928 1803282 1896822 2436117 2797646 2728672 2581108 2679902 2969527
35122 2969527 3306612 3658537 3931626 3938822 3631639 3169449 2763372 2584433 2685934 2840881
35112 2840881 2676610 2210343 1971496 2257080 2575578 2307182 1664436 1405409 1725378
35103 1725378 2080725 2121182 2150283 2504786 3043416 3494672 3848339 4133878 4199799 3992755
35093 3992755 3736178 3574494 3341726 2952711 2730356 2998468 3536984 3793315 3561812
35084 3561812 3162564 2959834 2951231 2900073 2716448 2581639 2698938 2994705 3161848 3021845
$$ packed form
35151B710223N27421L45664n3749m88303m89723m594L12911M9887k43852N7875
35141B723760N63755M76662j04972m14414k78107j90658k72298j44699J47139
35132B506168P5317l50557m27646R3540N39295L61529o8974j47564R8794K89625
35122B969527L37085L51925K73089P196l07183m62190m06077j78939J01501J54947
35112B840881j64271m66267k38847K85584L18498k68396o42746k59027L19969
35103A725378L55347M0457K9101L54503N38630M51256L53667K85539O5921k07044
35093C992755k56577j61684k32768l89015k22355K68112N38516K56331k31503
35084C561812l99248k02730q603n1158j83625j34809J17299K95767J67143j40003
$$ plain form
35074 3021845 2728832 2538542 2509944 2562751 2670359 2786164 2713319 2321299 1828488 1611201
35064 1611201 1767444 2080628 2323212 2368461 2161340 1890043 2005479 2661447 3299857 3292032
35054 3292032 2853943 2714338 2959071 2965705 2553545 2328097 2572824 2662539 2141759 1651280
35044 1651280 2024595 2970193 3460713 3120537 2450728 1879737 1381863 994385 974230 1323114
35034 1323114 1719161 2027177 2400562 2812466 2969725 2799986 2595494 2561312 2593990 2580887
35024 2580887 2551046 2483077 2344866 2346936 2726308 3237016 3330458 2937987 2592360 2641316
35014 2641316 2843368 2922457 2987483 3125030 3095339 2809627 2656852 2919051 3242051 3161383
35004 3161383 2842275 2794411 3088600 3366503 3452277 3439477 3295135 2919450 2564523 2657173
$$ packed form
35074C021845k93013j90290k8598N2807J07608J15805p2845l92020m92811k17287
35064A611201J56243L13184K42584M5249k07121k71297J15436O55968O38410p825
35054C292032m38089j39605K44733O634m12160k25448K44727Q9715n20780m90479
35044A651280L73315R45598M90520l40176o69809n70991m97874l87478k0155L48884
35034A323114L96047L08016L73385M11904J57259j69739k04492l4182L2678j3103
35024B580887k9841o7969j38211K070L79372N10708R3442l92471l45627M8956
35014B641316K02052P9089O5026J37547k9691k85712j52775K62199L23000q0668
35004C161383l19108m7864K94189K77903Q5774j2800j44342l75685l54927R2650
$$ plain form
34994 2657173 3133565 3419088 3192433 2762624 2546372 2553560 2580884 2583828 2621963 2675425 2724678
34983 2724678 2817093 2883787 2699916 2222058 1778371 1709686 1970816 2294144 2597069 2969652
34973 2969652 3348156 3479765 3224251 2695905 2107233 1652512 1525006 1806641 2272117
34964 2272117 2518006 2417190 2287650 2464141 2837286 3010720 2841368 2605533 2617518 2868326
34954 2868326 3100231 3103896 2889284 2684431 2797292 3316675 3889936 3994017 3545579 3039950
34944 3039950 2920913 3045113 3030091 2891646 2912963 3008864 2755070 2121932 1670726 1797972
34934 1797972 2198179 2355597 2214499 2042126 1943892 1889901 1965005 2184298 2263864 2006003
34924 2006003 1750739 1976544 2552287 2875829 2718744 2427968 2265187 2086109 1816723
$$ packed form
34994B657173M76392K85523k26655m29809k16252P188K7324K944L8135N3462M9253
34983B724678R2415O6694j83871m77858m43687o8685K61130L23328L02925L72583
34973B969652L78504J31609k55514n28346n88672m54721j27506K81635M65476
34964B272117K45889j00816j29540J76491L73145J73434j69352k35835J1985K50808
34954B868326K31905L665k14612k04853J12861N19383N73261J04081m48438n05629
34944C039950j19037J24200j5022j38445K1317R5901k53794o33138m51206J27246
34934A797972M00207J57418j41098j72373r8234n3991P5104K19293P9566k57861
34924B006003k55264K25805N75743L23542j57085k90776j62781j79078k69386
$$ plain form
34915 1816723 1734829 2015060 2390821 2551413 2563263 2638799 2774506 2880469 3007031 3170106
34905 3170106 3178947 2910605 2566183 2406138 2409258 2415991 2408319 2414584 2350292 2208501 2194377
34894 2194377 2396438 2542331 2384083 2105761 2007541 2009076 1877076 1750461 1940602 2304435
34884 2304435 2346020 1966722 1624484 1647713 1832711 1877334 1825596 1873589 2028422 2163291
34874 2163291 2207289 2149170 2035162 2021068 2206293 2390455 2272062 1928755 1786873 2045485
34864 2045485 2453944 2729070 2820086 2660951 2106989 1341629 933704 1180715 1713306 2030585
34854 2030585 2095539 2100592 2018217 1796803 1687894 1905498 2200329 2259636 2310769 2763201
34844 2763201 3390181 3504027 2963171 2396579 2294828 2432318 2408420 2260665 2232007 2329163
$$ packed form
34915A816723q1894K80231L75761J60592J1850P5536J35707J05963J26562J63075
34905C170106Q841k68342l44422j60045L120O733p672O265o4292j41791j4124
34894B194377K02061J45893j58248k78322r8220J535j32000j26615J90141L63833
34884B304435M1585l79298l42238K3229J84998M4623n1738M7993J54833J34869
34874B163291M3998n8119j14008j4094J85225J84162j18393l43307j41882K58612
34864B045485M08459K75126R1016j59135n53962p65360m07925K47011N32591L17279
34854B030585O4954N053q2375k21414j08909K17604K94831N9307N1133M52432
34844B763201O26980J13846n40856n66592j01751J37490k3898j47755k8658R7156
$$ plain form
34834 2329163 2454238 2660357 2928029 2953058 2541845 2031613 1917507 2163852 2281773 2061410
34824 2061410 1822860 1861584 2021440 2024501 1947249 2076482 2424703 2690093 2695137 2608612 2651071
34813 2651071 2785104 2841252 2801141 2758438 2673765 2394041 1937210 1571169 1538353 1823095
34803 1823095 2228991 2549892 2630858 2436866 2147561 2028250 2115995 2193443 2161255 2220978
34793 2220978 2522261 2832121 2795682 2399701 1950103 1695964 1697126 1944359 2336612 2607413
34783 2607413 2557535 2352488 2352368 2657850 3040864 3291012 3395771 3406093 3370080 3386595 3487843
34772 3487843 3492519 3216066 2781644 2459022 2270634 2088543 2044439 2399767 2987115 3264288
34762 3264288 3060222 2813602 2871390 2992616 2829108 2494867 2290388 2171453 1894631 1491237
$$ packed form
34834B329163J25075K06119K67672K5029m11213n10232j14106K46345J17921k20363
34824B061410k38550L8724J59856L061p7252J29233L48221K65390N044q6525M2459
34813B651071J34033N6148m0111m2703q4673k79724m56831l66041l2816K84742
34803A823095M05896L20901Q0966j93992k89305j19311Q7745P7448l2188N9723
34793B220978L01283L09860l6439l95981m49598k54139J162K47233L92253K70801
34783B607413m9878k05047j20L05482L83014K50148J04759J0322l6013J6515J01248
34772C487843M676k76453m34422l22622j88388j82091m4104L55328N87348K77173
34762C264288k04066k46620N7788J21226j63508l34241k04479j18935k76822m03394
$$ plain form
34752 1491237 1228008 1225735 1411965 1708466 1984495 1986367 1633895 1273246 1323793 1744933
34742 1744933 2122003 2204262 2098421 2002094 2004478 2111950 2264446 2372099 2464131 2651198
34732 2651198 2803460 2547424 1862549 1389354 1713894 2535661 3029767 2932916 2756734 2936874
34722 2936874 3302277 3505556 3518791 3506478 3549867 3674346 3879350 4028013 3975555 3863955
34712 3863955 3960702 4150062 3998736 3466579 3108000 3309825 3726341 3816281 3627557 3649080
34702 3649080 4079220 4630413 4971666 5051822 5029647 5111010 5387983 5664296 5573430 5066908
34692 5066908 4614749 4662484 5041211 5220533 5036826 4838353 4959137 5377739 5893227 6325574
34682 6325574 6512714 6408668 6242616 6299660 6478665 6369190 5879660 5473018 5570947 5985049
$$ packed form
34752A491237k63229k273J86230K96501K76029J872l52472l60649N0547M21140
34742A744933L77070Q2259j05841r6327K384J07472J52496J07653R2032J87067
34732B651198J52262k56036o84875m73195L24540Q21767M94106r6851j76182J80140
34722B936874L65403K03279J3235j2313M3389J24479K05004J48663n2458j11600
34712C863955R6747J89360j51326n32157l58579K01825M16516Q9940j88724K1523
34702C649080M30140N51193L41253Q0156k2175Q1363K76973K76313r0866n06522
34692E066908m52159M7735L78727J79322j83707j98473J20784M18602N15488M32347
34682F325574J87140j04046j66052N7044J79005j09475m89530m06642R7929M14102
$$ plain form
34672 5985049 6210399 6097595 5922978 5895323 5935997 5968796 6112536 6439747 6743687 6725135
34662 6725135 6324536 5740831 5189042 4758488 4452006 4220076 3960376 3609192 3256794
34653 3256794 3070516 3076604 3120321 3083034 3028142 3049891 3068354 2902936 2535213 2195082 2143418
34642 2143418 2393694 2672116 2678083 2403796 2151081 2176109 2394346 2563426 2666437 2869085
34632 2869085 3123308 3154037 2940106 2841568 3025407 3125812 2826882 2463052 2553467 2955163
34622 2955163 3058363 2741210 2505685 2610443 2707002 2534123 2359628 2401308 2368203 2034408
34612 2034408 1797499 2096897 2616227 2701757 2384084 2319020 2743965 3139355 3055876 2709338
34602 2709338 2502251 2419752 2253624 2105476 2258294 2680899 3015740 3053681 2955829 2946811
$$ packed form
34672E985049K25350j12804j74617k7655M0674L2799J43740L27211L03940j8552
34662F725135m00599n83705n51789m30554l06482k31930k59700l51184l52398
34653C256794j86278O088M3717l7287n4892K1749J8463j65418l67723l40131n1664
34642B143418K50276K78422N967k74287k52715K5028K18237J69080J03011K02648
34632B869085K54223L0729k13931r8538J83839J00405k98930l63830R0415M01696
34622B955163J03200l17153k35525J04758R6559j72879j74495M1680l3105l33795
34612B034408k36909K99398N19330Q5530l17673o5064M24945L95390q3479l46538
34602B709338k07087q2499j66128j48148J52818M22605L34841L7941r7852r018
$$ plain form
34592 2946811 2987040 2878724 2605309 2407945 2489070 2749138 2925577 2936892 2927317 2959992
34582 2959992 2864778 2506437 2057887 1851466 2030793 2448823 2808275 2815466 2367920 1760461
34572 1760461 1545622 1952600 2543249 2683916 2285396 1830788 1736398 1972900 2312238 2644908
34562 2644908 2953259 3181009 3250248 3122537 2835410 2561026 2530298 2724021 2754231 2309908
34552 2309908 1634916 1257372 1309284 1481943 1625539 1926424 2387709 2622213 2426869 2171098
34542 2171098 2277397 2610071 2736405 2566722 2358034 2241863 2140333 2078673 2214081 2552400
34532 2552400 2932403 3287851 3640945 3845668 3675074 3243480 3018970 3237401 3545534
34523 3545534 3449857 2958889 2532452 2472955 2629711 2730498 2761469 2876365 3087131 3256240
$$ packed form
34592B946811M0229j08316k73415j97364Q1125K60068J76439J1315r575L2675
34582B959992r5214l58341m48550k06421J79327M18030L59452P191m47546o07459
34572A760461k14839M06978N90649J40667l98520m54608r4390K36502L39338L32670
34562B644908L08351K27750O9239j27711k87127k74384l0728J93723L0210m44323
34552B309908o74992l77544N1912J72659J43596L00885M61285K34504j95344k55771
34542B171098J06299L32674J26334j69683k08688j16171j01530o1660J35408L38319
34532B552400L80003L55448L53094K04723j70594m31594k24510K18431L08133
34523C545534r5677m90968m26437n9497J56756J00787L0971J14896K10766J69109
$$ plain form
34513 3256240 3349267 3472761 3622499 3619930 3429286 3329221 3535586 3795767 3669422 3173785
34503 3173785 2811267 2887242 3121396 3094085 2800560 2530271 2404380 2319267 2248169 2316787
34493 2316787 2567023 2841038 2955543 2904086 2871013 3072168 3527364 3966322 4065854 3823827
34483 3823827 3562534 3504051 3519725 3402021 3189044 3064513 3114933 3357467 3812831 4327880
34473 4327880 4518360 4181573 3635034 3341993 3309303 3189772 2897794 2727347 2848467 3083301
34463 3083301 3279651 3540610 3909589 4140506 4030982 3785938 3797009 4143536 4494010 4472207
34453 4472207 4023711 3450590 3120738 3103998 3129152 2982755 2842243 3009837 3408187 3656720
34443 3656720 3647240 3680263 3934429 4173560 4176165 4115036 4231579 4410184 4405167 4286746 4313520
$$ packed form
34513C256240R3027J23494J49738k569j90644j00065K06365K60181j26345m95637
34503C173785l62518P5975K34154k7311k93525k70289j25891q5113p1098O8618
34493B316787K50236K74015J14505n1457l3073K01155M55196M38958R9532k42027
34483C823827k61293n8483J5674j17704k12977j24531N0420K42534M55364N15049
34473D327880J90480l36787n46539k93041l2690j19531k91978j70447J21120K34834
34463C083301J96350K60959L68979K30917j09524k45044J1071L46527L50474k1803
34453D472207m48496n73121l29852j6740K5154j46397j40512J67594L98350K48533
34443C656720r480L3023K54166K39131K605o1129J16543J78605n017j18421K6774
$$ plain form
34432 4313520 4499146 4648253 4726815 4851794 4970622 4906208 4716381 4661447 4773348 4794777
34422 4794777 4631468 4533896 4687781 4934468 5100537 5327597 5797440 6330909 6589598 6587916
34412 6587916 6684911 7070139 7557856 7974054 8482816 9338273 10452958 11417834 11928718
34403 11928718 12059537 12119169 12346258 12746175 13117457 13207292 12935165 12508348 12233327 12167349
34393 12167349 12057765 11697419 11210951 10840869 10555927 10105463 9449984 8880424 8614750
34384 8614750 8486630 8186882 7659606 7083887 6578398 6129729 5762111 5569276 5546767 5534313
34374 5534313 5376671 5076053 4779545 4660579 4767678 4926040 4863781 4534714 4231035 4239048
34364 4239048 4465223 4583913 4495883 4417438 4523319 4736320 4912074 5006536 4991269 4836970
$$ packed form
34432D313520J85626J49107P8562J24979J18828o4414j89827n4934J11901K1429
34422D794777j63309r7572J53885K46687J66069K27060M69843N33469K58689j682
34412F587916R6995L85228M87717M16198N08762Q55457J114685R64876N10884
34403A1928718J30819N9632K27089L99917L71282Q9835k72127m26817k75021o5978
34393A2167349j09584l60346m86468l70082k84942m50464o55479n69560k65674
34384H614750j28120k99748n27276n75719n05489m48669l67618j92835k2509j2454
34374E534313j57642l00618k96508j18966J07099J58362o2259l29067l03679Q013
34364D239048K26175J18690q8030p8445J05881K13001J75754R4462j5267j54299
$$ plain form
34354 4836970 4697818 4877733 5422105 5924361 5969026 5645214 5377112 5335074 5313996 5198903
34344 5198903 5215537 5538717 5885609 5801546 5310561 4984366 5230783 5724021 5802360 5358332
34334 5358332 4998232 5207195 5678017 5763308 5384237 5081627 5223058 5605923 5927322 6193310
34324 6193310 6431662 6405862 5987859 5536693 5487391 5741219 5892982 5931751 6211967 6734221
34314 6734221 6986774 6677011 6196104 6107120 6487750 7032321 7529369 7945285 8235800 8379885
34304 8379885 8490582 8649852 8742923 8682067 8666232 8948595 9432341 9779420 9877927 9921778
34294 9921778 10037390 10121814 10101912 10091960 10199459 10384086 10597731 10867296 11149045 11308975
34284 11308975 11371563 11586284 12079878 12619197 12929062 13108685 13479555 14090234 14651216
$$ packed form
34354D836970j39152J79915N44372N02256M4665l23812k68102m2038k1078j15093
34344E198903J6634L23180L46892q4063m90985l26195K46417M93238P8339m44028
34334E358332l60100K08963M70822Q5291l79071l02610J41431L82865L21399K65988
34324F193310K38352k5800m18003m51166m9302K53828J51763L8769K80216N22254
34314F734221K52553l09763m80907q8984L80630N44571M97048M15916K90515J44085
34304H379885J10697J59270R3071o0856j5835K82363M83746L47079R8507M3851
34294I921778J15612Q4424j9902r952J07499J84627K13645K69565K81749J59930
34284A1308975O2588K14721M93594N39319L09865J79623L70870O10679N60982
$$ plain form
34275 14651216 14981451 15249126 15649630 16062974 16248177 16284333 16579843 17397941 18535688
34266 18535688 19571086 20323899 20945351 21619740 22365216 23164094 24103638 25247462 26483317
34257 26483317 27677495 28916617 30385934 32023437 33553235 34942301 36556870 38672052
34249 38672052 41053030 43323700 45606930 48401169 51821521 55406929 58871078 62649202
34241 62649202 67331951 72820742 78539374 84418227 91146749 99318436 108793614 119196450
34233 119196450 130664734 143684951 158415577 174668146 192501315 212346877 234440821
34226 234440821 258496046 284032297 310611369 337500582 363405281 386778204 406123930
34219 406123930 419802415 426033019 423776546 413620555 397349081 376620138 352459589
$$ packed form
34275A4651216L30235K67675M00504M13344J85203L6156K95510Q18098J137747
34266A8535688J035398P52813O21452O74389P45476P98878R39544J143824J235855
34257B6483317J194178J239122J469317J637503J529798J389066J614569K115182
34249C8672052K380978K270670K283230K794239L420352L585408L464149L778124
34241F2649202M682749N488791N718632N878853O728522Q171687R475178J0402836
34233A19196450J1468284J3020217J4730626J6252569J7833169J9845562K2093944
34226B34440821K4055225K5536251K6579072K6889213K5904699K3372923J9345726
34219D06123930J3678485O230604k256473j0155991j6271474k0728943k4160549
$$ plain form
34212 352459589 325988125 298932639 272944439 248691734 226028558 204911782 185766644
34205 185766644 168976487 154384256 141463366 129814247 119349074 110066348 101795374
34198 101795374 94225878 87161784 80675137 74951346 70002622 65608445 61551649 57840712
34190 57840712 54648633 52050542 49845364 47657557 45272196 42889210 40947987 39621211
34182 39621211 38583686 37404836 36065169 34905564 34150637 33710868 33403492 33087204 32559857
34173 32559857 31620469 30340552 29043831 27916862 26851987 25742533 24655806 23591860
34165 23591860 22374764 20986904 19736724 18840702 18080299 17168881 16249584 15677150 15439091
34156 15439091 15162873 14647408 14040186 13476811 12867543 12134337 11431710 11011428 10956025
$$ packed form
34212C52459589k6471464k7055486k5988200k4252705k2663176k1116776j9145138
34205A85766644j6790157j4592231j2920890j1649119j0465173r282726q270974
34198A01795374p569496p064094o486647n723791m948724m394177m056796l710937
34190E7840712l192079k598091k205178k187807k385361k382986j941223j326776
34182C9621211j037525j178850j339667j159605p54927m39769l07376l16288n27347
34173C2559857r39388j279917j296721j126969j064875j109454j086727j063946
34165B3591860j217096j387860j250180q96022p60403r11418r19297n72434k38059
34156A5439091k76218n15465o07222n63375o09268p33206p02627m20282n5403
$$ plain form
34147 10956025 11066866 10973162 10454861 9749738 9368536 9446038 9490446 9022284 8233280 7667535
34137 7667535 7461514 7352739 7282518 7409560 7539638 7182222 6355646 5763200 5874055 6324268
34127 6324268 6583402 6731335 7067873 7332463 6984727 6147510 5614187 5790103 6143417
34118 6143417 5972109 5350337 4951240 5107345 5444936 5493577 5317137 5283683 5382293 5169863
34108 5169863 4495795 3909996 4022446 4663563 5092761 4974389 4707477 4740594 5014279 5261428
34098 5261428 5448259 5626117 5655165 5403879 5014637 4679260 4336318 3876101 3468419 3374833
34088 3374833 3557694 3756022 3837474 3830487 3767078 3765994 4073106 4667147 5011621 4642209
34078 4642209 3891640 3544702 3802866 4100314 3997230 3721761 3653250 3764735 3862532 3975894
$$ packed form
34147A0956025J10841r3704n18301p05123l81202P7502M4408m68162p89004n65745
34137G667535k06021j08775p0221J27042J30078l57416q26576n92446J10855M50213
34127F324268K59134J47933L36538K64590l47736q37217n33323J75916L53314
34118F143417j71308o21772l99097J56105L37591M8641j76440l3454R8610k12430
34108E169863o74068n85799J12450O41117M29198j18372k66912L3117K73685K47149
34098E261428J86831J77858K9048k51286l89242l35377l42942m60217m07682r3586
34088C374833J82861J98328Q1452o987o3409j084L07112N94041L44474l69412
34078D642209p50569l46938K58164K97448j03084k75469o8511J11485R7797J13362
$$ plain form
34068 3975894 4168724 4263408 4094894 3826680 3716092 3756036 3817001 3924506 4088946 4084070
34058 4084070 3777763 3510991 3701735 4158156 4269862 3902341 3604811 3780534 4111952
34049 4111952 4090246 3757369 3563110 3709346 3992166 4162783 4124973 3878187 3583673 3595888
34039 3595888 4064660 4550066 4450348 3857147 3530380 3854014 4271061 4075282 3377279 2835337
34029 2835337 2699408 2671012 2598550 2711500 3069797 3314424 3216309 3079378 3292078 3747501
34019 3747501 4009034 3866351 3456336 2982760 2589515 2419913 2547159 2864700 3196807
34010 3196807 3454830 3573970 3450617 3130915 2913295 3016194 3242360 3235442 3007060 2928772
34000 2928772 3209670 3656329 3994627 4179507 4296183 4363030 4356919 4291420 4157292 3894127
$$ packed form
34068C975894J92830R4684j68514k68214j10588L9944O0965J07505J64440m876
34058D084070l06307k66772J90744M56421J11706l67521k97530J75723L31418
34049D111952k1706l32877j94259J46236K82820J70617l7810k46786k94514J2215
34039C595888M68772M85406r9718n93201l26767L23634M17047j95779o98003n41942
34029B835337j35929k8396p2462J12950L58297K44627r8115j36931K12700M55423
34019C747501K61533j42683m10015m73576l93245j69602J27246L17541L32107
34010C196807K58023J19140j23353l19702k17620J02899K26166o918k28382p8288
34000B928772K80898M46659L38298J84880J16676O6847o111o5499j34128k63165
$$ plain form
33990 3894127 3523677 3217483 3109795 3092249 2928035 2588889 2357150 2490711 2858096 3088113
33980 3088113 3095319 3200251 3571844 3839480 3617122 3204506 3239765 3707295 3925094 3657797
33970 3657797 3556053 4116553 4844776 5040080 4906942 5142954 5749115 6081423 5967085
33961 5967085 5938459 6291346 6677966 6835011 7035270 7519183 8051016 8386123 8713653 9285120
33951 9285120 9980838 10560094 11002222 11315626 11350030 11096359 10857767 10825816 10778945 10479808
33941 10479808 10062767 9725598 9347491 8760087 8126713 7687181 7352083 6906515 6408379
33932 6408379 6021023 5636127 5047495 4376347 3965693 3923140 4051603 4143580 4105598 3929916
33922 3929916 3782316 3943425 4409928 4761073 4696814 4458495 4383450 4331789 4008285 3608160
$$ packed form
33990C894127l70450l06194j07688j7546j64214l39146k31739J33561L67385K30017
33980C088113P206J04932L71593K67636k22358m12616L5259M67530K17799k67297
33970C657797j01744N60500P28223J95304j33138K36012O06161L32308j14338
33961E967085k8626L52887L86620J57045K00259M83913N31833L35107L27530N71467
33951I285120O95718N79256M42128L13404L4404k53671k38592l1951m6871k99137
33941A0479808m17041l37169l78107n87404o33374m39532l35098m45568m98136
33932F408379l87356l84896n88632o71148m10654m2553J28463R1977l7982j75682
33922C929916j47600J61109M66503L51145o4259k38319p5045n1661l23504m00125
$$ plain form
33912 3608160 3581640 3878011 4000998 3789912 3577239 3522370 3360323 2967170 2653764 2656640
33902 2656640 2773525 2783458 2856313 3215546 3667497 3813250 3579520 3253134 3081299 3079643
33892 3079643 3186331 3386965 3648022 3843919 3819498 3534114 3133641 2818200 2606126 2333771
33882 2333771 1963061 1726343 1795526 1967991 1944838 1813725 1930827 2348039 2698505 2718903
33872 2718903 2584459 2591802 2731869 2731051 2395375 1825296 1369795 1372110 1850005 2447187 2805135
33861 2805135 2898409 2867490 2692266 2304502 1892846 1736231 1775644 1716363 1558615 1640347
33851 1640347 2075693 2515119 2607336 2411616 2213310 2172493 2273019 2410043 2445166 2358838
33841 2358838 2358443 2618487 2957190 3055382 2935674 2870061 2874855 2740139 2534532 2554975 2726731
$$ packed form
33912C608160k6520K96371J22987k11086k12673n4869j62047l93153l13406K876
33902B656640J16885R933P2855L59233M51951J45753k33730l26386j71835j656
33892C079643J06688K00634K61057J95897k4421k85384m00473l15441k12074k72355
33882B333771l70710k36718O9183J72465k3153j31113J17102M17212L50466K0398
33872B718903j34444P343J40067q18l35676n70079m55501K315M77895N97182L57948
33861B805135R3274l0919j75224l87764m11656j56615L9413n9281j57748Q1732
33851A640347M35346M39426R2217j95720j98306m0817J00526J37024L5123q6328
33841B358838l95K60044L38703R8192j19708o5613M794j34716k05607K0443J71756
$$ plain form
33830 2726731 2631038 2260533 2133745 2433167 2661970 2492908 2337100 2616612 3034160 3099261
33820 3099261 2885583 2683627 2359694 1728274 1183761 1226663 1626158 1793674 1781179 2116329
33810 2116329 2759142 3070148 2864539 2683466 2840345 2952651 2704307 2392734 2342389 2353163
33800 2353163 2163933 1988524 2125637 2407072 2500176 2468728 2568037 2707097 2602520 2348156
33790 2348156 2354266 2722418 3097035 3216428 3254950 3456827 3704194 3697627 3445927 3323240
33780 3323240 3608247 4145979 4580483 4810703 5030847 5340885 5549202 5468783 5222500 5084454
33770 5084454 5152162 5355491 5657854 6019584 6259253 6212055 5984099 5812642 5725367 5597529
33760 5597529 5490708 5604738 5871608 5933483 5626690 5209630 4996715 5013137 5120570 5237425
$$ packed form
33830B726731r5693l70505j26788K99422K28803j69062j55808K79512M17548O5101
33820C099261k13678k01956l23933o31420n44513M2902L99495J67516j2495L35150
33810B116329O42813L11006k05609j81073J56879J12306k48344l11573n0345J0774
33800B353163j89230j75409J37113K81435R3104l1448R9309J39060j04577k54364
33790B348156O110L68152L74617J19393L8522K01877K47367o567k51700j22687
33780C323240K85007N37732M34504K30220K20144L10038K08317q0419k46283j38046
33770E084454O7708K03329L02363L61730K39669m7198k27956j71457q7275j27838
33760E597529j06821J14030K66870O1875l06793m17060k12915J6422J07433J16855
$$ plain form
33750 5237425 5305345 5265668 5207499 5334416 5657588 5922239 5947538 5812017 5589058 5184082
33740 5184082 4631312 4273915 4351987 4592015 4521426 4099527 3743192 3751008 3957703 3997351
33730 3997351 3726502 3323274 3066341 3067264 3204652 3324083 3452388 3701592 3993279 4075348
33720 4075348 3850120 3480866 3117287 2759912 2490220 2535857 2907000 3232702 3216322 3033728
33710 3033728 3003784 3080385 3004642 2778400 2599326 2453735 2204989 2028579 2288055 2918800
33700 2918800 3372389 3316341 3018291 2872972 2904550 2949299 2995693 3056774 2965771 2616954
33690 2616954 2233107 2097462 2165392 2229139 2315333 2569020 2838007 2777491 2393736 2110790
33680 2110790 2194780 2441960 2584727 2687000 2897747 3066735 2929110 2561636 2357805 2555482
$$ packed form
33750E237425O7920l9677n8169J26917L23172K64651K5299j35521k22959m04976
33740E184082n52770l57397P8072K40028p0589m21899l56335P816K06695L9648
33730C997351k70849m03228k56933R23J37388J19431J28305K49204K91687Q2069
33720D075348k25228l69254l63579l57375k69692M5637L71143L25702j6380j82594
33710C033728k9944P6601p5743k26242j79074j45591k48746j76410K59476O30745
33700B918800M53589n6048k98050j45319L1578M4749M6394O1081r1003l48817
33690B616954l83847j35645O7930O3747Q6194K53687K68987o0516l83755k82946
33680B110790Q3990K47180J42767J02273K10747J68988j37625l67474k03831J97677
$$ plain form
33670 2555482 2993768 3332479 3351770 3067580 2720987 2624115 2841706 3049541 2885214 2408996
33660 2408996 2023784 1975115 2157684 2379454 2527847 2475563 2176092 1935606 2212847 2972073
33650 2972073 3587277 3617982 3332157 3179210 3127644 2945189 2798812 3004485 3356968 3319020
33640 3319020 2851147 2478074 2473836 2537936 2414753 2291852 2354504 2431974 2374363 2346651 2424819
33629 2424819 2315576 1880221 1575972 1883668 2537230 2841865 2632666 2400365 2486646 2669715
33619 2669715 2675701 2657134 2882558 3211862 3215262 2778177 2336562 2386255 2853251 3145297
33609 3145297 2900608 2487036 2514077 2974234 3255840 3030383 2673452 2612445 2699243 2580810
33599 2580810 2328137 2235534 2248038 2107356 1923541 2051488 2425401 2560750 2299886 2044653
$$ packed form
33670B555482M38286L38711J9291k84190l46593r6872K17591K07835j64327m76218
33660B408996l85212m8669J82569K21770J48393n2284k99471k40486K77241P59226
33650B972073O15204L0705k85825j52947n1566j82455j46377K05673L52483l7948
33640C319020m67873l73073m238O4100j23183j22901O2652P7470n7611k7712P8168
33629B424819j09243m35355l04249L07696O53562L04635k09199k32301Q6281J83069
33619B669715N986j8567K25424L29304L400m37085m41615M9693M66996K92046
33609C145297k44689m13572K7041M60157K81606k25457l56931o1007Q6798j18433
33599B580810k52673r2603J2504j40682j83815J27947L73913J35349k60864k55233
$$ plain form
33589 2044653 2078795 2138860 1935186 1692226 1785471 2103092 2194465 1958167 1793077 2014924
33579 2014924 2413660 2540573 2285276 1993121 2023435 2326168 2538553 2435340 2153739 1973166
33569 1973166 2016798 2213577 2400357 2389073 2104805 1758096 1683570 1876855 1935801 1660077
33559 1660077 1422698 1624113 2041123 2165039 2010990 2060897 2455596 2801437 2852006 2850641
33549 2850641 3024001 3204884 3187469 3065451 2994527 2976020 3063492 3376328 3684542 3446328
33539 3446328 2605825 1923448 2064614 2704313 3029139 2844386 2628761 2681719 2821634 2883776
33529 2883776 2941119 2955496 2708269 2226625 1877022 1870671 2008094 2068195 2142011 2398037
33519 2398037 2768342 3054744 3162392 3090732 2874821 2656052 2620107 2732079 2714192 2428788
$$ packed form
33589B044653L4142O0065k03674k42960R3245L17621R1373k36298j65090K21847
33579B014924L98736J26913k55297k92155L0314L02733K12385j03213k81601j80573
33569A973166M3632J96779J86780j1284k84268l46709p4526J93285N8946k75724
33559A660077k37379K01415M17010J23916j54049M9907L94699L45841N0569j365
33549B850641J73360J80883j7415j22018p0924j8507Q7472L12836L08214k38214
33539C446328q40503o82377J41166O39699L24826j84753k15625N2958J39915O2142
33529B883776N7343J4377k47227m81644l49603o351J37423O0101P3816K56026
33519B398037L70305K86402J07648p1660k15911k18769l5945J11972j7887k85404
$$ plain form
33509 2428788 2114581 2088101 2362662 2727562 3058076 3336650 3460565 3277884 2849510 2511154
33499 2511154 2582931 3047992 3536641 3623859 3188239 2528439 2112209 2183438 2619733 3141236
33489 3141236 3571010 3877882 4076918 4178487 4193781 4116582 3909972 3559470 3141933 2814328
33479 2814328 2711532 2828513 2994649 3010469 2854852 2722244 2800352 3041850 3213762 3140401
33469 3140401 2844701 2509690 2379901 2620494 3130996 3534594 3508768 3131857 2770341 2633982
33459 2633982 2607274 2535144 2478138 2589054 2873892 3178528 3325362 3203085 2830073 2402509
33449 2402509 2179680 2243655 2447319 2631558 2768663 2845542 2778560 2563965 2371114 2338589
33439 2338589 2383759 2359050 2295136 2323749 2437719 2502830 2459966 2357185 2234015 2140822 2212181
$$ packed form
33509B428788l14207k6480K74561L64900L30514K78574J23915j82681m28374l38356
33499B511154P1777M65061M88649Q7218m35620o59800m16230P1229M36295N21503
33489C141236M29774L06872J99036J01569J5294p7199k06610l50502m17537l27605
33479B814328j02796J16981J66136J5820j55617j32608P8108K41498J71912p3361
33469C140401k95700l35011j29789K40593N10502M03598k5826l76911l61516j36359
33459B633982k6708p2130n7006J10916K84838L04636J46834j22277l73012m27564
33449B402509k22829O3975K03664J84239J37105P6879o6982k14595j92851l2525
33439B338589M5170k4709o3914K8613J13970O5111m2864j02781j23170r3193P1359
$$ plain form
33428 2212181 2508505 2804776 2773629 2426809 2162028 2275082 2588722 2673957 2323972 1726318
33418 1726318 1274070 1271509 1701230 2202483 2396228 2297862 2264410 2464155 2617598 2442849
33408 2442849 2148426 2171194 2509008 2674605 2386152 1988868 1985280 2340319 2522070 2200208
33398 2200208 1673700 1510770 1882377 2389935 2548288 2315324 2055988 2059549 2257003 2426720
33388 2426720 2482104 2437783 2261769 1964703 1736021 1761221 1951581 2089948 2206113 2510258
33378 2510258 2926382 3044295 2703248 2324624 2404719 2877191 3255788 3276473 3117476 3059908
33368 3059908 3210209 3549931 4017527 4493527 4854887 5058353 5078882 4851339 4422105 4047642
33358 4047642 3931472 3950670 3869769 3721645 3689135 3700486 3509971 3162127 2977780 3030039
$$ packed form
33428B212181K96324K96271l1147l46820k64781J13054L13640Q5235l49985n97654
33418A726318m52248k561M29721N01253J93745r8366l3452J99745J53443j74749
33408B442849k94423K2768L37814J65597k88453l97284l588L55039J81751l21862
33398B200208n26508j62930L71607N07558J58353k32964k59336L561J97454J69717
33388B426720N5384m4321j76014k97066k28682K5200J90360J38367J16165L04145
33378B510258M16124J17913l41047l78624Q0095M72472L78597K0685j58997n7568
33368C059908J50301L39722M67596M76000L61360K03466K0529k27543m29234l74463
33358D047642j16170J9198q0901j48124l2510J1351j90515l47844j84347N2259
$$ plain form
33348 3030039 3047065 2936887 2954070 3141869 3079853 2539280 1991613 1997895 2368213 2450379
33338 2450379 2097493 1791467 1821925 1897411 1721670 1491256 1552515 1883469 2210678 2434827
33328 2434827 2649105 2850044 2911614 2828145 2748626 2725825 2627875 2410710 2325921 2642200
33318 2642200 3175408 3343513 2848184 2140927 1958412 2447517 3033208 3171540 2904531
33309 2904531 2545896 2175329 1738069 1385135 1322703 1433437 1419858 1292906 1365916 1734648
33299 1734648 2096760 2180898 2069370 1968960 1911962 1851306 1859327 2037410 2329657 2579194
33289 2579194 2710685 2749998 2715492 2588490 2380175 2171665 2068396 2094602 2129687 2020277
33279 2020277 1797306 1683787 1810469 2039497 2174759 2206866 2208279 2155313 2059053 2097269
$$ packed form
33348C030039J7026j10178J7183J87799o2016n40573n47667O282L70318Q2166
33338B450379l52886l06026L0458P5486j75741k30414O1259L30954L27209K24149
33328B434827K14278K00939O1570q3469p9519k2801r7950k17165q4789L16279
33318B642200N33208J68105m95329p07257j82515M89105N85691J38332k67009
33309B904531l58635l70567m37260l52934o2432J10734j3579j26952P3010L68732
33299A734648L62112Q4138j11528j00410n6998o0656Q021J78083K92247K49537
33289B579194J31491L9313l4506j27002k08315k08510j03269K6206L5085j09410
33279B020277k22971j13519J26682K29028J35262L2107J413n2966r6260L8216
$$ plain form
33269 2097269 2341773 2512976 2342726 2051929 2070434 2374104 2562648 2557534 2677968 2950752
33259 2950752 2939772 2501014 2161743 2382258 2882805 3123344 3082340 3083122 3130162 2953746
33249 2953746 2583055 2372596 2462227 2606472 2577730 2432593 2334498 2345773 2431902 2518367
33239 2518367 2550544 2578131 2678803 2746867 2587562 2315416 2308868 2564091 2527358 1950025
33229 1950025 1477210 1809220 2595858 2867738 2402305 1896929 1795754 1749617 1439878 1204066
33219 1204066 1465480 2087317 2678405 3097301 3292302 3064718 2409237 1767491 1547878
33210 1547878 1648362 1780614 1964290 2323966 2674921 2734826 2549674 2328784 2061685 1689444
33200 1689444 1438545 1531599 1740340 1717161 1638173 1961532 2580927 2808843 2318540 1584783
$$ packed form
33269B097269K44504J71203j70250k90797J8505L03670J88544n114J20434K72784
33259B950752j0980m38758l39271K20515N00547K40539m1004P82M7040j76416
33249B953746l70691k10459Q9631J44245k8742j45137r8095J1275Q6129Q6465
33239B518367L2177K7587J00672O8064j59305k72146o548K55223l6733n77333
33229A950025m72815L32010P86638K71880m65433n05376j01175m6137l09739k35812
33219A204066K61414O21837N91088M18896J95001k27584o55481o41746k19613
33210A547878J00484J32252J83676L59676L50955N9905j85152k20890k67099l72241
33200A689444k50899R3054K08741k3179p8988L23359O19395K27916m90303p33757
$$ plain form
33190 1584783 1191968 1152388 1165161 1169221 1311450 1604264 1904601 2089296 2068013 1806360
33180 1806360 1513122 1582623 2106602 2620044 2609733 2164476 1845400 1973173 2321165 2516941
33170 2516941 2480742 2373243 2302913 2236019 2117001 1941863 1703004 1354086 913396 586718
33160 586718 655840 1137317 1641925 1757851 1554230 1491609 1800030 2194451 2325023 2259949
33150 2259949 2297752 2477815 2557061 2399593 2133800 1934521 1849898 1833023 1778597 1575521
33140 1575521 1302466 1285881 1718973 2299978 2565759 2549321 2713439 3182148 3497634 3343844
33130 3343844 3070375 3146071 3447976 3546048 3440433 3478459 3652854 3560102 3109243 2731664
33120 2731664 2701283 2712850 2414649 1981789 1818741 1971422 2193108 2383323 2583826 2686546
$$ packed form
33190A584783l92815l9580J2773M060J42229K92814L00337J84695k1283k61653
33180A806360k93238O9501N23979N13442j0311m45257l19076J27773L47992J95776
33170B516941l6199j07499p0330o6894j19018j75138k38859l48918m40690l26678
33160E86718O9122M81477N04608J15926k03621o2621L08421L94421J30572o5074
33150B259949L7803J80063P9246j57468k65793j99279q4623j6875n4426k03076
33140A575521k73055j6585M33092N81005K65781j6438J64118M68709L15486j53790
33130C343844k73469P5696L01905R8072j05615L8026J74395r2752m50859l77579
33120B731664l0381J1567k98201m32860j63048J52681K21686J90215K00503J02720
$$ plain form
33110 2686546 2548897 2339484 2378232 2628122 2722475 2552408 2440935 2587474 2700523 2436136
33100 2436136 1937675 1640712 1700820 1898891 2009669 1987113 1850254 1672885 1673114 2019241
33090 2019241 2492691 2621126 2265188 1834645 1760980 1963536 2049098 1875321 1651299 1565759
33080 1565759 1595406 1672224 1778081 1836344 1761791 1692916 1914524 2406230 2707122 2447226
33070 2447226 1844281 1439015 1469120 1757240 2103735 2471569 2806720 3000443 3096214 3264079
33060 3264079 3484479 3515645 3291232 3095849 3164526 3303639 3118930 2509130 1776543 1342230
33050 1342230 1450820 2006082 2572733 2701395 2390543 2058736 1939895 1775346 1337297
33041 1337297 958150 1126216 1721782 2131126 2090054 1941383 1981516 2023173 1822731 1552896
$$ packed form
33110B686546j37649k09413L8748K49890R4353j70067j11473J46539J13049k64387
33100B436136m98461k96963O0108J98071J10778k2556j36859j77369K29L46127
33090B019241M73450J28435l55938m30543p3665K02556Q5562j73777k24022q5540
33080A565759K9647P6818J05857N8263p4553o8875K21608M91706L00892k59896
33070B447226o02945m05266L0105K88120L46495L67834L35151J93723R5771J67865
33060C264079K20400L1166k24413j95383O8677J39113j84709o09800p32587m34313
33050A342230J08590N55262N66651J28662l10852l31807j18841j64549m38049
33041A337297l79147J68066N95566M09344m1072j48671M0133M1657k00442k69835
$$ plain form
33031 1552896 1529920 1715425 1819684 1767908 1756207 1886176 2012313 1997059 1930953 2008914
33021 2008914 2271085 2541557 2615056 2472136 2283392 2202110 2211847 2215327 2185966 2138661 2039283
33010 2039283 1885659 1806198 1900922 2039058 2020993 1902685 1917423 2087055 2187647 2130649
33000 2130649 2073760 2069238 1922648 1559558 1237126 1180334 1264054 1291565 1350497 1611389 1962593
32989 1962593 2147488 2129692 2036990 1873233 1600405 1409005 1555155 1940473 2168379 2046490
32979 2046490 1764868 1555936 1451669 1414740 1422015 1335988 981200 495968 353316 810340
32969 810340 1495635 1779161 1490266 1072414 1031878 1394919 1760298 1779591 1486209 1171070
32959 1171070 1041542 1084064 1208463 1378249 1556011 1660859 1686284 1758192 1949311 2113203
$$ packed form
33031A552896k2976J85505J04259n1776j1701J29969J26137j5254o6106P7961
33021B008914K62171K70472P3499j42920j88744q1282R737L480k9361m7305r9378
33010B039283j53624p9461R4724J38136j8065j18308J4738J69632J00592n6998
33000B130649n6889m522j46590l63090l22432n6792Q3720K7511N8932K60892L51204
32989A962593J84895j7796r2702j63757k72828j91400J46150L85318K27906j21889
32979B046490k81622k08932j04267l6929P275q6027l54788m85232j42652M57024
32969H10340O85295K83526k88895m17852m0536L63041L65379J9293k93382l15139
32959A171070j29528M2522J24399J69786J77762J04848K5425P1908J91119J63892
$$ plain form
32949 2113203 2042674 1746568 1443289 1322271 1424217 1686676 1959490 2033750 1830313 1538470
32939 1538470 1413908 1472687 1550772 1614666 1781235 2024976 2127766 2016748 1928581 2075898
32929 2075898 2308966 2313364 2074775 1925113 2066136 2209713 1876802 1059768 398981 531737
32919 531737 1344908 2092837 2251149 2000347 1810295 1861217 2060397 2336014 2610754 2684622
32909 2684622 2475315 2243826 2271558 2451115 2534628 2628245 2992656 3433747 3413075 2829083
32899 2829083 2210314 1996650 2064997 2135760 2204661 2305895 2231031 1830720 1351005 1161979
32889 1161979 1319130 1619672 1911121 2132513 2228474 2222592 2219003 2190822 1972909 1590979
32879 1590979 1331390 1331315 1407312 1471460 1744136 2283543 2701591 2732572 2720503 3060513 3467084
$$ packed form
32949B113203p0529k96106l03279j21018J01946K62459K72814P4260k03437k91843
32939A538470j24562N8779P8085O3894J66569K43741J02790j11018q8167J47317
32929B075898K33068M398k38589j49662J41023J43577l32911q17034o60787J32756
32919E31737Q13171P47929J58312k50802j90052N0922J99180K75617K74740P3868
32909B684622k09307k31489K7732J79557Q3513R3617L64411M41091k0672n83992
32899B829083o18769k13664O8347P0763O8901J01234p4864m00311m79715j89026
32889A161979J57151L00542K91449K21392R5961n882l589k8181k17913l81930
32879A590979k59589p5P5997O4148K72676N39407M18048L0981j2069L40010M06571
$$ plain form
32868 3467084 3385336 2932458 2773600 3098450 3371152 3217656 2984336 3165828 3717076 4233302
32858 4233302 4522837 4726671 5037753 5488919 5910414 6030205 5770689 5465508 5562875 6071471
32848 6071471 6534402 6610544 6443605 6385787 6600827 7031227 7514184 7804585 7695922 7264356
32838 7264356 6845318 6670532 6661392 6621137 6451165 6134169 5710236 5339844 5197890 5236606
32828 5236606 5227317 5068544 4859627 4673611 4510563 4475700 4683582 4936229 4848867 4402270
32818 4402270 4018569 3955259 3999914 3942447 3932024 4079198 4091092 3690731 3123044 2855118
32808 2855118 2978716 3254416 3528538 3742250 3750711 3548440 3487729 3832388 4255740 4259437
32798 4259437 3956691 3896228 4168902 4285099 3998208 3660503 3592960 3643751 3609281 3583602
$$ packed form
32868C467084q1748m52878j58858L24850K72702j53496k33320J81492N51248N16226
32858D233302K89535K03834L11082M51166M21495J19791k59516l05181R7367N08596
32848F071471M62931P6142j66939n7818K15040M30400M82957K90401j08663m31566
32838G264356m19038j74786r140m0255j69972l16996m23933l70392j41954L8716
32828E236606r289j58773k08917j86016j63048l4863K07882K52647q7362m46597
32818D402270l83701o3310M4655n7467j0423J47174J1894m00361n67687k67926
32808B855118J23598K75700K74122K13712Q461k02271o0711L44659M23352L697
32798D259437l02746o0463K72674J16197k86891l37705o7543N0791l4470k5679
$$ plain form
32788 3583602 3580408 3291286 2639468 2176160 2411189 3000333 3131116 2600234 2007372 1906483
32778 1906483 2243812 2703109 3151120 3537930 3692277 3487464 3043091 2568737 2139155
32769 2139155 1775254 1594193 1677623 1886034 2008327 2045875 2149970 2306412 2318824 2158672
32759 2158672 2101447 2368711 2804595 3100299 3215154 3326544 3424598 3275999 2865466 2567872
32749 2567872 2679400 2999390 3133807 3047914 2998394 3008469 2803881 2332806 1978460 2052617
32739 2052617 2343729 2425307 2241736 2112077 2241474 2504396 2703108 2793020 2799761 2718529
32729 2718529 2589970 2522206 2529982 2473525 2283015 2149535 2323389 2738669 3010673 2883434
32719 2883434 2563045 2473028 2721690 2973034 2889891 2553637 2316191 2340240 2477604 2569924
$$ packed form
32788C583602l194k89122o51818m63308K35029N89144J30783n30882n92862j00889
32778A906483L37329M59297M48011L86810J54347k04813m44373m74354m29582
32769B139155l63901j81061Q3430K08411J22293L7548J04095J56442J2412j60152
32759B158672n7225K67264M35884K95704J14855J11390R8054j48599m10533k97594
32749B567872J11528L19990J34417q5893m9520J0075k04588m71075l54346P4157
32739B052617K91112Q1578j83571j29659J29397K62922J98712Q9912O741q1232
32729B718529j28559o7764P776n6457j90510j33480J73854M15280K72004j27239
32719B883434l20389r0017K48662K51344q3143l36254k37446K4049J37364R2320
$$ plain form
32709 2569924 2638879 2714758 2696065 2529376 2365952 2358444 2431782 2461254 2545989 2809236 2999067
32698 2999067 2693592 2010270 1709087 2284044 3211399 3500140 2897272 2143061 1994090
32689 1994090 2393272 2800237 3003615 3227193 3552953 3660596 3282679 2668230 2361091
32680 2361091 2581331 3007547 3187567 3024640 2784072 2715354 2803823 2898162 2948423 3007745
32670 3007745 3044329 2899658 2513274 2117580 2075826 2477589 2971729 3103427 2818134 2530350
32660 2530350 2637513 3060927 3387345 3397386 3260621 3203016 3231952 3316144 3580103 4037084
32650 4037084 4290592 3891811 3000107 2309750 2201331 2311115 2144171 1788078 1689848 1943222
32640 1943222 2189952 2154199 1925059 1718918 1669384 1859370 2256020 2582142 2565332 2376766
$$ packed form
32709B569924O8955P5879j8693j66689j63424p508P3338K9472Q4735K63247J89831
32698B999067l05475o83322l01183N74957R27355K88741o02868p54211j48971
32689A994090L99182M06965K03378K23578L25760J07643l77917o14449l07139
32680B361091K20240M26216J80020j62927k40568o8718Q8469R4339N0261N9322
32670C007745L6584j44671l86384l95694m1754M01763M94140J31698k85293k87784
32660B530350J07163M23414L26418J0041j36765n7605K8936Q4192K63959M56981
32650D037084K53508l98781q91704o90357j08419J09784j66944l56093r8230K53374
32640A943222K46730l5753k29140k06141m9534J89986L96650L26122j6810j88566
$$ plain form
32630 2376766 2484696 2948421 3217394 2873123 2268695 2093626 2485519 2930912 2972795 2677479
32620 2677479 2383447 2282071 2344520 2456553 2494660 2373217 2117440 1857705 1722958 1765188
32610 1765188 1963923 2242416 2491901 2629842 2620070 2430792 2064405 1670072 1490796 1588957
32600 1588957 1745954 1774301 1802694 2054776 2448948 2680687 2674260 2665791 2772429 2746097 2324483
32589 2324483 1663475 1226177 1290717 1699860 2081605 2217249 2172486 2127789 2147725 2155958
32579 2155958 2103880 2058966 2086174 2146069 2187040 2234440 2285492 2228827 2012897 1792138 1729060
32568 1729060 1738851 1637827 1478514 1497020 1746602 2013762 2098304 1965752 1649369 1250732
32558 1250732 1015676 1113974 1331482 1302467 1082634 1120345 1565644 2018088 2142475 2119708
$$ packed form
32630B376766J07930M63725K68973l44271o04428j75069L91893M45393M1883k95316
32620B677479k94032j01376O2449J12033L8107j21443k55777k59735j34747M2230
32610A765188J98735K78493K49485J37941r772j89278l66387l94333j79276R8161
32600A588957J56997K8347K8393K52082L94172K31739o427q469J06638k6332m21614
32589B324483o61008m37298O4540M09143L81745J35644m4763m4697J9936Q233
32579B155958n2078m4914K7208N9895M0971M7400N1052n6665k15930k20759o3078
32568A729060R791j01024j59313J8506K49582K67160Q4542j32552l16383l98637
32558A250732k35056R8298K17508k9015k19833L7711M45299M52444J24387k2767
$$ plain form
32548 2119708 2214743 2302909 2207918 2157033 2403992 2633168 2296272 1464208 818635 775660
32538 775660 1100069 1466769 1911484 2503254 2972397 3003226 2691780 2417308 2348583 2300826
32528 2300826 2053181 1643609 1312307 1211169 1218832 1108037 909035 954116 1423988 1997897
32518 1997897 2192903 1965086 1701684 1670273 1794796 1974734 2260411 2614214 2830097 2832908
32508 2832908 2762974 2632138 2238804 1625365 1256106 1417193 1729847 1648324 1237690 1036888
32498 1036888 1268363 1612688 1731400 1600944 1306743 919151 679219 921921 1609598
32489 1609598 2222982 2334168 2080989 1880460 1874156 1887285 1778834 1570202 1309207 1054092
32479 1054092 957765 1130166 1402925 1455933 1253329 1168105 1543466 2242077 2770437 2804325
$$ packed form
32548B119708R5035Q8166r4991n0885K46959K29176l36896q32064o45573m2975
32538G75660L24409L66700M44715N91770M69143L0829l11446k74472o8725m7757
32528B300826k47645m09572l31302j01138P663j10795j99002M5081M69872N73909
32518A997897J95006k27817k63402l1411J24523J79938K85677L53803K15883K811
32508B832908o9934j30836l93334o13439l69259J61087L12654q1523m10634k00802
32498A036888K31475L44325J18712j30456k94201l87592k39932K42702O87677
32489A609598O13384J11186k53179k00529o304J3129j08451k08632k60995k55115
32479A054092r6327J72401K72759N3008k02604q5224L75361O98611N28360L3888
$$ plain form
32469 2804325 2474192 2150155 2067005 2195103 2373845 2463039 2381615 2118500 1797286 1694513
32459 1694513 2059445 2816736 3492947 3578712 3031249 2337705 1994644 1997037 1979117 1806843
32449 1806843 1783156 2160941 2679686 2845362 2588751 2359062 2516594 2874530 2969019 2610908
32439 2610908 2016464 1508555 1252357 1225151 1296514 1347535 1400889 1606011 2028369 2510361
32429 2510361 2817670 2857812 2682685 2384196 2107355 2048351 2250963 2468115 2418986 2145071
32419 2145071 1917740 1838901 1778739 1700875 1750539 1934233 2002182 1821957 1630259 1688691
32409 1688691 1872774 1867347 1651985 1497309 1504029 1429555 1050582 497879 112053 61537
32399 61537 177748 114601 -354776 -1145789 -1957442 -2586604 -3079320 -3494469 -3650680 -3334447
$$ packed form
32469B804325l30133l24037q3150J28098J78742Q9194q1424k63115l21214j02773
32459A694513L64932P57291O76211Q5765n47463o93544l43061K393j7920j72274
32449A806843k3687L77785N18745J65676k56611k29689J57532L57936R4489l58111
32439B610908n94444n07909k56198k7206P1363N1021N3354K05122M22358M81992
32429B510361L07309M0142j75127k98489k76841n9004K02612K17152m9129k73915
32419B145071k27331p8839o0162p7864M9664J83694O7949j80225j91698N8432
32409A688691J84083n427k15362j54676O720p4474l78973n52703l85826n0516
32399F1537J16211o3147m69377p91013q11653o29162m92716m15149j56211L16233
$$ plain form
32389 -3334447 -2722524 -2315080 -2355070 -2546013 -2493191 -2218367 -2020235 -1976710 -1876756 -1619144
32379 -1619144 -1396649 -1392063 -1485676 -1400619 -1037715 -553895 -170961 -1448 -20110 -107735
32369 -107735 -115377 53922 385325 745617 919522 720214 194715 -264613 -178330 513376
32359 513376 1279582 1490793 1080204 596157 587443 1053035 1542320 1700464 1626565 1703292
32349 1703292 2109749 2543723 2516715 1967802 1437426 1451650 1843204 1980671 1656067 1348330
32339 1348330 1449033 1647688 1464961 1082332 1086385 1494998 1658402 1249927 776471 796762
32329 796762 1110123 1165799 932972 829037 973434 1086232 1099581 1314243 1830063 2298253
32319 2298253 2440232 2412625 2421293 2339366 2006412 1600324 1377661 1297902 1251343 1398430
$$ packed form
32389c334447O11923M07444l9990j90943N2822K74824J98132M3525R9954K57612
32379a619144K22495M586r3613Q5057L62904M83820L82934J69513j8662q7625
32369a07735p642J69299L31403L60292J73905j99308n25499m59328Q6283O91706
32359E13376P66206K11211m10589m84047q714M65592M89285J58144p3899P6727
32349A703292M06457M33974k7008n48913n30376J4224L91554J37467l24604l07737
32339A348330J00703J98655j82727l82629M053M08613J63404m08475m73456K0291
32329G96762L13361N5676k32827j03935J44397J12798J3349K14662N15820M68190
32319B298253J41979k7607Q668q1927l32954m06088k22663p9759m6559J47087
$$ plain form
32309 1398430 1836853 2132991 1745719 881180 364573 570697 1012174 1158910 1115082 1166624
32299 1166624 1181787 970286 860035 1282669 1953326 2111355 1593655 1070963 1072751 1327344
32289 1327344 1341773 1153482 1090879 1123210 947389 582376 408252 602986 918984 1100590
32279 1100590 1213892 1422150 1662573 1729653 1576691 1401798 1461266 1825916 2270069 2432850
32269 2432850 2208665 1945527 2073030 2529968 2801071 2604189 2272201 2246867 2418581 2300507
32259 2300507 1773395 1284616 1225349 1422717 1444868 1192922 933104 861548 934474 1118204
32249 1118204 1486724 1936790 2084276 1724819 1250100 1254363 1731588 2040487 1813539 1529234
32239 1529234 1833756 2539766 2804225 2294889 1665884 1653614 2115195 2351718 2131650 1900907
$$ packed form
32309A398430M38423K96138l87272q64539n16607K06124M41477J46736m3828N1542
32299A166624J5163k11501j10251M22634O70657J58029n17700n22692J788K54593
32289A327344J4429j88291o2603L2331j75821l65013j74124J94734L15998J81606
32279A100590J13302K08258K40423O7080j52962j74893N9468L64650M44153J62781
32269B432850k24185k63138J27503M56938K71103j96882l31988k5334J71714j18074
32259B300507n27112m88779n9267J97368K2151k51946k59818p1556P2926J83730
32249A118204L68520M50066J47486l59457m74719M263M77225L08899k26948k84305
32239A529234L04522P06010K64459n09336o29005j2270M61581K36523k20068k30743
$$ plain form
32229 1900907 2010005 2217957 2153920 1923820 1937507 2279446 2566885 2444700 1988198 1534027
32219 1534027 1281485 1199938 1237825 1437548 1806482 2203627 2453976 2522498 2485055 2371021
32209 2371021 2159783 1926336 1828878 1877882 1857591 1610286 1301355 1228671 1413098 1581211
32199 1581211 1582538 1607388 1848469 2101574 1953627 1385739 960545 1225128 2006751 2532578
32189 2532578 2319078 1737521 1503149 1754007 1971885 1820050 1645805 1908677 2430326
32180 2430326 2619015 2298428 1876039 1695547 1662435 1626649 1708695 1980873 2151008 1912682
32170 1912682 1415618 1045186 872192 694059 552026 772321 1394936 1939788 1975363 1680877
32160 1680877 1578631 1843396 2153491 2191463 2020194 1876461 1798744 1643829 1387468 1199196
$$ packed form
32229A900907J09098K07952o4037k30100J3687L41939K87439j22185m56502m54171
32219A534027k52542q1547L7887J99723L68934L97145K50349O8522l7443j14034
32209B371021k11238k33447r7458M9004k0291k47305l08931p2684J84427J68113
32199A581211J327K4850K41081K53105j47947n67888m25194K64583P81623N25827
32189B532578k13500n81557k34372K50858K17878j51835j74245K62872N21649
32180B430326J88689l20587m22389j80492l3112l5786Q2046K72178J70135k38326
32170A912682m97064l70432j72994j78133j42033K20295O22615N44852L5575k94486
32160A680877j02246K64765L10095L7972j71269j43733p7717j54915k56361j88272
$$ plain form
32150 1199196 1183792 1224276 1196364 1203791 1411554 1711209 1795062 1602223 1458635 1657012
32140 1657012 2092160 2469447 2697751 2863132 2948963 2849131 2612115 2425574 2360745 2345391
32130 2345391 2383763 2571430 2862683 3046994 3012159 2835228 2580456 2239360 1923906 1845246
32120 1845246 1978259 2009731 1790659 1593667 1705864 1995231 2152678 2172925 2265669 2410212
32110 2410212 2363993 2095258 1873233 1885833 2053278 2269038 2528326 2718890 2581730 2071443
32100 2071443 1545583 1387744 1577446 1807347 1894885 1882693 1833360 1752766 1699862 1785066
32090 1785066 2028005 2327757 2573182 2687230 2599689 2316673 2012858 1909871 2033382 2209336
32080 2209336 2315744 2387877 2430659 2315643 2003320 1722206 1721941 1915736 1991842 1875691
$$ packed form
32150A199196j5404M0484k7912P427K07763K99655Q3853j92839j43588J98377
32140A657012M35148L77287K28304J65381Q5831r9832k37016j86541o4829j5354
32130B345391L8372J87667K91253J84311l4835j76931k54772l41096l15454p8660
32120A845246J33013L1472k19072j96992J12197K89367J57447K0247R2744J44543
32110B410212m6219k68735k22025J2600J67445K15760K59288J90564j37160n10287
32100B071443n25860j57839J89702K29901Q7538j2192m9333q0594n2904Q5204
32090A785066K42939K99752K45425J14048q7541k83016l03815j02987J23511J75954
32080B209336J06408P2133M2782j15016l12323k81114k65J93795P6106j16151
$$ plain form
32070 1875691 1837144 2056398 2317452 2313323 2086255 1924895 1916843 1874746 1696873 1527495
32060 1527495 1491935 1518964 1542144 1653435 1895975 2096327 2092494 1967581 1863484 1740518
32050 1740518 1568111 1570214 1932457 2376132 2430603 2104635 1851762 1828659 1694025 1324661
32040 1324661 1191255 1622542 2127138 2005937 1391180 1060081 1297685 1588398 1531933 1428376
32030 1428376 1640925 1904580 1769407 1421277 1483821 2064017 2521844 2334707 1805241 1644615
32020 1644615 2060462 2557707 2620423 2346480 2269465 2635425 3043367 2915944 2242522 1642874
32010 1642874 1622380 1967029 2080663 1791863 1515236 1591514 1798395 1718082 1372392 1199963
32000 1199963 1459828 1920120 2177432 2085562 1796069 1536647 1449425 1527507 1603160 1486490
$$ packed form
32070A875691l8547K19254K61054m129k27068j61360q052m2097j77873j69378
32060A527495l5560K7029K3180J11291K42540K00352l833j24913j04097j22966
32050A740518j72407K103L62243M43675N4471l25968k52873k3103j34634l69364
32040A324661j33406M31287N04596j21201o14757l31099K37604K90713n6465j03557
32030A428376K12549K63655j35173l48130O2544N80196M57827j87137n29466j60626
32020A644615M15847M97245O2716k73943p7015L65960M07942j27423o73422n99648
32010A642874k0494L44649J13634k88800k76627P6278K06881q0313l45690j72429
32000A199963K59865M60292K57312r1870k89493k59422q7222P8082P5653j16670
$$ plain form
31990 1486490 1210889 1049564 1182954 1454653 1610654 1690458 1958965 2461661 2886273 2945230
31980 2945230 2701454 2403435 2176332 2036898 2059008 2286791 2539666 2543521 2288375 2067625
31970 2067625 2098491 2260021 2300173 2184202 2122301 2306584 2703345 3076485 3184838 3022018
31960 3022018 2892324 3145984 3767794 4335117 4493370 4369695 4351662 4534253 4629554 4454428
31950 4454428 4251243 4358095 4726179 4993865 4984083 4895422 4959008 5104773 5090388 4844153
31940 4844153 4541809 4395940 4488258 4778424 5151606 5445336 5536965 5450239 5319748 5235417
31930 5235417 5181363 5124053 5067058 4997486 4878916 4742638 4693669 4773846 4909405 5038739
31920 5038739 5163798 5199662 4947329 4392259 3895281 3837377 4124234 4298343 4138780 3874047
$$ packed form
31990A486490k75601j61325J33390K71699J56001P9804K68507N02696M24612N8957
31980B945230k43776k98019k27103j39434K2110K27783K52875L855k55146k20750
31970B067625L0866J61530M0152j15971o1901J84283L96761L73140J08353j62820
31960C022018j29694K53660O21810N67323J58253j23675j8033J82591R5301j75126
31950D454428k03185J06852L68084K67686r782q8661O3586J45765j4385k46235
31940D844153l02344j45869R2318K90166L73182K93730R1629q6726j30491q4331
31930E235417n4054n7310n6995o9572j18570j36278m8969Q0177J35559J29334
31920E038739J25059L5864k52333n55070m96978n7904K86857J74109j59563k64733
$$ plain form
31910 3874047 3746445 3666596 3456753 3173129 2949458 2716518 2365004 2069462 2132536 2526948
31900 2526948 2889077 3013585 3077743 3260862 3388452 3166424 2643135 2217313 2185720 2415658
31890 2415658 2502373 2200934 1686476 1389147 1549158 1951796 2164520 2016684 1736223 1607479
31880 1607479 1648269 1700380 1694321 1686089 1720167 1802000 1952797 2148928 2244745 2115390 1882527
31869 1882527 1852144 2184586 2721086 3145421 3203936 2775079 1918027 953891 340147 290528
31859 290528 575646 827589 972682 1199930 1550962 1780181 1705672 1511440 1535338 1845673
31849 1845673 2193117 2347374 2317633 2229542 2150550 2111358 2167499 2322304 2467183 2510936
31839 2510936 2503352 2509747 2438098 2177539 1884419 1888447 2225829 2483280 2287357 1805292 1540727
$$ packed form
31910C874047j27602p9849k09843k83624k23671k32940l51514k95542O3074L94412
31900B526948L62129J24508O4158J83119J27590k22028n23289m25822l1593K29938
31890B415658Q6715l01439n14458k97329J60011M02638K12724j47836k80461j28744
31880A607479M0790N2111o059q232L4078Q1833J50797J96131R5817j29355k32863
31869A882527l0383L32442N36500M24335N8515m28857q57052r64136o13744m9619
31859B90528K85118K51943J45093K27248L51032K29219p4509j94232K3898L10335
31849A845673L47444J54257k9741q8091p8992l9192N6141J54805J44879M3753
31839B510936p584O395p1649k60559k93120M028L37382K57451j95923m82065k64565
$$ plain form
31828 1540727 1711528 2071033 2320773 2417835 2392016 2139341 1625942 1137485 1041946 1323939
31818 1323939 1603443 1669274 1755439 2132663 2607916 2694609 2251571 1697928 1511427 1719381
31808 1719381 2025593 2248345 2390596 2398475 2185150 1914322 1923803 2233208 2429309 2251378
31798 2251378 2005187 2082539 2312846 2233839 1882138 1780580 2082825 2273822 1972943 1579323
31788 1579323 1713273 2303071 2678453 2447857 1873036 1402453 1199473 1182535 1235240 1277162
31778 1277162 1317708 1492518 1887014 2321002 2491652 2333825 2060775 1875861 1857764 2080615
31768 2080615 2536284 2907738 2768437 2154928 1655453 1738208 2215353 2558365 2528915 2281221
31758 2281221 2029128 1872547 1848456 1924531 1994275 2026205 2124510 2318052 2445531 2411420
$$ packed form
31828A540727J70801L59505K49740R7062k5819k52675n13399m88457r5539K81993
31818A323939K79504O5831Q6165L77224M75253Q6693m43038n53643j86501K07954
31808A719381L06212K22752J42251P879k13325k70828R481L09405J96101j77931
31798B251378k46191P7352K30307p9007l51701j01558L02245J90997l00879l93620
31788A579323J33950N89798L75382k30596n74821m70583k02980j6938N2705M1922
31778A277162M0546J74810L94496M33988J70650j57827k73050j84914j8097K22851
31768B080615M55669L71454j39301o13509m99475Q2755M77145L43012k9450k47694
31758B281221k52093j56581k4091P6075O9744L1930R8305J93542J27479l4111
$$ plain form
31748 2411420 2365999 2410676 2328359 1918891 1442644 1339096 1568165 1650283 1399798 1207339
31738 1207339 1442696 1919287 2178601 2077554 1867627 1829953 2014833 2262665 2372876 2319236
31728 2319236 2314222 2522401 2736114 2592840 2141327 1847516 1908145 1951031 1690207 1485514
31718 1485514 1777985 2225847 2020257 1058095 216665 270981 1003748 1670827 1960087 2093546
31708 2093546 2233841 2270653 2163974 2094248 2168631 2248467 2183154 2014027 1839712 1657956
31698 1657956 1459197 1315752 1244467 1134428 971804 980514 1310976 1705582 1769453 1536658
31688 1536658 1430917 1604056 1675222 1329416 867644 837865 1298934 1806698 2051019 2138503
31678 2138503 2224664 2230742 2073080 1901481 1903129 2025781 2076841 2000481 1904458 1869645 1855726
$$ packed form
31748B411420m5421M4677q2317m09468m76247j03548K29069Q2118k50485j92459
31738A207339K35357M76591K59314j01047k09927l7674J84880K47832J10211n3640
31728B319236n014K08179K13713j43274m51513k93811O0629M2886k60824k04693
31718A485514K92471M47862k05590r62162q41430N4316P32767O67079K89260J33459
31708B093546J40295L6812j06679o9726P4383P9836o5313j69127j74315j81756
31698A657956j98759j43445p1285j10039j62624Q710L30462L94606O3871k32795
31688A536658j05741J73139P1166l45806m61772k9779M61069N07764K44321Q7484
31678B138503Q6161O078j57662j71599J648J22652N1060p6360r6023l4813j3919
$$ plain form
31667 1855726 1780920 1637708 1538052 1617129 1824173 1882377 1617853 1264419 1198841 1406305
31657 1406305 1540083 1543346 1773092 2312101 2623018 2287285 1725427 1647775 2011039 2137389
31647 2137389 1808534 1581007 1872479 2336563 2452338 2262019 2135870 2153049 2132189 2030743
31637 2030743 1898579 1615790 1104558 685810 779573 1282340 1671900 1744504 1793578 1970064
31627 1970064 1974216 1648056 1421369 1730109 2281986 2418455 2088369 1922274 2284916 2764851
31617 2764851 2830372 2576455 2459471 2556331 2521077 2196191 1859494 1794064 1916520 1960010
31607 1960010 1821065 1607987 1502168 1660276 2095240 2567893 2766181 2682461 2608648 2634323
31597 2634323 2420964 1739254 1002153 861011 1349883 1862222 2022645 2134147 2554353
$$ packed form
31667A855726p4806j43212r9656P9077K07044N8204k64524l53434o5578K07464
31657A406305J33778L263K29746N39009L10917l35733n61858p7652L63264J26350
31647B137389l28855k27527K91472M64084J15775j90319j26149J7179k0860j01446
31637B030743j32164k82789n11232m18748R3763N02767L89560P2604M9074J76486
31627A970064M152l26160k26687L08740N51877J36469l30086j66095L62642M79935
31617B764851O5521k53917j16984R6860l5254l24886l36697o5430J22456M3490
31607A960010j38945k13078j05819J58108M34964M72653J98288q3720p3813K5675
31597B634323k13359o81710p37101j41142M88872N12339J60423J11502M20206
$$ plain form
31588 2554353 3024575 2997948 2420041 1770272 1392633 1180811 975957 896993 1076156 1332323
31578 1332323 1384066 1265005 1269645 1531155 1891196 2193865 2463686 2702631 2725989 2382887
31568 2382887 1834783 1437585 1377823 1547295 1736921 1826594 1810601 1769472 1823554 2019197
31558 2019197 2269134 2470188 2605401 2630676 2398113 1898577 1459956 1404955 1578557 1588653
31548 1588653 1511505 1878666 2799670 3585723 3591939 3054503 2666538 2619020 2557093 2289831
31538 2289831 1994307 1773133 1526074 1291113 1255209 1373315 1411026 1416983 1678475 2102988
31528 2102988 2157117 1640728 1056209 926242 1167672 1459668 1800196 2258976 2532469 2286269
31518 2286269 1752439 1468658 1511694 1470494 1151494 839888 802920 954042 1125409 1309475
$$ packed form
31588B554353M70222k6627n77907o49769l77639k11822k04854p8964J79163K56167
31578A332323N1743j19061M640K61510L60041L02669K69821K38945K3358l43102
31568B382887n48104l97198n9762J69472J89626Q9673j5993m1129N4082J95643
31558B019197K49937K01054J35213K5275k32563m99536m38621n5001J73602J0096
31548A588653p7148L67161R21004P86053O216n37436l87965m7518o1927k67262
31538B289831k95524k21174k47059k34961l5904J18106L7711N957K61492M24513
31528B102988N4129n16389n84519j29967K41430K91996L40528M58780K73493k46200
31518B286269n33830k83781M3036m1200l19000l11606l6968J51122J71367J84066
$$ plain form
31508 1309475 1481793 1510995 1437716 1559720 1988126 2325850 2092108 1389467 857826 920012
31498 920012 1301739 1440171 1221746 1079019 1348207 1786920 1918466 1690865 1493098 1546464
31488 1546464 1620776 1469462 1243350 1248671 1498459 1749403 1855824 1863144 1839627 1809027 1778212
31477 1778212 1687578 1446802 1157265 1131047 1502178 1992353 2277696 2398161 2543847 2645084
31467 2645084 2529177 2334172 2364097 2599313 2731456 2639545 2447326 2147392 1607395 990859
31457 990859 738872 1011163 1497940 1883235 2140001 2271138 2153386 1816338 1547577 1539944
31447 1539944 1697346 1882065 2030033 1954233 1469930 869331 794481 1373544 1931954 1893423
31437 1893423 1540371 1473256 1709142 1819758 1668393 1462603 1261886 977793 770620 929956
$$ packed form
31508A309475J72318K9202p3279J22004M28406L37724k33742p02641n31641O2186
31498I20012L81727J38432k18425j42727K69188M38713J31546k27601j97767N3366
31488A546464P4312j51314k26112N321K49788K50944J06421P320k3517l0600l0815
31477A778212r0634k40776k89537k6218L71131M90175K85343J20465J45686J01237
31467B645084j15907j95005K9925K35216J32143r1911j92219k99934n39997o16536
31457I90859k51987K72291M86777L85295K56766J31137j17752l37048k68761p633
31447A539944J57402J84719J47968p5800m84303o00599p4850N79063N58410l8531
31437A893423l53052o7115K35886J10616j51365k05790k00717k84093k07173J59336
$$ plain form
31427 929956 1368962 1680175 1708817 1683419 1773978 1896758 1968906 1993145 1875145 1517926
31417 1517926 1119450 1012390 1173964 1261125 1169774 1159346 1345851 1499253 1494577 1542338
31407 1542338 1739965 1782855 1443892 1045381 1083010 1549556 1974577 2045923 1884417 1730331
31397 1730331 1636890 1535147 1413863 1329655 1304915 1287122 1225537 1176539 1267729 1495847 1640881
31386 1640881 1520852 1282434 1253934 1515998 1813810 1915706 1859646 1809856 1878563 2133728
31376 2133728 2546519 2852285 2718268 2187602 1732571 1705018 1929655 2003613 1799734 1486254
31366 1486254 1240892 1171987 1367121 1770586 2108342 2153220 1987637 1823270 1678372 1454641
31356 1454641 1227710 1195579 1375114 1585776 1720555 1821787 1901454 1901389 1849222 1863612 1965930
$$ packed form
31427I29956M39006L11213K8642k5398R0559J22780P2148K4239j18000l57219
31417A517926l98476j07060J61574Q7161r1351j0428J86505J53402m676M7761
31407A542338J97627M2890l38963l98511L7629M66546M25021P1346j61506j54086
31397A730331r3441j01743j21284q4208k4740j7793o1585m8998R1190K28118J45034
31386A640881j20029k38418k8500K62064K97812J01896n6060m9790O8707K55165
31376B133728M12791L05766j34017n30666m55031k7553K24637P3958k03879l13480
31366A486254k45362o8905J95134M03465L37756M4878j65583j64367j44898k23731
31356A454641k26931l2131J79535K10662J34779J01232P9667o5n2167J4390J02318
$$ [...]
##END NTUPLES=NMR SPECTRUM
##END=
