##TITLE=31Pdec_PR1933_rmP
 D2O, 224 sc
 3.9.2020
##JCAMPDX= 6.0         $$ Bruker NMR JCAMP-DX V2.0
##DATA TYPE= NMR SPECTRUM
##DATA CLASS= NTUPLES
##ORIGIN= UXNMR, Bruker Analytische Messtechnik GmbH
##OWNER= root
$$ XWIN-NMR		Version 3.5
$$ Thu Sep  3 11:57:59 2020 Russian Standard Time (UT+4h)  she@DPX200
##.OBSERVE FREQUENCY= 81.013821
##.OBSERVE NUCLEUS= ^31P
##.ACQUISITION MODE= SIMULTANEOUS
##.ACQUISITION SCHEME= undefined
##.AVERAGES= 224
##.DIGITISER RES= 17
##SPECTROMETER/DATA SYSTEM= spect
##.PULSE SEQUENCE= zgpg30
##.SOLVENT NAME= D2O
##.SHIFT REFERENCE= (INTERNAL, D2O, 0, 182.463)
##AUDIT TRAIL= $$ (NUMBER, WHEN, WHO, WHERE, WHAT)
$$ ##TITLE= Audit trail, XWIN-NMR		Version 3.5
$$ ##JCAMPDX= 5.01
$$ ##ORIGIN= Bruker BioSpin GmbH
$$ ##OWNER= she
$$ F:/spectra/data/she/nmr/P31/1/pdata/1/auditp.txt
$$ ##AUDIT TRAIL=  $$ (NUMBER, WHEN, WHO, WHERE, WHAT)
(   1,<2020-09-03 11:54:45.17 +0400>,<she>,<DPX200>,
      <continue with go, POWCHK disabled, PULCHK disabled
       configuration hash MD5:
       00 E9 B6 7A A2 85 ED C7 34 08 36 98 17 FE 4E 26
       data hash MD5: 32K
       D5 A4 94 9D A1 20 72 E8 FE 5F C7 FA EE 74 54 F0>)
(   2,<2020-09-03 11:56:26.70 +0400>,<she>,<DPX200>,
      <Start of raw data processing
       efp BC_mod = 2 LB = 1 FT_mod = 6 PKNL = 1 PHC0 = -3974.879 PHC1 = 2497.802 SI = 64K 
       data hash MD5: 64K
       58 D6 A4 4C CD F2 9E C6 DB 89 A4 2C 65 CA C8 A4>)
(   3,<2020-09-03 11:57:08.56 +0400>,<she>,<DPX200>,
      <pk PHC0 = 842.4017 PHC1 = -1690 
       data hash MD5: 64K
       02 13 F0 95 8E A3 43 0D 2B 8A 79 C2 E8 C8 F4 21>)
(   4,<2020-09-03 11:57:17.32 +0400>,<she>,<DPX200>,
      <abs ABSG = 5 
       data hash MD5: 64K
       80 9F B5 F9 61 7B 36 1E B4 AB 05 65 F0 9F 26 EA>)
$$ ##END=
$$ 
$$ hash MD5
$$ F2 4D 2F 39 FE 23 82 90 E5 7C 60 D3 A1 E8 0E C7
##$RELAX= 
##$RELAX= 
##$RELAX= 
##$RELAX= 
##$RELAX= 
##$RELAX= 
##$RELAX= 
##$RELAX= 
$$ Bruker specific parameters
$$ --------------------------
##$DU= <F:/spectra>
##$EXPNO= 1
##$NAME= <P31>
##$PROCNO= 1
##$TYPE= <nmr>
##$USER= <she>
##$AMP= (0..31)
100 100 100 100 100 100 100 100 100 100 100 100 100 100 100 100 100 100 
100 100 100 100 100 100 100 100 100 100 100 100 100 100 
##$AQSEQ= 0
##$AQ_mod= 1
##$AUNM= <au_zg>
##$AUTOPOS= <>
##$BF1= 81.014009
##$BF2= 200.13
##$BF3= 200.13
##$BF4= 200.13
##$BF5= 200.13
##$BF6= 200.13
##$BF7= 200.13
##$BF8= 200.13
##$BYTORDA= 1
##$CFDGTYP= 0
##$CFRGTYP= 5
##$CHEMSTR= <none>
##$CNST= (0..31)
1 1 145 1 1 1 1 1 1 1 1 1 1 1 1 1 1 1 1 1 1 1 1 1 1 1 1 1 1 1 1 1 
##$CPDPRG= <waltz16>
##$CPDPRG1= <>
##$CPDPRG2= <waltz16>
##$CPDPRG3= <>
##$CPDPRG4= <mlev>
##$CPDPRG5= <mlev>
##$CPDPRG6= <mlev>
##$CPDPRG7= <mlev>
##$CPDPRG8= <mlev>
##$CPDPRGB= <>
##$CPDPRGT= <>
##$D= (0..31)
0 1 0 0 0 0 0 0 0 0 0 0.03 2e-05 3e-06 0 0 0 0 0 0 0 0 0 0 0 0 0 0 0 0 
0 0 
##$DATE= 1599119276
##$DBL= (0..7)
120 120 120 11 120 120 24 19 
##$DBP= (0..7)
150 150 150 150 150 150 150 150 
##$DBP07= 0
##$DBPNAM0= <>
##$DBPNAM1= <>
##$DBPNAM2= <>
$$ [...]
##$SUBNAM3= <"">
##$SUBNAM4= <"">
##$SUBNAM5= <"">
##$SUBNAM6= <"">
##$SUBNAM7= <"">
##$SUBNAM8= <"">
##$SUBNAM9= <"">
##$SW= 369.568048894756
##$SWIBOX= (0..15)
0 1 3 0 0 0 0 0 0 0 0 0 0 0 0 0 
##$SW_h= 29940.119760479
##$TD= 32768
##$TD0= 1
##$TE= 0
##$TE2= 300
##$TE3= 300
##$TEG= 300
##$TL= (0..7)
0 120 53 12 22 120 120 120 
##$TP= (0..7)
150 150 150 150 150 150 150 150 
##$TP07= 0
##$TPNAME0= <>
##$TPNAME1= <>
##$TPNAME2= <>
##$TPNAME3= <>
##$TPNAME4= <>
##$TPNAME5= <>
##$TPNAME6= <>
##$TPNAME7= <>
##$TPOAL= (0..7)
0.5 0.5 0.5 0.5 0.5 0.5 0.5 0.5 
##$TPOFFS= (0..7)
0 0 0 0 0 0 0 0 
##$TUNHIN= 0
##$TUNHOUT= 0
##$TUNXOUT= 0
##$USERA1= <user>
##$USERA2= <user>
##$USERA3= <user>
##$USERA4= <user>
##$USERA5= <user>
##$V9= 5
##$VALIST= <valist>
##$VCLIST= <CCCCCCCCCCCCCCC>
##$VD= 0
##$VDLIST= <DDDDDDDDDDDDDDD>
##$VPLIST= <PPPPPPPPPPPPPPP>
##$VTLIST= <TTTTTTTTTTTTTTT>
##$WBST= 1024
##$WBSW= 4
##$XGAIN= (0..3)
0 0 0 0 
##$XL= 0
##$YL= 0
##$YMAX_a= 13999
##$YMIN_a= -111887
##$ZGOPTNS= <>
##$ZL1= 120
##$ZL2= 120
##$ZL3= 120
##$ZL4= 120
##$ABSF1= 182.463
##$ABSF2= -187.1042
##$ABSG= 5
##$ABSL= 3
##$ALPHA= 0
##$AQORDER= 0
##$ASSFAC= 0
##$ASSFACI= 0
##$ASSFACX= 0
##$ASSWID= 0
##$AUNMP= <proc_1d>
##$AZFE= 0.1
##$AZFW= 0.5
##$BCFW= 0
##$BC_mod= 2
##$BYTORDP= 0
##$COROFFS= 0
##$CY= -3
##$DATMOD= 1
##$DC= 0
##$DFILT= <>
##$DTYPP= 0
##$F1P= 0
##$F2P= 0
##$FCOR= 1
##$FTSIZE= 65536
##$FT_mod= 6
##$GAMMA= 0
##$GB= 0
##$INTBC= 1
##$INTSCL= 5.30512e-09
##$ISEN= 30
##$LB= 1
##$LEV0= 0
##$LPBIN= 0
##$MAXI= 10000
##$MC2= 0
##$MEAN= 0
##$ME_mod= 0
##$MI= 50
##$NCOEF= 0
##$NC_proc= -8
##$NLEV= 6
##$NOISF1= 182.463
##$NOISF2= 159.3651
##$NSP= 0
##$NTH_PI= 0
##$NZP= 0
##$OFFSET= 182.463
##$PC= 4
##$PHC0= -3132.477
##$PHC1= 807.802
##$PH_mod= 1
##$PKNL= yes
##$PPARMOD= 0
##$PSCAL= 0
##$PSIGN= 0
##$REVERSE= no
##$SF= 81.0140089999434
##$SI= 65536
##$SIGF1= 159.3651
##$SIGF2= -187.1042
##$SINO= 113.3802
##$SIOLD= 16384
##$SREGLST= <1H.CDCl3>
##$SSB= 0
##$STSI= 65536
##$STSR= 0
##$SW_p= 29940.119760479
##$SYMM= 0
##$S_DEV= 0
##$TDeff= 32768
##$TDoff= 0
##$TI= <>
##$TILT= no
##$TM1= 0
##$TM2= 0
##$TOPLEV= 0
##$USERP1= <user>
##$USERP2= <user>
##$USERP3= <user>
##$USERP4= <user>
##$USERP5= <user>
##$WDW= 1
##$XDIM= 65536
##$YMAX_p= 408409194
##$YMIN_p= -102478057
$$ End of Bruker specific parameters
$$ ---------------------------------
##NTUPLES= NMR SPECTRUM
##VAR_NAME=  FREQUENCY,     SPECTRUM/REAL,   SPECTRUM/IMAG
##SYMBOL=    X,             R,               I
##VAR_TYPE=  INDEPENDENT,   DEPENDENT,       DEPENDENT
##VAR_FORM=  AFFN,          ASDF,            ASDF
##VAR_DIM=   65536,         65536,           65536
##UNITS=     HZ,            ARBITRARY UNITS, ARBITRARY UNITS
##FACTOR=    0.456856943014862, 1,           1
##FIRST=     14782.0589164792, 0,            0
##LAST=      -15158.0608439998, 0,           0
##MIN=       -15158.0608439998, -102478057,  0
##MAX=       14782.0589164792, 408409194,    0
$$ Real data points
##PAGE= N=1
##DATA TABLE= (X++(R..R)), XYDATA
$$ [...]
34941A0759450m795457O742742J1045597l045645k5422065l1304730r411045J9776309
34933b5654844K4531524K600512j3518488r13459K1058253K0321735k40266j0973712
34925A7211255l572490K81306j0197237j6841924n225019J1958408J8420747J7799824
34917B9834870J7280336R066581j1444381k5946596j5095409R684869J8248148
34910C1628418J290856k0446533k4895371j1259901O559625J6677069J6053501
34903A5607664P973548k510848j0264215q961584M586320J9631365J4976207j3128363
34895B7910094l5389958k2279156J2827182K8415840J1280046j0660425j4509070
34888b405447q505212l356895P324118K1489002J7489070q657063k5202097j0268924
$$ y = [10759450, 5963993, 12706735, 23752332, 20706687, -4715378, -36020108, -45431153, -25654844, -1123320, 1477192, -12041296, -12954755, 8103498, 28425233, 28184967, 17211255, 13638765, 13920071, 3722834, -13119090, -18344109, -6385701, 12035046, 29834870, 47115206, 56181787, 44737406, 18790810, 3695401, 13380270, 31628418, 32919274, 12472741, -12422630, -23682531, -17122906, -445837, 15607664, 23581212, 21070364, 10806149, 1844565, 6430885, 26062250, 41038457, 27910094, -7479864, -29759020, -16931838, 11484002, 22764048, 12103623, -2405447, -10910659, -14267554, -6943436, 14545566, 32034636, 23377573, -1824524, -12093448]
34880a2093448J2102870J0317507o651481j1863614o707208p808960q375489O925149
34872b4154674K3840175J7118153l288808o129561Q491207J2301904J23356n099472
34864B3202280K149484K636901o234377m788810O438890J800444k0548098k7311532
34856b2654818m393786J7053280R929742r364679j4605043r913859q846512k304263
34848d5099938K0735138M1429681L2606704L45999k3091594k0524538l163811
34841C237641R996069Q721515n287893j7931393j3567950L850154J2871993O289924
34833H180060K447504J2782444K0326192R496360m350868n30556R862435K934311
34825F1147882j4276132j3341758O405754J3388406n960980k3908382j2603975
$$ y = [-12093448, 9422, 10326929, 3675448, -8188166, -14895374, -22704334, -31079823, -24154674, -314499, 16803654, 13514846, 7385285, 15876492, 28178396, 28301752, 23202280, 25351764, 27988665, 21754288, 16965478, 23404368, 25204812, 4656714, -22654818, -27048604, -9995324, -65582, -9430261, -24035304, -33949163, -42795675, -45099938, -24364800, 17064881, 49671585, 50017584, 26925990, 6401452, 3237641, 13233710, 21955225, 16667332, -1264061, -14832011, -10981857, 1890136, 8180060, 10627564, 23410008, 43736200, 53232560, 48881692, 48351136, 58213571, 61147882, 46871750, 33529992, 39935746, 53324152, 47363172, 23454790, 10850815]
34818A0850815J5195880K5907015J1220487o239701q051998j281718q90703o041503
34810D0668574n681710o41743m235967j8492619k5276034j1170725J1122199K0738330
34802G030305J7686969J4915811R902705r476796l2210848k8080687O427342L4130707
34794B0325508K5484219k047356j3017426l468036K750403n219977j3842536j0859780
34786A05019q22921O479475P964437N338921J103465k411937n417763r830490
34778B508206j2866367p819189M799735J5019044J6370402J1640442K982077j0090108
34770B2544242j8861939r527427J2535004K1789941P924835p368240m367575M279656
34762B8948497k324951j7537141k0930798j3121994q792199n921194P756381K4161228
$$ y = [10850815, 26046695, 51953710, 63174197, 56934496, 48882498, 47600780, 46710077, 40668574, 34986864, 34345121, 30109154, 11616535, -13659499, -24830224, -13708025, 7030305, 24717274, 39633085, 49535790, 40058994, 7848146, -20232541, -13805199, 20325508, 45809727, 43762371, 30744945, 27276909, 30027312, 24807335, 10964799, 105019, -717902, 5761573, 13726010, 19064931, 20168396, 17756459, 12338696, 2508206, -10358161, -18177350, -13377615, 1641429, 18011831, 29652273, 32634350, 22544242, 3682303, -5845124, 6689880, 28479821, 36404656, 29036416, 24668841, 28948497, 26623546, 9086405, -11844393, -24966387, -33758586, -39679780, -31923399, -7762171]
34754g762171K2252634M508699m636578J200959K537092p736957r256677R538236
34746A0645237K7122800J9788773l239072j6198023j4088976j2111332j5986680
34739d067273j4484585j382153J2449783J4113867N071743l714942o445285n360679
34731c819524k185085M836289J3452094J4959105N977939l059105j061219N937094
34723C5037588L182028q192990j1548520k170752M435048j097921o560926q11420
34715A2272135O542804L583523k540710o27266L813147K789081N015383J7005722
34707D7853819K0288388k635761l0845765k8118666J470876J7824438N948641
34700C1785970n423121M725748J7289767J0131292m967101p256959l873376j3047373
$$ y = [-7762171, 14490463, 18999162, 14362584, 15563543, 18100635, 10363678, 1107001, 10645237, 37768037, 57556810, 54317738, 38119715, 24030739, 11919407, -4067273, -18551858, -19934011, -7484228, 6629639, 11701382, 7986440, 1541155, -3819524, -6004609, -1168320, 12283774, 27242879, 33220818, 30161713, 29100494, 35037588, 38219616, 30026626, 18478106, 16307354, 20742402, 19644481, 13083555, 12272135, 18814939, 22398462, 19857752, 19230486, 23043633, 25832714, 30848097, 47853819, 68142207, 65506446, 34660681, 6542015, 8012891, 25837329, 31785970, 26362849, 31088597, 48378364, 58509656, 53542555, 46285596, 42412220, 29364847]
34692B9364847k7027338k1621616M338216K5537226K5676561J5116658R798552
34685F1183106R326768L098641j1469898k4245578k3467668q493617Q799686J5744632
34677C0476072J0772710J326100o636565j0729643p299015M679920J5335784J2093257
34669E0018620j328331o990357J330029P783444j179059j4060311r234842J3601754
34661C9940947L0554949K2147868m503450k4390884k0464699J253620K0014157
34654F4552508K1632947J0470483R66175J292519P980760J2424252Q027912n266694
34646A22080862j8411217j9676779r250465j134544l331001n027171M904840J6133537
34638H6288062J1274055l801484n812633R584424J9491722P768264j2261258j8698711
$$ y = [29364847, 2337509, -19284107, -14945891, 10591335, 36267896, 51384554, 61183106, 70509874, 73608515, 62138617, 37893039, 14425371, 5931754, 14731440, 30476072, 41248782, 42574882, 35938317, 25208674, 17909659, 22589579, 37925363, 50018620, 48690289, 41699932, 43029961, 50813405, 49634346, 35574035, 26339193, 39940947, 70495896, 92643764, 88140314, 63749430, 43284731, 44538351, 64552508, 86185455, 96655938, 97622113, 98914632, 106895392, 119319644, 127347556, 122080862, 103669645, 83992866, 74742401, 73607857, 70276856, 65249685, 70154525, 86288062, 97562117, 93760633, 87948000, 97532424, 117024146, 124792410, 112531152, 93832441]
34630I3832441q955680L932820J0304191Q354292p31339j2131430j8543206j8725813
34622E7336276j8181560j7305536q491966R473642K4092715K3565498J1132604
34615H1621673r06570m905059j454853L520936J884466r000821j9354666j6199243
34607C5205863j264247R588557O239317o186004j7862059k2596238j5687534K439209
34599a0123136J9062354K0179278J0155122N055727O460649J670992q290319n513426
34591C8657241J2015983J9500489J564217k1990248k4266585q036685L994912
34584B1439324K271905m308382o283805j052395R877503J8988251J6173239K748227
34576E9853867q217172j1263690j3076349j2762502r4240J7163762J2225261j6576646
$$ y = [93832441, 84876761, 88809581, 99113772, 107468064, 106736725, 94605295, 76062089, 57336276, 39154716, 21849180, 13357214, 22830856, 46923571, 70489069, 81621673, 80715103, 75810044, 74355191, 77876127, 79760593, 70759772, 51405106, 35205863, 33941616, 43530173, 49769490, 43583486, 25721427, 3125189, -12562345, -10123136, 8939218, 29118496, 39273618, 44329345, 50789994, 52460986, 44170667, 38657241, 50673224, 70173713, 71737930, 49747682, 25481097, 17444412, 21439324, 23711229, 19402847, 13119042, 12066647, 21944150, 40932401, 57105640, 59853867, 51636695, 40373005, 27296656, 14534154, 14439914, 31603676, 43828937, 27252291]
34568B7252291k9769959k021420L2597779K6130852j1732795k9109274r262273
34561D085201J1267692L562471j5433355j7524187l752171O859222O837148J923401
34553b174578k621599m439879j801074L233532O065324O545721P484765P502829
34545A9795041M710819M290668J0894305J7202488J2874157R56539p820134j1649042
34537E1254841j3884324j0076199K723971J0540676j363515k0995823k2476286
34530d276659m994600O578068J611089k526392P069280J8123812J5783683M753726
34522D2122007l246143p089901j0270806j1691442j1402579j2620167j2265466
34515b6464497l805370O856127O171661k202224J034687J6860406J9628483l559346
$$ y = [27252291, -2517668, -4539088, 28058691, 54189543, 42456748, 13347474, 4085201, 15352893, 18915364, 3482009, -14042178, -17794349, -10935127, -4097979, -2174578, -4796177, -9236056, -11037130, -7803598, -1738274, 4807447, 12292212, 19795041, 24505860, 28796528, 39690833, 56893321, 69767478, 70724017, 62903883, 51254841, 37370517, 27294318, 30018289, 40558965, 39195450, 18199627, -4276659, -9271259, -2693191, -1082102, -3608494, 3460786, 21584598, 37368281, 42122007, 38875864, 31785963, 21515157, 9823715, -1578864, -14199031, -26464497, -30269867, -23413740, -17242079, -19444303, -18409616, -1549210, 18079273, 14519927]
34507A4519927k7781129k3954188P5372J3984688Q115838o60695K90556M498754
34499a0910877K381138m272118p218871j928867Q982810J7549513J6523625O439265
34491B7545618n944806j6050671k1983915j8358928j634256J7195587J9884888
34484F53517N594501o396266m561467O66711p17687R9408J1869170K1361475J0288976
34475C8858338j4141742k5295787j1637200J0352000J8115744O397815j2004196
34468A0644972k0351275j1931240N210068J7594296K0687003J9211689J4638896
34461E5704409L783232q218408q430489L343606Q905679l225115j9791770k1637698
34453A0433446r183320L334189Q311605O052233m388203k0734319l1368680k7473969
$$ y = [14519927, -13261202, -37215390, -37140018, -23155330, -15039492, -15700187, -15409631, -10910877, -8529739, -12801857, -20020728, -21949595, -12966785, 4582728, 21106353, 27545618, 21600812, 5550141, -16433774, -34792702, -36426958, -19231371, 653517, 6248018, -148248, -4709715, -4043004, -4760691, -4661283, 7207887, 28569362, 38858338, 24716596, -579191, -12216391, -1864391, 16251353, 22649168, 10644972, -9706303, -21637543, -16427475, 1166821, 21853824, 41065513, 55704409, 59487641, 51269233, 42838744, 46182350, 55088029, 51862914, 32071144, 10433446, 1250126, 4584315, 12895920, 18948153, 14559950, -6174369, -37543049, -65017018]
34445f5017018j4959416l252698Q338696K0938466K4906619J4623766L599445
34438a0822140O519421J6018896J6824812J2423707J4078621J2820951q134738
34431E9729530l6721290m0038277j3085591J1105159R562166n59553N672227K3059635
34423A8724006K9367883J8270024N91399j4015917k0157020j3226405J682479
34416B1236449Q169395J07324o876875l59851O280094m193137k0777247j8945709
34408a5359557k10153J0338709M389743J9586O840645R956853k94244q580017
34400G101565j498025P607008J950449q202656l278981J0256634J0471310j441951
34392B2965353l722500O012790N805352r495966j4856569K545172J7825993P800694
$$ y = [-65017018, -79976434, -83229132, -74890436, -53951970, -29045351, -14421585, -10822140, -4302719, 11716177, 28540989, 40964696, 55043317, 67864268, 59729530, 23008240, -17030037, -30115628, -19010469, -9448303, -10007856, -4335629, 18724006, 48091889, 66361913, 66953312, 52937395, 32780375, 19553970, 21236449, 29405844, 29513168, 22636293, 22276442, 28556536, 24363399, 3586152, -15359557, -15569710, -5231001, -841258, -821672, 6018973, 15975826, 15681582, 7101565, 5603540, 13210548, 15160997, 6958341, 3679360, 13935994, 24407304, 22965353, 19242853, 25255643, 31060995, 21565029, 6708460, 9253632, 27079625, 34880319]
34384C4880319r789682n641297J1940848J1970956o200665j2660221J609170J0397374
34376C6506802k610904j7598761j2319224M716312J2290674O704355l244021j3285901
34368A1159332j8773634r855969J0671757K0858072R848048j390992Q654668K5362138
34360E6533420J9300930o753398k2287936j5768127o061984o208643o361445j83205
34352A2209612J61366j1116654j7005387l435434J6020547J9608540R167657L977805
34344B9588052J0500621J5769795Q241597q459471k1775050k0799763l529589
34337I536192J7873059K3932984J0047837m058616j230J0484913J641541k3294462
34329D6162218l0480055n705979J9236962J1311378j2352209r339812K0132986
$$ y = [34880319, 25090637, 19449340, 31390188, 43361144, 37160479, 24500258, 26109428, 36506802, 33895898, 16297137, 3977913, 8694225, 20984899, 27689254, 24445233, 11159332, -7614302, -17470271, -6798514, 14059558, 23907606, 22516614, 31171282, 56533420, 75834350, 69080952, 46793016, 31024889, 24962905, 18754262, 12392817, 12209612, 12370978, 1254324, -15751063, -19186497, -3165950, 16442590, 25610247, 29588052, 40088673, 55858468, 64100065, 55640594, 33865544, 13065781, 9536192, 27409251, 51342235, 61390072, 57331456, 57330226, 67815139, 69456680, 46162218, 15682163, 9976184, 29213146, 40524524, 28172315, 18832503, 38965489]
34322C8965489K8608607p096807m6120579l8802090M881224L4142862K8736316
34315D3315022J4560621J2338922R624567o226363k0373354j5757035l411127
34308C4071253m593596j6042048j5401945M122168K3181495K1035088m09026j9290323
34300B6673066j6694032K200970J1776470k154997j9226129r748756J9392595
34293A2219187K9438219O424307j6169286q130484J2143313R717048j1299695
34286C4342609j7797360r74872J5158207J4750617P598814M385470K846810K523666
34278F2833961P821580J1471279q31614k2788539k7760028n951457J9059115K2003488
34270F5857785P413357k047668L777020J3930477J1060505r932061l2223171k9377036
$$ y = [38965489, 67574096, 60477289, 14356710, -24445380, -19564156, 14578706, 43315022, 57875643, 70214565, 79839132, 73612769, 53239415, 37482380, 34071253, 29477657, 13435609, -1966336, 2155832, 25337327, 46372415, 45963389, 26673066, 9979034, 12180004, 23956474, 21801477, 2575348, -7173408, 12219187, 41657406, 48081713, 31912427, 23781943, 35925256, 45642304, 34342609, 16545249, 15570377, 30728584, 45479201, 53078015, 57463485, 60310295, 62833961, 70655541, 82126820, 81295206, 58506667, 30746639, 24795182, 43854297, 65857785, 73271142, 71223474, 75000494, 88930971, 99991476, 90059415, 57836244, 28459208]
34262B8459208J739869K7479363J5266718k0922176l7107507j8887611L904887
34255f7249M605962r002769j9156953k2996412j9183665J045125L0670356M0495359
34247F409754J7530436j1894763j8427722p706474K73588P050353K2282352L2989635
34239D8507159J9379028q960872k3483466j6532181l222018Q235633J8187006
34232D2110289J5073250j1806071m0657737l4876060K244603K5589858J1705584
34225I383716r632330m163401J7833132K5505591J5598982P235034M603915l901792
34217F2462847j6103760j5109917Q83195J2670069R551678M052497Q214768J2735527
34209G9356904L364677j3346850j6837340j547450J4980636J5147361K210696
$$ y = [28459208, 30199077, 57678440, 72945158, 52022982, 14915475, -3972136, -67249, 4538713, -4464056, -23621009, -46617421, -65801086, -64755961, -34085605, 6409754, 23940190, 12045427, -6382295, -14088769, -13815181, -6764828, 15517524, 48507159, 67886187, 58925315, 35441849, 18909668, 15687650, 23923283, 42110289, 57183539, 45377468, 4719731, -30156329, -27911726, -2321868, 9383716, -248614, -4412015, 13421117, 38926708, 54525690, 61760724, 66364639, 62462847, 46359087, 31249170, 32132365, 44802434, 54354112, 58406609, 66621377, 79356904, 82721581, 69374731, 52537391, 50989941, 65970577, 81117938, 83328634]
34202H3328634o984436l968046L259488K429774p971835j7439780j5520406l849088
34194C3284305N037221K288945n603273m513811P746941J6820393J0924548k687862
34186F3297407q394304l693514J159716K182506O353868J5056509J6806753M185687
34178I6954628j2303280j7259068j0633424m451664l076937J687690J4516484
34171F5434429K5216767J9804816m86599j8117683j9394438j0868329r062183
34164E2526780j5923138j5936304j852161J0350018M727312p466745l291795J4658726
34156C7792693K0417658O200827l373713J0407401K9573287K4819700k741452
34149A23096401k4583363k1853106k339213J5306025J9261338Q507767p906157
$$ y = [83328634, 76344198, 72376152, 75635640, 78065414, 70093579, 52653799, 37133393, 33284305, 38321526, 40610471, 35007198, 30493387, 38240328, 55060721, 65985269, 63297407, 54903103, 51209589, 52369305, 54551811, 60905679, 75962188, 92768941, 96954628, 84651348, 67392280, 56758856, 52307192, 49230255, 50917945, 65434429, 90651196, 110456012, 109969413, 91851730, 72457292, 61588963, 52526780, 36603642, 20667338, 18815177, 29165195, 33892507, 26425762, 23133967, 37792693, 58210351, 64411178, 61037465, 71444866, 101018153, 125837853, 123096401, 98513038, 76659932, 74320719, 89626744, 108888082, 117395849, 109489692]
34142A09489692j5438780p300803O743841J1020134J779261j0286735j2361970
34135H3644640j038672J3938457J6072699q5826j7272774j4014986M043638R410583
34127I4697759n258840j3354261L879256K4985367K0335582j893762j0176013
34120A13215088J336040R015379J035652p778378n698919k543935r689569k0450065
34112G8441293j9976181l964812J7156178K6078254J3436534p625284j0846912
34105I2699070P696144J7839175k233850k8176644k2397447Q164152K2978433
34098I6569033J0219391k047064K058643N137826l394467o821325L795877J0957412
34090A16475326M940326J491243O710050J542783j6294013j5323750J4494534
$$ y = [109489692, 94050912, 86750109, 93493950, 104514084, 106293345, 96006610, 83644640, 82605968, 96544425, 112617124, 112531298, 95258524, 81243538, 85287176, 94697759, 89438919, 76084658, 79963914, 104949281, 125284863, 123391101, 113215088, 114551128, 123566507, 124602159, 116823781, 111124862, 108580927, 98891358, 78441293, 58465112, 54500300, 71656478, 97734732, 111171266, 103545982, 92699070, 100395214, 118234389, 116000539, 87823895, 65426448, 73590600, 96569033, 106788424, 104741360, 106800003, 111937829, 108543362, 101722037, 105517914, 116475326, 121415652, 122906895, 129616945, 131159728, 114865715, 99541965, 114036499]
34083A14036499L0668658L029446k8065678j0419753L2614897L5126247p345686
34076A69644630l3264592j3383248J1863992O092693j1703131j3348933p594345
34069A08307066r269565n168838J4476697K5589978Q485197j1851881k322801
34062A28245853K3873197K9136939J0891839j752444M14275J71944o045429l318734
34054A81617440N143328k285969k1633833j9423391J1879297L2567097J3776926
34047B01640895j5972408j4377554R408873J2434318j1985133k4675535l762630
34040A52710826K1320863J5361882j1034002j9186963L089404K8850330L0195360
34033B21307700R168476j2351245j8565331q679760R438024K4277591K4242308
$$ y = [114036499, 144705157, 147734603, 119668925, 109249172, 141864069, 176990316, 169644630, 136380038, 122996790, 134860782, 140953475, 129250344, 115901411, 108307066, 99037501, 93868663, 108345360, 133935338, 142420535, 130568654, 128245853, 152119050, 181255989, 192147828, 190395384, 190809659, 190981603, 184936174, 181617440, 186760768, 184474799, 162840966, 143417575, 155296872, 187863969, 201640895, 185668487, 171290933, 180699806, 193134124, 181148991, 156473456, 152710826, 174031689, 189393571, 178359569, 159172606, 162262010, 191112340, 221307700, 230476176, 218124931, 199559600, 190879840, 200317864, 224595455, 248837763]
34026B48837763P375482j1708345j4147183L2189R828531J253072j1462075n527367
34018B24482067J4961786K1789492L159215j8096410j6870012P14180J1729587
34011B41869905J0866312J0225485J3033551J0462250K774773J563832Q355538
34004B99151646J0829702M663236K12688J905223J87731q295083j1651503l883423
33996B93120217L465501K442619K569322R465647R285399o608511j9510151r446678
33988B84783365J0944943J5053978M423173L375132J6944304K4335348J5162223
33981C75022466L657550J006027j160129j0759171k0086897k0493182j4615069
33974C12571595n524806R416630K5417131K7516277J0900305r629159j8456614
$$ y = [248837763, 256213245, 244504900, 230357717, 230389906, 240218437, 241471509, 230009434, 224482067, 239443853, 261233345, 264392560, 246296150, 229426138, 230140318, 241869905, 252736217, 262961702, 275995253, 286457503, 289232276, 290796108, 299151646, 309981348, 314644584, 314857272, 316762495, 316950226, 308655143, 297003640, 293120217, 296585718, 299028337, 301597659, 311063306, 320348705, 313740194, 294230043, 284783365, 295728308, 310782286, 315205459, 318580591, 335524895, 359860243, 375022466, 378680016, 379686043, 378525914, 367766743, 347679846, 327186664, 312571595, 307046789, 316463419, 341880550, 369396827, 380297132, 370667973, 352211359]
33967C52211359j4393327k073035J4972785K5645495J4938693j2226853k8341897
33960C50733220j8005059P26122M274847l295559l294197N290882Q639069N047329
33952C50116654O159619J3285531J3118983K15323j2348177j0945711J68887M929519
33944C64700628m388274j7503746j7225673p4111J7644400J9234733Q333094j59452
33936C70561599m961452j6256286k9160901k3492638J467691J6253222J518846
33929C15930081k1485577k1252757N1073J6214421J6981900J2695280Q205550
33922C27339971q81274j0029020r085052k397565k719036o639702O674J2510341
33914C08105337R044255j3580101l0470230k2862623n39415J8012288K7028366
$$ y = [352211359, 337818032, 335744997, 350717782, 376363277, 391301970, 379075117, 350733220, 332728161, 333454283, 337729130, 334433571, 331139374, 336430256, 345069325, 350116654, 356276273, 369561804, 382680787, 382896110, 370547933, 359602222, 359771109, 364700628, 360312354, 342808608, 325582935, 325508824, 343153224, 362387957, 370721051, 370561599, 365600147, 349343861, 320182960, 296690322, 298158013, 314411235, 315930081, 294444504, 273191747, 273242820, 289457241, 306439141, 319134421, 327339971, 326458697, 316429677, 307344625, 304947060, 302228024, 295588322, 295594996, 308105337, 317149592, 303569491, 273099261, 250236638, 249697223, 267709511, 294737877]
33907B94737877K5394047Q119071j9747998l7036982k9848585r880968K847303
33900B34583765M240024J281643m507318j3311491j5865256l201067J6209505
33893B19429805K3807792J4331138j97276r033605j3120500j5268691j1841073
33886B08107590j091422P455739J852439j4297786k1664694q801937R841308J0092401
33878A91493638q689571k0286044p093340J5058719J9407901M103378j0751448
33871A83243233j3889573j1314960p797523r72312N307184K170658n892335l318933
33863A47535439J0273566J5563141L113891j1784548j4237491j0761429j1911308
33856A27791261j2244194m814369M89575n936061j0468955N302038L0086663L2611570
$$ y = [294737877, 320131924, 328250995, 308502997, 271466015, 241617430, 231736462, 234583765, 238823789, 240105432, 235598114, 222286623, 206421367, 203220300, 219429805, 243237597, 257568735, 257371459, 248337854, 235217354, 219948663, 208107590, 207016168, 214471907, 216324346, 202026560, 180361866, 171559929, 181401237, 191493638, 182804067, 162518023, 155424683, 170483402, 189891303, 193994681, 183243233, 169353660, 158038700, 150241177, 149268865, 154576049, 156746707, 150854372, 147535439, 157809005, 173372146, 176486037, 164701489, 150463998, 139702569, 127791261, 115547067, 110732698, 111222273, 105286212, 94817257, 100119295, 130205958, 162817528]
33848A62817528O177815j9984540j9847527j681713R465570N310657k374355l574843
33840A36308592k115187o524354j6488017k1306500j1500789Q180767K0247476
33833A06801988J3128318l647314r519455J524355J2794623N853697j6069656
33826A10866556l1531352k5680991n892466Q534524Q156751J140034J81285O269495
33818G2043836Q843075N88945j2316524j6729339p441035O853981J2974569P388588
33810G2206096j016704k639312J844215N640322P241155J0015455J1804645N649387
33802A10745259o518444j2331433o966285j478748n044853j0261103p012404M7133
33794F1179122J276205j046759q71379k813282j0316625j0476067O403108K1872721
$$ y = [162817528, 168995343, 149010803, 129163276, 127481563, 136947133, 142257790, 139883435, 136308592, 134193405, 127669051, 111181034, 89874534, 78373745, 86554512, 106801988, 119930306, 116282992, 106763537, 108287892, 121082515, 126936212, 110866556, 79335204, 53654213, 47761747, 56296271, 64453022, 65593056, 65774341, 72043836, 80886911, 81475856, 69159332, 52429993, 44988958, 51842939, 64817508, 72206096, 71189392, 68550080, 70394295, 76034617, 83275772, 93291227, 105095872, 110745259, 104226815, 91895382, 84929097, 83450349, 78405496, 68144393, 61131989, 61179122, 62455327, 61408568, 60537189, 57723907, 47407282, 36931215, 43334323, 65207044]
33786F5207044J2206392j0382642j2678520N243966R183841r864996j7700778
33779D1214307M737132K5704668J3459343j1507573j0941419R949480J5947563
33772H8563501P30348q655376M8912R524718O952157M13939k742102o380726r647816
33763G8807555m805443M292832L731230o243238j0093303m354900l881075j4337365
33755D3116293k0415139j1231436J905757N019571K693959O643421J5097746J6797803
33747E9627975Q218740l859709j2328324j4432786r844395k85046R595176J3720800
33739E0412431Q316327l178612r402208k525663Q164081N491835q788324j2307091
33731C6182776L948284J9109795J4934048M140215M249727M107716j2716152k8755382
$$ y = [65207044, 77413436, 67030794, 54352274, 59596240, 68780081, 58915085, 41214307, 45951439, 71656107, 85115450, 73607877, 62666458, 72615938, 88563501, 89293849, 80638473, 80687385, 90212103, 97164260, 97578199, 94836097, 88455371, 78807555, 74002112, 78294944, 82026174, 75782936, 65689633, 61334733, 57453658, 43116293, 22701154, 11469718, 13375475, 18395046, 21089005, 27732426, 42830172, 59627975, 67846715, 63987006, 51658682, 37225896, 27381501, 27096455, 36691631, 50412431, 58728758, 55550146, 46147938, 43622275, 51786356, 57278191, 48489867, 36182776, 40131060, 59240855, 74174903, 78315118, 82564845, 86672561, 73956409, 45201027]
33723D5201027j5750201J3690792K0794483L114996m159207P868854P031958j7784046
33715F0008656l0696978r708692J2523629K551252j7802588r232631K0502041
33708B8144689L2322389J6276018m282072j4983985j8923391j3460358M616476
33701B9709766J7809941O715957j4825567j6945045j916056J83201j6452215k2341418
33693a8061436q22183K5759012L0440296J5880779L66886r093446j4689179j4190420
33685A5590309m275305R853764J7388834J1700907l735461j5466120j0955079
33678B0101849M285560R297630l508991j5064922q572467M606107P604336Q294857
33670B7043959J8939912K2802295j416333l2819869l0399423L68957J0946038
$$ y = [45201027, 29450826, 43141618, 63936101, 67051097, 62891890, 70760744, 77792702, 60008656, 29311678, 19602986, 32126615, 34677867, 16875279, 7642648, 28144689, 60467078, 76743096, 72461024, 57477039, 38553648, 25093290, 29709766, 47519707, 54235664, 39410097, 22465052, 20548996, 20732197, 4279982, -18061436, -18883619, 6875393, 37315689, 53196468, 53563354, 44469908, 29780729, 15590309, 11315004, 21168768, 38557602, 50258509, 46523048, 31056928, 20101849, 24387409, 33685039, 30176048, 15111126, 6538659, 11144766, 18749102, 27043959, 45983871, 68786166, 67369833, 34549964, 4150541, 4519498, 15465536]
33663A5465536j3082100k7902068l377718K7590534K1839053r472195k5119462
33656a4058420j5326038k107524K811879N026015M732371j562962n413989P35349
33648b5163319M736679n607386j5204030k323219K2717031L0240337J6887511
33641B6283604O607860P619822J962986j6468915k5259453q294225J7135882K4473813
33633C4061374J2343784p58126m492362m384516p440248j2287836j3142400p547168
33625c647498N68691N223778O551847J0834920J8592561J9089855N286298j1264752
33617E1235700j2565599R52245J0435220M422252p159604q687608N48410P493902
33609D6674918L178960n804203n680011M765040Q374885q215492l0367549k8909518
$$ y = [15465536, 2383436, -25518632, -28896350, -1305816, 20533237, 11061042, -14058420, -29384458, -31491982, -28680103, -23654088, -18921717, -20484679, -25898668, -25163319, -20426640, -26034026, -41238056, -43561275, -20844244, 9396093, 26283604, 32891464, 40511286, 42474272, 26005357, 745904, -7548321, 9587561, 34061374, 46405158, 45647032, 41154670, 36770154, 29329906, 17042070, 3899670, -3647498, -3078807, 2144971, 8696818, 19531738, 38124299, 57214154, 62500452, 51235700, 38670101, 39622346, 50057566, 54479818, 47320214, 38632606, 39181016, 46674918, 49853878, 44049675, 38369664, 43134704, 51509589, 43294097, 12926548, -15982970]
33601a5982970l42731K4504757K0411354j571252j5471497j3987973m264437J1538701
33593D833952K9200788L1046074P568297j9809647k3457670q523798j074543o129841
33585A3653612p386436k490449n373812j4704663j3141199j01665O664258M747929
33577a8132425R077818J7027548Q585627j1404591j1301460J3460055K5212562
33570C2525134L138426k1465799j5374672P200694J6980188J8328842K7766688
33563F9099501L0912239M520089l4824180m6630895k3727365K797890J0538673
33556A2685952M646198n493159j6131495j7756466l333712J3238167J3205721
33549A061206L630282M854289J3168376P686493q702288j0461544N913465J3470971
$$ y = [-15982970, -16325701, 8179056, 28590410, 27019158, 11547661, -2440312, -6704749, 4833952, 34034740, 65080814, 72649111, 52839464, 29381794, 20857996, 19783453, 13653612, 6267176, 3776727, -1597085, -16301748, -29442947, -29544612, -22880354, -18132425, -9054607, 7972941, 16558568, 5153977, -6147483, 7312572, 32525134, 35663560, 14197761, -1176911, 6023783, 23003971, 41332813, 69099501, 100011740, 104531829, 69707649, 23076754, -650611, 2147279, 12685952, 17332150, 11838991, -4292504, -22048970, -25382682, -12144515, 1061206, 4691488, 9545777, 22714153, 30400646, 21698358, 11236814, 17150279, 30621250]
33541C0621250o28237j4505958p946840Q955271J7803659J7555727J2724270j571862
33533F3007280k4708118l7972352k5270518M175050K7295641L2373739K3191827
33526F2092549Q176429m752556j0105668r069088o678287l262878L139754P040752
33518D6581007M94102j2085930j7081810r970795J623644J0663704J2858311J945270
33510C5027503j8858753k7278303p421437K0173211K1566992o59308j2685846
33503I864059m310541n35547j1881089j4612630L367426J6657273N948039q171172
33495c674182l134293O147568j769098j3064304m881286R954986N046793r680529
33487a5054345l146456K0990747K6596024K543613k1262912k0739869o456928
$$ y = [30621250, 29993013, 15487055, 7540215, 16495486, 34299145, 51854872, 64579142, 63007280, 38299162, 326810, -24943708, -20768658, 6526983, 38900722, 62092549, 70268978, 65516422, 55410754, 46341666, 39663379, 36400501, 39540255, 46581007, 47075109, 34989179, 17907369, 7936574, 9560218, 20223922, 33082233, 35027503, 16168750, -11109553, -18530990, 1642221, 23209213, 22549905, 9864059, 5553518, 5017971, -6863118, -21475748, -18108322, -1451049, 4496990, -3674182, -6808475, -660907, -2430005, -15494309, -20375595, -10420609, -5373816, -15054345, -18200801, 2789946, 29385970, 31929583, 10666671, -10073198, -16530126]
33480a6530126L325377Q993959J6396660K0154178J3963228K755539n271239p820736
33472C5966840m700781L689549J0246178M796048j1676513k4750859k1645739
33465h075277l397118J7652664K8229778K4754806J6419232J2239709N761320
33458I3585114j4024607l6095298l3925693o386711J3555089N734013q643669
33451A3798238n902100J672454m626505j0268836L946755J7150493j055914l0937999
33443a6223414k5424874J3457902L4228345J4889729r881130j0734892k711087
33436b399421m673120n488402N547263J3133154N946638n72943N387446R906438
33428B6787053L661826K339445J2861532J1993763j3101009l3784055k1639568
$$ y = [-16530126, -13204749, -4210790, 12185870, 32340048, 46303276, 49058815, 43787576, 35966840, 31266059, 34955608, 45201786, 49997834, 38321321, 13570462, -8075277, -11472395, 6180269, 34410047, 59164853, 75584085, 87823794, 93585114, 79560507, 43465209, 9539516, 3152805, 16707894, 22441907, 13798238, 7896138, 9568592, 4942087, -5326749, -1379994, 15770499, 14714585, -16223414, -41648288, -28190386, 6037959, 20927688, 11046558, 311666, -2399421, -7072541, -12560943, -7013680, 6119474, 12066112, 11493169, 16880615, 26787053, 30448879, 32788324, 45649856, 57643619, 44542610, 10758555, -10881013]
33421a0881013N641190J4127813N540065L193671O884972R71920p673766J11358
33413A7916210J6535473J5872983j988332j2449885q110791n377319q969349l871884
33405I557106J1934291J7524241J862622j7392797j8378142p83519J9880203K9010636
33397E3214641K0235643M6083j3396976r181455P03711r05644q662514m610236
33389C7443253Q748425R845330o783152k1343235j9466529r203697r00887P560926
33381E900434J6034844J3438733l214016j7447608j4528620j778951M305851Q01318
33373C511985l074511j467236M651716J2811834J8544706J5056925J727147j1025499
33365D0737067j2079115j946831R689670J5260636J3979458Q501554J651771l943072
$$ y = [-10881013, -5239823, 8887990, 14428055, 17621726, 24506698, 25478618, 17804852, 17916210, 34451683, 50324666, 48336334, 35886449, 27775658, 22398339, 13428990, 9557106, 21491397, 39015638, 40878260, 23485463, 5107321, 4323802, 24204005, 53214641, 73450284, 73496367, 60099391, 50917936, 51621647, 50716003, 42053489, 37443253, 46191678, 56037008, 49253856, 27910621, 8444092, -759605, -1660492, 5900434, 21935278, 35374011, 32159995, 14712387, 183767, -1595184, 2710667, 3511985, 437474, -1029762, 3621954, 16433788, 34978494, 50035419, 51762566, 40737067, 28657952, 26711121, 36400791, 51661427, 65640885, 74142439, 75794210, 71851138]
33357G1851138n777804l183240l10985m493043j5962652k1668960j0149870P565833
33349A7870417Q070082q672885j4187731N506796K3831534J2326419j3928673
33342C0815959j9528347l929569K603594p263731q009335J0336328K2743586J1926760
33334C9695245l660613l959016m9848r174034k1005977j5456508L122173J5409081
33326D920503J7616572J7825466J3226643k895073j8956796j6316714m0441N893368
33318B1273528n716889j6863566j3647236k547699P097297J6301045K4193937
33311C0090417K0880937L923004j1817110j2865934n407751l392190p379044q214996
33303E817333n286464o219484j0403950p697934L860148J2249937R432365L802213
$$ y = [71851138, 66073334, 62890094, 62579109, 58086066, 42123414, 20454454, 10304584, 17870417, 25940499, 17267614, 3079883, 8586679, 32418213, 44744632, 30815959, 11287612, 7358043, 9961637, 2697906, -5311429, 5024899, 27768485, 39695245, 36034632, 32075616, 32025768, 22851734, 1845757, -13610751, -10488578, 4920503, 22537075, 40362541, 53589184, 50694111, 31737315, 15420601, 15380160, 21273528, 15556639, -1306927, -14954163, -17501862, -10404565, 5896480, 30090417, 50971354, 54894358, 43077248, 30211314, 24803563, 21411373, 14032329, 5817333, 530869, -5688615, -16092565, -23790499, -19930351, -7680414, 1751951, 5554164]
33295E554164N407111Q162691M98232j1418717q370430J2045640K7032661J8350709
33287E7262061k952824j3433648q947947n003963j0876663j8468572j6691295
33280a9112851n191318P508143J1752682L875906p615696p484229O329875J5796618
33272E859130P915348k904045L374616J6218483P275897k1052768l1459629o881443
33264b1654411K0027688J3118979j5175974k5183056q086432Q218662N936565
33257b2797979r22841L436368J1273368R168778K829189O510597J6872210J5584936
33249D1954626k273736j7850558j3399351K669464P165810n443701j6036015r197613
33241a2411074N279204Q655578O455o902326o118786k959038P97424P628844J1461840
$$ y = [5554164, 10961275, 19123966, 19622198, 8203481, -166949, 11878691, 38911352, 57262061, 54309237, 40875589, 31927642, 26923679, 16047016, -2421556, -19112851, -24304169, -16796026, -5043344, -1167438, -8783134, -16267363, -9937488, 5859130, 13774478, 10870433, 14245049, 30463532, 37739429, 16686661, -14772968, -21654411, -1626723, 11492256, -3683718, -28866774, -36953206, -28734544, -22797979, -23720820, -20284452, -9011084, 157694, 2986883, 9497480, 26369690, 41954626, 39680890, 21830332, 8430981, 11100445, 18266255, 12822554, -3213461, -12411074, -7131870, 1523708, 1530163, -5372163, -11490949, -14449987, -13652563, -6023719, 5438121]
33232E438121K903671j0805317j0415506N562464J4915421L985647j2421627j4808379
33224a5645505n975106j39963O34149K719936M116528j709642j1215281j4313880
33216d1528764q520073J070343J0646200J7271832J6437248R235437M532341N625621
33208A4770185M469798j929645k357045Q816470J6517401O714000q751030r331860
33200B8918274J586590L880141n518058j0320123m544432J18113q96977L378147
33192A6601675J5852405K0384331N817643j4536526j9929576q601326L494646
33185A9083272L755056n514840j2286779o537589R402949K0233673J2646920q094042
33177C2688620k2857877k0620188q494019J219679N657233R423098J4039277J4389842
$$ y = [5438121, 8341792, -2463525, -12879031, -7316567, 7598854, 11584501, -837126, -15645505, -21620611, -21760574, -21126425, -18406489, -14289961, -15999603, -27214884, -41528764, -50048837, -48978494, -38332294, -21060462, -4623214, 4612223, 9144564, 14770185, 19239983, 17310338, 14953293, 23769763, 40287164, 47001164, 38250134, 28918274, 30504864, 34385005, 28866947, 18546824, 14002392, 14120505, 13223528, 16601675, 32454080, 52838411, 58656054, 44119528, 24189952, 15588626, 19083272, 22838328, 17323488, 5036709, -1500880, 7902069, 28135742, 40782662, 32688620, 9830743, -10789445, -19283464, -18063785, -12406552, -2983454, 11055823, 25445665]
33169B5445665N200755r565906j5699459l455867J5652093J7526682l197350k3168859
33161H737754k2204433j1013558r871045j2895475M76285K4677785K9737877P956356
33153A5601546j0929443l816469J2217779R560010o513159q542688R371780K3711668
33145D0661024J6718249j245749r877863m903762K231346J822058n712447j5122640
33137B4570216k1902836k1963305j1925891O030154K1946611K5201634J4192174
33130C6148757l123308j6450157j7923233m488628J6381036K6945884J6951483
33123E4441834k34739l315417N621016M285994j2361646k1604615j0079345L611192
33115B0364274P86259o707013j378155O313668r76092j1157885k786474J1816338
$$ y = [25445665, 30646420, 21080514, 5381055, 1925188, 17577281, 35103963, 31906613, 8737754, -13466679, -24480237, -34351282, -47246757, -46770472, -22092687, 7645190, 15601546, 4672103, 855634, 13073413, 22633423, 16120264, 7577576, 16949356, 40661024, 57379273, 56133524, 46255661, 41351899, 43583245, 45405303, 39692856, 24570216, 2667380, -19295925, -31221816, -25191662, -3245051, 21956583, 36148757, 33025449, 16575292, -1347941, -5836569, 10544467, 37490351, 54441834, 54207095, 50891678, 56512694, 60798688, 48437042, 26832427, 16753082, 20364274, 21150533, 14443520, 13065365, 19379033, 18402941, 7245056, 4458582, 16274920]
33107A6274920L410040k0823216k3318426L441441K4561990J8031630K263395
33100B3841774l086235m970473r821497n452294J0118448J5301570J633575q013339
33092A9551529L84340O979525j824050l970834J4824632K3040693q259592m6425987
33084D300256l7224151J1671016L9050155J7504611j6705650k4864981j1636841
33077a7905585J412858Q715382J0391705M31601j6253301j8598895J856224K5112744
33069d837267K8854793J4390458l423818j4869277j3937724L728229K8490937
33062C8396331L7065965J8666551r691120k4111933j9934020q991312k158933
33055B9241529k990061q191041p284952P158551K3411308J9182819n952685k3404594
$$ y = [16274920, 19684960, -1138256, -24456682, -21015241, 3546749, 21578379, 23841774, 20755539, 15785066, 5963569, 511275, 10629723, 25931293, 27564868, 19551529, 19935869, 26915394, 25091344, 21120510, 35945142, 58985835, 50726243, 4300256, -32923895, -21252879, 17797276, 35301887, 18596237, -6268744, -17905585, -16492727, -7777345, 2614360, 3045961, -13207340, -31806235, -29950011, -4837267, 24017526, 38407984, 34984166, 20114889, 6177165, 9905394, 38396331, 75462296, 94128847, 84437727, 60325794, 40391774, 31400462, 29241529, 26251468, 18060427, 10775475, 17934026, 41345334, 60528153, 54575468, 31170874]
33047C1170874j2986700Q642009J3382611J444390n279045O4087L648401o56618
33039C9430009k173868K788825M71640j6180031l0320994k2707672J206430K0540719
33031f944942K6675515K5411699J7849520n45155k1458571k5341292r170222M963913
33023A1440465J96563j1512986j0275099J164792O151995K696027J715714L487920
33015E065391q35083p568862m775688K819063n68026r975989l078883J8861611
33007e6466K5725549O356676j1269997o231600J664969r630962k2421999r590396
32999b5454226J6689826K4460039J3243232O644916O239418n567904k3291824
32992A2963477k1685143j177625J0883383P797893J1379243K4906550K0932985
$$ y = [31170874, 18184174, 26826183, 40208794, 41653184, 36374139, 36438226, 40086627, 39430009, 37256141, 40044966, 40516606, 24336575, -5984419, -28692091, -27485661, -6944942, 19730573, 45142272, 62991792, 62446637, 40988066, 15646774, 6476552, 11440465, 11637028, 124042, -10151057, -8986265, -2834270, -138243, 1577471, 5065391, 4230308, -3338554, -8114242, -5295179, -5863205, -15839194, -18918077, -56466, 25669083, 32025759, 20755762, 14524162, 16189131, 6558169, -15863830, -25454226, -8764400, 15695639, 28938871, 35583787, 41823205, 36255301, 12963477, -8721666, -9899291, 984092, 8781985, 20161228, 45067778, 66000763]
32985F6000763p999676k6346910p593817K2829236K5128065J962586j1965832
32978F2014415k159553J1800580Q610937r846790k5446290k4098308r867834j325284
32970I681873p954284j3962271k44225K2242944K4610308M842801q704816l347546
32962B7164784J029422q099941j3605323m172060J656784r086669j5724309k21891
32954b1059203J7195901J2122230k45653O314535J8785555P267022j7484667j6794195
32946F101525J1154907K6676246J1660934o894393n626924L225549K858458m81031
32938D8675271J610171J429368l809232K24667J6782100K2930470M684297j5405457
32930G7121655j1179624N444617M999301j0288331j1087840Q111937J6374599
$$ y = [66000763, 58001087, 31654177, 24060360, 46889596, 72017661, 73980247, 62014415, 59854862, 71655442, 80266379, 70419589, 44973299, 20874991, 11007157, 9681873, 1727589, -12234682, -12478907, 9764037, 34374345, 39217146, 30512330, 27164784, 28194206, 20094265, 6488942, 2316882, 3973666, -5113003, -20837312, -21059203, -3863302, 8258928, 8013275, 14327810, 33113365, 40380387, 22895720, 6101525, 17256432, 43932678, 55593612, 48699219, 43072295, 46297844, 49156302, 48675271, 50285442, 51714810, 47905578, 48130245, 64912345, 87842815, 92527112, 77121655, 65942031, 71386648, 76385949, 66097618, 55009778, 63121715, 79496314]
32923G9496314n488024l1112743k3163746J3086722L4879224J8815602j0236968
32916G6276381j6672359k157951M303872n089791o909063J0359324K2426559P030849
32908H9567821j7378681j8464134r94645K026593j5857503k4189339n655742J6767680
32900B5822050J7461304N409326L315133J0233666Q890354k647070j0202088p965251
32892E0317424l228308q030L747203M334182m318870j4321179q385647J3888933
32884D2025708K9226517J9155260n543227j9661365j5661079q188468q869811
32877C2483535j0756913k962110J0379180J6457892J3474997J1094707J1928563
32870H2099851O608133p953432j8605831j3915668j853525K763902Q42348M311492
$$ y = [79496314, 74008290, 42895547, 19731801, 32818523, 67697747, 86513349, 76276381, 59604022, 57446071, 61749943, 56660152, 49751089, 60110413, 82536972, 89567821, 72189140, 53725006, 52730361, 54756954, 38899451, 14710112, 9054370, 25822050, 43283354, 48692680, 52007813, 62241479, 71131833, 68484763, 58282675, 50317424, 47089116, 47081086, 50828289, 55162471, 50843601, 36522422, 28136775, 42025708, 71252225, 90407485, 84864258, 65202893, 49541814, 41353346, 32483535, 21726622, 18764512, 29143692, 45601584, 59076581, 70171288, 82099851, 88707984, 80754552, 62148721, 48233053, 46379528, 49143430, 49985778, 54297270]
32862E4297270J3347024J5078731N558262l176893k934599k386856j1570029k3002510
32854D5210400j9306494L241720K7469079L3431074J9663141K591941m885726
32847A07415135p638214j4491253j7199562m92975K6122338L0175494K500268
32840A26391231k1065343p303734K3009899K2900164j1111086l3487790j5368033
32833H3965308J9329934L3515854K1993546K066762j4543277k1974327j3603219
32826A10750581N218407J3802656K954400r305887m646121Q703432J3593536J2588038
32818A53659042J7381005K2214934J2432734o865952j4403881m156503O460185
32811A86721564K122148j1358332j6735054n063300J5315690K5187090J4010624
$$ y = [54297270, 67644294, 82723025, 88281287, 85104394, 82169795, 79782939, 68212910, 45210400, 25903906, 29145626, 56614705, 90045779, 109708920, 112300861, 107415135, 99776921, 85285668, 68086106, 67593131, 93715469, 123890963, 126391231, 105325888, 98022154, 121032053, 143932217, 132821131, 99333341, 83965308, 103295242, 136811096, 158804642, 160871404, 146328127, 124353800, 110750581, 115968988, 129771644, 132726044, 123420157, 118774036, 127477468, 141071004, 153659042, 171040047, 193254981, 205687715, 198821763, 184417882, 180261379, 186721564, 188843712, 177485380, 160750326, 155687026, 171002716, 196189806, 210200430]
32804B10200430m021582l655115J6641922K8665710J3449448j0750120j5742262
32797B34788431l090448M908201K127284J826790R182152J4935499J4846753J4187909
32789B93712571J3346990Q153892L572317Q139486J5794618J2446034j33730o676291
32781C48355887m077225l614290o941478k803419Q482585J0444545j971204j1261781
32773C36613620l862363J0295880J5385999J0868512M137417l612703j2421796
32766C57404566j6167908j1297443l879900N49612M714053R585474P313624o328677
32758C41893401k1026085k3279067j3185377k309162R13605k015565m381757k601228
32750B74008765j141380o850255j5644932j3165774K719574J1281030l143472
$$ y = [210200430, 206178848, 202523733, 219165655, 247831365, 261280813, 250530693, 234788431, 231697983, 236606184, 238733468, 240560258, 249742410, 264677909, 279524662, 293712571, 307059561, 315213453, 318785770, 326925256, 342719874, 355165908, 355032178, 348355887, 344278662, 340664372, 333722894, 330919475, 339402060, 349846605, 347875401, 336613620, 332751257, 343047137, 358433136, 369301648, 373439065, 369826362, 357404566, 341236658, 329939215, 326059315, 326608927, 331322980, 340908454, 348222078, 341893401, 320867316, 297588249, 284402872, 282093710, 283007315, 280991750, 276609993, 274008765, 272867385, 266017130, 250372198, 237206424, 239925998, 251207028, 248063556]
32743B48063556k3120066k1304925m514992m608633k5396268l2544401o432965
32736A30141306K6345112L1452480J1142486r101412j6490267j3178052j422679
32729A58888974J2107441J2213296m646498j9189254j5938500o226555o234158
32722A30974746q490575K353766J9433739K4018264J5722778Q523921M971634
32715A97508273k370657j0827782j1617055p894452p570935n358767N993017J4951576
32707A72813218O851453o760782k482344J5192778J8474265J158983j1370436
32700A93877135k971946J0109849P287037p475682j6258277j0361028N421237
32693A79628325J8555105J5668871k293171j3245711o40304J6800852P938195
$$ y = [248063556, 224943490, 203638565, 199123573, 194514940, 169118672, 136574271, 130141306, 156486418, 187938898, 199081384, 189979972, 173489705, 160311653, 158888974, 170996415, 183209711, 178563213, 159373959, 143435459, 137208904, 130974746, 122484171, 124837937, 144271676, 168289940, 184012718, 192536639, 197508273, 195137616, 184309834, 172692779, 164798327, 157227392, 151868625, 157861642, 172813218, 179664671, 172903889, 170421545, 185614323, 204088588, 205247571, 193877135, 190905189, 201015038, 208302075, 200826393, 184568116, 174207088, 179628325, 198183430, 213852301, 211559130, 198313419, 197673115, 214473967, 222412162]
32686B22412162j9032796k1153348J4271347M4578240L2179069k44106n221619
32679B67788949J8837138K8387129J091145l2005826l0110437L661179K9320863
32672B86970140K2837174M199922O286284K7654361L4896193J2645219j2079692
32665C83409601r990312O895366P192919r113384j5006869n047912k155184j2615747
32657C43568478j2095328J0960710L1604350K6206042O106924o002176q697225
32650C91651775j0264155o724893O155298J6292603J1298566l200281j6835745
32643C88373168k9004309l5974090k5016648J326056J7490258J0413823n91704
32636C27016554P12209p9055j4929045k2941703o769504Q541812n944088k9264155
$$ y = [222412162, 203379366, 182226018, 196497365, 241075605, 273254674, 273010568, 267788949, 286626087, 315013216, 316104361, 284098535, 253988098, 257649277, 286970140, 309807314, 314007236, 320293520, 347947881, 382844074, 395489293, 383409601, 373419289, 380314655, 387507574, 378394190, 363387321, 358339409, 356184225, 343568478, 331473150, 342433860, 374038210, 400244252, 406351176, 400349000, 391651775, 381387620, 374662727, 380818025, 397110628, 408409194, 405208913, 388373168, 359368859, 323394769, 298378121, 299704177, 317194435, 327608258, 327016554, 327728763, 327649708, 312720663, 289778960, 283009456, 291551268, 285607180, 256343025]
32628B56343025k1982500O522720J3672656m424255j1601417R08557K641514j4127641
32620B27952659j7160996M466649J4387684j0199935l6691032k7393425M208988
32613A59570592K0397172J4365425O153634M923350N493613O807664Q312557J440893
32605B27464900j4333198k1728336j1150540O49588k845340j0460578m615308
32598A62981188O818513M837570p951435j4195941j1332676j0210792j2019593
32591A18926834r042102k271685J833816N870740J3924349J6545050K585809j9611814
32583A28760997l0594461k4060830q048391R340358K0093214J4071334m816714
32576A04745507j2590525L555584K0816440J2180711j0355309j3947148K735520
$$ y = [256343025, 234360525, 240883245, 254555901, 250131646, 238530229, 239438786, 242080300, 227952659, 210791663, 215258312, 229645996, 219446061, 182755029, 155361604, 159570592, 179967764, 194333189, 200486823, 205410173, 210903786, 217711450, 226024007, 227464900, 213131702, 191403366, 180252826, 180902414, 178057074, 167596496, 162981188, 169799701, 174637271, 166685836, 152489895, 141157219, 130946427, 118926834, 109884732, 107613047, 109446863, 115317603, 129241952, 145787002, 148372811, 128760997, 98166536, 74105706, 66057315, 75397673, 95490887, 109562221, 104745507, 92154982, 95710566, 116527006, 128707717, 118352408, 104405260, 107140780]
32569A07140780R809079l203448j2424441j029007J6041835J9308740J0642693
32562A46286231O06774p971921j3019872r342197j344052j691666r655041r560544
32554I4307712K036992Q321807M26840p384936k464102O037479N265674p96300
32546A05751166l240735m777087r680873j1299239m023585M521452O004855M037747
32538H7293701L463638J042011k532670J980621J2719763J1707365n055188j3784048
32530I6835193K59706J4225394L574240j3679518m776226J9337074J6623866j7044174
32522A15355555l6497958j5477693J4713668J5558423l457448q431591M271548
32515H6034504R802084j069148j1393157r340396l553130l482273m931104j856528
$$ y = [107140780, 116949859, 113746411, 101321970, 100292963, 116334798, 135643538, 146286231, 146893005, 138921084, 125901212, 116559015, 115214963, 113523297, 103868256, 94307712, 96344704, 104666511, 105093351, 97708415, 95244313, 101281792, 106547466, 105751166, 102510431, 97733344, 88052471, 76753232, 72729647, 77251099, 83255954, 87293701, 90757339, 91799350, 89266680, 91247301, 103967064, 115674429, 110619241, 96835193, 97094899, 111320293, 114894533, 101215015, 96438789, 115775863, 132399729, 115355555, 78857597, 63379904, 78093572, 93651995, 90194547, 81762956, 86034504, 95836588, 94767440, 83374283, 74033887, 70480757, 66998484, 62067380, 60210852]
32507F0210852K651915M688326P646212J4490040J9834117J6835774P017314k200920
32499A31173630o037559m660917j135050n76175o478433j3503119r657618P315756
32491I6440515K0980107J4531072l948235q626688Q032079K1320219P180562k3019076
32483A32890555l7149011k4704885m319815R264169K1347640L3167635K6743096
32476A57239384o710339m0135796l8085450m805315J9539780J1310882j0395498
32469H7957648j5861156l024621Q184257O198306j285032q06625J2212181K9207112
32461A22782070L3907590J6962671j1179737k8347716k4840662j1673146j598921
32454I6012149O535029J6972767K2145446J1735096q746190k0796068j3590156
$$ y = [60210852, 62862767, 67551093, 75197305, 89687345, 109521462, 126357236, 133374550, 131173630, 125136071, 120475154, 119340104, 118763929, 112285496, 98782377, 89124759, 96440515, 117420622, 131951694, 128003459, 119376771, 127408850, 148729069, 155909631, 132890555, 95741544, 71036659, 66716844, 75981013, 97328653, 130496288, 157239384, 150529045, 110393249, 72307799, 67502484, 87042264, 98353146, 87957648, 72096492, 69071871, 77256128, 83454434, 82169402, 81362777, 93574958, 122782070, 156689660, 173652331, 162472594, 134124878, 109284216, 97611070, 96012149, 102547178, 119519945, 141665391, 153400487, 144654297, 123858229, 110268073]
32447A10268073N469994J8985857J4012516o264939k0793741r519394J9069152
32440A31227518L0873110Q151808k3667364k8113913o102216J0363812O750269
32433A29483024O31092N825281J0478486K130645r245134r476273l177221r26017
32425A25723883J505768J1612439J9535515J0845474o438575r585064N303298
32418A58502738J7669969J3057366J211344k559179Q82767P88281n562131j1411275
32410A72579880j1798388p684238j235621N470841O980186k990555k0832689k9372963
32402A11116453j4279337J4118565K6160734Q310051j6376418j7117349L200414
32395A15133113J5680767J0183768N462927J1290269J1603143j287854o666272
$$ y = [110268073, 115738067, 134723924, 148736440, 142471501, 121677760, 112158366, 131227518, 162100628, 170252436, 146585072, 118471159, 112368943, 122732755, 129483024, 130114116, 135939397, 146417883, 148548528, 139303394, 129827121, 126649900, 125723883, 127229651, 138842090, 158377605, 169223079, 162784504, 153199440, 158502738, 176172707, 189230073, 190441417, 187882238, 188765005, 189553286, 183991155, 172579880, 160781492, 153097254, 151861633, 157332474, 164312660, 161322105, 140489416, 111116453, 96837116, 110955681, 137116415, 145426466, 129050048, 111932699, 115133113, 130813880, 140997648, 146460575, 157750844, 169353987, 168066133, 161399861]
32388A61399861P993640J8446451J771620k0540982j4152029J1254862J8136222
32381A84309645K820027m189088M427544L018345j4908080k2228873q087096K536276
32373A47698700l919393o073022P176855J0804519r002033k2198011m097078J8784874
32365A39175411J1456452j1898986j5669234j916814L753719L319955J4394107
32358A42614610K3912188N752269k4988977k7510370j123503J5785967J1589524
32351A46031708J2247372K1795984R577914k7471590m4964175j9230247J2709888
32344A10696854J2235104m204760k948761R244178O428443n582114k806952J0212304
32336A33274296Q621788p727110j4671494m780114M547284L452855K268292R253616
$$ y = [161399861, 169393501, 187839952, 189611572, 169070590, 154918561, 166173423, 184309645, 187129672, 182940584, 187368128, 190386473, 175478393, 153249520, 145162424, 147698700, 143779307, 137706285, 144883140, 155687659, 146685626, 124487615, 120390537, 139175411, 150631863, 138732877, 123063643, 121146829, 124900548, 128220503, 142614610, 166526798, 172279067, 147290090, 119779720, 118656217, 134442184, 146031708, 158279080, 180075064, 189652978, 162181388, 117217213, 97986966, 110696854, 122931958, 118727198, 115778437, 125022615, 131451058, 125868944, 123061992, 133274296, 141896084, 134168974, 119497480, 114717366, 119264650, 122717505, 124985797, 134239413]
32328A34239413J7295762J6177937L879503j3563732k3116981j2685046J0618695
32321A32845551K1132692P449154r031428n635087P057755N412392o570431n949447
32313A46711151Q127564J3682284M187861l289834j012079k071891j1707815j4469635
32305A40157606j872875J0206029O169264n679672r180277n064368l831891n104186
32297A25799630q28415O878769O807480k859507r214339j476762J3428541J7488022
32289A56023419L116377j6153005k0409607p117961O675221O656479l480899j2622514
32281A12687510j6390967j2925558K551517K5418805L4977479J8235292o864564
32274A57689514j2431866p62874j51004j9443409l1967608j4536250J8469539
$$ y = [134239413, 151535175, 167713112, 171592615, 158028883, 134911902, 122226856, 132845551, 153978243, 161427397, 152395969, 146760882, 153818637, 159231029, 152660598, 146711151, 154838715, 168520999, 172708860, 169419026, 168406947, 166335056, 154627241, 140157606, 138284731, 148490760, 154660024, 148980352, 139800075, 134735707, 130903816, 125799630, 124971215, 131849984, 138657464, 135797957, 126583618, 125106856, 138535397, 156023419, 159139796, 142986791, 122577184, 115459223, 122134444, 128790923, 125310024, 112687510, 96296543, 83370985, 85922502, 111341307, 146318786, 164554078, 157689514, 145257648, 144494774, 144343770, 124900361, 92932753, 78396503, 96866042]
32267I6866042L5207893K6414552Q952968j862394o378148r235342r021962l814226
32259A37129383J703512J478850k166552m20637Q407743J2682828J769427j5941616
32251A44642938j9776227l464849J6106143K1678829J5251262P465872O02579
32244A82506547n986002n821815L531864Q947554r98430j4719246j2248843M657407
32236A59869036J6498780J5224920Q679554q3761j4443148k6168763k0411585
32229A39165033j385125J0348727R676716J1706024K0097606J7902709R5478j1584264
32221A96022904k118761J1316429O183996j1242074j8091303p788521P097573
32214A81380243J4313476R481149n487753j9234470j7841818n510489l475388
$$ y = [96866042, 132073935, 158488487, 167441455, 165579061, 159200913, 149965571, 140943609, 137129383, 138832895, 140311745, 138145193, 137724556, 146132299, 158815127, 160584554, 144642938, 124866711, 121401862, 137508005, 159186834, 174438096, 181903968, 182506547, 176520545, 170698730, 174230594, 183178148, 182179718, 167460472, 155211629, 159869036, 176367816, 191592736, 200272290, 200188529, 185745381, 159576618, 139165033, 137779908, 148128635, 157805351, 169511375, 189608981, 207511690, 207607168, 196022904, 193904143, 205220572, 211404568, 200162494, 182071191, 174282670, 181380243, 195693719, 205174868, 199687115, 180452645, 162610827, 157100338, 153624950]
32207A53624950j6952500k2147317k293139K3243715K7160879J3370396L009579
32200A79016563j955589j1270722j6020504j102491J8392809J1078633j9039626
32193A59099073l2074684j1707015J0796039P180092o658171l251022J0514278
32186A33898590J0056267k943147o166974K804249L944037q214066j5128183p481327
32178A10769446p66751o292181j0390095M86307J3352439R374949k918383j099096
32170A12516635J2203580J3205397o97432m768143Q169051R882328j5958069l8334695
32162I6218652k2318372J3254668K0875589l309655j5957063K949306K0533036
32155A12246161P577151j4114917p742598K2027687L8734404K4769459m117545
$$ y = [153624950, 136672450, 114525133, 112231994, 135475709, 162636588, 176006984, 179016563, 177060974, 165790252, 149769748, 148667257, 167060066, 178138699, 159099073, 127024389, 115317374, 126113413, 133293505, 126635334, 123384312, 133898590, 143954857, 141011710, 134844736, 137648985, 141593022, 133378956, 118250773, 110769446, 110002695, 103710514, 93320419, 93806726, 107159165, 116534114, 113615731, 112516635, 124720215, 137925612, 137228180, 132460037, 140629088, 150511416, 134553347, 96218652, 73900280, 87154948, 108030537, 104720882, 88763819, 91713125, 112246161, 119823312, 105708395, 97965797, 119993484, 158727888, 183497347, 179379802]
32148A79379802k5242506k7886814j3465985M551767P999429l962423j0595330
32141A10777940j179643N537878o853362j9577838o365232J9534520K0972937
32134A22847200n506897k3976577j3864975M582652R256530Q092640J5106992
32127A16537565K1271525J1829338m878579q776806J134423O976427r54238j2771794
32119A30367861j4524993n138702L765928J484075q151928q720404P893936K6395117
32111A33370890K4997747N418723q906976n394426M193984O836184N388853L711505
32103A69616484n371616k1913192k5812127l091272K5564834K6097223k618241
32096A62472093k6171840k0411378N08177R197188J303581n866289j125001Q401262
$$ y = [179379802, 154137296, 126250482, 112784497, 117336264, 125335693, 121373270, 110777940, 109598297, 115136175, 108282813, 88704975, 82339743, 101874263, 122847200, 117340303, 93363726, 79498751, 84081403, 93337933, 101430573, 116537565, 137809090, 149638428, 144759849, 135983043, 137117466, 144093893, 143139655, 130367861, 115842868, 110704166, 114470094, 115954169, 107802241, 99081837, 106975773, 133370890, 158368637, 163787360, 154880384, 149485958, 153679942, 160516126, 165904979, 169616484, 164244868, 142331676, 116519549, 113428277, 138993111, 165090334, 162472093, 136300253, 115888875, 116397052, 125594240, 126897821, 121031532, 119906531, 128307793]
32088A28307793J0912924M791236k895032o318429n121927j431877L068967O643679
32080A37957334O844849K334524n096523j1109179j1258286l955421O404629J0019507
32072A32141434P82928j3167923j4504510K006725J8634716J3887386r737632
32065A30043124k7102374k0483165J105505J6226808J6258571R533768N590155
32058A31172392M490354K441862O51987L099980P905380P716317Q52919m272170
32050A54059021j554781J667986m562279j4959651j5509055o693308l031250o566462
32042A02850221j724110J3951687J6834659o416633k9602366k0638118R144607
32035H4399947K0257463K784815j4354617j1853141l500902l549440k994932O806388
$$ y = [128307793, 139220717, 144011953, 141116921, 134798492, 129676565, 128244688, 131313655, 137957334, 144802183, 147136707, 142040184, 130931005, 119672719, 115717298, 122121927, 132141434, 132924362, 119756439, 105251929, 107258654, 125893370, 139780756, 130043124, 102940750, 82457585, 83563090, 99789898, 116048469, 125582237, 131172392, 135662746, 138104608, 138756595, 141856575, 149761955, 157478272, 158331191, 154059021, 152504240, 154172226, 149609947, 134650296, 119141241, 112447933, 109416683, 102850221, 101126111, 115077798, 131912457, 125495824, 95893458, 75255340, 84399947, 104657410, 107442225, 93087608, 81234467, 77733565, 74184125, 71189193, 77995581]
32027G7995581J4278714R543352L394992N415928M082211j0053832k0392374q389386
32019G5875186J3043295J6847885K352643q287663o956976m666484k965269R742853
32011I4985470K9559205L3051375J2056239j0838621j4735796q806530j2690231
32004A22581111k4550842k7289847j6269956j819288J0145339K1045659K5106657
31997A08948833J1946913j1405943j9114258J036211K6094288K4479074k028161
31990A39956957k0557932j1885979N853234O999941m355364m335825J1914976
31983A23590008K2921046J3850398k815573q141997k936983k99120k625476j759777
31975A41782526K678884J331566p319710j1502567m269490L351070l088250j8686526
$$ y = [77995581, 92274295, 101817647, 105212639, 110628567, 114710778, 104656946, 84264572, 75875186, 88918481, 105766366, 108119009, 99831346, 92874370, 88207886, 85242617, 94985470, 124544675, 157596050, 169652289, 158813668, 144077872, 135271342, 122581111, 98030269, 70740422, 54470466, 52651178, 62796517, 83842176, 108948833, 120895746, 109489803, 90375545, 91411756, 117506044, 141985118, 139956957, 119399025, 107513046, 113366280, 120366221, 116010857, 111675032, 123590008, 146511054, 160361452, 157545879, 149403882, 146466899, 146167779, 143542303, 141782526, 144461410, 145792976, 138473266, 126970699, 122701209, 126052279, 122964029, 104277503]
31967A04277503k2016528k711334K2016889K5456967L245728k0983398k3566434
31960H5719393o553123J0440115J7261394K0462119K4518773J9947496j362754
31953A70433413k7108104l3720938j5682651M222967J112331j9817018k7664371
31946E1775629n506183K4510672K7189663L06795k2386137j6904775J207383M512864
31938F4705911n921869q155741K417188P332294k860113j3887562j1208103M61337
31930C2883342R341661J2808669J2171592M785502p875734j4729348q297275M230783
31922D5319192J1721620J3359368J4077960J3235812O899718l623167j2834528
31915H8155975j6652619j2756240j385176J0442974J3133769P140697L219896
$$ y = [104277503, 82260975, 79549641, 101566530, 127023497, 130269225, 109285827, 85719393, 79166270, 89606385, 106867779, 127329898, 151848671, 171796167, 170433413, 143325309, 109604371, 93921720, 98144687, 99257018, 79440000, 51775629, 46269446, 70780118, 97969781, 98276576, 75890439, 58985664, 60193047, 64705911, 58784042, 50628301, 53045489, 60377783, 57517670, 43630108, 32422005, 32883342, 42225003, 55033672, 67205264, 71990766, 64115032, 49385684, 41088409, 45319192, 57040812, 70400180, 84478140, 97713952, 104613670, 100990503, 88155975, 71503356, 58747116, 57361940, 67804914, 80938683, 88079380, 91299276]
31908I1299276O333591R360870P366994N956857Q420376P488153l23950m860982
31900A31041185O34326M587399m790207j6179025r828391R172632J4308994l364951
31892A25581962k0511803j5157597J806196M352080r576792j6796150n922484
31885F3775412N890235L254368J4933J4591461L0414298J3656832k8791441m6533008
31877E6273090j6529013J9250539J5423289r894383j0695741R563056R147153
31870G2537990j5523549k3736567l239225R936407j617136p132829J1090459K1204857
31862F3520407P3624k0820968q446502J5288822J5407804M626276J2071220K3650341
31854A05371024R324692j4837959j0800948J1930419J0917531j4381896k2677783
$$ y = [91299276, 97632867, 106993737, 114360731, 120317588, 128737964, 136226117, 135902167, 131041185, 131675511, 136262910, 131472703, 115293678, 105465287, 114637919, 128946913, 125581962, 105070159, 89912562, 91718758, 96070838, 86494046, 69697896, 63775412, 69665647, 72920015, 72934948, 87526409, 117940707, 131597539, 102806098, 56273090, 39744077, 58994616, 74417905, 64523522, 53827781, 63390837, 72537990, 57014441, 33277874, 30038649, 39975056, 38357920, 31225091, 42315550, 63520407, 63594031, 42773063, 34326561, 49615383, 65023187, 69649463, 81720683, 105371024, 114695716, 99857757, 89056809, 100987228, 111904759, 97522863, 74845080]
31847G4845080m104528N677064r204410k0669101j0075473L642550M107756J771655
31839D5990593L553450p20047q366720j172711J4996743J0947451j1797803j4386499
31831C9044457J3079735K7509928K215014k6655544j8563937Q017214J2666619
31824E7313486l48820Q21266J5534433J5296369l938685j7003492j2457485m669771
31816E0547301m071521m368235k7294N576219Q938822P771526p96172j0422574
31808E3148072n725510J2964056K0557866J642381k2209142k1773818j855662
31801C6748243J0948031Q859813M744394L950470J646951O74948N994118Q116877
31793H1683845k324175j0875948J801831K2829999J9860547r302794l0260065
$$ y = [74845080, 70740552, 76417616, 67213206, 46544105, 36468632, 40111182, 44218938, 45990593, 49544043, 48823996, 40457276, 39284565, 54281308, 65228759, 53430956, 39044457, 52124192, 79634120, 81849134, 55193590, 36629653, 44646867, 57313486, 56964666, 57785932, 73320365, 88616734, 84678049, 67674557, 55217072, 50547301, 46475780, 42107545, 42080251, 47656470, 56595292, 64366818, 63570646, 53148072, 47422562, 60386618, 80944484, 82586865, 60377723, 38603905, 36748243, 47696274, 56556087, 61300481, 65250951, 66897902, 67572850, 73566968, 81683845, 79359670, 68483722, 70285553, 93115552, 112976099, 103673305, 73413240]
31786G3413240k0116996N168102J9239651J6827866O627840o091842j6604032
31779G8463829j5897785k145946J2175452J4480132P005151Q63799O74456J021474
31771I6640562m221270j2743026j5389201q714521l262345j0792249k3670805
31764A7847145k0947975P04908J8724607J6480744N988992N285372J0523104Q960123
31756F3567020M192774O156948Q188825j588789j4681872j2696857K608879J3440368
31748F9187296J4412066J2491037M538645j6737850l6581167k8512431M890256
31741B3687852K9349178K4273717N610800n093859r378782j6564316k1110113
31734C0774477j2362897N873083J9536521K0541329J0944282j416542p177540
$$ y = [73413240, 53296244, 58464346, 77703997, 94531863, 101159703, 95067861, 78463829, 62566044, 60420098, 72595550, 87075682, 94080833, 94944632, 95619088, 96640562, 92419292, 79676266, 64287065, 55572544, 52310199, 41517950, 17847145, -3100830, -2395922, 16328685, 32809429, 38798421, 44083793, 54606897, 63567020, 67759794, 73916742, 82105567, 80516778, 65834906, 53138049, 55746928, 69187296, 83599362, 96090399, 100629044, 83891194, 47310027, 18797596, 23687852, 53037030, 77310747, 82921547, 77827688, 68448906, 51884590, 30774477, 18411580, 24284663, 43821184, 64362513, 75306795, 73890253, 66712713]
31727F6712713l947518j866016j0170768j9604790j3256019N542279J4831659
31720C8241540O402988l157907Q7373Q348338R680474O754056O143389L901281
31712G6401532m662779j2020769q440444K549549R496205Q174164L275493J57536
31704G4930487J100228N027587P048079L246739k802049m802532m029963n472764
31696G4245812n693598J941643J0159251K741352j9159594l2201572k0416900
31689A1616394L976777J8381464J7256654J2400766J4189402K0948342K2157928
31682A20927727Q611556j5122492k9317243k0292505j547281P63445j6044747
31675D7978460k7133049j6219823L163631J0950924P357787M119095L395278M8674
$$ y = [66712713, 62765195, 60899179, 50728411, 31123621, 17867602, 23409881, 38241540, 44644528, 41486621, 41573994, 49922332, 59602806, 66356862, 72500251, 76401532, 71738753, 59717984, 51277540, 53827089, 63323294, 71497458, 74772951, 74930487, 76030715, 81058302, 88106381, 91353120, 88551071, 83748539, 79718576, 74245812, 68552214, 70493857, 80653108, 83394460, 64234866, 32033294, 11616394, 15593171, 33974635, 51231289, 63632055, 77821457, 98769799, 120927727, 129539283, 114416791, 85099548, 64807043, 63259762, 64023207, 47978460, 20845411, 4625588, 7789219, 18740143, 26097930, 30217025, 33612303, 33660977]
31667C3660977m526892m497561k01701L051520K410175k190745q956331j1273018
31659G476424k296013J2916282J9326380J1196112n5058k384892K378391N921774
31651E4479400N313074J702160l722134p472658n812549j827885j245049r39966
31643D0474393O018700J4209514J0704313k767397j0415295p495516n264234p982282
31635C7482196p458357m903837j1944216k1943209j0218815K2935290M0257521
31628D4206573J9743425r756251j1803821M558186P090585n544721r047548O99733
31620D0146161N045437n58174k581871L13923l333989q680974J290671J9466648
31612E1107832J6420163j2855082l5317023k6012202p96240J2227560R961121
$$ y = [33660977, 29134085, 24636524, 24434823, 27486343, 29896518, 27705773, 18749442, 7476424, 5180411, 18096693, 37423073, 48619185, 48564127, 46179235, 48557626, 54479400, 59792474, 61494634, 57772500, 50299842, 44487293, 42659408, 41414359, 40474393, 46493093, 60702607, 71406920, 68639523, 58224228, 50728712, 45464478, 37482196, 30023839, 25120002, 13175786, -8767423, -18986238, 3949052, 44206573, 63949998, 54193747, 42389926, 46948112, 54038697, 48493976, 39446428, 40146161, 45191598, 44633424, 42051553, 42365476, 39031487, 30350513, 31641184, 51107832, 67527995, 54672913, 19355890, -6656312, -7452552, 4775008, 14736129]
31605A4736129N186770N93373p004962j0354033q44017J3298198J5620766M507994
31597C5740218o446714q288116m453582m25440K494184K459060l283644j0739175
31589G056791r568303K990105J4070531R394131n701812r553626O793210K3456505
31581C8937532J6064174r353021k2182234q945454Q545527M597685j6206985k8697390
31573a7240166j9809826J911076K1318884K7651216J6701829m439481j8187967
31566G905565j2966820L910129J7111761K0366799J5183205L043974r928311j1507179
31558C3119123m35049N790095m255823j5257852q736807M662065J600261j3573798
31550B912215j4488815L328267J5226053Q465688N27038O432381J5035086J2371218
$$ y = [14736129, 19922899, 20516272, 13511310, 3157277, 2313260, 15611458, 31232224, 35740218, 29293504, 21005388, 16551806, 16126366, 18620550, 21079610, 17795966, 7056791, -2511512, 478593, 14549124, 23943255, 18241443, 8687817, 15481027, 38937532, 55001706, 45648685, 23466451, 14520997, 23066524, 27664209, 11457224, -17240166, -37049992, -35138916, -13820032, 13831184, 30533013, 26093532, 7905565, -5061255, -1151126, 15960635, 36327434, 51510639, 54554613, 44626302, 33119123, 32684074, 38474169, 34218346, 18960494, 10223687, 14885752, 16486013, 2912215, -11576600, -8248333, 6977720, 15443408, 15970446, 22402827, 37437913, 49809131]
31542D9809131N150499L406682n91325j5769411k9353672k2668497j799092Q077110
31534c738575l357585j9737514k0687078m098641J5797036K3941269J6306525
31527D425437J696512p064885n496432O57870N822475J0552810J4578634J2024879
31519C7197300M85662j0627110r420901K441240J0553713N721942m453789n436084
31511B6461973N173809J3411741O125307j1447881k1393151j5327582k732672
31504B71544M434726N762818O363457O715832N831718N658551M449967m437565
31496C5051048j7944865j9246527j049633J8777965K0756863J1365299P759356
31489E5469506O855143m679558j8023487j1388541R368757J2683343r568376k7020150
$$ y = [49809131, 54959630, 58366312, 57774987, 42005576, 12651904, -10016593, -11815685, -3738575, -7096160, -26833674, -47520752, -51619393, -35822357, -11881088, 4425437, 6121949, -942936, -6439368, -5781498, 40977, 10593787, 25172421, 37197300, 37682962, 27055852, 17634951, 20076191, 30629904, 36351846, 31898057, 26461973, 31635782, 45047523, 51172830, 39724949, 18331798, 3004216, 271544, 4706270, 10469088, 16832545, 23548377, 29380095, 35038646, 39488613, 35051048, 17106183, -2140344, -3189977, 15587988, 36344851, 47710150, 55469506, 62324649, 57645091, 39621604, 28233063, 37601820, 50285163, 40716787, 13696637]
31481A3696637j7640001M76004K700020l492504J941034J4023804J3329021J920049
31473B6954064q1125J0595231J5155108M172800q008724o868262J259498J519736
31465D4698326o824617j1237687n541907J392572o07113p051642m672425P378368
31457A7533875J3107171K710942j0417719p970546N714926J0877362L230041j462934
31449C3323118N466459J3048033J0047463l10118j1167221k1724498k9358312
31442f75076k7091247j6024512o527274j819260M392449J0176191N052366o376598
31434c8892961l648548J5542406K4607365P899110j1606039o395465J3169491
31427F75359J6616179j90643j3818811j0740839k65193O415420P428820K275552
$$ y = [13696637, -3943364, -3467360, -767340, -4259844, -2318810, 11704994, 25034015, 26954064, 26872939, 37468170, 52623278, 56796078, 48787354, 41919092, 43178590, 44698326, 37873709, 26636022, 21094115, 22486687, 21879574, 14827932, 10155507, 17533875, 30641046, 33351988, 22934269, 14963723, 20678649, 31556011, 34786052, 33323118, 38789577, 51837610, 61885073, 61574955, 50407734, 28683236, -675076, -27766323, -43790835, -50318109, -52137369, -47744920, -37568729, -32516363, -38892961, -42541509, -26999103, -2391738, 5507372, -6098667, -12494132, 675359, 17291538, 17100895, 3282084, -7458755, -7723948, -1308528, 6120292, 8395844]
31419H395844p319578r966949L642425K2505063K5482734Q725180j1779990k2282255
31411A7402474k1184509j1260781J516765N028678o068380j7457990j1908308
31404d3932051M939683J3414253R929741P471085R230483N830485m99638N408145
31396A1792186K2827749K8951301J1723218j1578327k0328436j7003650j4362839
31389A2021202j2440409m765906L772816K528446o744831j1541683o465513J147451
31381b2488427K896731r45561l672114L446Q130095J2645845Q722371K268010
31373G560396K882755R780440J2209433N226132l133812l899666Q42993K950986
31365C4419657P0854k819943j323601K838286M052187m75218o884816r633597
$$ y = [8395844, 1076266, -8890683, -5248258, 17256805, 42739539, 51464719, 39684729, 17402474, -3782035, -15042816, -13526051, -8497373, -14565753, -32023743, -43932051, -38992368, -25578115, -15648374, -8177289, 1053194, 6883679, 6384041, 11792186, 34619935, 63571236, 75294454, 63716127, 43387691, 26384041, 12021202, -419207, -5185113, -1412297, 1116149, -5628682, -17170365, -23635878, -22488427, -19591696, -20537257, -24209371, -24205925, -16075830, -3429985, 5292386, 7560396, 10443151, 20223591, 32433024, 37659156, 34525344, 30625678, 31468671, 34419657, 34490511, 31670568, 30346967, 33185253, 37237440, 36762222, 29877406, 20243809]
31357B0243809r814616j2794868j6267914r969576P212141K0282647J7971738
31350A6863361R681339R693198J3632265P528085o521774j3723566j1999714j2145904
31342A3007290j3261096k622202J5452933J6683092n496556k2943279j1369520
31335a0549338J2947996J7234193O9772j0216543n8910J2292135Q625800k064507
31327B8280598n23188J2289626J7534114O816302p057432j0622524q203678j0303647
31319B8210171j2507220j840964J7414179K2941310O007863j3476701j5607931
31312C1140707q244602r001900j3967251p925338M066443L508092o930352n978568
31304a3332769P249759Q870008p082084j4337730J587691J6191853O040045j0923943
$$ y = [20243809, 10429193, -2365675, -18633589, -28603165, -21391024, -1108377, 16863361, 26544700, 36237898, 49870163, 57398248, 50876474, 37152908, 25153194, 13007290, -253806, -2876008, 12576925, 29260017, 23763461, 820182, -10549338, 2398658, 19632851, 19702623, 9486080, 9427170, 21719305, 30345105, 28280598, 27757410, 40047036, 57581150, 64397452, 57340020, 46717496, 38513818, 28210171, 15702951, 13861987, 31276166, 54217476, 60225339, 46748638, 31140707, 22896105, 13894205, -73046, -7998384, -3931941, -423849, -7354201, -13332769, -6083010, 2786998, -4295086, -18632816, -17045125, -853272, 5186773, -5737170]
31296e737170n087846J4952339J6564086m561013k1193057j9110158j0850299
31289c5023118m223882Q868156K4646200K1307228l526721j7069914M278612L5184781
31281C4441342L2991686k353903k8854625k1399066k392109m328016k3722151
31274a5616842l0718614j3868672O020733Q121400k19172J820971J5811417K1532796
31266g115983P074028j2253411j2881073O095696K0839835J1691233j2709627
31259G40698k4271702p004194K3984840L8044352K2667324l855430j6098024j0614265
31251B3593599l295181l550530m918561j028952M361724P820422J2173907J4620534
31243D9776962L959774j8652812l0729764j7106026M245242O199502o452671o364093
$$ y = [-5737170, -10825016, 4127323, 20691409, 16130396, -5062661, -24172819, -35023118, -39247000, -30378844, -5732644, 15574584, 12047863, -5022051, -743439, 34441342, 67433028, 65079125, 36224500, 14825434, 12433325, 8105309, -15616842, -46335456, -60204128, -54183395, -46061995, -46281167, -44460196, -28648779, -7115983, -41955, -12295366, -25176439, -19080743, 1759092, 13450325, 740698, -23531004, -30535198, -6550358, 31493994, 54161318, 50305888, 34207864, 23593599, 20298418, 16747888, 11829327, 10800375, 15162099, 22982521, 35156428, 49776962, 53736736, 35083924, 4354160, -12751866, -8506624, -2307122, -8759793, -15123886]
31235a5123886R164283J2396607o183309j6848421J737993K2589500R576342k2225999
31227d916890k4439682J1708841M1118125L1222634M847701k341138M916589j37814
31219F1978366j6836487k0819664p257618L310061R46511j963464J774541K258555
31211B3390801n173014r960536o810666l976794l343685M654200J7692330J8523164
31203C4995800O189243K042386R733513J614248l1261990m9026698j8781886K6564441
31195a7930943K9953774o592351k9158608j4307483O864210R121065O858979J4746496
31187d44861J9802637J2107643N322550O266891q34429j8579526k0298350M725694
31179H068249K3864057R741388j4333901j2982454L654380J670575j6681738j9000883
$$ y = [-15123886, -5959603, 6437004, 253695, -16594726, -14856733, 7732767, 17309109, -4916890, -29356572, -17647731, 23470394, 54693028, 59540729, 57199591, 62116180, 61978366, 45141879, 24322215, 17064597, 20374658, 21321169, 19357705, 21132246, 23390801, 18217787, 8257251, 1446585, -2530209, -5873894, -1219694, 16472636, 34995800, 41185043, 43227429, 52960942, 54575190, 23313200, -25713498, -44495384, -17930943, 12022831, 5430480, -23728128, -38035611, -31171401, -22050336, -15191357, -444861, 19357776, 31465419, 36787969, 43054860, 42220431, 23640905, 3342555, 8068249, 31932306, 41673694, 27339793, 14357339, 18011719, 19682294, 3000556, -16000327]
31171a6000327J073635J6127909J1250907K91917n169210q551625p324320P209881
31163a091233K3837490J7557781r325093k2597446m989897J7743328J5070342
31156C6205272p209919k1502445j5880101J31123J3407860J5572749M353612j0785848
31148A4292303j3884917k690856P300224O583925M830408J0407845J3456480M343906
31140D4639318o077847l531214M275127R03257q483940m633377J0693365J3286061
31132E1070750n134986k1501376j5586725J171469P463281N928807J2936893K4428575
31124F0776688J8515816p486714k7951187k5092998j2262387p696046n148631
31117f345459Q634338K2558359J4947077p618460j4770813K149095J7442005J2318043
$$ y = [-16000327, -14926692, 1201217, 12452124, 12744041, 7574831, -976794, -8301114, -1091233, 22746257, 40304038, 30978945, 8381499, 3391602, 21134930, 36205272, 28995353, 7492908, -8387193, -8256070, 5151790, 20724539, 25078151, 14292303, 407386, -2283470, 5016754, 11600679, 16431087, 26838932, 40295412, 44639318, 38561471, 35030257, 39305384, 40208641, 31724701, 27091324, 37784689, 51070750, 45935764, 24434388, 8847663, 10019132, 17482413, 23411220, 36348113, 60776688, 79292504, 71805790, 43854603, 18761605, 6499218, -1196828, -6345459, 2288879, 24847238, 39794315, 32175855, 17405042, 19554137, 36996142, 49314185]
31109D9314185J625705M188095J0565364K210204j4805284j9885421j0850101
31102B2362747k718174m19409L518507P412310N04450j3891230j7062879k248331
31094b542009J4160449J5444458M735639l993006l758874K437858P588421N531071
31086C9604007k884345p219039Q69005J3771155J5803833M696991o266005q325964
31078E0049638o881458q109414q140127j295870R566823J6220087J3112530N56287
31070F5078496j4203194j9608307j1128359Q53924K782286m257638q230619n229478
31062F057111k500319l442068l508980k165643m636172q774435m540191Q205494
31054a5305203J4896202O887623m287616k536761J0564337J8449402J0978853
$$ y = [49314185, 50939890, 55127985, 65693349, 67903553, 53098269, 33212848, 22362747, 19644573, 19225164, 22743671, 30155981, 30660431, 16769201, -293678, -2542009, 11618440, 27062898, 31798537, 27805531, 24046657, 26484515, 34072936, 39604007, 36719662, 29500623, 30369628, 44140783, 59944616, 64641607, 58375602, 50049638, 43168180, 35058766, 26918639, 25622769, 35189592, 51409679, 64522209, 65078496, 50875302, 31266995, 20138636, 20992560, 23774846, 19517208, 11286589, 6057111, 3556792, 114724, -3394256, -5559899, -10196071, -18970506, -23510697, -15305203, -409001, 6478622, 2191006, -345755, 10218582, 28667984, 39646837]
31047C9646837l904399r921744j024057J1341651J1833625J092972n451092l58007
31039D3255786N980185M356533J280952L449650L241727m127790m982749R340359
31031F1794653J8480237R50294k5448373k4807147J462317J7120656Q008463k567589
31023E4993511J55608J647162n674142n689021N072883L180217j7501191k4651620
31015A1533407J327963K8896418K1959635l542206p617785J0622750J7899124
31008H1079306K101217j5087964j5452967l047803J0582485J5250804K758935
31001G8184013j9279779k4845324l212917J9082401J5266148k33629J332547J2585084
30993G8878544N805470j3664784j4641827M260190J2084093J18971o616622M51722
$$ y = [39646837, 35742438, 25820694, 24796637, 36138288, 47971913, 49064885, 43613793, 43255786, 49235971, 53592504, 54873456, 58323106, 61564833, 57437043, 52454294, 61794653, 80274890, 81225184, 55776811, 30969664, 32431981, 49552637, 57561100, 54993511, 55149119, 56796281, 51122139, 45433118, 50506001, 53686218, 36185027, 11533407, 12861370, 41757788, 63717423, 60175217, 52557432, 63180182, 81079306, 83180523, 68092559, 52639592, 49591789, 60174274, 75425078, 78184013, 58904234, 34058910, 30845993, 49928394, 65194542, 64960913, 66293460, 78878544, 84684014, 71019230, 56377403, 60637593, 72721686, 72840657, 66224035, 66675757]
30985F6675757k570021k3653214l3418350j3186546J2672311J6747087Q788430
30978C2055454R594458J2997199L488114j0156347r366450J077519K449778n718232
30970C6421493p927297j39902O947974P411751M924744J995381j425288l208352
30962D5000504l702344p767110j3133899q477310O025918J1200921k641681j5076180
30954A1428819m361811J5491429J2339813j4986840l2442409j8272647R194701
30947b1608945K0163956J1466407K891351O149294J2374119R539306R19988p42725
30939D1152751O322321Q822862q34776j0319850n759665M424409K815722n035376
30931D1588398K278823K1146552K0248002q679084k8671991r958343K1657040
$$ y = [66675757, 64105736, 40452522, 7034172, -6152374, 6519937, 23267024, 32055454, 41649912, 54647111, 58135225, 47978878, 38612428, 39689947, 42139725, 36421493, 28494196, 28354294, 35302268, 42714019, 47638763, 49634144, 48208856, 45000504, 41298160, 33531050, 20397151, 11919841, 17945759, 29146680, 26504999, 11428819, 7067008, 22558437, 34898250, 19911410, -12530999, -30803646, -21608945, -1444989, 10021418, 12912769, 19062063, 31436182, 40975488, 41895476, 41152751, 47475072, 56297934, 55463158, 45143308, 39383643, 43808052, 46623774, 41588398, 43867221, 65013773, 85261775, 76582691, 47910700, 37952357, 59609397]
30924E9609397K1253634q208612k2863324m163313K0143000K3229318J2145272
30917A01145372M064806l44224n156879m248522N177678J0851924K535865j1486370
30909A02539650j7373232j4048025q067800j702303L255770J194449o525682p582860
30901E1689967K253436P295008n625687k2161036j6597160J0801781L1282512
30894E8938821K3915700j360095k0843045k3259494j2717304K026678J1527607
30887C8228868P590487o964021j4438211K12179K8061064M2718156L0571680N523497
30879A31503699j0170416j0181446k517812O498155J4540169J5583973M842096
30872A50098418r772871j5287781j2934038j4686009j9825802j4011473L491706
$$ y = [59609397, 80863031, 72654419, 49791095, 45627782, 65770782, 89000100, 101145372, 105210178, 104865954, 99709075, 95460553, 100638231, 111490155, 114026020, 102539650, 85166418, 71118393, 63050593, 61348290, 64604060, 65798509, 59272827, 51689967, 53943403, 61238411, 55612724, 33451688, 16854528, 27656309, 58938821, 82854521, 81494426, 60651381, 37391887, 24674583, 26701261, 38228868, 45819355, 38855334, 24417123, 24629302, 52690366, 95408522, 125980202, 131503699, 121333283, 111151837, 108634025, 115132180, 129672349, 145256322, 150098418, 140325547, 125037766, 112103728, 97417719, 77591917, 63580444, 67072150]
30865F7072150J3478172Q072204N275210J5640068J8171552m971155l0215666
30858I2522535k3132395N951760J6255349J095881n321555J0135440J6596415
30851A14103430n005042k5470895j4326862J0912842J6047291M544606L522778
30844A04328148J3892251J3646355R03768m443564J062241j78492j1785931j6052781
30836A01371995o580110R68606j920553k918482O684017J6938905J7857120J2794201
30828A45195699N964449l202390p527935L438979J9828830J7460171l425581j2585903
30820A65146319L974632K0420776J2076977p496992j4046133j1808845j6091045
30813A52175689j8166241j660824K0934677K3917191J1401631Q892004J6997438
$$ y = [67072150, 80550322, 88622526, 93897736, 109537804, 127709356, 122738201, 92522535, 69390140, 75341900, 91597249, 92693130, 87371575, 97507015, 114103430, 109098388, 83627493, 69300631, 80213473, 96260764, 100805370, 104328148, 118220399, 131866754, 132770522, 128326958, 129389199, 129210707, 117424776, 101371995, 94791885, 95760491, 93839938, 90921456, 97605473, 114544378, 132401498, 145195699, 151160148, 147957758, 140429823, 143868802, 163697632, 181157803, 177732222, 165146319, 169120951, 189541727, 201618704, 194121712, 180075579, 168266734, 152175689, 134009448, 132348624, 153283301, 177200492, 188602123, 197494127, 214491565]
30806B14491565J1034182j2132461k4318285j1512833M348429J989634r877761
30799A74022470j4847694j4408677j3977029o419794J0679847K0288756R536583
30792A64874462o699020o820362M497147N682521p383884j7938507j6153221j0642733
30784A09416403j0257986r887091l11373J5901077K4088098J2974226r533430
30777A32389924j9774739m997077J6666739J6650608m134053j5461550l126897
30770A18212955R540648m0445j6539655j1630804R809885J7300391J667714j4284023
30762A14036666j2486817j496511L673799K452018J335522J614244K352249L756898
30754A15238068K360059o103470j5594942j3440332J249204J4495417J6388645
$$ y = [214491565, 225525747, 213393286, 189075001, 177562168, 181910597, 183900231, 174022470, 159174776, 144766099, 130789070, 124369276, 135049123, 155337879, 164874462, 158175442, 151355080, 155852227, 161534748, 154150864, 136212357, 120059136, 109416403, 99158417, 89271326, 88959953, 104861030, 128949128, 141923354, 132389924, 112615185, 107618108, 124284847, 140935455, 136801402, 121339852, 118212955, 127753603, 127713158, 111173503, 99542699, 109352584, 126652975, 128320689, 114036666, 101549849, 100053338, 103727137, 106179155, 107514677, 109128921, 111481170, 115238068, 117598127, 111494657, 95899715, 82459383, 83708587, 98204004, 114592649]
30747A14592649J1534681P194082L213773j842179o187266j0758540j8160087
30740I9587113k2331262j2946502N317470J3593856O206913L21244O959887R957313
30732A06666032p895415l1067375k7747287M111048L0700887K5624912k39361
30725A00153441j9220456k0587760j2640300l679402L849860N726474j895784
30718E1706073j1272593o632368J5072370L5287146L3415969J0507434j4117741
30711A13966290k5926069k5229316j6519537j421108J3462284J4736706j033377
30704G2035873j6612858j2530004P387089K0999286J7139751P220893N292046
30697A00932076Q788717O367706l207953r701105o775566o37327r56017p573373
$$ y = [114592649, 126127330, 133321412, 136535185, 134693006, 128505740, 117747200, 99587113, 77255851, 64309349, 69626819, 83220675, 89427588, 89748832, 96708719, 106666032, 98770617, 67703242, 39955955, 44067003, 74767890, 100392802, 100153441, 80932985, 60345225, 47704925, 44025523, 47875383, 53601857, 51706073, 40433480, 33801112, 48873482, 84160628, 117576597, 128084031, 113966290, 88040221, 62810905, 46291368, 44870260, 58332544, 73069250, 72035873, 55423015, 42893011, 50280100, 71279386, 88419137, 95640030, 100932076, 109720793, 116088499, 112880546, 103179441, 96403875, 95766548, 94810531, 87237158]
30689H7237158j0921853n609478J436468O41071n789218o587132J941367J0949892
30681G3298275J2852414J0687438R480749P714105L170484j982687p913392j7890834
30673H9416552k5276147j4575655J1991581K4914268M545213k4298067k0848762
30666D5868983J3694520L4993054J5157235k2640893l8245626k1940097M247830
30659C1135006J6525747P963436j1650664k3640595j5566027M485141J5404511
30652B4656555Q118126n251577q758509J053997J6752857K6035863J6791493r102131
30644G0296674k7872227j8090675O892936J3120316m367049j3229389N072045
30637C1822631K4950373J6967981o299810j1586606L986452J2507462n43698j8160985
$$ y = [87237158, 76315305, 70705827, 72142295, 72783366, 66994148, 60407016, 62348383, 73298275, 86150689, 96838127, 106318876, 114032981, 117203465, 115220778, 107307386, 89416552, 64140405, 49564750, 61556331, 86470599, 91015812, 66717745, 45868983, 59563503, 94556557, 109713792, 87072899, 48827273, 26887176, 31135006, 47660753, 55624189, 43973525, 20332930, 4766903, 9252044, 24656555, 32774681, 27523104, 18764595, 19818592, 36571449, 62607312, 79398805, 70296674, 42424447, 24333772, 31226708, 44347024, 39979975, 26750586, 31822631, 56773004, 73740985, 67441175, 55854569, 59841021, 72348483, 71804785, 53643800]
30629E3643800j8732890j578387J7274037K1498067N575435j9780051l3182184
30622B4717827k2465302R84443J3900782N767289j2284096k0471532j0071189
30615a9921778O627076Q398369o242495j0452607J4663610M3822704L5895443
30608G2790322l121201k2396958j256941J9067448K202259k4090898j3573602
30601B9620429K2814734L4407565R098063j4344043j0352700J498833k898406
30594F9844475j5947169j7547160n639474O740911R823415M004167j869741J605745
30586E1015169R773589N208653j4046456k2438878l884237J5985766M881642k2467985
30578B4027263k4016629K928967J7924313K706184j3704409p088320N404245M42878
$$ y = [53643800, 34910910, 33332523, 50606560, 72104627, 77680062, 57900011, 24717827, 2252525, 3236968, 17137750, 22905039, 10620943, -9850589, -19921778, -13294702, -4896333, -11138828, -21591435, -6927825, 36894879, 72790322, 69669121, 47272163, 46015222, 65082670, 67284929, 43194031, 29620429, 52435163, 86842728, 95940791, 81596748, 71244048, 72742881, 69844475, 53897306, 36350146, 30710672, 37451583, 47274998, 51279165, 49409424, 51015169, 60788758, 65997411, 51950955, 29512077, 25627840, 41613606, 46495248, 24027263, 10634, 2939601, 20863914, 23570098, 9865689, 2777369, 8181614, 8624492]
30570H624492j3135487j4278408k798657Q893588J6945907K0876595J5377386
30563D0505416K526884m939721m004224n822474j1000945m957125J0840875J1437404
30555C4586090j0945852k6970773j2703924J3397208K0511856R460780J94815
30548B7530200l785635r406268r817341L263790J6135523J1519435p19706j46855
30540C4573143P640309K116663j2339008j1237396P323168J7139313M705011j2774305
30532C7146898j6455377q665224N50726Q407820J2860344Q943938m87016m538371
30524C7763738k11338M190724M316837M738894O687662N375746J635566J183868
30516F5681697M29692j0113970k4898289k4546054n445954R607667J869384j6542226
$$ y = [8624492, -4510995, -18789403, -21588060, -12694472, 4251435, 25128030, 40505416, 43032300, 38092579, 34088355, 28265881, 17264936, 12307811, 23148686, 34586090, 23640238, -3330535, -16034459, -2637251, 17874605, 27335385, 27530200, 23744565, 14338297, 4520956, 7784746, 23920269, 35439704, 34719998, 34573143, 42213452, 44330115, 31991107, 20753711, 28076879, 45216192, 49921203, 37146898, 20691521, 12026297, 12577023, 20984843, 33845187, 42789125, 42302109, 37763738, 37552400, 41743124, 46059961, 50798855, 57486517, 62862263, 64497829, 65681697, 66111389, 55997419, 31099130, 6553076, 1107122, 10714789, 12584173, -3958053]
30508c958053j9941086l107043J5941802K0913085J1857939j743730j0390799
30501I572115p912268L783508J2135038N711594q773096j1089535M847768J7725031
30493B6000155N412104k1012699k7640299m087860K0492310J8487914J983357
30486A9634982L61330J4241374J8600319N246031p650040r254227r361444j1799896
30478B0018429m614866J1353721J3065129q333664k7539654k1477425j977484
30471a9505814R540777J5993887K6799786K8581592O547064k0645438k1994890
30464B5316964o88918J3034898Q278990K29851m179195j3257231k3643403j9061183
30456a3969227N4134J3405032J0698311J57722j2091055k4263543k3135191J828814
$$ y = [-3958053, -23899139, -27006182, -11064380, 9848705, 21706644, 19962914, 9572115, 1659847, 5443355, 17578393, 23289987, 14516891, 3427356, 8275124, 26000155, 31412259, 10399560, -17240739, -21328599, -836289, 17651625, 19634982, 19996312, 34237686, 52838005, 58084036, 50433996, 41179769, 31818325, 20018429, 15403563, 26757284, 39822413, 31488749, 3949095, -17528330, -19505814, -9965037, 6028850, 32828636, 61410228, 67957292, 47311854, 25316964, 24628046, 37662944, 45941934, 46171785, 41992590, 28735359, 5091956, -13969227, -13915093, -510061, 10188250, 10345972, -1745083, -26008626, -49143817, -47315003]
30448d7315003K8499852K2215333r456833k0263239O240128L1054276K0076458
30441C1050972p323481j4750800j764988Q905892J1795232J5047519J4612894
30434E7573240K464982j1541857j2455669n061642l205457n097509j824618O10495
30426B1461965p889222j7872385j3080955l67360l60559j0914802p104871J8445624
30418a7682565L9285421K9244988l134598k5418577j8691477L944483J4369560
30411B1917235J729397j4914625j0781750J1109021K3927971J5620215M008973
30404E2616437M799534O517884n150933j7839685j2129806L426536N280151n617514
30396C1902604p350498L099500M531215j0660941k2434537j5451808o21709O360633
$$ y = [-47315003, -18815151, 3400182, -6056651, -26319890, -20079762, 10974514, 31050972, 23727491, 8976691, 7211703, 16117595, 27912827, 42960346, 57573240, 60038222, 48496365, 36040696, 30979054, 27773597, 22676088, 20851470, 21461965, 13572743, -4299642, -17380597, -17747957, -18108516, -29023318, -36128189, -17682565, 21602856, 50847844, 47713246, 22294669, 3603192, 7547675, 21917235, 23646632, 8732007, -2049743, 9059278, 32987249, 48607464, 52616437, 57415971, 63933855, 58782922, 40943237, 28813431, 32239967, 37520118, 31902604, 24552106, 27651606, 32182821, 21521880, -912657, -16364465, -16986174, -10625541]
30388a0625541O292099M732192r41215r439784q259684P004940K1083769K0852049
30380C0698825J4229205J2586735R599322l747975j6482805j2789614j029234
30373C3064459k653109j5963405j7326828n34776J1644349L788710r002849q761971
$$ y = [-10625541, -4333442, 398750, -542465, -9982249, -18241933, -11236993, 9846776, 30698825, 44928030, 57514765, 67114087, 63366112, 46883307, 34093693, 33064459, 30411350, 14447945, -2878883, -3413659, 8230690, 12019400, 3016551, -5745420]
$$ [...]
##END NTUPLES=NMR SPECTRUM
##END=
