##TITLE=31Pdec_PR1933_rm
 D2O, 124 sc
 2.9.2020
##JCAMPDX= 6.0         $$ Bruker NMR JCAMP-DX V2.0
##DATA TYPE= NMR SPECTRUM
##DATA CLASS= NTUPLES
##ORIGIN= UXNMR, Bruker Analytische Messtechnik GmbH
##OWNER= root
$$ XWIN-NMR		Version 3.5
$$ Wed Sep  2 13:37:07 2020 Russian Standard Time (UT+4h)  she@DPX200
##.OBSERVE FREQUENCY= 81.013821
##.OBSERVE NUCLEUS= ^31P
##.ACQUISITION MODE= SIMULTANEOUS
##.ACQUISITION SCHEME= undefined
##.AVERAGES= 124
##.DIGITISER RES= 17
##SPECTROMETER/DATA SYSTEM= spect
##.PULSE SEQUENCE= zgpg30
##.SOLVENT NAME= CDCl3
##.SHIFT REFERENCE= (INTERNAL, CDCl3, 0, 182.463)
##AUDIT TRAIL= $$ (NUMBER, WHEN, WHO, WHERE, WHAT)
$$ ##TITLE= Audit trail, XWIN-NMR		Version 3.5
$$ ##JCAMPDX= 5.01
$$ ##ORIGIN= Bruker BioSpin GmbH
$$ ##OWNER= she
$$ F:/spectra/data/she/nmr/P31/1/pdata/1/auditp.txt
$$ ##AUDIT TRAIL=  $$ (NUMBER, WHEN, WHO, WHERE, WHAT)
(   1,<2020-09-02 13:36:19.78 +0400>,<she>,<DPX200>,
      <continue with go, POWCHK disabled, PULCHK disabled
       configuration hash MD5:
       00 E9 B6 7A A2 85 ED C7 34 08 36 98 17 FE 4E 26
       data hash MD5: 32K
       0D 0E C9 00 5B BC 12 C1 3A 86 1A 90 40 58 84 95>)
(   2,<2020-09-02 13:36:21.76 +0400>,<she>,<DPX200>,
      <Start of raw data processing
       efp BC_mod = 2 LB = 1 FT_mod = 6 PKNL = 1 PHC0 = -3538.245 PHC1 = 1942.202 SI = 64K 
       data hash MD5: 64K
       28 31 B8 34 68 EF 01 8C A2 E6 F8 06 8E FA C5 27>)
(   3,<2020-09-02 13:36:38.43 +0400>,<she>,<DPX200>,
      <pk PHC0 = 27.17783 PHC1 = 0 
       data hash MD5: 64K
       19 60 F1 45 8E 29 70 93 56 34 96 F4 71 58 63 C6>)
(   4,<2020-09-02 13:36:41.03 +0400>,<she>,<DPX200>,
      <abs ABSG = 5 
       data hash MD5: 64K
       E1 BE 49 A0 E5 EC 8C BE 27 88 29 5F 31 5E 24 C5>)
$$ ##END=
$$ 
$$ hash MD5
$$ 7C EB 99 78 96 25 12 F6 E3 89 A6 8B B5 D0 6A C3
##$RELAX= 
##$RELAX= 
##$RELAX= 
##$RELAX= 
##$RELAX= 
##$RELAX= 
##$RELAX= 
##$RELAX= 
$$ Bruker specific parameters
$$ --------------------------
##$DU= <F:/spectra>
##$EXPNO= 1
##$NAME= <P31>
##$PROCNO= 1
##$TYPE= <nmr>
##$USER= <she>
##$AMP= (0..31)
100 100 100 100 100 100 100 100 100 100 100 100 100 100 100 100 100 100 
100 100 100 100 100 100 100 100 100 100 100 100 100 100 
##$AQSEQ= 0
##$AQ_mod= 1
##$AUNM= <au_zg>
##$AUTOPOS= <>
##$BF1= 81.014009
##$BF2= 200.13
##$BF3= 200.13
##$BF4= 200.13
##$BF5= 200.13
##$BF6= 200.13
##$BF7= 200.13
##$BF8= 200.13
##$BYTORDA= 1
##$CFDGTYP= 0
##$CFRGTYP= 5
##$CHEMSTR= <none>
##$CNST= (0..31)
1 1 145 1 1 1 1 1 1 1 1 1 1 1 1 1 1 1 1 1 1 1 1 1 1 1 1 1 1 1 1 1 
##$CPDPRG= <waltz16>
##$CPDPRG1= <>
##$CPDPRG2= <waltz16>
##$CPDPRG3= <>
##$CPDPRG4= <mlev>
##$CPDPRG5= <mlev>
##$CPDPRG6= <mlev>
##$CPDPRG7= <mlev>
##$CPDPRG8= <mlev>
##$CPDPRGB= <>
##$CPDPRGT= <>
##$D= (0..31)
0 1 0 0 0 0 0 0 0 0 0 0.03 2e-05 3e-06 0 0 0 0 0 0 0 0 0 0 0 0 0 0 0 0 
0 0 
##$DATE= 1599039203
##$DBL= (0..7)
120 120 120 11 120 120 24 19 
##$DBP= (0..7)
150 150 150 150 150 150 150 150 
##$DBP07= 0
##$DBPNAM0= <>
##$DBPNAM1= <>
##$DBPNAM2= <>
$$ [...]
##$SUBNAM3= <"">
##$SUBNAM4= <"">
##$SUBNAM5= <"">
##$SUBNAM6= <"">
##$SUBNAM7= <"">
##$SUBNAM8= <"">
##$SUBNAM9= <"">
##$SW= 369.568048894756
##$SWIBOX= (0..15)
0 1 3 0 0 0 0 0 0 0 0 0 0 0 0 0 
##$SW_h= 29940.119760479
##$TD= 32768
##$TD0= 1
##$TE= 0
##$TE2= 300
##$TE3= 300
##$TEG= 300
##$TL= (0..7)
0 120 53 12 22 120 120 120 
##$TP= (0..7)
150 150 150 150 150 150 150 150 
##$TP07= 0
##$TPNAME0= <>
##$TPNAME1= <>
##$TPNAME2= <>
##$TPNAME3= <>
##$TPNAME4= <>
##$TPNAME5= <>
##$TPNAME6= <>
##$TPNAME7= <>
##$TPOAL= (0..7)
0.5 0.5 0.5 0.5 0.5 0.5 0.5 0.5 
##$TPOFFS= (0..7)
0 0 0 0 0 0 0 0 
##$TUNHIN= 0
##$TUNHOUT= 0
##$TUNXOUT= 0
##$USERA1= <user>
##$USERA2= <user>
##$USERA3= <user>
##$USERA4= <user>
##$USERA5= <user>
##$V9= 5
##$VALIST= <valist>
##$VCLIST= <CCCCCCCCCCCCCCC>
##$VD= 0
##$VDLIST= <DDDDDDDDDDDDDDD>
##$VPLIST= <PPPPPPPPPPPPPPP>
##$VTLIST= <TTTTTTTTTTTTTTT>
##$WBST= 1024
##$WBSW= 4
##$XGAIN= (0..3)
0 0 0 0 
##$XL= 0
##$YL= 0
##$YMAX_a= 15911
##$YMIN_a= -9256
##$ZGOPTNS= <>
##$ZL1= 120
##$ZL2= 120
##$ZL3= 120
##$ZL4= 120
##$ABSF1= 182.463
##$ABSF2= -187.1042
##$ABSG= 5
##$ABSL= 3
##$ALPHA= 0
##$AQORDER= 0
##$ASSFAC= 0
##$ASSFACI= 0
##$ASSFACX= 0
##$ASSWID= 0
##$AUNMP= <proc_1d>
##$AZFE= 0.1
##$AZFW= 0.5
##$BCFW= 0
##$BC_mod= 2
##$BYTORDP= 0
##$COROFFS= 0
##$CY= -3
##$DATMOD= 1
##$DC= 0
##$DFILT= <>
##$DTYPP= 0
##$F1P= 0
##$F2P= 0
##$FCOR= 1
##$FTSIZE= 65536
##$FT_mod= 6
##$GAMMA= 0
##$GB= 0
##$INTBC= 1
##$INTSCL= 5.30512e-09
##$ISEN= 30
##$LB= 1
##$LEV0= 0
##$LPBIN= 0
##$MAXI= 10000
##$MC2= 0
##$MEAN= 0
##$ME_mod= 0
##$MI= 50
##$NCOEF= 0
##$NC_proc= -8
##$NLEV= 6
##$NOISF1= 182.463
##$NOISF2= 159.3651
##$NSP= 0
##$NTH_PI= 0
##$NZP= 0
##$OFFSET= 182.463
##$PC= 4
##$PHC0= -3511.067
##$PHC1= 1942.202
##$PH_mod= 1
##$PKNL= yes
##$PPARMOD= 0
##$PSCAL= 0
##$PSIGN= 0
##$REVERSE= no
##$SF= 81.0140089999434
##$SI= 65536
##$SIGF1= 159.3651
##$SIGF2= -187.1042
##$SINO= 113.3802
##$SIOLD= 16384
##$SREGLST= <1H.CDCl3>
##$SSB= 0
##$STSI= 65536
##$STSR= 0
##$SW_p= 29940.119760479
##$SYMM= 0
##$S_DEV= 0
##$TDeff= 32768
##$TDoff= 0
##$TI= <>
##$TILT= no
##$TM1= 0
##$TM2= 0
##$TOPLEV= 0
##$USERP1= <user>
##$USERP2= <user>
##$USERP3= <user>
##$USERP4= <user>
##$USERP5= <user>
##$WDW= 1
##$XDIM= 65536
##$YMAX_p= 356805208
##$YMIN_p= -81902624
$$ End of Bruker specific parameters
$$ ---------------------------------
##NTUPLES= NMR SPECTRUM
##VAR_NAME=  FREQUENCY,     SPECTRUM/REAL,   SPECTRUM/IMAG
##SYMBOL=    X,             R,               I
##VAR_TYPE=  INDEPENDENT,   DEPENDENT,       DEPENDENT
##VAR_FORM=  AFFN,          ASDF,            ASDF
##VAR_DIM=   65536,         65536,           65536
##UNITS=     HZ,            ARBITRARY UNITS, ARBITRARY UNITS
##FACTOR=    0.456856943014862, 1,           1
##FIRST=     14782.0589164792, 0,            0
##LAST=      -15158.0608439998, 0,           0
##MIN=       -15158.0608439998, -81902624,   0
##MAX=       14782.0589164792, 356805208,    0
$$ Real data points
##PAGE= N=1
##DATA TABLE= (X++(R..R)), XYDATA
$$ [...]
$$ plain form
4906 -7377470 -23767172 -27430185 -18643322 -3640128 9962716 17897983 21865695 24980396
4898 24980396 24108350 11221128 -14911003 -41713777 -51928604 -40072358 -17481634
4891 -17481634 -97083 6728029 8868479 10950921 9996581 4433166 1691470 7639333
4883 7639333 12760653 1531287 -24013833 -43267650 -43436799 -33791856 -26885666 -19358725
4875 -19358725 -3283607 14469724 19850710 12937871 6962177 9287654 16866355 27496622
4867 27496622 40398000 46355367 33813094 8843081 -4811468 7480758 33378141
4860 33378141 47700172 37531425 10445758 -14692190 -22318030 -12409290 -103945
4853 -103945 2297062 521317 6576824 16361007 14753579 2320075 -2845837 4743593
$$ packed form
4906g377470j6389702l663013Q786863J5003194J3602844P935267L967712L114701
4898B4980396q72046j2887222k6132131k6802774j0214827J1856246K2590724
4891a7481634J7384551O825112K140450K082442r54340n563415k741696N947863
4883G639333N121320j1229366k5545120j9253817j69149R644943O906190P526941
4875a9358725J6075118J7753331N380986o912839n975694K325477P578701J0630267
4867B7496622J2901378N957367j2542273k4970013j3654549J2292226K5897383
4860C3378141J4322031j0168747k7085667k5137948p625840R908740J2305345
4853a03945K401007j775745O055507R784183j607428j2433504n165912P589430
$$ plain form
4845 4743593 6686051 -8502107 -21833566 -9394279 20983726 39182434 32750215 17562935
4837 17562935 10432592 10210700 9544764 9503260 14799710 23837277 30414914 30711683 25327823
4828 25327823 18330921 15401636 18591066 22497848 19851831 10569283 1292018 -2529482
4820 -2529482 195055 7827885 14943899 13482592 3017864 -3698021 4069764 16702990
4812 16702990 14497493 -2796421 -12021444 1324638 21116661 22621651 7042177 -983077
4804 -983077 12664935 34729835 44223826 37177931 25268782 17382598 11445486 2424920
4796 2424920 -9653704 -21687982 -32063536 -39440014 -40191384 -31993093 -19120614 -9165235
4788 -9165235 -3415462 5030382 21205292 39923349 50561828 47840068 35439840 21382680
$$ packed form
4845D743593J942458j5188158j3331459J2439287L0378005J8198708o432219j5187280
4837A7562935p130343k21892o65936m1504N296450R037567O577637K96769n383860
4828B5327823o996902k929285L189430L906782k646017r282548r277265l821500
4820b529482K724537P632830P116014j461307j0464728o715885P767785J2633226
4812A6702990k205497j7293914r225023J3346082J9792023J504990j5579474q025254
4804i83077J3648012K2064900R493991p045895j1909149p886184n937112r020566
4796B424920j2078624j2034278j0375554p376478p51370Q198291J2872479R955379
4788i165235N749773Q445844J6174910J8718057J0638479k721760j2400228j4057160
$$ plain form
4780 21382680 11898979 6859374 -507383 -14882582 -27732155 -22337198 4045478 30464328
4772 30464328 34705489 20470831 10055970 12797625 15855395 8251763 -1656203 -542478
4764 -542478 10098896 18942864 21615995 22012914 22375001 22424498 24894894 31912127 37607118
4755 37607118 33647673 21747212 12288471 10143799 9765289 5759216 1135243 2194332
4747 2194332 10055945 19442794 22655220 14769615 -919244 -13247351 -14119947 -8442504
4739 -8442504 -7268385 -12286092 -15323693 -13263535 -12933320 -17796692 -20410267 -14920934
4731 -14920934 -8212850 -9728178 -16822640 -20088521 -18430166 -18226748 -20460608 -19983481
4723 -19983481 -17053006 -18454581 -25063946 -27825890 -19706940 -4589952 8464352 13394316
$$ packed form
4780B1382680r483701n039605p366757j4375199j2849573N394957K6382676K6418850
4772C0464328M241161j4234658j0414861K741655L057770p603632r907966J113725
4764e42478J0641374Q843968K673131L96919L62087M9497K470396P017233N694991
4755C7607118l959445j1900461r458741k144672l78510m006073m623973J059089
4747B194332P861613R386849L212426p885605j5688859j2328107q72596N677443
4739h442504J174119n017707l037601K060158L30215m863372k613575N489333
4731a4920934O708084j515328p094462l265881J658355K03418k233860M77127
4723a9983481K930475j401575o609365k761944Q118950J5116988J3054304M929964
$$ plain form
4715 13394316 7915230 -6275473 -21427798 -29201902 -30897375 -34723696 -40771889 -38579268
4707 -38579268 -23901624 -7211754 1132857 3607759 5117402 1379657 -10118427 -17731014
4699 -17731014 -10054210 4155974 7797703 2523593 4378425 13562500 10651702 -11828345
4691 -11828345 -34662665 -38939070 -30734344 -26173409 -25946564 -19743248 -6080474 7624572
4683 7624572 18181175 25653728 24571070 10704834 -6078470 -9592653 2352927 16865877
4675 16865877 24351648 26148683 23828779 14033930 -1827933 -12918023 -10210687 2837628
4667 2837628 14655290 17152647 11641734 6400435 7960574 11986345 6196530 -12741161
4659 -12741161 -30255449 -29785723 -13028067 5689771 20355973 34690504 45152105
$$ packed form
4715A3394316n479086j4190703j5152325p774104j695473l826321o048193K192621
4707c8579268J4677644J6689870Q344611K474902J509643l737745j1498084p612587
4699a7731014P676804J4210184L641729n274110J854832R184075k910798k2480047
4691a1828345k2834320m276405Q204726M560935K26845O203316J3662774J3705046
4683G624572J0556603P472553j082658j3866236j6783304l514183J1945580J4512950
4675A6865877P485771J797035k319904r794849j5861863j1090090K707336J3048315
4667B837628J1817662K497357n510913n241299J560139M025771n789815j8937691
4659a2741161j7514288M69726J6757656J8717838J4666202J4334531J0461601
$$ plain form
4652 45152105 40063569 19331926 -549493 -7479578 -6298178 -4223634 1221332 10121461
4644 10121461 10862942 -2485628 -14278193 -5571200 17898245 32569581 28762915 19139183
4636 19139183 15602275 14132893 7246322 -1850402 -5514904 -3935486 -3637956 -8013860
4628 -8013860 -14490439 -18205533 -15116792 -4187024 10634558 22222430 25649854 21178045
4620 21178045 13175223 8162235 11021683 18270944 17521620 880925 -21378083 -28621745
4612 -28621745 -13740639 7759691 16302899 9971052 2967057 7177001 21231803 35363013
4604 35363013 40958685 35074983 20172310 2076478 -12481894 -17970805 -12204687 1040745
4596 1040745 12374641 13736137 6646420 1066513 4489617 13951598 19761032 15317924
$$ packed form
4652D5152105n088536k0731643j9881419o930085J181400K074544N444966Q900129
4644A0121461P41481j3348570j1792565Q706993K3469445J4671336l806666r623732
4636A9139183l536908j469382o886571r096724l664502J579418K97530m375904
4628h013860o476579l715094L088741J0929768J4821582J1587872L427424m471809
4620B1178045q002822n012988K859448P249261p49324j6640695k2259008p243662
4612b8621745J4881106K1500330Q543208o331847p003995M209944J4054802J4131210
4604C5363013N595672n883702j4902673j8095832j4558372n488911N766118J3245432
4596A040745J1333896J361496p089717n579907L423104R461981N809434m443108
$$ plain form
4588 15317924 2893911 -8088842 -8597196 1256548 11172249 11823175 6145195 4142337
4580 4142337 7075623 5017734 -7550990 -22671281 -30724597 -32859885 -33737834 -29690104
4572 -29690104 -15788277 -409099 776366 -14052191 -29281296 -31967014 -25683612 -21161059
4564 -21161059 -22378863 -26200266 -27723709 -21786080 -7008397 7631781 8983869 -2794229
4556 -2794229 -12521060 -11284585 -7729479 -9631904 -7845869 6895892 22865293 22746368
4548 22746368 12895356 14313347 26782897 27458127 9287197 -5219398 14653 8660016
4540 8660016 111935 -15358495 -12990767 6241909 16464953 4100901 -17811031 -32597693
4532 -32597693 -37416360 -34616917 -23548687 -7920542 1554961 -1165356 -11610907 -23666482
$$ packed form
4588A5317924j2424013j0982753n08354R853744R915701O50926n677980k002858
4580D142337K933286k057889j2568724j5120291q053316k135288q77949M047730
4572b9690104J3901827J5379178J185465j4828557j5229105k685718O283402M522553
4564b1161059j217804l821403j523443N937629J4777683J4640178J352088j1778098
4556b794229r726831J236475L555106j902425J786035J4741761J5969401j18925
4548B2746368r851012J417991J2469550O75230j8170930j4506595N234051Q645363
4540H660016q548081j5470430K367728J9232676J0223044j2364052k1911932j4786662
4532c2597693m818667K799443J1068230J5628145R475503k720317j0445551j2055575
$$ plain form
4524 -23666482 -34795031 -40430858 -34755315 -21188723 -11331690 -8803828 -4742687 5398380
4516 5398380 11867387 5159740 -9020016 -18336411 -19960547 -18913509 -15867165 -6213664
4508 -6213664 10794275 28801307 39430108 37770752 25988205 13290999 7419202 5079476
4500 5079476 -2025208 -10821655 -7502774 11226175 29330313 31417355 21090614 10854153
4492 10854153 4344458 -822932 -2809798 -1337580 -5148084 -18932446 -29677266 -22377568
4484 -22377568 -4621644 2277868 -5279869 -9618305 -1818363 3586787 -8040869 -27848043
4476 -27848043 -34483014 -21206312 -2735471 2121863 -10446680 -26223778 -27889835 -14166486
4468 -14166486 -661418 1776370 1757703 10932967 21031718 14013940 -7511271 -19158004
$$ packed form
4524b3666482j1128549n635827N675543J3566592R857033K527862M061141J0141067
4516E398380O469007o707647j4179756r316395j624136J047038L046344R653501
4508f213664J7007939J8007032J0628801j659356j1782547j2697206n871797k339726
4500E079476p104684q796447L318881J8728949J8104138K087042j0326741j0236461
4492A0854153o509695n167390j986866J472218l810504j3784362j0744820P299698
4484b2377568J7755924O899512p557737m338436P799942N405150j1627656j9807174
4476b7848043o634971J3276702J8470841M857334j2568543j5777098j666057J3723349
4468a4166486J3505068K437788j8667R175264J0098751p017778k1525211j1646733
$$ plain form
4460 -19158004 -7540775 12869337 21733969 16328253 5728508 -3600858 -6995576 213994
4452 213994 12808181 15440126 3153002 -8808531 -6791499 1329227 1098142 -5503963
4444 -5503963 -8515173 -10985086 -20773912 -27774144 -13361198 16787590 32665257 19717595
4436 19717595 -1018110 -3210277 10609568 19130607 14369425 6718208 3725455 1188902
4428 1188902 -3732940 -5387612 -1782208 -3380991 -19888396 -42604692 -50379282 -34601141
4420 -34601141 -10303038 1999676 -516430 -4673095 -1702656 4154867 7326053 9988961
4412 9988961 14673578 17000421 13567069 10604085 15869875 26135392 31818362 31033985
4404 31033985 29123477 25798823 14193883 -5197620 -19923425 -19806967 -8515399 3751826
$$ packed form
4460a9158004J1617229K0410112Q864632n405716j0599745r329366l394718P209570
4452B13994J2594187K631945j2287124j1961533K017032Q120726k31085o602105
4444e503963l011210k469913r788826p000232J4412946L0148788J5877667j2947662
4436A9717595k0735705k192167J3819845Q521039m761182p651217k992753k536553
4428A188902m921842j654672L605404j598783j6507405k2716296p774590J5778141
4420c4601141K4298103J2302714k516106m156665K970439N857523L171186K662908
4412I988961M684617K326843l433352k962984N265790J0265517N682970p84377
4404C1033985j910508l324654j1604940j9391503j4725805J16458J1291568J2267225
$$ plain form
4396 3751826 12411009 17658646 17678327 11077931 3592978 3754552 10616991 12542955 1859616
4387 1859616 -13659070 -19149470 -10947073 -797638 -562236 -8376727 -14260435 -14688502
4379 -14688502 -14046179 -13812929 -10179455 -4077232 -3416429 -10232340 -14841890 -10425982 -5127221
4370 -5127221 -9374696 -18018010 -18294301 -11670892 -12296067 -23133030 -29260902 -20293340
4362 -20293340 -6390840 -3884092 -14822970 -29416231 -40618017 -46629862 -45018856 -35091824
4354 -35091824 -23677691 -19613344 -23151601 -27146743 -27105919 -24134411 -20245054 -17454940
4346 -17454940 -19696163 -28535078 -38035167 -40664254 -37174711 -33314324 -28074695 -14859059
4338 -14859059 4330392 16023917 11561394 -1163188 -7779348 -3529161 5990472 14368455
$$ packed form
4396C751826Q659183N247637J9681o600396p484953J61574O862439J925964j0683339
4387A859616j5518686n490400Q202397J0149435K35402p814491n883708m28067
4379a4688502O42323K33250L633474O102223O60803o815911m609550M415908N298761
4370e127221m247475q643314k76291O623409o25175j0836963o127872Q967562
4362b0293340J3902500K506748j0938878j4593261j1201786o011845J611006R927032
4354c5091824J1414133M064347l538257l995142M0824K971508L889357K790114
4346a7454940k241223q838915r500089k629087L489543L860387N239629J3215636
4338a4859059J9189451J1693525m462523j2724582o616160M250187R519633Q377983
$$ plain form
4330 14368455 17784954 13248080 1611900 -9161351 -10940976 -5441086 -1307966 -1477618
4322 -1477618 92393 8067632 18284491 23080732 19435241 9641167 -1682350 -8885797
4314 -8885797 -8087322 -1816443 2793834 3014665 3088509 4514371 181681 -14396569 -28338384
4305 -28338384 -24516947 -2382036 17756626 17703443 1965357 -10207561 -8147092 2541213
4297 2541213 13179950 23180527 34556871 42681220 40469614 29859428 20943174 17851430
4289 17851430 13392822 3211524 -1951811 11222502 36600177 52056021 47397740 35837653
4281 35837653 30821206 24333363 1643048 -30357691 -46364769 -33466675 -4737464
4274 -4737464 19217272 29253969 25687911 11411656 -5625512 -13624284 -9515712 -3669043
$$ packed form
4330A4368455L416499m536874j1636180j0773251j779625N499890M133120j69652
4322a477618J570011P975239J0216859M796241l645491r794074j1323517p203447
4314h885797P98475O270879M610277K20831P3844J425862m332690j4578250j3941815
4305b8338384L821437K2134911K0138662n3183j5738086j2172918K060469J0688305
4297B541213J0638737J0000577J1376344Q124349k211606j0610186q916254l091744
4289A7851430m458608j0181298n163335J3174313K5377675J5455844m658281j1560087
4281C5837653n016447o487843k2690315l2000739j6007078J2898094K8729211
4274d737464K3954736J0036697l566058j4276255j7037168p998772M108572N846669
$$ plain form
4266 -3669043 -5107254 -8844371 -5460814 3114246 6509911 751067 -8321523 -14178976
4258 -14178976 -14717463 -10126134 -3066283 -370499 -7587116 -20515669 -27036397 -19373112
4250 -19373112 -2343790 11525870 14315438 10102994 9550053 16468952 22869577 20885208
4242 20885208 14905408 13638019 13775654 4307189 -12890107 -21869987 -16386070 -9444052
4234 -9444052 -11082727 -11884528 -1040228 12104985 10186042 -7062828 -24513623 -31302724
4226 -31302724 -25148286 -5705440 19961221 32734170 21046273 439272 -5228940
4219 -5228940 2152448 752004 -13605170 -19972033 -6262642 12242685 17047969 10294709
4211 10294709 4377632 3104694 3404423 3538183 1111743 -6229716 -12139008 -5790165
$$ packed form
4266c669043j438211l737117L383557Q575060L395665n758844r072590n857453
4258a4178976n38487M591329P059851K695784p216617j2928553o520728P663285
4250a9373112J7029322J3869660K789568m212444n52941O918899O400625j984369
4242B0885208n979800j267389J37635r468465j7197296q979880N483917O942018
4234i444052j638675q01801J0844300J3145213j918943j7248870j7450795o789101
4226c1302724O154438J9442846K5666661J2772949j1687897k0607001n668212
4219e228940P381388j400444j4357174o366863J3709391J8505327M805284o753260
4211A0294709n917077j272938K99729J33760k426440p341459n909292O348843
$$ plain form
4203 -5790165 9713087 16664193 6803170 -7658944 -13309936 -11054463 -5857362 2054699
4195 2054699 7038423 -2472440 -22144787 -27709331 -8306128 13408925 13453139 3121873
4187 3121873 9943334 33213285 45398533 34633320 20553198 24163723 41511275 53730654
4179 53730654 49785443 33175696 14541157 1817369 -5557438 -11245887 -9758055 10228993
4171 10228993 43390801 61853169 46130574 12177516 -8785592 -9414970 -7283286 -13486717
4163 -13486717 -20690684 -20006932 -10732502 5740064 24422661 31443219 18715360 1467753
4155 1467753 1025497 12451258 12519387 -853944 -4632400 9258955 18854171 8851288
4147 8851288 -4043006 459115 14165776 16542477 6225089 -3719959 -9133373 -13558345
$$ packed form
4203e790165J5503252O951106r861023j4462114n650992K255473N197101P912061
4195B054699M983724r510863j9672347n564544J9403203K1715053M4214j0331266
4187C121873O821461K3269951J2185248j0765213j4080122L610525J7347552J2219379
4179E3730654l945211j6609747j8634539j2723788p374807n688449J487832J9987048
4171A0228993L3161808J8462368j5722595l3953058k0963108o29378K131684o203431
4163a3486717p203967O83752R274430J6472566J8682597P020558j2727859j7247607
4155A467753m42256J1425761O8129j3373331l778456J3891355R595216j0002883
4147H851288j2894294M502121J3706661K376701j0317388r945048n413414m424972
$$ plain form
4139 -13558345 -13553429 -4408890 6302522 8095392 4609321 5188669 5454371 -6086511 -25212867
4130 -25212867 -33311343 -22303796 -4305741 5141575 2574394 -4999068 -7365516 2849819
4122 2849819 22225109 35648657 31961870 18147064 8962302 6735233 3560552 -232166
4114 -232166 3879842 13298490 12442828 -2808129 -13113435 499708 29279210 45297605
4106 45297605 34370326 10385044 -3827772 -2395318 490297 -9877591 -30592379
4099 -30592379 -44381566 -39431733 -22395651 -10190215 -12021458 -22572898 -30388033 -28484031
4091 -28484031 -17616023 -3796030 6112982 8676772 4584199 -5147764 -20867939 -39218297
4083 -39218297 -49424167 -41283965 -18338404 2066341 6007301 -1534753 -2591177 11945238
$$ packed form
4139a3558345M916R144539J0711412J792870l486071N79348K65702j1540882j9126356
4130b5212867q098476J1007547J7998055R447316k567181p573462k366448J0215335
4122B849819J9375290J3423548l686787j3814806r184762k227069l174681l792718
4114b32166M112008R418648q55662j5250957j0305306J3613143K8779502J6018395
4106D5297605j0927279k3985282j4212816J432454K885615j0367888k0714788
4099c0592379j3789187M949833J7036082J2205436j831243j0551440p815135J904002
4091b8484031J0868008J3819993R909012K563790m092573r731963j5720175j8350358
4083c9218297j0205870Q140202K2945561K0404745L940960p542054j056424J4536415
$$ plain form
4075 11945238 30800653 36609572 28779993 24125439 32860035 43167718 37338227 16577016
4067 16577016 -1465048 -6673191 -4998001 -2752148 3649811 17230617 31286515 37966456
4059 37966456 37771424 34380658 28154424 21010155 19152751 23172216 23008568 11278959
4051 11278959 -4725431 -12629197 -10598132 -5119031 766462 7597014 12547770 11950366
4043 11950366 8197598 6802217 9330921 14400250 20498419 22731879 14502506 -717709
4035 -717709 -8091096 -334819 11563610 16116201 18062779 23843534 22733315 2098169
4027 2098169 -26493930 -38475897 -30337334 -20825672 -19111310 -14744768 -2748443 3966236
4019 3966236 -3750253 -15134128 -15646085 -6237201 2425771 4158755 -1280777 -10726106
$$ packed form
4075A1945238J8855415N808919p829579m654554Q734596J0307683n829491k0761211
4067A6577016j8042064n208143J675190K245853O401959J3580806J4055898O679941
4059C7966456j95032l390766o226234p144269j857404M019465j63648j1729609
4051A1278959j6004390p903766K031065N479101N885493O830552M950756n97404
4043A1950366l752768j395381K528704N069329O098169K233460q229373j5220215
4035g17709p373387P756277J1898429M552591J946578N780755j110219k0635146
4027B098169k8592099j1981967Q138563R511662J714362M366542J1996325O714679
4019C966236p716489j1383875n11957R408884Q662972J732984n439532r445329
$$ plain form
4011 -10726106 -16093586 -10513196 22182 2305109 -3816557 -4289100 6172497 15353621
4003 15353621 14165964 10618747 14620728 22964135 28820932 32910449 35585171 31015201
3995 31015201 19589753 13111950 16861816 19968618 15577116 16120835 33056816 53914598
3987 53914598 57446975 43021176 27887398 21966686 21380438 21118416 18782706 11002019
3979 11002019 195817 -1454586 10930964 21705226 14959106 281348 -842428 11647819
3971 11647819 17951406 10318174 1340685 -132275 -109995 -3052296 -3471779 959549 4155238
3962 4155238 4032899 5650851 9003857 8387270 5620525 7778054 10497362 2165190 -12748965
3953 -12748965 -15488995 -3404188 3635595 -4031278 -9099075 3827669 23226030 30630959
$$ packed form
4011a0726106n367480N580390J0535378K282927o121666m72543J0461597R181124
4003A5353621j187657l547217M001981Q343407N856797M089517K674722m569970
3995C1015201j1425448o477803L749866L106802m391502N43719J6935981K0857782
3987E3914598L532377j4425799j5133778n920712n86248k62022k335710p780687
3979A1002019j0806202j650403J2385550J0774262o746120j4677758j123776J2490247
3971A1647819O303587p633232q977489j472960K2280k942301m19483M431328L195689
3962D155238j22339J617952L353006o16587k766745K157529K719308q332172j4914155
3953a2748965k740030J2084807P039783p666873n067797J2926744J9398361P404929
$$ plain form
3945 30630959 27729211 25685745 23290610 15816705 12868084 25601583 44295160 49064143
3937 49064143 37481705 23407593 13993210 6394050 2396480 6239682 9701473 -1335597
3929 -1335597 -24620741 -42401019 -44824945 -36621580 -21593575 456405 19309986 17047612
3921 17047612 -7361778 -31950930 -37866924 -28197453 -14715665 -1303317 10042396
3914 10042396 11116586 -1117048 -14130352 -13538075 -1840008 6420608 3297562 -7329490
3906 -7329490 -17829358 -21053709 -10984872 11083341 32822031 41066534 34662482 21832493
3898 21832493 8104096 -5961738 -17204929 -18451072 -6773013 10816056 21637252
3891 21637252 17146509 602094 -14436015 -17078060 -11581872 -11770047 -22074486 -32096205
$$ packed form
3945C0630959k901748k043466k395135p473905k948621J2733499J8693577M768983
3937D9064143j1582438j4074112r414383p599160l997570L843202L461791j1037070
3929a335597k3285144j7780278k423926Q203365J5028005K2049980J8853581k262374
3921A7047612k4409390k4589152n915994R669471J3481788J3412348J1345713
3914A0042396J074190j2233634j3013304N92277J1698067Q260616l123046j0627052
3906g329490j0499868l224351J0068837K2068213K1738690Q244503o404052j2829989
3898B1832493j3728397j4065834j1243191j246143J1678059J7589069J0821196
3891B1637252m490743j6544415j5038109k642045N496188j88175j0304439j0021719
$$ plain form
3883 -32096205 -33280896 -31239700 -34210802 -38200519 -34332983 -24736899 -18551022 -15251822
3875 -15251822 -5432572 10881753 18917340 7089889 -16986659 -32802168 -25724738 1175946
3867 1175946 29660677 40992440 32896348 21030296 19458308 23850318 21450714 12254494
3859 12254494 7406794 8671403 5408129 -5064968 -10090133 -2128306 7574418 6601802
3851 6601802 888693 2994125 9330257 4996167 -11970447 -26189388 -25433020 -13363661
3843 -13363661 -36995 9538257 14345672 14142148 11399001 9724716 7630858 572722
3835 572722 -8853014 -11180163 -4309291 1377269 -1461281 -4394064 4752357 22298580
3827 22298580 32009914 26531001 15112981 8954611 9178041 13367048 23963933 41199897
$$ packed form
3883c2096205j184691K041196k971102l989717L867536R596084O185877L299200
3875a5251822R819250J6314325Q035587j1827451k4076548j5815509P077430K6900684
3867A175946K8484731J1331763q096092j1866052j571988M392010k399604r196220
3859A2254494m847700J264609l263274j0473097n025165P961827R702724r72616
3851F601802n713109K105432O336132m334090j6966614j4218941P56368J2069359
3843a3363661J3326666R575252M807415k03524k743147j674285k093858p058136
3835E72722r425736k327149O870872N686560k838550k932783R146421J7546223
3827B2298580R711334n478913j1418020o158370K23430M189007J0596885J7235964
$$ plain form
3819 41199897 53628570 47348241 24981603 6040956 5076744 16266943 23585834 19957856
3811 19957856 10640138 2655462 -1541027 -2228343 -1744656 -4978609 -13713667 -20694252
3803 -20694252 -16476772 -2880023 7686466 7685605 1595142 -4234690 -9638007 -14351419
3795 -14351419 -13385527 -6126334 -1969310 -7571123 -14995746 -13367020 -7260526 -10455483
3787 -10455483 -23264148 -30186658 -22535371 -10657405 -8008935 -13341674 -16445477 -14270479
3779 -14270479 -12410879 -14149904 -16157116 -14533410 -9482267 -3784830 -622432 -2870452
3771 -2870452 -10536449 -17646738 -14969175 946264 21911940 34250322 32311739 23870955
3763 23870955 20106472 23046153 26944559 28659760 28851401 24715097 13015667 2078821
$$ packed form
3819D1199897J2428673o280329k2366638j8940647r64212J1190199P318891l627978
3811A9957856r317718p984676m196489o87316M83687l233953q735058o980585
3803b0694252M217480J3596749J0566489q61o090463n829832n403317m713412
3795a4351419R65892P259193M157024n601813p424623J628726O106494l194957
3787a0455483j2808665o922510P651287J1877966K648470n332739l103803K174998
3779a4270479J859600j739025k007212J623706N051143N697437L162398k248020
3771b870452p665997p110289K677563J5915439K0965676J2338382j938583q440784
3763B3870955l764483K939681L898406J715201J91641m136304j1699430j0936846
$$ plain form
3755 2078821 6702715 24284224 30622096 11960042 -11537932 -11206296 10929396 28201454
3747 28201454 27487948 18096236 5735515 -15417498 -40666790 -51027819 -41306495 -29385207
3739 -29385207 -26437118 -20288255 -2177982 12849170 11030067 4597194 8933784 13557012
3731 13557012 2582557 -11232603 -4500815 14106302 13655328 -8463065 -20461823 -6254242
3723 -6254242 10969152 7637413 -6019100 -8416458 -1076025 262748 -5691940 -6524192
3715 -6524192 2364717 13535912 20144031 20582784 15149280 7921371 6918250 14084621
3707 14084621 20925699 21199622 20041878 22380060 21645952 11073616 -1725663 -4263867
3699 -4263867 2148983 5660167 1655131 -5016898 -12167429 -21224626 -26973825 -19655307
$$ packed form
3755B078821M623894J7581509O337872j8662054k3497974L31636K2135692J7272058
3747B8201454p13506r391712j2360721k1153013k5249292j0361029R721324J1921288
3739b9385207K948089O148863J8110273J5027152j819103o432873M336590M623228
3731A3557012j0974455j3815160O731788J8607117m50974k2118393j1998758J4207581
3723f254242J7223394l331739j3656513k397358P340433J338773n954688q32252
3715f524192Q888909J1171195O608119M38753n433504p227909j003121P166371
3707A4084621O841078K73923j157744K338182p34108j0572336j2799279k538204
3699d263867O412850L511184m005036o672029p150531r057197n749199P318518
$$ plain form
3691 -19655307 -21230 17716517 21460033 13042681 2869001 -1060029 2190004 7080470
3683 7080470 6373115 66709 -2075498 6772137 17679347 15109965 -1010014 -12398118
3675 -12398118 -4965547 13874024 25272009 20273361 5856425 -5870709 -8591743 -3785922
3667 -3785922 2791441 5660518 3456122 -50530 560698 6211312 10121298 3053098
3659 3053098 -15443851 -33054340 -37071050 -29798285 -24607570 -26687078 -27848261 -23310346
3651 -23310346 -20515808 -22755784 -17531829 3412208 22536739 15708877 -10995131 -26626172
3643 -26626172 -19462238 -11705877 -21564636 -34844512 -31839247 -22682838 -30284304 -48721958
3635 -48721958 -47902975 -20036765 5594235 3150394 -16256239 -25406397 -18823119 -12361200
$$ packed form
3691a9655307J9634077J7737747L743516q417352j0173680l929030L250033M890466
3683G080470p07355o306406k142207Q847635J0907210k569382j6119979j1388104
3675a2398118P432571J8839571J1397985m998648j4416936j1727134k721034M805821
3667c785922O577363K869077k204396l506652O11228N650614L909986p068200
3659C053098j8496949j7610489m016710P272765N190715k079508j161183M537915
3651b3310346K794538k239976N223955K0944037J9124531o827862k6704008j5631041
3643b6626172P163934P756361r858759j3279876L005265R156409p601466j8437654
3635d8721958Q18983K7866210K5631000k443841j9406633r150158O583278O461919
$$ plain form
3627 -12361200 -15425035 -22508338 -28040108 -31600074 -28576379 -12924511 6925154 10663596
3619 10663596 -7756141 -29127541 -33018774 -21630383 -9193666 1358094 15824743
3612 15824743 29758799 30201286 16071555 887577 -7293525 -14160396 -23315782 -26546806
3604 -26546806 -17388877 -2664480 8077099 14759884 19711101 18214415 7172285 -4379979
3596 -4379979 -5599237 78068 671381 -5795745 -9432739 -3091030 11166171 28277150
3588 28277150 42933610 47690095 38611667 22680025 10827540 4662935 -1164275 -6247032
3580 -6247032 -5777794 -2871642 -5185583 -7804048 4829533 33594218 55140815 48062072
3572 48062072 19631984 -4211594 -9821051 -6270353 -7424638 -13877331 -15816861 -8884686
$$ packed form
3627a2361200l063835p083303n531770l559966L023695J5651868J9849665L738442
3619A0663596j8419737k1371400l891233J1388391J2436717J0551760J4466649
3612A5824743J3934056M42487j4129731j5183978q181102o866871r155386l231024
3604b6546806R157929J4724397J0741579O682785M951217j496686j1042130j1552264
3596d379979j219258N677305N93313o467126l636994O341709J4257201J7110979
3588B8277150J4656460M756485r078428j5931642j1852485o164605n827210n082757
3580f247032M69238K906152k313941k618465J2633581K8764685K1546597p078743
3572D8062072k8430088k3843578n609457L550698j154285o452693j939530O932175
$$ plain form
3564 -8884686 -1865617 -6072253 -18975503 -25315441 -17596411 -6642826 -3514317 -818780
3556 -818780 12508350 25303474 16077659 -9039897 -16564521 6623777 30319149 22513489
3548 22513489 -6558910 -23604847 -19494173 -11425924 -8290386 -2859370 4319829 2119552
3540 2119552 -6007856 -206633 23460588 41536651 36271289 20754093 16115706 20241535
3532 20241535 17434507 7211868 2825253 6599825 6315635 -4079285 -16504973 -23680883
3524 -23680883 -28035701 -31634751 -29378102 -18951882 -8987450 -9657321 -19625174 -28254116
3516 -28254116 -27921248 -19486167 -7827952 3157224 11097201 14066111 10928683 2978149
3508 2978149 -5502020 -10416930 -12702688 -17280055 -24750464 -27896153 -21680281 -13548784
$$ packed form
3564h884686P019069m206636j2903250o339938P719030J0953585L128509K695537
3556h18780J3327130J2795124r225815k5117556p524624K3188298K3695372p805660
3548B2513489k9072399j7045937M110674Q068249L135538N431016P179199k200277
3540B119552q127408N801223K3667221J8076063n265362j5517196m638387M125829
3532B0241535k807028j0222639m386615L774572k84190j0394920j2425688p175910
3524b3680883m354818l599050K256649J0426220R964432o69871r967853q628942
3516b8254116L32868Q435081J1658215J0985176P939977K968910l137428p950534
3508B978149q480169m914910k285758m577367p470409l145689O215872Q131497
$$ plain form
3500 -13548784 -15526374 -26542214 -32188145 -24583834 -12741599 -7738166 -6873826 -1479450
3492 -1479450 6399960 6252663 -5094858 -20130520 -31316809 -35561877 -30297600 -16536763
3484 -16536763 -5092509 -6887812 -15640414 -13682025 2023033 14946974 15999535 18264627
3476 18264627 32941952 46471151 39565536 18225680 5239786 6668214 8099400 2387193
3468 2387193 -835582 3899781 8166200 7088162 7524147 10391588 3596106 -14796854
3460 -14796854 -23162793 -3505431 29155481 42957744 28332640 3666176 -13879166
3453 -13879166 -24537119 -32276931 -33044396 -24168638 -13961501 -12847130 -19978702 -24977581
3445 -24977581 -20630247 -9978300 -1755830 -694997 -2598472 183417 8476138 14797742
$$ packed form
3500a3548784j977590j1015840n645931P604311J1842235N003433Q64340N394376
3492a479450P879410j47297j1347521j5035662j1186289m245068N264277J3760837
3484a6536763J1444254j795303q752602J958389J5705058J2923941J052561K265092
3476A8264627J4677325J3529199o905615k1339856j2985894J428428J431186n712207
3468B387193l222775M735363M266419j078038M35985K867441o795482j8392960
3460a4796854q365939J9657362L2660912J3802263j4625104k4666464j7545342
3453a3879166j0657953p739812p67465Q875758J0207137J114371p131572m998879
3445b4977581M347334J0651947Q222470J060833j903475K781889Q292721O321604
$$ plain form
3437 14797742 13675387 8828252 6226559 4133065 -4335704 -20560510 -36966582 -43737502
3429 -43737502 -37334209 -24604056 -18399659 -23642667 -27780928 -14527382 10759080 22558123
3421 22558123 9166756 -9097968 -8608685 3605115 3427616 -11283802 -18257321 -6358263
3413 -6358263 9075202 11829377 6690936 6534221 11737667 12859292 5011092 -8140859
3405 -8140859 -18432756 -17700414 -5794204 4550377 762946 -11246842 -14981490 -10431442
3397 -10431442 -15515609 -35101990 -48326934 -38536987 -18412002 -9492813 -11014565 -7692554
3389 -7692554 2157235 6905856 4194707 3044931 5016458 1396359 -9791550 -19607349
3381 -19607349 -23119021 -24900954 -27327072 -26085932 -20695058 -18521958 -24647499 -36273041
$$ packed form
3437A4797742j122355m847135k601693k093494q468769j6224806j6406072o770920
3429d3737502O403293J2730153O204397n243008m138261J3253546K5286462J1799043
3421B2558123j3391367j8264724M89283J2213800j77499j4711418o973519J1899058
3413f358263J5433465K754175n138441j56715N203446J121625p848200j3151951
3405h140859j0291897P32342J1906210J0344581l787431j2009788l734648M550048
3397a0431442n084167j9586381j3224944R789947K0124985Q919189j521752L322011
3389g692554R849789M748621k711149j149776J971527l620099j1187909r815799
3381a9607349l511672j781933k426118J241140N390874K173100o125541j1625542
$$ plain form
3373 -36273041 -48889028 -59202764 -61099884 -48585093 -24921089 -892228 16223289
3366 16223289 23896736 17757415 -3134276 -25352610 -30939468 -20598775 -12081144 -12540336
3358 -12540336 -9799329 3155493 14408158 14914255 15580300 26315313 33455235 18717825
3350 18717825 -9392229 -25182510 -21612931 -14808176 -14455046 -11880211 -960830 9523969
3342 9523969 12093634 12542651 16630666 18812597 14568710 12050408 19272948 28211068
3334 28211068 24450167 8236272 -5262727 -4977593 5083908 12541652 7884378 -9388232
3326 -9388232 -30307688 -43213616 -44198618 -38271612 -29214106 -15830742 -1985858 257502
3318 257502 -12713069 -24331564 -15485054 10365962 31860484 36294973 28960878 18901311
$$ packed form
3373c6273041j2615987j0313736j897120J2514791K3664004K4028861J7115517
3366A6223289P673447o139321k0891691k2218334n586858J0340693Q517631m59192
3358a2540336K741007J2954822J1252665N06097O66045J0735013P139922j4737410
3350A8717825k8110054j5790281L569579O804755L53130K574835J0919381J0484799
3342I523969K569665M49017M088015K181931m243887k518302P222540Q938120
3334B8211068l760901j6213895j3498999K85134J0061501P457744m657274j7272610
3326i388232k0919456j2905928r85002N927006R057506J3383364J3844884K243360
3318B57502j2970571j1618495Q846510K5851016K1494522M434489p334095j0059567
$$ plain form
3310 18901311 10229036 7267190 12267358 15060421 601454 -27728384 -46950151 -43271231
3302 -43271231 -27411031 -13267761 1739137 21410280 31761319 18095814 -7442416
3295 -7442416 -17583783 -7138719 2199393 -3807810 -12799935 -8380372 4725226 9791945
3287 9791945 2104803 -7943437 -10216053 -3111827 10804104 28358613 44098861 50940032
3279 50940032 45475435 31764029 18887959 13765430 15389237 17092859 15213919 12739856
3271 12739856 12657473 12445637 9664053 8263448 12604823 19061172 21586211 22301367 26972793
3262 26972793 32395644 29573974 18924858 10334467 6969591 1568470 -8252161 -13961769
3254 -13961769 -10712593 -5856944 -5828736 -5628015 57090 5231152 2458442 -3077776 -86471
$$ packed form
3310A8901311q672275k961846N000168K793063j4458967k8329838j9221767L678920
3302d3271231J5860200J4143270J5006898J9671143J0351039j3665505k5538230
3295g442416j0141367J0445064R338112o007203q992125M419563J3105598N066719
3287I791945p687142j0048240k272616P104226J3915931J7554509J5740248O841171
3279E0940032n464597j3711406j2876070n122529J623807J703622j878940k474063
3271A2739856q2383k11836k781584j400605M341375O456349K525039P15156M671426
3262B6972793N422851k821670j0649116q590391l364876n401121r820631n709608
3254a3961769L249176M855649K8208K00721N685105N174062k772710n536218K991305
$$ plain form
3245 -86471 12765283 26074482 31313182 26366762 14067608 1849936 -1932474 2298671
3237 2298671 4187515 -2752799 -12545721 -17075159 -16451138 -12665096 -3490407 8010579
3229 8010579 9196580 -4157333 -15793862 -10188857 3256742 5096789 -3020790 -3942492
3221 -3942492 2625527 -1163214 -17738298 -24701014 -8556680 13344976 17867279 6432994
3213 6432994 -4357339 -9211992 -15071932 -24241038 -32152363 -37182186 -39802605 -35966783
3205 -35966783 -23400592 -11337606 -12060327 -24129267 -34564755 -36388766 -33245801 -27450472
3197 -27450472 -16154958 -2403999 1961104 -8311342 -21583587 -22939125 -13683798 -8816871
3189 -8816871 -16790778 -30039331 -36534720 -33240340 -25019971 -17055362 -13782257 -19385507
$$ packed form
3245h6471J2851754J3309199N238700m946420j2299154j2217672l782410M231145
3237B298671J888844o940314r792922m529438O24021L786042R174689J1500986
3229H010579J186001j3353913j1636529N605005J3445599J840047q117579r21702
3221c942492O568019l788741j6575084o962716J6144334K1901656M522303j1434285
3213F432994j0790333m854653n859940r169106p911325n029823k620419L835822
3205c5966783J2566191J2062986p22721j2068940j0435488j824011L142965N795329
3197b7450472J1295514J3750959M365103j0272446j3272245j355538R255327M866927
3189h816871p973907j3248553o495389L294380Q220369P964609L273105n603250
$$ plain form
3181 -19385507 -31003695 -35298931 -22491423 -2654490 4475932 -2520142 -4134637 8087549
3173 8087549 13596598 -8456552 -45191603 -64590940 -57492361 -43295474 -35730968 -26980079
3165 -26980079 -11067644 129656 -3128283 -10160379 -7171825 -133870 -3770137 -16358169
3157 -16358169 -22532879 -16684757 -7682951 -2093326 2292922 5219370 3782 -14811033
3149 -14811033 -29534923 -33486094 -24375769 -5531170 18003043 36985883 40146229 26208703
3141 26208703 9286921 4826007 11660802 14635042 5310462 -6761573 -7306246 2900319
3133 2900319 8586573 190221 -13428665 -16142600 -3670358 13684253 24648771 27679291
3125 27679291 29074230 35303010 46795147 55814849 52478091 37007346 22598761 20044982
$$ packed form
3181a9385507j1618188m295236J2807508J9836933P130422o996074j614495J2222186
3173H087549N509049k2053150l6735051j9399337P098579J4196887P564506Q750889
3165b6980079J5912435J1197300l257939p032096K988554P037955l636267j2588032
3157a6358169o174710N848122R001806N589625M386248K926448n215588j4814815
3149a4811033j4723890l951171R110325J8844599K3534213J8982840L160346j3937526
3141B6208703j6921782m460914O834795K974240r324580j2072035n44673J0206565
3133B900319N686254q396352j3618886k713935J2472242J7354611J0964518L030520
3125B7679291J394939O228780J1492137R019702l336758j5470745j4408585k553779
$$ plain form
3117 20044982 23362529 19220291 7340444 156719 3094684 8054593 8570923 8514816
3109 8514816 10953680 10371768 3000803 -4914485 -6518293 -3841581 -1538760 424158
3101 424158 1378035 -3754865 -15206275 -23836985 -23757807 -21193850 -22626055 -23068248 -16130805
3092 -16130805 -7742933 -8528419 -18088689 -26676482 -27087943 -16840484 3236086 22650100
3084 22650100 23043776 -316464 -26550402 -32904567 -23473414 -18881930 -24510529 -28053221
3076 -28053221 -24851446 -24583533 -31241421 -35246587 -29519963 -17648943 -2744064 15977546
3068 15977546 31460171 30185404 12193706 -4522442 -7085563 -2289154 -732294 222732
3060 222732 7621840 18098491 23258100 22333642 19253882 13024343 800457 -13224126
$$ packed form
3117B0044982L317547m142238j1879847p183725K937965M959909N16330n6107
3109H514816K438864n81912p370965p915288j603808K676712K302821J962918
3101D24158R53877n132900j1451410q630710P9178K563957j432205m42193O937443
3092a6130805Q387872p85486r560270q587793m11461J0247459K0076570J9414014
3084B2650100L93676k3360240k6233938o354165R431153M591484n628599l542692
3076b8053221L201775K67913o657888m005166N726624J1871020J4904879J8721610
3068A5977546J5482625j274767j7991698j6716148k563121M796409J556860R55026
3060B22732P399108J0476651N159609r24458l079760o229539j2223886j4024583
$$ plain form
3052 -13224126 -20482684 -18101563 -11136153 -6501893 -7501028 -11467921 -11193319 -2462093
3044 -2462093 9301087 14616960 11238378 3362514 -7968626 -23210691 -34185355 -29457001
3036 -29457001 -12644884 -1594717 -4338271 -9623201 -7856487 -6443587 -13700972 -21159836
3028 -21159836 -16326543 -3403708 4143888 5353276 10461487 20938828 26063641 20381371
3020 20381371 12161551 11074074 15891139 17837294 10859862 -3683541 -19329343 -30428772
3012 -30428772 -36771955 -40833790 -40640158 -30819028 -12754828 2949840 8170814 5445665
3004 5445665 915374 -3258991 -4625679 2204313 16012904 24847827 20854801 12377068
2996 12377068 11297009 15241379 14532697 11185074 16015233 28150458 31983797 17482006
$$ packed form
3052a3224126p258558K381121O965410M634260r99135l966893K74602Q731226
3044b462093J1763180N315873l378582p875864j1331140j5242065j0974664M728354
3036b9457001J6812117J1050167k743554n284930J766714J412900p257385p458864
3028b1159836M833293J2922835P547596J209388N108211J0477341N124813n682270
3020B0381371q219820j087477M817065J946155o977432j4543403j5645802j1099429
3012c0428772o343183m061835J93632R821130J8064200J5704668N220974k725149
3004E445665m530291m174365j366688O829992J3808591Q834923l993026q477733
2996A2377068j080059L944370p08682l347623M830159J2135225L833339j4501791
$$ plain form
2988 17482006 -7297701 -27277348 -35366540 -33685676 -27941542 -24609004 -27878770 -35189498
2980 -35189498 -38436271 -31495397 -15345864 2933681 13935436 11595132 -983271 -13927685
2972 -13927685 -22099278 -29928730 -40888758 -48842228 -47143359 -40162026 -36125906 -33439786
2964 -33439786 -25543492 -16172854 -16794437 -28900227 -41115316 -45770085 -47160248 -50432269
2956 -50432269 -52883441 -50799943 -45965088 -40472113 -32927801 -24855609 -23224384 -29883607
2948 -29883607 -34261643 -24579786 -4034609 11202028 10537560 508396 -4334656 1023062
2940 1023062 7841624 7155969 1971146 775580 3189690 2058678 -600049 7351499
2932 7351499 28269023 46464109 48640843 41241770 36130984 30206418 14767650 -3672340
$$ packed form
2988A7482006k4779707j9979647q089192J680864N744134L332538l269766p310728
2980c5189498l246773O940874J6149533J8279545J1001755k340304j2578403j2944414
2972a3927685q171593p829452j0960028p953470J698869O981333M036120K686120
2964c3439786P896294R370638o21583j2105790j2215089m654769j390163l272021
2956e0432269k451172K083498M834855N492975P544312Q072192J631225o659223
2948b9883607m378036R681857K0545177J5236637o64468j0029164m843052N357718
2940A023062O818562o85655n184823j195566K414110j131012k658727P951548
2932G351499K0917524J8195086K176734p399073n110786n924566j5438768j8439990
$$ plain form
2924 -3672340 -10962788 -9096149 -12474161 -21617314 -21121689 -6395794 7454547 9389701
2916 9389701 7143199 10348594 15285180 15877618 15320274 16201689 12049894 194172 -8362910
2907 -8362910 -4312630 3977076 2292202 -8801667 -16840150 -15083564 -6541691 4226158
2899 4226158 12875083 13312175 3916526 -7305000 -11233177 -7112240 2334024 17491100
2891 17491100 34953119 42328413 31627092 11880189 -3049361 -12809653 -23360678
2884 -23360678 -27931960 -13385120 15173425 34340274 31335654 17996804 9951200 5706173
2876 5706173 -4387011 -19358829 -29675258 -32130792 -31353640 -28705925 -20047961 -5936368
2868 -5936368 4075294 1837087 -8378572 -13503148 -5551412 10733392 23742367 25895974
$$ packed form
2924c672340p290448J866639l378012r143153M95625J4725895J3850341J935154
2916I389701k246502L205395M936586N92438n57344Q81415m151795j1855722q557082
2907h362910M050280Q289706j684874j1093869q038483J756586Q541873J0767849
2899D226158Q648925M37092r395649j1221526l928177M120937R446264J5157076
2891A7491100J7462019P375294j0701321j9746903j4929550r760292j0551025
2884b3360678m571282J4546840K8558545J9166849l004620j3338850q045604m245027
2876E706173j0093184j4971818j0316429k455534P77152K647715Q657964J4111593
2868e936368J0011662k238207j0215659n124576P951736J6284804J3008975K153607
$$ plain form
2860 25895974 18348887 7952190 1607299 1468976 3424129 2217895 -341587 3391396
2852 3391396 13809722 18357131 7274128 -9528048 -13350189 -3319511 1778339 -8870728
2844 -8870728 -22911120 -24428300 -16406136 -13412392 -20859755 -32194323 -40303632 -42100243
2836 -42100243 -37235308 -30600942 -30020982 -33821150 -29123863 -11910224 1621718 -2632460
2828 -2632460 -12701710 -6867207 12674711 23755702 19520215 16063565 20918864 17988027
2820 17988027 -4009295 -27344234 -27159093 -6303670 9530755 6513763 -3546043 -3849795
2812 -3849795 6383044 15389843 14415989 4136120 -10199702 -24263532 -34815718 -37953618
2804 -37953618 -31248986 -18632556 -9546987 -9668492 -14509560 -16040795 -13499512 -12663863
$$ packed form
2860B5895974p547087j0396697o344891j38323J955153j206234k559482L732983
2852C391396J0418326M547409j1083003j6802176l822141J0030678N097850j0649067
2844h870728j4040392j517180Q022164K993744p447363j1334568q109309j796611
2836d2100243M864935O634366N79960l800168M697287J7213639J3531942m254178
2828b632460j0069250N834503J9541918J1080991m235487l456650M855299k930837
2820A7988027k1997322k3334939J85141K0855423J5834425l016992j0059806l03752
2812c849795J0232839R006799r73854j0279869j4335822j4063830j0552186l137900
2804c7953618O704632J2616430R085569j21505m841068j531235K541283Q35649
$$ plain form
2796 -12663863 -15970002 -19183798 -17747310 -11619894 -4260839 -794473 -4919729 -12682885
2788 -12682885 -13099259 -2134082 8206010 4598563 -7440378 -10739373 -1833567 6067263
2780 6067263 6489107 9024609 19639826 27774025 22352244 7395088 -7960775 -21981573
2772 -21981573 -31978806 -27306505 -5926665 13034671 10612685 -6037411 -16576992 -18957847
2764 -18957847 -26903346 -39956205 -40646959 -25108073 -13561850 -20779512 -34618141 -36039278
2756 -36039278 -25595503 -16453645 -12928824 -10872011 -11081897 -16998992 -23581719 -22354739
2748 -22354739 -15189937 -11026934 -10979746 -8637044 -3718086 -2888087 -6801473 -8807194 -8178425
2739 -8178425 -12324618 -23013659 -32877155 -39651972 -50219919 -63505393 -63619401 -41996104
$$ packed form
2796a2663863l306139l213796J436488O127416P359055L466366m125256p763156
2788a2682885m16374J0965177J0340092l607447j2038941l298995Q905806P900830
2780F067263M21844K535502J0615217Q134199n421781j4957156j5355863j4020798
2772b1981573r997233M672301K1379840J8961336k421986j6650096j0539581k380855
2764a8957847p945499j3052859o90754J5538886J1546223p217662j3838629j421137
2756c6039278J0443775R141858L524821K056813k09886n917095o582727J226980
2748b2354739P164802M163003M7188K342702M918958Q29999l913386k005721O28769
2739h178425m146193j0689041r863496o774817j0567947j3285474j14008K1623297
$$ plain form
2731 -41996104 -15039083 -4771716 -9529229 -10150806 -639111 5472882 -629217 -10215391
2723 -10215391 -13151585 -11873727 -12018172 -11217325 -5809255 232392 1102264 -2875963 -8867693
2714 -8867693 -15404493 -17504802 -8002859 8534734 13516921 -3285598 -27212783 -36135954
2706 -36135954 -27411704 -15292912 -8529824 -5575340 -7295884 -17128216 -29025050 -31592157
2698 -31592157 -25936974 -23664644 -24278637 -12218147 15665905 35938237 25586050 -6589555
2690 -6589555 -29921652 -28732624 -16512599 -14257980 -25847913 -38201275 -38920001 -28450025
2682 -28450025 -16161181 -8418176 -3474368 2422761 8823836 14131843 19868908 25793395
2674 25793395 25094925 13174795 -1658464 -6815705 -3397651 -3395276 -8775946 -8056778 2303551
$$ packed form
2731d1996104K6957021J0267367m757513o21577R511695O111993o102099r586174
2723a0215391k936194J277858j44445Q00847N408070O041647Q69872l978227n991730
2714h867693o536800k100309R501943J6537593M982187j6802519k3927185q923171
2706c6135954Q724250J2118792O763088K954484j720544r832332j1896834k567107
2698c1592157N655183K272330o13993J2060490K7884052K0272332j0352187l2175605
2690f589555k3332097J189028J2220025K254619j1589933j2353362p18726J0469976
2682b8450025J2288844P743005M943808N897129O401075N308007N737065N924487
2674B5793395o98470j1920130j4833259n157241L418054K375n380670P19168J0360329
$$ plain form
2665 2303551 8743712 1787313 -7140083 -2535949 11708262 19836581 18270368 16865986
2657 16865986 19532751 19218767 13326158 10246419 15518302 21567579 18128570 7096046
2649 7096046 114640 3157062 8910434 6227296 -5224405 -13692230 -10663847 -3659154
2641 -3659154 -7569060 -24413899 -39897204 -41762426 -32824843 -21926790 -11483287 -1284781
2633 -1284781 3776309 385883 -3602918 2718960 17244349 26531719 23461731 14806760
2625 14806760 10155065 10347622 9021141 1020388 -12181005 -22791395 -23120353 -14469103
2617 -14469103 -7762520 -12038647 -24404747 -34291901 -34473180 -25078621 -11789354 -4173402
2609 -4173402 -9382134 -21231890 -22431912 -6393059 9860599 6365305 -11210107 -18790772
$$ packed form
2665B303551O440161o956399q927396M604134J4244211Q128319j566213j404382
2657A6865986K666765l13984n892609l079739N271883O049277l439009j1032524
2649G096046o981406L042422N753372k683138j1451701q467825L028383P004693
2641c659154l909906j6844839j5483305j865222Q937583J0898053J0443503J0198506
2633a284781N061090l390426l988801O321878J4525389R287370l069988q654971
2625A4806760m651695J92557j326481q000753j3201393j0610390l28958Q651250
2617a4469103O706583m276127j2366100r887154j81279R394559J3289267P615952
2609d173402n208732j1849756j200022J6038853J6253658l495294j7575412p580665
$$ plain form
2601 -18790772 -8736553 -240528 -9086903 -22176467 -14903847 13657111 37195796 34395182
2593 34395182 13911151 1300848 7077303 17481638 17698472 12954084 16701969 24777798
2585 24777798 17827736 -8664099 -33151968 -35058612 -19882855 -6855708 -3456228 -5164017
2577 -5164017 -9742218 -15574031 -13816459 8558 12122622 6598116 -8863911 -13295617
2569 -13295617 -5947758 -6443149 -20135326 -28202068 -19681063 -9698749 -12995004 -19644005
2561 -19644005 -13800434 -765038 3439824 -1329231 -2041721 4585188 9532901 9102769
2553 9102769 9444992 13324397 15265257 12073485 8690350 10587851 16018965 17762507
2545 17762507 10046088 -5523770 -19569892 -23587486 -19955141 -18052785 -19649851 -16577545
$$ packed form
2601a8790772J0054219Q496025q846375j3089564P272620K8560958K3538685k800614
2593C4395182k0484031j2610303N776455J0404335K16834m744388L747885Q075829
2585B4777798o950062k6491835k4487869j906644J5175757J3027147L399480j707789
2577e164017m578201n831813J757572J3825017J2114064n524506j5462027m431706
2569a3295617P347859m95391j3692177q066742Q521005R982314l296255o649001
2561a9644005N843571J3035396M204862m769055p12490O626909M947713m30132
2553I102769L42223L879405J940860l191772l383135J897501N431114J743542
2545A7762507p716419j5569858j4046122m017594L632345J902356j597066L072306
$$ plain form
2537 -16577545 -5537439 5229282 9299232 10877270 12441542 5318700 -15518960 -36575720
2529 -36575720 -40079549 -27765745 -17030671 -16892074 -20174846 -16968316 -4575985 12997800
2521 12997800 25006436 18732003 -2368201 -10713384 17545660 68021708 99789434
2514 99789434 93378858 68669688 51078928 41044771 28228555 17187466 20236944
2507 20236944 34464840 43843800 40431573 28944861 13253341 -6448046 -22742037
2500 -22742037 -22481500 -4659826 14056189 18229054 10216183 1854560 -2238097 -4270417
2492 -4270417 -2623986 6195804 16534022 17104248 8248879 4136931 11839191 18938377
2484 18938377 11727077 -2802857 -6474295 3069759 9653610 2432042 -12072121 -24120293
$$ packed form
2537a6577545J1040106J0766721M069950J578038J564272p122842k0837660k1056760
2529c6575720l503829J2313804J0735074J38597l282772L206530J2392331J7573785
2521A2997800J2008636o274433k1100204q345183K8259044N0476048L1767726
2514I9789434o410576k4709170j7590760j0034157j2816216j1041089L049478
2507B0236944J4227896R378960l412227j1486712j5691520j9701387j6293991
2500b2742037K60537J7821674J8716015M172865q012871q361623m092657k032320
2492d270417J646431Q819790J0338218N70226q855369m111948P702260P099186
2484A8938377p211300j4529934l671438R544054O583851p221568j4504163j2048172
$$ plain form
2476 -24120293 -32465707 -36736457 -32178970 -20475606 -13919541 -18885674 -25295641 -22721159
2468 -22721159 -16555216 -15970301 -16090261 -7947408 1501320 -2342120 -17052092 -25354579
2460 -25354579 -21454567 -16836836 -17572607 -14232065 -540858 14197936 20043221 20486382
2452 20486382 22311199 23094245 19129493 15809241 18589810 21107829 13946110 -47485
2444 -47485 -10251317 -13997875 -16760154 -19341178 -16472482 -8193285 -1970495 -1133432 56230
2435 56230 6217407 12825611 13090290 7880795 3552408 2614449 1580809 -2686521 -8688981
2426 -8688981 -12732881 -12212350 -5437793 8180128 24994930 37071243 39725557 37744196
2418 37744196 38820269 41183259 34511161 15015150 -7422057 -21049376 -24666608 -23468125
$$ packed form
2476b4120293q345414m270750M557487J1703364O556065m966133o409967K574482
2468b2721159O165943N84915j19960Q142853R448728l843440j4709972q302487
2460b5354579L900012M617731p35771L340542J3691207J4738794N845285M43161
2452B0486382J824817P83046l964752l320252K780569K518019p161719j3993595
2444d7485j0203832l746558k762279k581024K868696Q279197O222790Q37063J189662
2435E6230O161177O608204K64679n209495m328387r37959j033640m267330o002460
2426h688981m043900N20531O774557J3617921J6814802J2076313K654314j981361
2418C7744196J076073K362990o672098j9496011k2437207j3627319l617232J198483
$$ plain form
2410 -23468125 -19727338 -14855896 -14173175 -20328229 -26980490 -28589823 -30662556 -38052529
2402 -38052529 -39221167 -20108506 7537320 12638892 -14065681 -43924906 -46547949 -27075090
2394 -27075090 -13288731 -16978816 -24996836 -23256237 -13360344 -5252044 -5214779 -12878586
2386 -12878586 -22301622 -25335361 -19550357 -11881243 -9954549 -13300157 -18602099 -28133859
2378 -28133859 -44132289 -58924438 -61442616 -52191890 -41467603 -33038932 -20324634 -439318
2370 -439318 18312671 26967133 25781325 19439869 9876280 -833711 -6748506 -4268079
2362 -4268079 892858 -915464 -11453109 -22095554 -23166151 -13388728 -293862 6829909
2354 6829909 4120449 -5432745 -16424900 -25843852 -33616714 -40329985 -45565463 -47026511
$$ packed form
2410b3468125L740787M871442O82721o155054o652261j609333k072733p389973
2402c8052529j168638J9112661K7645826N101572k6704573k9859225k623043J9472859
2394b7075090J3786359l690085q018020J740599R895893Q108300L7265p663807
2386a2878586r423036l033739N785004P669114J926694l345608n301942r531760
2378b8133859j5998430j4792149k518178R250726J0724287Q428671J2714298J9885316
2370d39318J8751989Q654462j185808o341456r563589j0709991n914795K480427
2362d268079N160937j808322j0537645j0642445j070597R777423J3094866P123771
2354F829909k709460r553194j0992155r418952p772862o713271n235478j461048
$$ plain form
2346 -47026511 -40667054 -24513340 -4026450 9850554 11235236 5145240 -260720 -3403819
2338 -3403819 -6598777 -8026655 -4131326 1985699 3506605 1955173 7504449 23772876
2330 23772876 39560661 41201860 28828266 15283242 11570736 17714926 26015286 28834096
2322 28834096 23265088 11215846 -3812968 -19828357 -35492257 -47366120 -51500253
2315 -51500253 -48342148 -42133321 -33814851 -19185167 2052166 19411345 20377807 5830832
2307 5830832 -8885831 -10081848 1091163 13567736 20177434 22138327 22305704 20226293
2299 20226293 15083878 8490411 1579746 -6411810 -12867417 -9741374 6132256 23010229
2291 23010229 23820913 7401256 -8725183 -11072177 -7175092 -12323778 -26153439 -33454967
$$ packed form
2346d7026511O359457J6153714K0486890J3877004J384682o089996n405960l143099
2338c403819l194958j427878L895329O117025J520906j551432N549276J6268427
2330B3772876J5787785J641199j2373594j3545024l712506O144190Q300360K818810
2322B8834096n569008j2049242j5028814j6015389j5663900j1873863m134133
2315e1500253L158105O208827Q318470J4629684K1237333J7359179R66462j4546975
2307E830832j4716663j196017J1173011J2476573O609698J960893J67377k079411
2299B0226293n142415o593467o910665p991556o455607L126043J5873630J6877973
2291B3010229Q10684j6419657j6126439k346994L897085n148686j3829661p301528
$$ plain form
2283 -33454967 -25905027 -11596402 -1627198 2218496 2134380 -3651989 -14998582 -21763621
2275 -21763621 -12449864 8843304 23174125 18442289 3992141 -2535108 1315258 1629681
2267 1629681 -9452046 -20983712 -19558262 -9944903 -7661420 -14657265 -16696703 -6657951
2259 -6657951 4158390 4646200 566749 1809081 3974094 -2755026 -13645476 -15238067
2251 -15238067 -8125261 -6077368 -11251425 -8539943 8735147 23601868 17452319 -3456682
2243 -3456682 -16288473 -10690638 1920200 5798743 -1806162 -10984299 -10943266 -804154
2235 -804154 9406746 10233509 4767677 3040192 4464798 -2884406 -20687719 -31363752
2227 -31363752 -22061948 -6786852 -8274240 -24252252 -31018806 -19656492 -8202513 -12002952
$$ packed form
2283c3454967P549940J4308625R969204L845694q4116n786369j1346593o765039
2275b1763621R313757K1293168J4330821m731836j4450148o527249L850366L14423
2267A629681j1081727j1531666J425450R613359K283483o995845k039438J0038752
2259f657951J0816341M87810m079451J242332K165013o729120j0890450j592591
2251a5238067P112806K047893n174057K711482J7275090J4866721o149549k0909001
2243c456682j2831791N597835J2610838L878543p604905r178137M1033J0139112
2235h04154J0210900Q26763n465832j727485J424606p349204j7803313j0676033
2227c1363752R301804J5275096j487388j5978012o766554J1362314J1453979l800439
$$ plain form
2219 -12002952 -20418866 -14845864 3204561 16420739 16685456 11841937 10679945 13431406
2211 13431406 16894076 19099011 17996500 13197913 9395205 10985656 13725579 9899397
2203 9899397 1750722 -318044 4728700 4058615 -9598693 -23946792 -22719203 -8685086
2195 -8685086 1128292 329184 131546 10064773 24166206 31815650 32302926 30694044 26559292
2186 26559292 16519817 3974875 -3685680 -6380029 -10566074 -16614984 -16172828 -5413082
2178 -5413082 6825756 9584791 3488774 -1589724 705432 8058109 14920379 17706351
2170 17706351 15020904 7355456 -2285383 -9831792 -12996086 -12228955 -10402191 -12367231
2162 -12367231 -21135037 -31320827 -30612238 -14162390 4805756 7208967 -8367805 -23253982
$$ packed form
2219a2002952q415914N573002J8050425J3216178K64717m843519j161992K751461
2211A3431406L462670K204935j102511m798587l802708J590451K739923l826182
2203I899397q148675k068766N046744o70085j3657308j4348099J227589J4034117
2195h685086R813378p99108j97638R933227J4101433P649444M87276j608882m134752
2186B6559292j0039475j2544942p660555k694349m186045o048910M42156J0759746
2178e413082J2238838K759035o096017n078498K295156P352677O862270K785972
2170A7706351k685447p665448r640839p546409l164294P67131J826764j965040
2162a2367231q767806j0185790P08589J6449848J8968146K403211j5576772j4886177
$$ plain form
2154 -23253982 -23394120 -17327546 -21561449 -34944919 -39948639 -28580749 -14531049 -14488211
2146 -14488211 -26252538 -33260893 -26328608 -13058055 -6953325 -13480538 -26981363 -36521321
2138 -36521321 -34466297 -23321870 -14192744 -14796421 -19932191 -18981754 -12040837 -10821166
2130 -10821166 -21298427 -33678966 -35335912 -27146753 -18986229 -13791112 -6858935 18792
2122 18792 -3911222 -21479530 -37396915 -33910710 -12763078 7181793 13411817 12467889
2114 12467889 16957279 27331891 32495942 24812539 7953405 -9219384 -20275579 -21829330
2106 -21829330 -13115741 885423 10142888 8719289 1514930 -2381714 -1254931 -693488
2098 -693488 -3285974 -4758888 -1489027 3694082 5695404 3320268 -697626 -2535551
$$ packed form
2154b3253982j40138O066574m233903j3383470n003720J1367890J4049700M2838
2146a4488211j1764327p008355O932285J3270553O104730o527213j3500825r539958
2138c6521321K055024J1144427R129126o03677n135770R50437O940917J219671
2130a0821166j0477261j2380539j656946Q189159Q160524N195117O932177O877727
2122A8792l930014j7568308j5917385L486205K1147632J9944871O230024r43928
2114A2467889M489390J0374612N164051p683403j6859134j7172789j1056195j553751
2106b1829330Q713589J4001164R257465j423599p204359l896644J126783N61443
2098f93488k592486j472914L269861N183109K001322k375136m017894j837925
$$ plain form
2090 -2535551 986048 9579499 17158283 16626750 8455177 170687 -3462753 -4102138 -2990494
2081 -2990494 1416166 6127913 3080657 -8575576 -18362808 -19602622 -19496224 -24827131
2073 -24827131 -27320479 -16991298 -2630652 -1317055 -10323411 -8914771 9190980 24047389
2065 24047389 18047724 345456 -8694260 -5379421 -1723420 -4674918 -10406209 -15763639
2057 -15763639 -22571945 -30461003 -35411174 -37162249 -40787111 -48524382 -54566711 -49956468
2049 -49956468 -31261933 -5651241 11246913 6898737 -13918742 -29711940 -23195448
2042 -23195448 -179824 17733873 17394897 4675382 -7587566 -13489465 -13959669 -11074298
2034 -11074298 -8035745 -9549370 -15284567 -15430836 -621191 22511262 32898124 17217765
$$ packed form
2090b535551L521599Q593451P578784n31533q171573q284490l633440o39385J111644
2081b990494M406660M711747l047256j1656233r787232j239814J06398n330907
2073b4827131k493348J0329181J4360646J313597r006356J408640J8105751J4856409
2065B4047389n999665j7702268r039716L314839L656001k951498n731291n357430
2057a5763639o808306p889058m950171j751075l624862p737271o042329M610243
2049d9956468J8694535K5610692J6898154m348176k0817479j5793198O516492
2042b3195448K3015624J7913697l38976j2719515j2262948n901899m70204K885371
2034a1074298L038553j513625n735197j46269J4809645K3132453J0386862j5680359
$$ plain form
2026 17217765 -13474331 -35257482 -37162953 -28400017 -21159815 -16753534 -12375355 -10520315
2018 -10520315 -12469015 -10438377 1748469 15196926 16839316 11269841 15889179 32873498
2010 32873498 42806302 32604388 14343606 5815016 5111986 -1659587 -15895438 -24794180
2002 -24794180 -20606688 -8578622 3225839 11314703 14446684 13269059 12269932 14338239
1994 14338239 14396770 6417776 -4642242 -7153751 774265 8029893 5002904 -6250565
1986 -6250565 -17540050 -22752577 -18978489 -7016219 6099164 10703813 3743319 -8826852
1978 -8826852 -19139289 -22883937 -19190499 -11555185 -8264780 -14415800 -23198736 -22954858
1970 -22954858 -13510003 -6387608 -6803968 -5760689 4892728 18636214 22619560 13181811
$$ packed form
2026A7217765l0692096k1783151j905471Q762936P240202M406281M378179J855040
2018a0520315j948700K030638J2186846J3448457J642390n569475M619338J6984319
2010C2873498R932804j0201914j8260782q528590p03030o771573j4235851q898742
2002b4794180M187492J2028066J1804461Q088864L131981j177625r99127K068307
1994A4338239N8531p978994j1060018k511509P928016P255628l026989j1253469
1986f250565j1289485n212527L774088J1962270J3115383M604649o960494j2570171
1978h826852j0312437l744648L693438P635314L290405o151020q782936K43878
1970b2954858R444855P122395m16360J043279J0653417J3743486L983346r437749
$$ plain form
1962 13181811 -3708696 -21293984 -33846436 -35444864 -26250129 -16861901 -17567783 -24963235
1954 -24963235 -27225714 -20678531 -11918788 -4571849 4843150 15558851 18431905 9626430
1946 9626430 -63663 2208361 15025943 26946065 32011970 31575562 24697855 9282172
1938 9282172 -7128385 -10925223 -1601117 3639123 -8558035 -30590252 -46286720 -51414803
1930 -51414803 -51042829 -44199797 -26161001 -3640610 7354384 1279434 -10763676 -16973682
1922 -16973682 -16382006 -12217809 -5421530 679530 -176568 -7132829 -10187231 -3330056
1914 -3330056 8362173 18262839 24509156 22711286 5804865 -20256024 -33393578 -20493104
1906 -20493104 3262430 12447475 1516481 -15003262 -24989564 -27498587 -24087128 -15626486
$$ packed form
1962A3181811j6890507j7585288j2552452j598428R194735R388228p05882p395452
1954b4963235k262479O547183Q759743P346939R414999J0715701K873054q805475
1946I626430r690093K272024J2817582J1920122N065905m36408o877707j5415683
1938I282172j6410557l796838R324106N240240j2197158k2032217j5696468n128083
1930e1414803L71974O843032J8038796K2520391J0994994o074950j2043110o210006
1922a6973682N91676M164197O796279O101060q56098o956261l054402O857175
1914c330056J1692229R900666O246317j797870j6906421k6060889j3137554J2900474
1906b0493104K3755534R185045j0930994j6519743r986302k509023L411459Q460642
$$ plain form
1898 -15626486 -6008697 2075567 12316817 25784427 32037982 21989326 5446086 1564421
1890 1564421 13795920 28011549 34003768 34475729 32685294 25835987 13590984 1212539
1882 1212539 -8805610 -18926911 -29450568 -37913285 -44433269 -48272492 -42206125 -22061067
1874 -22061067 1224301 12305965 11371533 9435555 7859300 -132654 -10573186 -11740129
1866 -11740129 -5692619 -5343159 -8593618 982070 22896653 34212089 24805231 14558964
1858 14558964 22196269 38062429 43014194 35409393 23046187 5928259 -14780840 -25977079
1850 -25977079 -20104408 -11178796 -15115455 -25427877 -26510581 -19693322 -16501340 -16056683
1842 -16056683 -10311214 -4289861 -9573097 -22218316 -27692286 -24900525 -25686953 -32100512
$$ packed form
1898a5626486R617789Q084264J0241250J3467610O253555j0048656j6543240l881665
1890A564421J2231499J4215629N992219M71961j790435o849307j2245003j2378445
1882A212539j0018149j0121301j0523657q462717o519984l839223O066367K0145058
1874b2061067K3285368J1081664r34432j935978j576255p991954j0440532j166943
1866a1740129O047510L49460l250459R575688K1914583J1315436r406858j0246267
1858A4558964P637305J5866160M951765p604801j2363206j7117928k0709099j1196239
1850b5977079N872671Q925612l936659j0312422j082704O817259L191982M44657
1842a6056683N745469O021353n283236j2645219n473970K791761p86428o413559
$$ plain form
1834 -32100512 -33549343 -27017001 -21885829 -22049059 -19017221 -6570329 10249545 23622798
1826 23622798 30292384 29569719 23238930 16732965 12191972 4024620 -9479858 -16801743
1818 -16801743 -8310543 5693981 7557069 -2337839 -9769114 -11392170 -14995633 -17299198
1810 -17299198 -4806168 19322837 31092039 17112265 -6776998 -17448834 -10951395
1803 -10951395 1406737 10201835 11732357 5718458 -1510899 -253772 8276523 9175411
1795 9175411 -6966659 -29509525 -40168120 -34239347 -22346018 -15239241 -13335812 -9728462
1787 -9728462 268383 12818704 19695511 19764278 21443445 29202553 34604295 29518643
1779 29518643 20970457 19789938 20406845 9224030 -9070324 -13336737 2592846 18879168
$$ packed form
1834c2100512j448831O532342N131172j63230L031838J2446892J6819874J3373253
1826B3622798O669586p22665o330789o505965m540993q167352j3504478p321885
1818a6801743Q491200J4004524J863088r894908p431275j623056l603463k303565
1810a7299198J2493030K4129005J1769202j3979774k3889263j0671836O497439
1803a0951395J2358132Q795098J530522o013899p229357J257127Q530295Q98888
1795I175411j6142070k2542866j0658595N928773J1893329P106777J903429L607350
1787i728462R996845J2550321O876807O8767J679167P759108N401742n085652
1779B9518643q548186j180519O16907j1182815j8294354m266413J5929583J6286322
$$ plain form
1771 18879168 17067107 2430187 -9853888 -16348499 -21702303 -24393912 -19337945 -9614072
1763 -9614072 -5072625 -10214536 -18383093 -17073476 817770 26859493 40646427 31409100
1755 31409100 13348186 8285463 15363532 13264587 -6466989 -26131955 -28453241 -20373660
1747 -20373660 -19428292 -27830103 -32182700 -22901382 -4563101 10086856 11637468 2809872
1739 2809872 -2924282 3488604 14072831 14101960 2727784 -7388503 -9232448 -7328948
1731 -7328948 -5423402 -2668435 -2174480 -8086710 -13527800 -7632496 4619486 7053547
1723 7053547 -2462504 -10883061 -15034766 -24750916 -37090576 -32784417 -7242269 18316078
1715 18316078 26951740 25152571 22364413 15230012 3855512 145224 7304803 13749098
$$ packed form
1771A8879168j812061j4636920j2284075o494611n353804k691609N055967R723873
1763i614072M541447n141911q168557J309617J7891246K6041723J3786934r237327
1755C1409100j8060914n062723P078069k098945j9731576j9664966k321286Q079581
1747b0373660R45368q401811m352597R281318J8338281J4649957J550612q827596
1739B809872n734154O412886J0584227K9129j1374176j0116287j843945J903500
1731g328948J905546K754967M93955n912230n441090N895304J2251982K434061
1723G053547r516051q420557m151705r716150j2339660M306159K5542148K5558347
1715A8316078Q635662j799169k788158p134401j1374500l710288P159579O444295
$$ plain form
1707 13749098 17486512 29697650 43807617 34469865 3215127 -11449768 8587476
1700 8587476 31173429 27840606 17289489 21521654 21484893 714858 -8423822 22362143
1692 22362143 54992310 40694556 6380064 9755094 34406312 22893423 4479480
1685 4479480 78487581 244637451 356805208 304582357 157941572 60167525 43522345
1678 43522345 35397166 725504 -19415206 172226 24912559 22448183 5907540
1671 5907540 -3193472 -7867537 -13269975 -9542519 4721069 11821988 4050459 -1148208
1663 -1148208 10583110 28235523 34829695 31252896 27862102 26437433 22299850 14469432
1655 14469432 5003619 -4532610 -11325848 -12890189 -11613738 -10435991 -6367205 1621085
$$ packed form
1707A3749098L737414J2211138J4109967r337752l1254738j4664895K0037244
1700H587476K2585953l332823j0551117M232165l6761k0770035r138680L0785965
1692B2362143L2630167j4297754l4314492L375030K4651218j1512889j8413943
1685D479480P4008101J66149870J12167757n2222851j46640785r7774047j6645180
1678D3522345q125179l4671662k0140710J9587432K4740333k464376j6540643
1671E907540r101012m674065n402438L727456J4263588P100919p771529n198667
1663a148208J1731318J7652413O594172l576799l390794j424669m137583p830418
1655A4469432r465813r536229o793238j564341J276451J177747M068786P988290
$$ plain form
1647 1621085 2757124 -12486048 -31854728 -31597232 -8963833 12687066 15157471 5542223
1639 5542223 -354738 928603 3924592 5379817 3691922 -2401703 -7459507 -2324655
1631 -2324655 10152302 14384543 4879854 -3105236 3287059 12954563 7506181 -9342127
1623 -9342127 -17180527 -10369840 -5315399 -13601759 -24897878 -25113205 -18835692 -20988022
1615 -20988022 -32292782 -36480217 -22385455 1526781 18323345 21000326 14978508 7932633
1607 7932633 3842211 4519414 10236559 18624965 27321083 36932974 46916460 50555712
1599 50555712 41304157 24040018 11776775 9113336 7218645 -938477 -8822743 -6355958
1591 -6355958 4899784 14690679 18139951 18877520 20397670 21706745 20790663 16533754
$$ packed form
1647A621085J136039j5243172j9368680K57496K2633399K1650899K470405r615248
1639E542223n896961J283341K995989J455225j687895o093625n057804N134852
1631b324655J2476957M232241r504689p985090O392295R667504n448382j6848308
1623i342127p838400O810687N054441q286360j1296119k15327O277513k152330
1615b0988022j1304760m187435J4094762K3912236J6796564K676981o021818p045875
1607G932633m090422O77203N717145Q388406Q696118R611891R983486L639252
1599E0555712r251555j7264139j2263243k663439j894691q157122p884266K466785
1591f355958J1255742R790895L449272P37569J520150J309075r16082m256909
$$ plain form
1583 16533754 8097137 -2480191 -8779872 -6876860 -2022721 -1852919 -4285187 -575495
1575 -575495 8681398 10047579 -4981740 -25459713 -32009596 -19518174 -979262 11110669
1567 11110669 18627877 29062217 40254442 42577720 33410142 19348473 3530347 -18044562
1559 -18044562 -43183559 -57941215 -53429202 -39287296 -29470502 -22516306 -9430875 5699614
1551 5699614 10435018 6212929 6850134 14515058 17042138 12477701 15027517 28555359
1543 28555359 34647592 19415470 -5245930 -20546490 -24381744 -21453193 -7605005 16094570
1535 16094570 28697182 13232946 -13795890 -21137597 -5580383 7948048 5656466
1528 5656466 -1327625 -3455028 -7343293 -17141803 -23349217 -19776417 -13738830 -9959734
$$ packed form
1583A6533754q436617j0577328o299681J903012M854139J69802k432268L709692
1575e75495R256893J366181j5029319k0477973o549883J2491422J8538912J2089931
1567A1110669P517208J0434340J1192225K323278r167578j4061669j5818126k1574909
1559a8044562k5138997j4757656M512013J4141906R816794O954196J3085431J5130489
1551E699614M735404m222089O37205P664924K527080m564437K549816J3527842
1543B8555359O092233j5232122k4661400j5300560l835254K928551J3848188K3699575
1535A6094570J2602612j5464236k7028836p341707J5557214J3528431k291582
1528E656466o984091k127403l888265r798510o207414L572800O037587L779096
$$ plain form
1520 -9959734 -1010216 15681339 26839941 22139148 11400024 9471376 14001516 12538100
1512 12538100 4380947 190523 3062499 4175731 -1873650 -8618545 -7858341 -672213
1504 -672213 5703219 7605025 7689448 9646327 13366455 16127477 16814617 16517904 14996908
1495 14996908 9965887 1641549 -5461523 -8200988 -9074745 -11450432 -13773929 -12085021
1487 -12085021 -4785028 8158151 25289419 38945884 38138719 23096893 9143038 7179716
1479 7179716 8702459 1722024 -7645033 -5972285 2043866 -246027 -11836492 -13078849
1471 -13078849 2611899 18436916 23358753 29854207 48806231 64521369 53691405
1464 53691405 19579552 -10518760 -17892034 -8249914 2926779 8070096 9026480 9512922
$$ packed form
1520i959734Q949518J6691555J1158602m700793j0739124j928648M530140j463416
1512A2538100q157153m190424K871976J113232o049381o744895P60204P186128
1504f72213O375432J901806Q4423J956879L720128K761022O87140k96713j520996
1495A4996908n031021q324338p103072k739465q73757k375687k323497J688908
1487a2085021P299993J2943179J7131268J3656465q07165j5041826j3953855j963322
1479G179716J522743o980435r367057J672748Q016151k289893j1590465j242357
1471a3078849J5690748J5825017M921837O495454J8952024J5715138j0829964
1464E3691405l4111853l0098312p373274R642120J1176693N143317R56384M86442
$$ plain form
1456 9512922 9574689 5576169 -4081016 -13816600 -15986223 -11318035 -7514303 -6481920 -1791648
1447 -1791648 8264769 15074913 12945406 9171841 13337903 22853373 26362186 17235566
1439 17235566 -1523139 -21255276 -32277715 -29525914 -17601673 -6191322 938111
1432 938111 6738885 11124070 9497489 1874698 -6716688 -15986434 -28937758 -39886552
1424 -39886552 -38267606 -26428999 -17137480 -10536925 5913925 28513430 32928321 11723244
1416 11723244 -8085666 -3842556 9188758 7055860 -1244876 7550714 25865059 24690640
1408 24690640 1579293 -16275075 -16678077 -16186426 -24780353 -29364377 -22000126 -15231651
1400 -15231651 -16798214 -15659475 -7608440 -9458929 -29547517 -46232794 -36952839 -11258506
$$ packed form
1456I512922O1767l998520r657185r735584k169623M668188L803732J032383M690272
1447a791648J0056417O810144k129507l773565M166062R515470L508813r126620
1439A7235566j8758705j9732137j1022439K751801J1924241J1410351P129433
1432I38111N800774M385185j626581p622791q591386r269746j2951324j0948794
1424c9886552J618946J1838607R291519O600555J6450850K2599505M414891k1205077
1416A1723244j9808910M243110J3031314k132898q300736Q795590J8314345j174419
1408B4690640k3111347j7854368m03002M91651q593927m584024P364251O768475
1400a5231651j566563J138739Q051035j850489k0088588j6685277R279955K5694333
$$ plain form
1392 -11258506 6459966 11956107 15987352 17179904 6438585 -8129299 -7077484 9972820
1384 9972820 23017515 23351209 24968698 38047939 50391753 46082488 28729169 14330208
1376 14330208 10204073 11883863 14365904 15793464 13609353 6709389 493047 2395336
1368 2395336 12265017 22199834 25040337 18446007 3117652 -15587205 -25106839 -14366408
1360 -14366408 11334844 31824201 33772480 24551711 18462398 16513090 9967950 -1185476
1352 -1185476 -6962540 -4236830 -1128602 -1252089 3387929 17378448 31209857 33986630
1344 33986630 27346150 18038861 6314544 -7591448 -14616551 -8274809 1417177 -179474
1336 -179474 -11009497 -17712250 -18629365 -24394305 -36256443 -41963133 -36684360 -31149037
$$ packed form
1392a1258506J7718472N496141M031245J192552j0741319j4567884J051815J7050304
1384I972820J3044695L33694J617489J3079241J2343814m309265j7353319j4398961
1376A4330208m126135J679790K482041J427560k184111o899964o216342J902289
1368B395336R869681R934817K840503o594330j5328355j8704857r519634J0740431
1360a4366408K5701252K0489357J948279r220769o089313j949308o545140j1153426
1352a185476n777064K725710L108228j23487M640018J3990519J3831409K776773
1344C3986630o640480r307289j1724317j3905992p025103O341742R691986j596651
1336a79474j0830023o702753r17115n764940j1862138n706690N278773N535323
$$ plain form
1328 -31149037 -32663504 -33233178 -25114467 -15064995 -12725118 -15093254 -13634807 -9308677
1320 -9308677 -9376075 -13690645 -14033775 -5608180 7091221 14549175 9546226 -5816737
1312 -5816737 -18135805 -13857857 4406416 19558560 21418271 18126019 21372893 29925801
1304 29925801 35901483 38985797 43875137 48954599 48117902 40985481 32141991 22256759
1296 22256759 8382611 -7924917 -19820177 -22037178 -14178019 -250011 10090899
1289 10090899 4761046 -18333285 -44778507 -56838960 -50892737 -35507091 -16796402
1282 -16796402 4410914 23109275 29624841 21643223 9197223 4275728 9474497 17674441
1274 17674441 19075338 9254318 -5445838 -12212465 -6373788 991665 -3341538 -16313232
$$ packed form
1328c1149037j514467n69674Q118711J0049472K339877k368136J458447M326130
1320i308677o7398m314570l43130Q425595J2699401P457954n002949j5362963
1312e816737j2319068M277948J8264273J5152144J859711l292252L246874Q552908
1304B9925801N975682L084314M889340N079462q36697p132421q843490r885232
1296B2256759j3874148j6307528j1895260k217001P859159J3928008J0340910
1289A0090899n329853k3094331k6445222j2060453N946223J5385646J8710689
1282a6796402K1207316J8698361O515566p981618j2446000m921495N198769Q199944
1274A7674441J400897r821020j4700156o766627N838677P365453m333203j2971694
$$ plain form
1266 -16313232 -22544285 -15585095 -5192962 -2098562 -5313009 -8074434 -7732534 -4700565
1258 -4700565 1256209 7776773 8643523 2361883 -2021382 5015198 18924351 23342695
1250 23342695 8467319 -16788341 -33180272 -29820798 -12710115 4078098 12299002
1243 12299002 12798244 8242158 -860995 -11251131 -14555645 -5748734 8874227 17571705
1235 17571705 15131985 4456641 -10259850 -24543471 -29994049 -19437304 1997978
1228 1997978 18347626 18561540 5792306 -9880528 -20717890 -21334995 -8666440 11812865
1220 11812865 26255367 26110558 17963016 14023610 16932912 20242611 19663589 15861128
1212 15861128 9152293 609405 -3066637 3791414 13350949 9688737 -8818106 -22804144
$$ packed form
1266a6313232o231053O959190J0392133L094400l214447k761425L41900L031969
1258d700565N956774O520564Q66750o281640m383265P036580J3909153M418344
1250B3342695j4875376k5255660j6391931L359474J7110683J6788213Q220904
1243A2299002M99242m556086r103153j0390136l304514Q806911J4622961Q697478
1235A7571705k439720j0675344j4716491j4283621n450578J0556745K1435282
1228A997978J6349648K13914j2769234j5672834j0837362o17105J2668555K0479305
1220A1812865J4442502j44809q147542l939406K909302L309699n79022l802461
1212A5861128o708835q542888l676042O858051R559535l662212j8506843j3986038
$$ plain form
1204 -22804144 -15480557 5075574 17132555 12909876 2620160 -6105214 -17446715 -32637147
1196 -32637147 -40386812 -31555805 -14085541 -2662717 170949 1682872 3159356 -130900
1188 -130900 -5472023 -3882582 3953262 7566228 6328747 13475843 32129831 42594945
1180 42594945 27912788 1032796 -11230628 -5173837 -1569335 -10915846 -17754064 -6262526
1172 -6262526 14943431 24571145 14666520 -5838487 -25717332 -38241678 -38435425 -25738237
1164 -25738237 -9272937 -1366304 -4091235 -7814013 -3593810 7793599 18958763 22953885
1156 22953885 17203190 5406894 -4018368 -6037975 -5756748 -11874703 -22986797 -27224650
1148 -27224650 -18352543 -5387868 -533365 -2636285 -396806 10351864 21318554 24600248
$$ packed form
1204b2804144P323587K0556131J2056981m222679j0289716q725374j1341501j5190432
1196c2637147p749665Q831007J7470264J1422824K833666J511923J476484l290256
1188a30900n341123J589441P835844L612966j237481P147096J8653988J0465114
1180D2594945j4682157k6879992j2263424O056791L604502r346511o838218J1491538
1172f262526K1205957R627714r904625k0505007j9878845j2524346j93747J2697188
1164b5738237J6465300P906633k724931l722778M220203J1387409J1165164L995122
1156B2953885n750695j1796296r425262k019607K81227o117955j1112094m237853
1148b7224650Q872107J2964675M854503k102920K239479J0748670J0966690L281694
$$ plain form
1140 24600248 22709391 22074447 23061531 21988293 18352817 13488160 5436435 -6711944
1132 -6711944 -14766680 -7620649 11731597 24265728 16273324 -3322355 -14101567 -8172501
1124 -8172501 5285677 16525709 25291203 32592995 32933321 21751678 5216363 -4375948
1116 -4375948 -667140 13996617 34314312 54101753 65356095 63968439 56899837 55335216
1108 55335216 58555756 53565002 35384687 18125401 16828864 25946914 28401002 21108458
1100 21108458 15571886 14080891 4962053 -11964943 -15003477 9128344 39226156 44116998
1092 44116998 25101331 11762815 18351033 28273420 25620332 18215189 18137744 19346616
1084 19346616 11136111 -398708 -2870369 -419260 -6920967 -20871505 -25755229 -15475811
$$ packed form
1140B4600248j890857o34944R87084j073238l635476m864657q051725j2148379
1132f711944q054736P146031J9352246J2534131p992404j9595679j0779212N929066
1124h172501J3458178J1240032Q765494P301792L40326j1181643j6535315r592311
1116d375948L708808J4663757K0317695J9787441J1254342j387656p068602j564621
1108E5335216L220540m990754j8180315j7259286j296537R118050K454088p292544
1100B1108458n536572j490995r118838j6926996l038534K4131821L0097812M890842
1092D4116998j9015667j3338516O588218R922387k653088p405143p7445J208872
1084A9346616q210505j1534819k471661K451109o501707j3950538m883724J0279418
$$ plain form
1076 -15475811 -2671598 1478526 1295456 4959656 10658155 11811109 8208704 4923386
1068 4923386 5283880 10286816 20270042 31681820 35824130 27081784 11929215 5202668
1060 5202668 15578245 35844537 49008881 44962323 30269530 19230034 16561536 14867166
1052 14867166 10384690 11905364 26259796 41788538 38652104 15133333 -7254326 -7965494
1044 -7965494 10938828 30726171 37673034 34959401 35964468 47838463 60856243 56606521
1036 56606521 30420596 1463363 -6979052 5482060 18222090 16825389 6952772 -31450
1028 -31450 -2479613 -4084391 -4895183 -4594004 -6807928 -11776759 -10724292 3663949 24900821
1019 24900821 38871451 39766821 32329050 20346740 1994821 -21664245 -41090799 -46732466
$$ packed form
1076a5475811J2804213M150124j83070L664200N698499J152954l602405l285318
1068D923386L60494N002936R983226J1411778M142310q742346j5152569o726547
1060E202668J0375577K0266292J3164344m046558j4692793j1039496k668498j694370
1052A4867166m482476J520674J4354432J5528742l136434k3518771k2387659p11168
1044g965494J8904322J9787343O946863k713633J005067J1873995J3017780m249722
1036E6606521k6185925k8957233q442415J2461112J2740030j396701r872617o984222
1028c1450k448163j604778q10792L01179k213924m968831J052467J4388241K1236872
1019B4900821J3970630Q95370p437771j1982310j8351919k3659066j9426554n641667
$$ plain form
1011 -46732466 -40807891 -35484013 -37465314 -37685776 -21807036 8231229 30046333 24256763
1003 24256763 -2195197 -24146579 -27052725 -18062048 -9265008 -2341238 6084106 14951880
995 14951880 22057913 28864985 34394016 31096537 15507819 -1922944 -6801138 2130622
987 2130622 14003895 21591397 27260420 33674160 37587944 35840137 31431079 29682971
979 29682971 31126166 30857554 23906451 10485779 -3029789 -8681248 -4249141 4120053
971 4120053 8294055 6896522 5429100 7066985 6083155 -5917592 -26955888 -42598817
963 -42598817 -41646162 -31176498 -28130500 -35707346 -38575192 -26370040 -10621505 -7704505
955 -7704505 -14041315 -13384228 -3830903 37181 -8093291 -17135272 -18205038 -16606019 -17105925
$$ packed form
1011d6732466N924575N323878j981301k20462J5878740L0038265K1815104n789570
1003B4256763k6451960k1951382k906146Q990677Q797040O923770Q425344Q867774
995A4951880P106033O807072N529031l297479j5588718j7430763m878194Q931760
987B130622J1873273P587502N669023O413740L913784j747807m409058j748108
979B9682971J443195k68612o951103j3420672j3515568n651459M432107Q369194
971D120053M174002j397533j467422J637885r83830j2000747k1038296j5642929
963d2598817R52655J0469664L045998p576846k867846J2205152J5748535K917000
955g704505o336810O57087R553325L868084q130472r041981j069766J599019m99906
$$ plain form
946 -17105925 -12927925 -240855 8957848 1413725 -18091465 -33675867 -38198787 -35585699
938 -35585699 -29394257 -20539071 -12837864 -10297731 -10278078 -7161187 -1253305 2026165 -404604
929 -404604 -7307162 -15167751 -18506659 -13242844 -3439094 1694832 962192 2757989 9336168
920 9336168 10927320 2948559 -3199278 2149125 8957665 1129427 -19146449 -34401363
912 -34401363 -34291571 -23155956 -10335659 -4030580 -8960010 -19202595 -20136462 -8361335
904 -8361335 -479526 -8836442 -19310546 -10928005 11516296 25167553 23215249 19247335
896 19247335 21047418 22649350 21650281 22451070 21859074 13041273 3998424 8565575 17609953
887 17609953 5952259 -25903804 -44277096 -28112537 2199810 16398342 13048850
$$ packed form
946a7105925M178000J2687070R198703p544123j9505190j5584402m522920K613088
938c5585699O191442Q855186P701207K540133J9653L116891N907882L279470k430769
929d04604o902558p860589l338908N263815R803750N133926p32640J795797O578179
920I336168J591152p978761o147837N348403O808540p828238k0275876j5254914
912c4401363J09792J1135615J2820297O305079m929430j0242585r33867J1775127
904h361335P881809q356916j0474104Q382541K2444301J3651257j952304l967914
896A9247335J800083J601932r99069Q00789n91996q817801r042849M567151R044378
887A7609953j1657694l1856063j8373292J6164559L0312347J4198532l349492
$$ plain form
880 13048850 9782035 13463912 19183534 25612905 33604231 38771281 38751547 38045105 35611669
871 35611669 21562212 -2245711 -14828879 -4882071 8820044 4514386 -9201085 -8773029
863 -8773029 6634428 16654156 12399853 4368324 685876 -731486 1084146 10870772
855 10870772 22966087 24371816 14459144 5874578 3844077 11700 -10396942 -20011577
847 -20011577 -21896063 -18334898 -13971080 -11419605 -15158145 -27404189 -38472012 -34551894
839 -34551894 -17886615 -5661470 -4915951 -2785196 11644650 29073602 33532534 24732803
831 24732803 15891199 13992933 11710763 -1392580 -24493498 -43248953 -42538960 -23272792
823 -23272792 -3243050 3356729 2031466 5261312 10234449 4357841 -9540430 -12816261
$$ packed form
880A3048850l266815L681877N719622O429371P991326N167050j9734p06442k433436
871C5611669j4049457k3807923j2583168R946808J3702115m305658j3715471M28056
863h773029J5407457J0019728m254303q031529l682448j417362J815632R786626
855A0870772J2095315J405729r912672q584566k030501l832377j0408642r614635
847b0011577j884486L561165M363818K551475l738540j2246044j1067823L920118
839c4551894J6665279J2225145P45519K130755J4429846J7428952M458932q799731
831B4732803q841604j898266k282170j3103343k3100918j8755455P09993J9266168
823b3272792K0029742O599779j325263L229846M973137n876608j3898271l275831
$$ plain form
815 -12816261 -90233 10293920 4773858 -3433804 4190395 20664696 22645603 4127752
807 4127752 -17015677 -24759071 -21183816 -15643540 -12261425 -12692573 -19363445 -29376121
799 -29376121 -33491738 -27090698 -15514312 -4094534 8800513 22375819 26283379 14061244
791 14061244 -2137167 -3969769 7560606 13531927 6144198 828853 11851021 29887213
783 29887213 36522061 30789534 25866472 26054426 24587042 21591228 25365330 33916981
775 33916981 33582183 21659407 13533552 19132717 27988740 28022130 24412238 26875962 31157638
766 31157638 28030698 19857727 12594718 1613907 -16702978 -28508863 -19108454 -642353
758 -642353 232178 -18434846 -30727703 -22507962 -10360592 -11428008 -15690708 -3949486
$$ packed form
815a2816261J2726028J0384153n520062q207662P624199J6474301J980907j8517851
807D127752k1143429p743394L575255N540276L382115m31148o670872j0012676
799b9376121m115617O401040J1576386J1419778J2895047J3575306L907560j2222135
791A4061244j6198411j832602J1530375N971321p387729n315345J1022168J8036192
783B9887213O634848n732527m923062J87954j467384k995814L774102Q551651
775C3916981l34798j1922776q125855N599165Q856023L3390l609892K463724M281676
766C1157638l126940q172971p263009j0980811j8316885j1805885R400409J8466101
758f42353Q74531j8667024j2292857Q219741J2147370j067416m262700J1741222
$$ plain form
750 -3949486 21210189 39821173 41914953 34656157 25658762 13523471 -3319036 -18292135
742 -18292135 -22306128 -14917588 -6609419 -8107441 -16976525 -18559926 -4220123 15537990
734 15537990 23461460 17631120 10763718 8942147 4512862 -6502766 -13268511 -4960349
726 -4960349 11898180 20299879 12709449 -2809178 -13425854 -13019119 -4845187 3131474
718 3131474 6003909 5551220 4563136 307518 -10532785 -22328493 -24254775 -14151455
710 -14151455 -945106 7390837 10302742 8713006 2017365 -7089590 -13617612 -17984936
702 -17984936 -24150719 -29356231 -26092018 -15458806 -6826297 -2320302 4956939 13978436
694 13978436 12405869 -3048482 -17357621 -17405231 -8841696 -3326098 -1482975 585869
$$ packed form
750c949486K5159675J8610984K093780p258796q997395j2135291j6842507j4973099
742a8292135m013993P388540Q308169j498022q869084j583401J4339803J9758113
734A5537990P923470n830340o867402j821571m429285j1015628o765745Q308162
726d960349J6858529Q401699p590430j5518627j0616676M06735Q173932P976661
718C131474K872435m52689r88084m255618j0840303j1795708j926282J0103320
710a4151455J3206349Q335943K911905j589736o695641r106955o528022m367324
702a7984936o165783n205512L264213J0633212Q632509M505995P277241R021497
694A3978436j572567j5454351j4309139m7610Q563535N515598J843123K068844
$$ plain form
686 585869 -264632 -6620231 -11186369 -7757157 -3002252 -5282922 -10286582 -10067792 -7416288
677 -7416288 -7564680 -4199469 10560985 28512359 33541238 23321652 8695150 -3756614
669 -3756614 -13689840 -16508674 -7762698 4340037 7152260 3210045 5938286 16581150
661 16581150 21913134 16017334 8324982 7270132 10559695 14624518 19527305 21086190
653 21086190 12337563 -2460825 -8443261 16533 11990342 17120107 17598947 17716819
645 17716819 14500101 6610491 1311725 3476015 6447168 2696568 -3529839 -2722679
637 -2722679 5928051 14368219 15849119 10256638 2900362 1090495 7416381 14609212
629 14609212 13060515 4701450 1430596 7676965 14032290 12243513 6925999 6415019
$$ packed form
686E85869q50501o355599m566138L429212M754905k280670n003660K18790K651504
677g416288j48392L365211J4760454J7951374N028879j0219586j4626502j2451764
669c756614r933226k818834Q745976J2102735K812223l942215K728241J0642864
661A6581150N331984n895800p692352j054850L289563M064823M902787J558885
653B1086190q748627j4798388n982436Q459794J1973809N129765M78840J17872
645A7716819l216718p889610n298766K164290K971153l750600o226407Q07160
637b722679Q650730Q440168J480900n592481p356276j809867O325886P192831
629A4609212j548697q359065l270854O246369O355325j788777n317514n10980
$$ plain form
621 6415019 10367489 13237675 13067052 10183168 3477188 -5406017 -9707354 -5596481 2356592
612 2356592 8842982 14881286 21279620 21395266 8572644 -12593297 -29483233 -34313204
604 -34313204 -29297338 -21429677 -15989871 -13015364 -7806779 2551447 13115119 16723279
596 16723279 15556724 19277745 30470759 40892582 44223066 42233478 35323381 19385193
588 19385193 -2056644 -15358594 -14802628 -11011755 -11685282 -7120608 11606635 32241755
580 32241755 36765583 28727345 25749293 29760371 25651350 9248509 -4010092 -2766841
572 -2766841 5688726 11498283 17568380 29396054 41038396 41578202 29044389 10813211
564 10813211 -4080164 -8363277 110601 12702749 15160689 5079451 -2617081 4909885
$$ packed form
621F415019L952470K870186j70623k883884o705980q883205m301337M110873P953073
612B356592O486390O038304O398334J15646j2822622k1165941j6889936m829971
604c4313204N015866P867661N439806K974507N208585J0358226J0563672L608160
596A6723279j166555L721021J1193014J0421823L330484j989588o910097j5938188
588A9385193k1441837j3301950N55966L790873o73527M564674J8727243K0635120
580C2241755M523828q038238k978052M011078m109021j6402841j3258601J243251
572b766841Q455567N809557O070097J1827674J1642342N39806j2533813j8231178
564A0813211j4893375m283113Q473878J2592148K457940j0081238p696532P526966
$$ plain form
556 4909885 19629224 22357881 7815113 -9078652 -11341778 2739373 20962165 30496473
548 30496473 28476084 22357392 20630153 22782176 20796398 11530892 2597693 1910160
540 1910160 6274167 7156738 4605791 6599980 14730229 19976601 16249998 10259910 11831092
531 11831092 19744441 24362455 21249169 14594979 8278632 1514487 -5417873 -8551857
523 -8551857 -6584298 -4015387 -4296138 -5052993 -3943958 -3486350 -4842318 -2796221 5591419
514 5591419 12316046 7962271 -2990013 -6887894 -136320 6966138 6407920 1559138
506 1559138 -2517326 -7136268 -13799951 -19136770 -20818361 -20150391 -15107284 -1326897
498 -1326897 14809845 16618299 -302152 -17402464 -16772512 -5202528 -690356 -3901086
$$ packed form
556D909885J4719339K728657j4542768j6893765k263126J4081151J8222792R534308
548C0496473k020389o118692j727239K152023j985778r265506q933199o87533
540A910160M364007Q82571k550947J994189Q130249N246372l726603n990088J571182
531A1831092P913349M618014l113286o654190o316347o764145o932360l133984
523h551857J967559K568911k80751p56855J109035M57608j355968K046097Q387640
514E591419O724627m353775j0952284l897881O751574P102458n58218m848782
506A559138m076464m618942o663683n336819j681591O67970N043107J3780387
498a326897J6136742J808454j6920451j7100312O29952J1569984M512172l210730
$$ plain form
490 -3901086 -722853 11705995 20957958 21362537 21595214 26268448 26622927 16887942 6193326
481 6193326 4754476 8365139 6641406 -309264 -3364030 1086878 6465981 5349420
473 5349420 -1298581 -4414331 4597828 23752196 39577628 40285362 28912207 18026835
465 18026835 13113658 9401463 4571535 3876949 9925598 17547954 23072517 29268933
457 29268933 36585016 39605663 37689582 37828067 39509221 29649175 4577610 -15046729
449 -15046729 -8791190 11585804 15349858 -3532715 -17427814 -5010247 19322740 27672643
441 27672643 15955785 3653484 4119098 11384414 15362202 15874571 17078320 17357527
433 17357527 11729462 630551 -9182877 -11991315 -8364240 -2844270 1865943 7363756
$$ packed form
490c901086L178233J2428848R251963M04579K32677M673234L54479r734985j0694616
481F193326j438850L610663j723733o950670l054766M450908N379103j116561
473E349420o648001l115750R012159J9154368J5825432P07734j1373155j0885372
465A8026835m913177l712195m829928o94586O048649P622356N524563O196416
457B9268933P316083L020647j916081J38485J681154r860046k5071565j9624339
449a5046729O255539K0376994L764054j8882573j3895099J2417567K4332987Q349903
441B7672643j1716858j2302301M65614P265316L977788N12369J203749K79207
433A7357527n628065j1098911r813428k808438L627075N519970M710213N497813
$$ plain form
425 7363756 16144407 26400522 31621693 26198728 10614428 -9391977 -27006648 -36407125
417 -36407125 -33638927 -19939283 -3895238 4400536 3178118 -204565 347263 2610977
409 2610977 2104579 581867 3056645 8956291 12524047 11440971 9226502 8784004 9036164
400 9036164 8569998 7091900 2552196 -6926302 -16802922 -18544764 -10743734 -1224812 4306128
391 4306128 7841313 10176333 6550338 -2306505 -4894169 5212830 16227757 12633589
383 12633589 -3125597 -15707241 -18384237 -15739786 -9259932 3143822 14221274 11702059
375 11702059 -1396706 -7069941 1972885 12192652 11199210 4461025 1184922 -1617685
367 -1617685 -8708774 -12614497 -4451689 9964988 18971469 22943294 28823861 32590396
$$ packed form
425G363756Q780651J0256115N221171n422965j5584300k0006405j7614671r400477
417c6407125K768198J3699644J6044045Q295774j222418l382683N51828K263714
409B610977n06398j522712K474778N899646L567756j083076k214469m42498K52160
400I036164m66166j478098m539704r478498r876620j741842P801030R518922N530940
391D306128L535185K335020l625995q856843k587664J0106999J1014927l594168
383A2633589j5759186j2581644k676996K644451O479854J2403754J1077452k519215
375A1702059j3098765n673235R042826J0219767r93442o738185l276103k802607
367a617685p091089l905723Q162808J4416677R006481L971825N880567L766535
$$ plain form
359 32590396 23764922 5870064 -3495198 4463449 19108488 25813496 21716019 12558311
351 12558311 3166762 -3771314 -5988323 -4064133 -2452993 -5067091 -11628732 -18807368
343 -18807368 -22509142 -19760009 -11558738 -3184056 953958 1056753 -1494545 -6973977
335 -6973977 -12764904 -11543190 -790655 10461592 12489919 8645079 9205897 14976851
327 14976851 17941301 16338997 16757765 20647472 21216874 16554703 13912390 16325192 16294531
318 16294531 9428751 4294925 9916393 20928444 24766893 18994523 12323724 10769270
310 10769270 11023810 7433750 -628304 -9256198 -14141665 -13696816 -10080567 -6861851 -5021752
301 -5021752 -2965465 -555360 328426 -55291 1000512 3293060 3024515 11172 425822
$$ packed form
359C2590396q825474j7894858r365262P958647J4645039O705008m097477r157708
351A2558311r391549o938076k217009J924190J611140k614098o561641p178636
343a8807368l701774K749133Q201271Q374682M138014J02795k551298n479432
335f973977n790927J221714J0752535J1252247K028327l844840N60818N770954
327A4976851K964450j602304M18768L889707N69402m662171k642313K412802l0661
318A6294531o865780n133826N621468J1012051L838449n772370o670799j554454
310A0769270K54540l590060q062054q627894m885467M44849L616249L218716J840099
301e021752K056287K410105Q83786l83717J055803K292548k68545l013343M14650
$$ plain form
292 425822 8557508 20321098 29266572 34846363 39497849 40981945 34168282 19631585
284 19631585 5126862 -2171558 -1880392 854153 133011 -6622272 -16501295 -22621879
276 -22621879 -19517644 -7804445 6100504 14239454 12550635 4862892 671468 5285447
268 5285447 12788721 13359390 6933655 3153797 7069835 12671273 13496615 11797676 12231084
259 12231084 13448792 12186335 9859298 8512913 5713032 703986 182958 9067549
251 9067549 19690370 20009007 9976349 -174634 -5931842 -11583318 -17527726 -16829480
243 -16829480 -7860002 237416 93094 -4234743 -5753499 -5128530 -6005559 -5813173 696585
234 696585 11690666 19066463 18156551 11959430 6651940 6160893 9427664 10284583 2832900
$$ packed form
292D25822Q131686J1763590Q945474N579791M651486J484096o813663j4536697
284A9631585j4504723p298420K91166K734545p21142o755283r879023o120584
276b2621879L104235J1713199J3904949Q138950j688819p687743m191424M613979
268E285447P503274N70669o425735l779858L916038N601438Q25342j698939M33408
259A2231084J217708j262457k327037j346385k799881n009046n21028Q884591
251I067549J0622821L18637j0032658j0150983n757208n651476n944408O98246
243a6829480Q969478Q097418j44322m327837j518756O24969q77029J92386O509758
234F96585J0994081P375797r09912o197121n307490m91047L266771Q56919p451683
$$ plain form
225 2832900 -9939270 -16609468 -10823325 -723884 873853 -7187948 -14795159 -15436292
217 -15436292 -12729708 -12108686 -14238954 -18455728 -24531881 -27594673 -19558489 -1521933
209 -1521933 12485116 12204189 6052037 9455491 21921907 27878305 20429994 11259767
201 11259767 12114621 17881268 16622210 8287506 3038873 5451705 10531697 13305793
193 13305793 13101508 9510705 3308103 940141 8295571 19018920 19269211 7066275
185 7066275 -3148361 -98649 9730951 14031814 12738074 14754858 22310152 28974110
177 28974110 30882243 30365707 28573943 22775536 12769587 4066177 2162777 6333346
169 6333346 9826475 5337054 -7313199 -17436572 -12363668 6264030 21196081 20539713
$$ packed form
225B832900j2772170o670198N786143J0099441J597737q061801p607211o41133
217a5436292K706584O21022k130268m216774o076153l062792Q036184J8036556
209a521933J4007049k80927o152152L403454J2466416N956398p448311r170227
201A1259767Q54854N766647j259058q334704n248633K412832N079992K774096
193A3305793k04285l590803o202602k367962P355430J0723349K50291j2202936
185G066275j0214636L049712R829600M300863j293740K016784P555294O663958
177B8974110J908133n16536j791764n798407j0005949q703410j903400M170569
169F333346L493129m489421j2650253j0123373N072904J8627698J4932051o56368
$$ plain form
161 20539713 13080934 13414604 18673957 14304938 -198298 -8802529 -4720766 -1192750
153 -1192750 -8545191 -16112034 -9943228 3103315 5209833 -4674810 -9948406 -2172977
145 -2172977 8175442 10206134 8227311 11718456 19425402 22399019 17640899 10600043
137 10600043 6546823 6089178 8043725 10981689 12021278 8892999 3824710 1653912
129 1653912 3578229 6231656 7426820 9038918 13136764 19076890 25917041 33287752
121 33287752 37179615 29904612 9772471 -12216082 -21800368 -16680612 -6793873 -814828
113 -814828 601655 -1135146 -5863309 -9547704 -5185379 5973779 12193480 6758272
105 6758272 -1780440 -2834992 -45913 -3910449 -13860047 -20310742 -21408037 -23781583
$$ packed form
161B0539713p458779L33670N259353m369019j4503236q604231M081763L528016
153a192750p352441p566843O168806J3046543K106518r884643n273596P775429
145b172977J0348419K030692j978823L491145P706946K973617m758120p040856
137A0600043m053220m57645J954547K937964J039589l128279n068289k170798
129A653912J924317K653427J195164J612098M097846N940126O840151P370711
121C3287752L891863p275003k0132141k1988553r584286N119756R886739N979045
113h14828J416483j736801m728163l684395M362325J1159158O219701n435208
105F758272q538712j054552K789079l864536r949598o450695j097295k373546
$$ [...]
##END NTUPLES=NMR SPECTRUM
##END=
