##TITLE=31Pdec_PR193
 D2O, 24 sc
 30.7.2020
##JCAMPDX= 6.0         $$ Bruker NMR JCAMP-DX V2.0
##DATA TYPE= NMR SPECTRUM
##DATA CLASS= NTUPLES
##ORIGIN= UXNMR, Bruker Analytische Messtechnik GmbH
##OWNER= root
$$ XWIN-NMR		Version 3.5
$$ Thu Jul 30 12:37:24 2020 Russian Standard Time (UT+4h)  she@DPX200
##.OBSERVE FREQUENCY= 81.013821
##.OBSERVE NUCLEUS= ^31P
##.ACQUISITION MODE= SIMULTANEOUS
##.ACQUISITION SCHEME= undefined
##.AVERAGES= 24
##.DIGITISER RES= 17
##SPECTROMETER/DATA SYSTEM= spect
##.PULSE SEQUENCE= zgpg30
##.SOLVENT NAME= CDCl3
##.SHIFT REFERENCE= (INTERNAL, CDCl3, 0, 182.463)
##AUDIT TRAIL= $$ (NUMBER, WHEN, WHO, WHERE, WHAT)
$$ ##TITLE= Audit trail, XWIN-NMR		Version 3.5
$$ ##JCAMPDX= 5.01
$$ ##ORIGIN= Bruker BioSpin GmbH
$$ ##OWNER= she
$$ F:/spectra/data/she/nmr/P31/1/pdata/1/auditp.txt
$$ ##AUDIT TRAIL=  $$ (NUMBER, WHEN, WHO, WHERE, WHAT)
(   1,<2020-07-30 12:36:04.53 +0400>,<she>,<DPX200>,
      <created by zg, POWCHK disabled, PULCHK disabled
       configuration hash MD5:
       00 E9 B6 7A A2 85 ED C7 34 08 36 98 17 FE 4E 26
       data hash MD5: 32K
       87 66 33 27 56 53 D5 64 24 E2 C9 B7 3B DB AA 39>)
(   2,<2020-07-30 12:36:29.39 +0400>,<she>,<DPX200>,
      <Start of raw data processing
       efp BC_mod = 2 LB = 1 FT_mod = 6 PKNL = 1 PHC0 = -3265.805 PHC1 = 1282.602 SI = 64K 
       data hash MD5: 64K
       6F 46 1E 2E CB 72 FB 94 3A 11 88 02 F2 A8 4D 59>)
(   3,<2020-07-30 12:36:52.85 +0400>,<she>,<DPX200>,
      <pk PHC0 = -79.68737 PHC1 = -10.2 
       data hash MD5: 64K
       2D CE 81 3A 24 3E 8A 15 21 CC CC 40 5D C8 1F B0>)
(   4,<2020-07-30 12:36:55.96 +0400>,<she>,<DPX200>,
      <abs ABSG = 5 
       data hash MD5: 64K
       F5 3B 02 EC 14 6D 68 AC 6D D2 99 7E AC 62 35 D4>)
$$ ##END=
$$ 
$$ hash MD5
$$ CA 63 FA 2A BA C0 51 66 65 FA 42 F8 1F 44 A6 D4
##$RELAX= 
##$RELAX= 
##$RELAX= 
##$RELAX= 
##$RELAX= 
##$RELAX= 
##$RELAX= 
##$RELAX= 
$$ Bruker specific parameters
$$ --------------------------
##$DU= <F:/spectra>
##$EXPNO= 1
##$NAME= <P31>
##$PROCNO= 1
##$TYPE= <nmr>
##$USER= <she>
##$AMP= (0..31)
100 100 100 100 100 100 100 100 100 100 100 100 100 100 100 100 100 100 
100 100 100 100 100 100 100 100 100 100 100 100 100 100 
##$AQSEQ= 0
##$AQ_mod= 1
##$AUNM= <au_zg>
##$AUTOPOS= <>
##$BF1= 81.014009
##$BF2= 200.13
##$BF3= 200.13
##$BF4= 200.13
##$BF5= 200.13
##$BF6= 200.13
##$BF7= 200.13
##$BF8= 200.13
##$BYTORDA= 1
##$CFDGTYP= 0
##$CFRGTYP= 5
##$CHEMSTR= <none>
##$CNST= (0..31)
1 1 145 1 1 1 1 1 1 1 1 1 1 1 1 1 1 1 1 1 1 1 1 1 1 1 1 1 1 1 1 1 
##$CPDPRG= <waltz16>
##$CPDPRG1= <>
##$CPDPRG2= <waltz16>
##$CPDPRG3= <>
##$CPDPRG4= <mlev>
##$CPDPRG5= <mlev>
##$CPDPRG6= <mlev>
##$CPDPRG7= <mlev>
##$CPDPRG8= <mlev>
##$CPDPRGB= <>
##$CPDPRGT= <>
##$D= (0..31)
0 1 0 0 0 0 0 0 0 0 0 0.03 2e-05 3e-06 0 0 0 0 0 0 0 0 0 0 0 0 0 0 0 0 
0 0 
##$DATE= 1596098163
##$DBL= (0..7)
120 120 120 11 120 120 24 19 
##$DBP= (0..7)
150 150 150 150 150 150 150 150 
##$DBP07= 0
##$DBPNAM0= <>
##$DBPNAM1= <>
##$DBPNAM2= <>
$$ [...]
##$SUBNAM3= <"">
##$SUBNAM4= <"">
##$SUBNAM5= <"">
##$SUBNAM6= <"">
##$SUBNAM7= <"">
##$SUBNAM8= <"">
##$SUBNAM9= <"">
##$SW= 369.568048894756
##$SWIBOX= (0..15)
0 1 3 0 0 0 0 0 0 0 0 0 0 0 0 0 
##$SW_h= 29940.119760479
##$TD= 32768
##$TD0= 1
##$TE= 0
##$TE2= 300
##$TE3= 300
##$TEG= 300
##$TL= (0..7)
0 120 53 12 22 120 120 120 
##$TP= (0..7)
150 150 150 150 150 150 150 150 
##$TP07= 0
##$TPNAME0= <>
##$TPNAME1= <>
##$TPNAME2= <>
##$TPNAME3= <>
##$TPNAME4= <>
##$TPNAME5= <>
##$TPNAME6= <>
##$TPNAME7= <>
##$TPOAL= (0..7)
0.5 0.5 0.5 0.5 0.5 0.5 0.5 0.5 
##$TPOFFS= (0..7)
0 0 0 0 0 0 0 0 
##$TUNHIN= 0
##$TUNHOUT= 0
##$TUNXOUT= 0
##$USERA1= <user>
##$USERA2= <user>
##$USERA3= <user>
##$USERA4= <user>
##$USERA5= <user>
##$V9= 5
##$VALIST= <valist>
##$VCLIST= <CCCCCCCCCCCCCCC>
##$VD= 0
##$VDLIST= <DDDDDDDDDDDDDDD>
##$VPLIST= <PPPPPPPPPPPPPPP>
##$VTLIST= <TTTTTTTTTTTTTTT>
##$WBST= 1024
##$WBSW= 4
##$XGAIN= (0..3)
0 0 0 0 
##$XL= 0
##$YL= 0
##$YMAX_a= 6442
##$YMIN_a= -3995
##$ZGOPTNS= <>
##$ZL1= 120
##$ZL2= 120
##$ZL3= 120
##$ZL4= 120
##$ABSF1= 182.463
##$ABSF2= -187.1042
##$ABSG= 5
##$ABSL= 3
##$ALPHA= 0
##$AQORDER= 0
##$ASSFAC= 0
##$ASSFACI= 0
##$ASSFACX= 0
##$ASSWID= 0
##$AUNMP= <proc_1d>
##$AZFE= 0.1
##$AZFW= 0.5
##$BCFW= 0
##$BC_mod= 2
##$BYTORDP= 0
##$COROFFS= 0
##$CY= -3
##$DATMOD= 1
##$DC= 0
##$DFILT= <>
##$DTYPP= 0
##$F1P= 0
##$F2P= 0
##$FCOR= 1
##$FTSIZE= 65536
##$FT_mod= 6
##$GAMMA= 0
##$GB= 0
##$INTBC= 1
##$INTSCL= 5.30512e-09
##$ISEN= 30
##$LB= 1
##$LEV0= 0
##$LPBIN= 0
##$MAXI= 10000
##$MC2= 0
##$MEAN= 0
##$ME_mod= 0
##$MI= 50
##$NCOEF= 0
##$NC_proc= -9
##$NLEV= 6
##$NOISF1= 182.463
##$NOISF2= 159.3651
##$NSP= 0
##$NTH_PI= 0
##$NZP= 0
##$OFFSET= 182.463
##$PC= 4
##$PHC0= -3345.492
##$PHC1= 1272.402
##$PH_mod= 1
##$PKNL= yes
##$PPARMOD= 0
##$PSCAL= 0
##$PSIGN= 0
##$REVERSE= no
##$SF= 81.0140089999434
##$SI= 65536
##$SIGF1= 159.3651
##$SIGF2= -187.1042
##$SINO= 113.3802
##$SIOLD= 16384
##$SREGLST= <1H.CDCl3>
##$SSB= 0
##$STSI= 65536
##$STSR= 0
##$SW_p= 29940.119760479
##$SYMM= 0
##$S_DEV= 0
##$TDeff= 32768
##$TDoff= 0
##$TI= <>
##$TILT= no
##$TM1= 0
##$TM2= 0
##$TOPLEV= 0
##$USERP1= <user>
##$USERP2= <user>
##$USERP3= <user>
##$USERP4= <user>
##$USERP5= <user>
##$WDW= 1
##$XDIM= 65536
##$YMAX_p= 441845830
##$YMIN_p= -193553416
$$ End of Bruker specific parameters
$$ ---------------------------------
##NTUPLES= NMR SPECTRUM
##VAR_NAME=  FREQUENCY,     SPECTRUM/REAL,   SPECTRUM/IMAG
##SYMBOL=    X,             R,               I
##VAR_TYPE=  INDEPENDENT,   DEPENDENT,       DEPENDENT
##VAR_FORM=  AFFN,          ASDF,            ASDF
##VAR_DIM=   65536,         65536,           65536
##UNITS=     HZ,            ARBITRARY UNITS, ARBITRARY UNITS
##FACTOR=    0.456856943014862, 1,           1
##FIRST=     14782.0589164792, 0,            0
##LAST=      -15158.0608439998, 0,           0
##MIN=       -15158.0608439998, -193553416,  0
##MAX=       14782.0589164792, 441845830,    0
$$ Real data points
##PAGE= N=1
##DATA TABLE= (X++(R..R)), XYDATA
$$ [...]
4115F487987J4441514l296348q397937L685651J0598147j46919j1995721q540285
4107B836089L20945j275498o496980Q14991J5176753J4910258m638448k3131205
4099a483095k2370887o733788O951656R312321M200410J033144M392927R073865
4091D376553O689014j658981n336869l95754L153370j834806n154133N154721
4083D993115J9566751J6971610l337366j8035929j2622905n37512K19695n596104
4075A621355k054409Q830425R369442l795820j1731247j796381J2329388J1656432
4067B4429185R00471n48050R610186J3895628M655622m415314l573054l959356
4059D0995318j5283055k3442790j0718914J2425546J8906594L942561j0685555
$$ plain form
4115 6487987 20929501 17633153 9235216 12920867 23519014 23372095 11376374 2836089
4107 2836089 3157034 1881536 -4615444 -3800453 11376300 26286558 21648110 -1483095
4099 -1483095 -23853982 -30587770 -23636114 -14323793 -10123383 -9090239 -4697312 4376553
4091 4376553 11065567 9406586 4069717 3673963 6827333 4992527 -161606 4993115
4083 4993115 24559866 41531476 38194110 20158181 7535276 6997764 7217459 1621355
4075 1621355 -433054 8397371 17766813 13970993 2239746 443365 12772753 24429185
4067 24429185 25329656 24781606 34391792 48287420 52943042 48527728 44954674 40995318
4059 40995318 25712263 2269473 -8449441 3976105 22882699 26825260 16139705
4052A6139705j1046190o532111p006122p222534k604742m04420l995482l604449
4044b6276345N259347J0601818M460313j256725N096715J3414531Q150203n844104
4036A3605753j2316204q684774l716789Q71502P424260R297646J015528o150234
4028A346688l75515O435320m334015k2161801j8005420Q970576K6079148J4998760
4020A2953741m487189r791119o570750q214967r199114j16688R681396P084081
4012h660609r26155j36061N246161J656699p436810o649205M158274R128329J911630
4003a707747o941718q866918o660799l185203L738149J1946790J3868498Q346517
3995A0537569K273515j577816o654786j0896197o347517N319443J0010381Q58776
$$ plain form
4052 16139705 5093515 -1438596 -8444718 -15667252 -18271994 -18676414 -22671896 -26276345
4044 -26276345 -21016998 -10415180 -5954867 -7211592 -2114877 11299654 19449857 13605753
4036 13605753 1289549 -7395225 -11112014 -10240512 -2816252 6481394 7496922 1346688
4028 1346688 971173 7406493 3072478 -19089323 -37094743 -28124167 -2045019 12953741
4020 12953741 8466552 -1324567 -7895317 -16110284 -25309398 -25426086 -15744690 -8660609
4012 -8660609 -9586764 -9722825 -4476664 -2819965 -10256775 -16905980 -12747706 -3619377 -1707747
4003 -1707747 -8649465 -17516383 -24177182 -27362385 -23624236 -11677446 2191052 10537569
3995 10537569 12811084 11233268 4578482 -6317715 -12665232 -7345789 2664592 3523368
3987C523368j0261309r230941Q09802N542162p12906j0158577j3499352r156205
3979d3143958j401502N031164P806582P380400N433680L009617J055127J370923
3971a3457967M279261O861987P060867P212311Q593677N905593m697238j4677929
3963G080562j1640696Q27513N130680m218509j0316775J113056J8505423K0012608
3955B6493862M617016q249940p410831j838341j633696k633961K145127P271536
3947A8760772K791505q130919j1538238k688764O356178L263751p431685j0681302
3939i298702j675445P772367N717838l568250n879998L023393J1413917P231891
3931A4737011o235526j4626211r376831M114508J4031156J3869966O216251k268457
$$ plain form
3987 3523368 -6737941 -15968882 -15159080 -9616918 -10329824 -20488401 -33987753 -43143958
3979 -43143958 -44545460 -39514296 -31707714 -24327314 -18893634 -15884017 -14828890 -13457967
3971 -13457967 -9178706 -2316719 4744148 11956459 20550136 26455729 21758491 7080562
3963 7080562 -4560134 -3732621 1398059 -2820450 -13137225 -12024169 6481254 26493862
3955 26493862 31110878 22860938 15450107 13611766 11978070 9344109 11489236 18760772
3947 18760772 21552277 13421358 1883120 -805644 5550534 8814285 1382600 -9298702
3939 -9298702 -10974147 -3201780 2516058 -1052192 -6932190 -3908797 7505120 14737011
3931 14737011 8501485 -6124726 -15501557 -11387049 2644107 16514073 22730324 20461867
3923B0461867p541795r798081r712543o002750R91930N894778L613510k383155
3915d476239l267606K438240O311805L350463K07624L962503R482804P087946
3907B5097540j602631o273451m759180n610838j1965246j4102175l870710J1655366
3899a1431325J8350099J2171874J413515n296074o891602o642215o311961m903211
3891i540900j206843L251609M504597J222536j380622L004076J1681249J3529094
3883B5064796K645955j2836762j9564191j3748154l387358K193158J312770p91932
3875a9111718P91963M468515L952675k258398o403564j907517M755286K282782
3867a3429976o239781n551113P151888J5052759P624458j681786K359019J0522429
$$ plain form
3923 20461867 12920072 3121991 -6590552 -12593302 -11601372 -5706594 -2093084 -4476239
3915 -4476239 -7743845 -5305605 1006200 4356663 4564287 8526790 18009594 25097540
3907 25097540 23494909 17221458 12462278 6851440 -5113806 -19215981 -23086691 -11431325
3899 -11431325 6918774 19090648 20504163 15208089 8316487 1674272 -4637689 -9540900
3891 -9540900 -10747743 -7496134 -2991537 -1769001 -3149623 -145547 11535702 25064796
3883 25064796 27710751 14873989 -4690202 -18438356 -21825714 -19632556 -18319786 -19111718
3875 -19111718 -18319755 -13851240 -9898565 -12156963 -18560527 -20468044 -15712758 -13429976
3867 -13429976 -19669757 -25220870 -18068982 -3016223 4608235 2926449 5285468 15807897
3859A5807897M767274r300035r592407N654025J3479163K367908j1028019j0297129
3851A858677l001569k722457n256763N38957J0840560J3112373O236502q97295
3843B0708985m655896o702052m770991K682260P706256K604584n853030n762600
3835E957516N89343J576380l008762k541983M059959N524745k185411r077966
3827H93821p692939k643527N15822L078242N520019M271566M14221k39153Q12221
3818D930293m148465j2216421r687048M962330J4394750Q226539p28559J309882
3810G043301O177400j36093j1180561j0002813K279407Q432962K211371n799956
3802i74982q424104r357606r101765j567045J0867661J5080042O564175k427202
$$ plain form
3859 15807897 20575171 11275136 1682729 7336754 20815917 23183825 12155806 1858677
3851 1858677 -1142892 -3865349 -9122112 -8583155 2257405 15369778 21606280 20708985
3843 20708985 16053089 9351037 4580046 7262306 14968562 17573146 11720116 5957516
3835 5957516 6546859 8123239 5114477 2572494 6632453 12157198 9971787 893821
3827 893821 -6799118 -9442645 -8926823 -5848581 -328562 3943004 4357225 4118072 4930293
3818 4930293 781828 -11434593 -21121641 -16159311 -1764561 6461978 5733419 7043301
3810 7043301 13220701 13084608 1904047 -8098766 -5819359 2613603 4824974 -974982
3802 -974982 -9399086 -18756692 -27858457 -29425502 -18557841 -3477799 3086376 659174
3794F59174j246018M458507M212447j389016m961350m647700l751766l677014
3786a0342736l981354m631521l368577L187768J1385798J1121569M45129q347949
3778d531873m721280N391666R488109O038703J852421j868521q330595j3782595
3770a0463965j0917355k767721j0305l420681k242733O884808J2655914O755533
3762c526505l024281n448883j686008Q21011J695255M102711M957376O82071k627902
3753d055155K038662P670749K125366r730130j0141300K817602R239167j848274
3745a883313j3213100m887954J4509074J9901573N636993r611072j1253127l874681
3737d675607L437628R554060J3534450R105535m219098j4636460j1729151k11572
$$ plain form
3794 659174 -586844 3871663 8084110 6695094 1733744 -2913956 -6665722 -10342736
3786 -10342736 -14324090 -18955611 -22324188 -19136420 -7750622 3370947 3816076 -4531873
3778 -4531873 -9253153 -3861487 5626622 11665325 13517746 11649225 3318630 -10463965
3770 -10463965 -21381320 -24149041 -24159346 -27580027 -29822760 -22937952 -10282038 -3526505
3762 -3526505 -6550786 -11999669 -13685677 -12864666 -11169411 -7066700 -2109324 -1427253 -4055155
3753 -4055155 -2016493 5654256 7779622 -1950508 -12091808 -9274206 -35039 -1883313
3745 -1883313 -15096413 -19984367 -5475293 14426280 20063273 10452201 -800926 -4675607
3737 -4675607 -1237979 8316081 21850531 30956066 26736968 12100508 371357 159785
3729A59785P019220M227302m295870j1283734j1375065m189704L227934K696899
3721a3813233l071683k366274P481530J3577911O127484n664175o222949M868154
3713I16765J4445476J3565940L755994r443082j8873873j6658279l782766N619090
3705a0454735R84014q485372p203070K482643N668233J204821K723069J1997672
3697a082725J2562507k518490j5559388r234180P829453J4470325N773811n444207
3689F797106q743674m469412L114487R047635P242659k492826r623541m920486
3681d048052N349724P647532J682387R49585J1357879K0365366J2958262q162891
3673D8099792k4730486k3314270r255541P56702j638212p517936m174646N796134
$$ plain form
3729 159785 7179005 11406307 7110437 -4173297 -15548362 -19738066 -16510132 -13813233
3721 -13813233 -16884916 -19251190 -11769660 1808251 7935735 2271560 -3951389 916765
3713 916765 15362241 28928181 32684175 23241093 4367220 -12291059 -16073825 -10454735
3705 -10454735 -9470721 -17956093 -25159163 -22676520 -17008287 -15803466 -13080397 -1082725
3697 -1082725 11479782 8961292 -6598096 -15832276 -8002823 6467502 12241313 6797106
3689 6797106 -1946568 -6415980 -3301493 5746142 12988801 10495975 872434 -4048052
3681 -4048052 1301672 8949204 10631591 11581176 22939055 43304421 56262683 48099792
3673 48099792 23369306 55036 -9200505 -8443803 -10082015 -17599951 -21774597 -15978463
3665a5978463P194862m921829j5408248q769977R360923K0055626J5064221K317169
3657H914284r068454j6828098j8511847r309864Q017990K0478076J9058777R781058
3649A2531922M223524L927140J937640l023034l790064J750774L546310o665195
3641A4439017j9396960j6497733L162852J8799990J4584628Q59107k352687N341012
3633A8939226P519139r34737p368556m774397k272039n297855m065860O525883
3625H270804J2552455K801290r153516m361221R976104J0611844n146125j6094091
3617I457544j0651163j556912j887366n681146j571758Q501473J3980020R837192
3609B0427884q92900j1328046j3627825n653008L240580K261828m477051l545351
$$ plain form
3665 -15978463 -8783601 -13705430 -29113678 -37883655 -28522732 -8467106 6597115 8914284
3657 8914284 -154170 -16982268 -35494115 -44803979 -36785989 -16307913 2750864 12531922
3649 12531922 16755446 20682586 22620226 19597192 15807128 17557902 21104212 14439017
3641 14439017 -4957943 -21455676 -18292824 507166 15091794 15950901 13598214 18939226
3633 18939226 26458365 25523628 18155072 13380675 11108636 5810781 1744921 8270804
3625 8270804 20823259 23624549 14471033 10109812 20085916 30697760 25551635 9457544
3617 9457544 -1193619 -2750531 -4637897 -10319043 -11890801 -3389328 10590692 20427884
3609 20427884 19534984 8206938 -5420887 -11073895 -7833315 -5571487 -10048538 -13593889
3601a3593889N497767Q845546K363451j152011M569417P316210p37472o126556
3593F982463L732840J6186809J0937349p888199j8162080j2782503n420004m756441
3585a1169766l427346M022474R973717P632240K769554L174818N590511J754867
3577B0321069p604064j2241672m888532R614228J8506128J4226524K295352o504390
3569C3724643j0017116j3557287j5400425o513466R845682J3835046k719816j7620596
3561h423335o983004J7185298K1770072P22915j7629950j3563458K5565M772463
3553b123434L379842N157691N816803q29427o921266m370106j440124p085832
3545h415853j0874354N03095J6422152J5886989K382755n14124J1874064J6964652
$$ plain form
3601 -13593889 -8096122 749424 3112875 1960864 6530281 13846491 13109019 6982463
3593 6982463 10715303 26902112 37839461 29951262 11789182 -993321 -6413325 -11169766
3585 -11169766 -14597112 -10574638 -600921 7031319 9800873 12975691 18566202 20321069
3577 20321069 12717005 475333 -4413199 5201029 23707157 37933681 40229033 33724643
3569 33724643 23707527 10150240 -5250185 -11763651 -1917969 11917077 9197261 -8423335
3561 -8423335 -15406339 1778959 23549031 24271946 6641996 -6921462 -6895897 -2123434
3553 -2123434 1256408 6414099 12230902 11401475 4480209 110103 -1330021 -8415853
3545 -8415853 -19290207 -18787112 -2364960 13522029 15904784 15390660 27264724 44229376
3537D4229376J702462j6309475j6192310k881798N666999N088348K178885k616874
3529B0865613j2289107j9284026j2271586M430496J3219673O348706n325346q757026
3521a3062603l406019L295218O045665L662834j642571l719628K166288J0722717
3513D061901J0589350K64783p898724n013996Q47828l101873j4194562j7156416
3505c1601709n861475Q174440J1475740M492959k734898m702069l901163l048946
3497b7707121n72440N134667J1332191J3582013J1282591Q134551O944841N833019
3489C3964312J039668p310581j4256402j5090705r714037j607334N281623P861943
3481A68487N167676M30058r24746J847407K916149j343390n130764r67445P572133
$$ plain form
3537 44229376 45931838 29622363 13430053 10548255 16215254 21303602 23482487 20865613
3529 20865613 8576506 -10707520 -22979106 -18548610 -5328937 1019769 -4305577 -13062603
3521 -13062603 -16468622 -13173404 -7127739 -3464905 -5107476 -8827104 -6660816 4061901
3513 4061901 14651251 14916034 7017310 2003314 2851142 -250731 -14445293 -31601709
3505 -31601709 -37463184 -29288744 -17813004 -13320045 -16054943 -20757012 -24658175 -27707121
3497 -27707121 -28279561 -23144894 -11812703 1769310 13051901 21186452 28131293 33964312
3489 33964312 35003980 27693399 13436997 -1653708 -11367745 -12975079 -7693456 168487
3481 168487 5336163 5766221 4841475 6688882 9605031 8261641 3130877 2163432 9735565
3472I735565R125688R03418p032591o659618k410804j507900k231609N2129J832528
3463A806806k856523r305563o673609M430195J0641463M981369l494474m513370
3455d983706j370897k787864p265098n876309K647332R628783Q957561L622554
3447B572356j060861l370854k640448K313761R115881J1521766O574910j790852
3439B3235659q456101j1877083j1154874m552562M940255Q659654L082018l241287
3431F35679q58893O280182O235212l478370j3155187j5103189j1173163n354295
3423c5972024J427484O832370O947025L932224M564237P744247M352246n432802
3415e604993p613125L868023J3857837P827275m416125m230852N257725N375550
$$ plain form
3472 9735565 18861253 19764671 12732080 6072462 3661658 2153758 -77851 -25722 1806806
3463 1806806 -1049717 -10355280 -17028889 -12598694 -1957231 3024138 -470336 -4983706
3455 -4983706 -6354603 -9142467 -16407565 -22283874 -19636542 -10007759 -1050198 2572356
3447 2572356 1511495 -1859359 -4499807 -2186046 6929835 18451601 25026511 23235659
3439 23235659 14779558 2902475 -8252399 -12804961 -7864706 794948 3876966 635679
3431 635679 -223214 6056968 12292180 8813810 -4341377 -19444566 -30617729 -35972024
3423 -35972024 -34544540 -27712170 -20765145 -16832921 -12268684 -4524437 -172191 -5604993
3415 -5604993 -13218118 -9350095 4507742 12335017 7918892 3688040 8945765 14321315
3407A4321315n250025q122171K412172Q085904k562104j3880726p881671P511757
3399e365549J2218839M191373k225312p99597J390599J2602j126144m56514j455707
3390F384590m264840m809864k791919j974285k932714l253031l332730m203605
3382b1178398k260844N140919J1847194J0399955M602139M020937Q281104Q158267
3374B9011273O84469q335713j5118684j8995124j5178295j205593J0882080O296059
3366a1959528p609652p892594Q136833J5347161p09395j8834463j2694071J0136732
3358b6078977K0800053J0788698j457012j951356K395880J618659p03087L391728
3350H804586J1137057J1731763M75557j4739004k0892864j3395875j823515Q49163
$$ plain form
3407 14321315 9071290 949119 3361291 11447195 8885091 -4995635 -12877306 -5365549
3399 -5365549 6853290 11044663 8819351 8019754 9410353 9422955 8296811 7840297 6384590
3390 6384590 2119750 -2690114 -5482033 -7456318 -10389032 -13642063 -16974793 -21178398
3382 -21178398 -23439242 -18298323 -6451129 3948826 8550965 12571902 20853006 29011273
3374 29011273 29695742 21360029 6241345 -12753779 -27932074 -29137667 -18255587 -11959528
3366 -11959528 -19569180 -27461774 -19324941 -3977780 -4687175 -23521638 -36215709 -26078977
3358 -26078977 -5278924 5509774 4052762 2101406 4497286 6115945 5412858 8804586
3350 8804586 19941643 31673406 32148963 17409959 -3482905 -16878780 -18702295 -17853132
3342a7853132n464954q698982k583024N701398R458971J2071604J5105142J0124832
3334A7861855m821709j2764148J02108J8360206J4982515q406424k1994714j0495444
3326g175755P613754J0970266M119401K510846N756395K783192o571277j1782891
3318H223931q800812l568622q63189l18501j619665m420494m661821R24902Q082582
3309g021689R953550O921050M485274L286997r56818q208208j2195327q571133
3301a2306304L30367Q993348J2546773Q324530j162175p882473o281640o03066
3293A959360J002114k161430m315091l775731m297710n920737l382424M255309
3285a6636340J0510080J1087360R140011P451953L070862n359527j2015253j1629473
$$ plain form
3342 -17853132 -23318086 -32017068 -34600092 -28898694 -19439723 -7368119 7737023 17861855
3334 17861855 13040146 275998 378106 18738312 33720827 25314403 3319689 -7175755
3326 -7175755 437999 11408265 15527666 18038512 23794907 26578099 20006822 8223931
3318 8223931 -576881 -4145503 -5008692 -5327193 -6946858 -11367352 -16029173 -15104271 -7021689
3309 -7021689 2931861 9852911 14338185 17625182 16668364 8460156 -3735171 -12306304
3301 -12306304 -11975937 -2982589 9564184 17888714 16726539 8844066 2562426 1959360
3293 1959360 2961474 800044 -3515047 -7290778 -11588488 -17509225 -20891649 -16636340
3285 -16636340 -6126260 4961100 14101111 21553064 24623926 19264399 7249146 -4380327
3277d380327o777276j660309M498500J0734436R054010l171245j2028584k897379
3269f628174J5298557J8277973O17197j5308399j1227063K262252M475218m752376
3261C015185r000757k261401M891723M044123j168250n041936p263866p994222
3253b0779401n611544j647646M86483K380726P344885J0940134N971109l305439
3245d220693n441036j334363l436959j1703548r149459R492666K3553651J5624157
3237A3384416j294316m716791K308383j50812j3385963j8271636p327655N358883
3229b4095491R148845J0108441J3590306J3416752O658924J792014K722501M68412
3221C3810704r026424j4039043o316285K597276j328549j2338569j5572326j0876090
$$ plain form
3277 -4380327 -11157603 -12817912 -8319412 2415024 11469034 8297789 -3730795 -6628174
3269 -6628174 8670383 26948356 27565553 12257154 1030091 3292343 7767561 3015185
3261 3015185 -5985572 -8246973 -3355250 688873 -479377 -5521313 -12785179 -20779401
3253 -20779401 -26390945 -28038591 -27552108 -25171382 -17826497 -6886363 -915254 -4220693
3245 -4220693 -9661729 -10996092 -14433051 -26136599 -35286058 -25793392 -2239741 13384416
3237 13384416 12090100 7373309 9681692 9530880 -3855083 -22126719 -29454374 -24095491
3229 -24095491 -14946646 -4838205 8752101 22168853 28827777 30619791 33342292 33810704
3221 33810704 24784280 10745237 4428952 7026228 5697679 -6640890 -22213216 -33089306
3213c3089306q921898r719824l038802J1573262K1635360J9607657J0370210N1655
3205H468314r211830j2028705k115421J3252687J5232287j480576j6843256j0331150
3197a5057650R806148J5831165k718927k4869187k5007387l990662J4857605J5878879
3189a5270016O609500K185505M708688N764366L073600L071834P378195Q321860
3181B5843532K143655l122626o0331N351430K474643p118456j1453347n414393
3173H644107K865908L984185j292016m858870j396854O111515R394219M089801
3165B7541995l571805l644615K083693m71099j6154062k7164501j4052037J4356223
3157b1076208K7935037J3467763r329904j5374965m149259O893335P803208K904271
$$ plain form
3213 -33089306 -42011204 -51731028 -54769830 -43196568 -21561208 -1953551 8416659 8468314
3205 8468314 -743516 -12772221 -14887642 -1634955 13597332 12116756 -4726500 -15057650
3197 -15057650 -5251502 10579663 7860736 -17008451 -42015838 -46006500 -31148895 -15270016
3189 -15270016 -8660516 -6475011 -1766323 3998043 7071643 10143477 17521672 25843532
3181 25843532 27987187 24864561 24804230 30155660 32630303 25511847 14058500 8644107
3173 8644107 11510015 15494200 14202184 9343314 7946460 14057975 23452194 27541995
3165 27541995 23970190 20325575 22409268 21938169 5784107 -21380394 -35432431 -21076208
3157 -21076208 6858829 20326592 10996688 -4378277 -8527536 -1634201 6169007 9073278
3149I073278j509743l661792k438041K300860N266252L45923r025479j1723545
3141a1372287l503941O975426J0195697P941498P936151J0285759P065442m010807
3133C1512938j2870462r408448J131057K944246q858056j9079596j0833384J1078864
3125a4382841K3672302J3065145r213499k0300345j0784065Q684584K1023948
3118A1765229J7505304J703212j4781971k0205840j1499190K555034R586973O451823
3110C080574J504006L098514R085339J0666533M350586m565423j0185085j2178720
3102D856324j1283337m349824R436542K0342926J5761075j850921j4024326r312395
3094I576064O14311k500916j6320853k0561574o503437J0557555J3861868P438344
$$ plain form
3149 9073278 7563535 3901743 1463702 3764562 9030814 9376737 351258 -11372287
3141 -11372287 -14876228 -7900802 2294895 10236393 18172544 28458303 35523745 31512938
3133 31512938 18642476 9234028 10365085 13309331 4451275 -14628321 -25461705 -14382841
3125 -14382841 9289461 22354606 13141107 -7159238 -17943303 -9258719 11765229
3118 11765229 29270533 30973745 16191774 -4014066 -15513256 -12958222 -3371249 3080574
3110 3080574 4584580 7683094 16768433 27434966 31785552 27220129 17035044 4856324
3102 4856324 -6427013 -10776837 -1340295 19002631 34763706 32912785 18888459 9576064
3094 9576064 10190375 7689459 -8631394 -29192968 -35696405 -25138850 -11276982 -3838638
3086c838638N507627R184189Q106030J009794j533849L327290L808268p014579
3078A8556132j7739976j5364963n369772j283809j403001O475407J9390961J8851567
3070B2112546J173559j1821500m380801Q118919L412916j1439668j1307735N648881
3062A517117J3883331K76182j6275449j4449230K79746Q971235O252684l14600
3054A41016n946206r214029o204549K279959O056574J034483j76492J1913532
3046a15712K3095586J3859246q311599j6824927m311227Q703260N860185m587776
3038A7367036p402132j262408N630738P401877J422715j0772360j8605641j0556274
3030a6776449Q636073K1195953J9691345J2909907O091403n868326j9470749j8267234
$$ plain form
3086 -3838638 1668989 10853178 18959208 19969002 18435153 21762443 25570711 18556132
3078 18556132 816156 -14548807 -19918579 -21202388 -22605389 -16129982 3260979 22112546
3070 22112546 23286105 11464605 7083804 15202723 18615639 7175971 -4131764 1517117
3062 1517117 15400448 15676630 -598819 -15048049 -14768303 -5797068 455616 141016
3054 141016 -5805190 -15019219 -21223768 -18943809 -12887235 -11852752 -12029244 -115712
3046 -115712 22979874 36839120 28527521 11702594 7391367 16094627 21954812 17367036
3038 17367036 9964904 8702496 14333234 21735111 23157826 12385466 -6220175 -16776449
3030 -16776449 -8140376 13055577 32746922 45656829 51748232 45879906 26409157 8141923
3022H141923M06111J3949726N869296q480643o431094O650040R027990j152998
3014B7980351o256823q32349J894381m115362p687976j419565N304908J664643
3006A6532208q984156j5376405j1335198J154968J4110028J7397531Q180302l711271
2998A7968007p572898o060812p587583r188877j943875Q751295O594656r266628
2990h306715j9231492j1134895K935163O700158K389279J987515O911474R223825
2982h525688O229071K223608m26992k891461n375599p442279r315956q212438
2974c3737734Q54350J5051367K1477301J2782136q37208m406790J417066K992719
2966A5593207n116386j2410688q216407L183304Q645273L769153j619481K711261
$$ plain form
3022 8141923 8548034 22497760 28367056 19886413 13455319 20105359 29133349 27980351
3014 27980351 21723528 20891179 22785560 18670198 10982222 9562657 14867565 16532208
3006 16532208 7548052 -7828353 -19163551 -18008583 -3898555 13498976 21679278 17968007
2998 17968007 10395109 4334297 -3253286 -12442163 -14386038 -5634743 959913 -8306715
2990 -8306715 -27538207 -38673102 -35737939 -29037781 -26648502 -24660987 -17749513 -8525688
2982 -8525688 -2296617 -73009 -500001 -3391462 -8767061 -16209340 -25525296 -33737734
2974 -33737734 -32883384 -17832017 3645284 16427420 15590212 11183422 12600488 15593207
2966 15593207 10476821 -1933867 -10150274 -6966970 1678303 5447456 3827975 6539236
2958F539236J1816404J0082993o997058k2989620j9867271j934629J0485014Q573079
2950d291852K601899J597566J581036l37001L595549J6117802K3025206J1553040
2942E5443245q162302j5417444p320581L00916k526744r301984j0988952p397756
2934e371602k630646N84520M67489j573921J036550J0658880J6307871O070377
2926B5549518j2275053j7720316n444244N689733J168189q618426o544542M410523
2918a3784618O864620m319319j5299797j2940103o77553P718216M235912n625189
2910c3827831q782611J260333J5062913J5829590L2357j5870139j4707107J01366
2902d0901129R961471N039691n706634q429060o56370Q632618J0141777L122071
$$ plain form
2958 6539236 18355640 28438633 21441575 -1548045 -21415316 -23349945 -12864931 -4291852
2950 -4291852 -1689953 -92387 1488649 1151648 4747197 20864999 43890205 55443245
2942 55443245 47280943 31863499 24542918 24843834 22317090 13015106 2026154 -5371602
2934 -5371602 -8002248 -7417728 -6950239 -8524160 -7487610 3171270 19479141 25549518
2926 25549518 13274465 -4445851 -9890095 -4200362 -3032173 -11650599 -18195141 -13784618
2918 -13784618 -6919998 -11239317 -26539114 -39479217 -40156770 -32438554 -28202642 -33827831
2910 -33827831 -42610442 -41350109 -26287196 -10457606 -10425249 -26295388 -41002495 -40901129
2902 -40901129 -30939658 -25899967 -31606601 -40035661 -40692031 -32059413 -21917636 -18795565
2894a8795565m160460k481876P267985J2875529N298571p730782j0020704J131973
2886a6615329J0222707M267298r883235j5428190p112193N043162J0398656P823890
2878a1283234J787512l724203n452286j348635N797974R288952O062056J72565
2870A300701l513533n215237o597063n381031R62427Q432790R734949M236872
2862C960875j083265j593065q7286K33699J641864O136721Q931771M358220m511745
2853A7987789r252775p779964n158733l168546J793094Q354760Q028064o64130
2845A0139559n512174K245108J1744543O739147q133283j1518080K911870J5520524
2837B4137214Q651266q727948j5596621p562773K444402N326287L515020R48950
$$ plain form
2894 -18795565 -22956025 -25437901 -18169916 -5294387 4184 -7726598 -17747302 -16615329
2886 -16615329 -6392622 -2125324 -12008559 -27436749 -34548942 -29505780 -19107124 -11283234
2878 -11283234 -9495722 -13219925 -18672211 -20020846 -14222872 -4933920 1128136 1300701
2870 1300701 -2212832 -7428069 -14025132 -19406163 -18443736 -10010946 -275997 3960875
2862 3960875 2877610 1284545 1197259 1430958 3072822 9209543 18141314 22499534 17987789
2853 17987789 8735014 955050 -4203683 -7372229 -5579135 2775625 10803689 10139559
2845 10139559 4627385 6872493 18617036 25356183 17222900 5704820 8616690 24137214
2837 24137214 32788480 24060532 8463911 901138 3345540 8671827 12186847 13135797
2829A3135797j283527o40921L614650M436100l581530j1249358o191795M331047
2821B570463Q59532j5657268k0295901j719737J8072627J6090129J425904l544784
2813b199035O19373k545634j2097413j0755047L252597J1675848O439319O11254
2805d998738L254578N312633n05539n616002k497197J688396M69295O67829O211759
2796C987014N695186p053974j4886700j098981J9425113J7346191p395881k4068684
2788h050716j4985810K831509O989256k33626l586057n59414N54672j174490N27482
2779a7687194M554816K930831l455866k744440R455916J9721590J3403785m178889
2771B2000549j3642576p848097j097228p134928j7867682j5074881J545594J2446953
$$ plain form
2829 13135797 11852270 11211349 14825999 19262099 15680569 4431211 -1760584 2570463
2821 2570463 3429995 -12227273 -32523174 -34242911 -16170284 -80155 1345749 -2199035
2813 -2199035 -1579662 -4125296 -16222709 -26977756 -23725159 -12049311 -5609992 -4998738
2805 -4998738 -1744160 3568473 3062934 -2553068 -5050265 -3361869 -2892574 -2224745 3987014
2796 3987014 9682200 2628226 -12258474 -13357455 6067658 23413849 16017968 -8050716
2788 -8050716 -23036526 -20205017 -13215761 -13449387 -17035444 -17594858 -17040186 -18214676 -17687194
2779 -17687194 -13132378 -10201547 -13657413 -16401853 -6945937 12775653 26179438 22000549
2771 22000549 8357973 509876 -587352 -7722280 -25589962 -40664843 -39119249 -26672296
2763b6672296O103489n163101m623320M887231Q078669J562670k515997L882934
2755a4459721J3563354J5643060R549923K717428n18446k527209o113574q249486
2747I605329k639711J0308550J8939446J1727373o505915j7497085j1932060p64400
2739A1241527J431761m249567p227732n198933l670570k533187L321433J1229394
2731D344126J1692116L542400l110835j625599L175844M397105J711128k094489
2723B2031796n438662o434789l808909m56252K28355L23565J854652j230917j3610308
2714f541469k4038890j6540734L454585J2762250M321084k712868M791041J2692001
2706a1813000N251112p001366n575710L998960K588426q454626r182259M898663
$$ plain form
2763 -26672296 -20568807 -25731908 -30355228 -25467997 -17389328 -15826658 -18342655 -14459721
2755 -14459721 -896367 14746693 24296616 27014044 26495598 23968389 17854815 9605329
2747 9605329 6965618 17274168 36213614 47940987 41435072 23937987 12005927 11241527
2739 11241527 12673288 8423721 1195989 -4002944 -7673514 -10206701 -6885268 4344126
2731 4344126 16036242 19578642 16467807 14842208 18018052 22415157 24126285 22031796
2723 22031796 16593134 10158345 6349436 5893184 6121539 6445104 8299756 7068839 -6541469
2714 -6541469 -30580359 -47121093 -43666508 -30904258 -26583174 -29296042 -24505001 -11813000
2706 -11813000 -6561888 -13563254 -19138964 -15140004 -12551578 -21006204 -30188463 -25289800
2698b5289800J5217218J0059162K86314k016476j700571p077010j3337888j1553667
2690c5412718l754373K376484O146950J0750263J3638005J0226426L290040l53567
2682F907510R2077K28695j171633j820990j696922j918795M54131Q700526J7681587
2673B7456186J6681546L329242j1314289j5120954q619577k788417n094900j1306069
2665f777232j1807354m187689L011923P90477p747026r948896j96691J1255661
2657b5606827J0805233n93188q687940m186325P054069J3157940R359252j83686
2649A118528p879945o889063M446745J7775338J9419357N713413j0482048j5125560
2641H096765j0716609r980735j4947787j4348569l093126Q328416R811464O138587
$$ plain form
2698 -25289800 -10072582 -13420 272894 -1743582 -3444153 -10521163 -23859051 -35412718
2690 -35412718 -39167091 -36790607 -30643657 -19893394 -6255389 3971037 7261077 6907510
2682 6907510 6999587 7228282 6056649 4235659 2538737 619942 1074073 9774599 27456186
2673 27456186 44137732 47466974 36152685 21031731 12412154 9623737 4528837 -6777232
2665 -6777232 -18584586 -22772275 -19760352 -18969875 -26716901 -36665797 -36862488 -25606827
2657 -25606827 -14801594 -15394782 -24082722 -28269047 -21214978 -8057038 1302214 1118528
2649 1118528 -6761417 -13650480 -9203735 8571603 27990960 33704373 23222325 8096765
2641 8096765 -2619844 -12600579 -27548366 -41896935 -44990061 -36661645 -26850181 -20711594
2633b0711594O290907O810627j482538j4140980j4632391K534933K1423009K2988800
2625I080773O932615j0225023j4238933n015228P503106J3643610J0490390K207644
2617B0378954m446978n978864m305936l367907m327068m684250k069231J669963
2609g131317J652135l384071p282187l029411P123578J2918175Q706064l37053
2601I235913o620047q652020p805436l585242K344702M151292P06422m29708L937491
2592f716633L854447p638040j7574706r158951R838617J5353698M099823n30813
2584h472558J3211041K3989178R605570j7004490k4656916o901557J3076579J6847518
2576A9694365R989164N322038M433602K452402j107767m287587p834539j1496093
$$ plain form
2633 -20711594 -14420687 -7610060 -9092598 -23233578 -37865969 -35331036 -13908027 9080773
2625 9080773 16013388 5788365 -8450568 -13465796 -5962690 7680920 18171310 20378954
2617 20378954 15931976 9953112 5647176 2279269 -2047799 -6732049 -8801280 -7131317
2609 -7131317 -5479182 -8863253 -16145440 -19174851 -12051273 866902 9572966 9235913
2601 9235913 2615866 -6036154 -13841590 -17426832 -15082130 -10930838 -10224416 -10654124 -6716633
2592 -6716633 -2862186 -10500226 -28074932 -37233883 -27395266 -12041568 -7941745 -8472558
2584 -8472558 4738483 28727661 38333231 21328741 -3328175 -10229732 2846847 19694365
2576 19694365 29683529 35005567 39439169 41891571 40783804 36496217 28661678 17165585
2568A7165585j0631943l152849L913469J907676o543236r186718p80839Q116582
2560H07727M716913p175973j0636146J208395J4892782J4608258K135634r056034
2552A1501556j2273443r852338l267393N997212R873200K539612o577668m205216
2544f264478M041459M52792j4682909k0337641o600468J1327224J8004621J5790086
2536A730686R187587o101219k5176665k7424716n949474J5731757J5352322K048200
2528b0601522m399375m358205n795433k321308Q679287P673056j3797784k3853244
2520e8774528K247219K4983512j0727385p5859955p5422279J6460195J05365005
2513g1728216R8284873K3262619k3354875r638800J3954709R540436j981497M567383
$$ plain form
2568 17165585 6533642 3380793 7294262 9201938 2658702 -6528016 -7308855 807727
2560 807727 5524640 -1651333 -12287479 -11079084 3813698 18421956 20557590 11501556
2552 11501556 -771887 -10624225 -13891618 -7894406 1978794 4518406 -2059262 -6264478
2544 -6264478 -2223019 -1770227 -16453136 -36790777 -43391245 -32064021 -14059400 1730686
2536 1730686 10918273 4817054 -20359611 -47784327 -53733801 -38002044 -22649722 -20601522
2528 -20601522 -25000897 -29359102 -35154535 -37475843 -28796556 -21123500 -34921284 -58774528
2520 -58774528 -56527309 -31543797 -42271182 -118131137 -193553416 -177093221 -71728216
2513 -71728216 26556657 49819276 26464401 16825601 30780310 40320746 38339249 42906632
2505D2906632J4080711M640959j2026931j2142550M1145J118594j3134498k2636453
2497B847609j4759188j684765j17582o636912m429416R973770J9499270J0188166
2489A4880952q109921j4804749o471185J672982M82074k418133K25051L102175
2481a1440754J160909J034701Q608686J5620033J1142958p73949p162651m819751
2473A3370182j414078j394104k003327k124067n117606j1465389j5110618r417914
2465c4676921M946041J7849301J6844523J126418j3319759j0717436L301846Q895462
2457e750525O99530o020827j924769J678690n350203j2261084m486250J2264342
2449b1151096K1237803J8354457J0768115M67499j3311132k1720567j4575119
$$ plain form
2505 42906632 56987343 61628302 49601371 37458821 37499966 38618560 25484062 2847609
2497 2847609 -11911579 -13596344 -13713926 -20350838 -24780254 -14806484 4692786 14880952
2489 14880952 6771031 -8033718 -14504903 -12831921 -12349847 -14767980 -14542929 -11440754
2481 -11440754 -10279845 -9245144 -636458 14983575 26126533 25352584 18189933 13370182
2473 13370182 11956104 10562000 8558673 6434606 1317000 -10148389 -25259007 -34676921
2465 -34676921 -29730880 -11881579 4962944 6089362 -7230397 -17947833 -14645987 -5750525
2457 -5750525 -5050995 -11071822 -12996591 -11317901 -16668104 -28929188 -33415438 -21151096
2449 -21151096 86707 18441164 29209279 29676778 16365646 -5354921 -19930040
2442a9930040J762563J0655805P366409O85269m676318j1732151j8320154j6075877
2434e0264494m177668Q017692J3426569J2459881O764815j729694o738813l180667
2426b5422379M203805P105512N731413M955786L025147l968156j0633425q589393
2418b3591690q49520L437042M769406R176495J2241898M423431r140253j1919791
2410a1452982l71713J1085036J1341483L963422m083954j0114614j0576030l007118
2402a3216470N187541L937796l259101n000807k346681n778578j2897883j0042845
2394d3417028K531169R517975P834027J0716544J8696796J3348160q506197k0900579
2386a0179133o446822J5091608J6814243L704100k164850L25803m553045j5927461
$$ plain form
2442 -19930040 -18167477 -7511672 -145263 540006 -4136312 -15868463 -34188617 -50264494
2434 -50264494 -54442162 -46424470 -32997901 -20538020 -13773205 -15502899 -22241712 -25422379
2426 -25422379 -21218574 -14113062 -8381649 -3425863 -400716 -4368872 -15002297 -23591690
2418 -23591690 -24441210 -21004168 -16234762 -7058267 5183631 9607062 466809 -11452982
2410 -11452982 -11824695 -739659 10601824 14565246 10481292 366678 -10209352 -13216470
2402 -13216470 -8028929 -4091133 -7350234 -12351041 -14697722 -20476300 -33374183 -43417028
2394 -43417028 -40885859 -31367884 -23533857 -12817313 5879483 19227643 10721446 -10179133
2386 -10179133 -16625955 -1534347 15279896 18983996 16819146 17144949 12591904 -3335557
2378c335557j4807135M036733K1183516J8124175j453447j9723828k3060912j0183860
2370b9220315Q835808J9507451J4703047K78010j3072629j9260743j5784531k070669
2362c6084571J4699699K0716625J1336689r72654k733912L628258P612639P400360
2354B5603133P909285Q492484M481349k697253p378097q872304j0092494j0141741
2346G304362o479633j451335P19884M92900N84880Q41402N58519Q74405N40206
2337C985590l835949r047740n899002N729141J2689407O898511k527786l973293
2329D018879L56004K194961P03999j894064p370609j3551241j0656032K978144
2321b3219959J3401629J1358746O804260R497730J0358571k64177j0843183o851414
$$ plain form
2378 -3335557 -18142692 -14105959 7077557 25201732 23748285 4024457 -19036455 -29220315
2370 -29220315 -20384507 -877056 13825991 14104001 1031372 -18229371 -34013902 -36084571
2362 -36084571 -21384872 -668247 10668442 9695788 6961876 10590134 18202773 25603133
2354 25603133 33512418 42004902 46486251 43788998 36410901 27538597 17446103 7304362
2346 7304362 824729 -626606 93278 586178 1171058 2012460 2570979 3445384 3985590
2337 3985590 149641 -8898099 -14797101 -9067960 3621447 10519958 7992172 4018879
2329 4018879 4374883 6569844 7273843 5379779 -1990830 -15542071 -26198103 -23219959
2321 -23219959 -9818330 1540416 8344676 17842406 28200977 27936800 17093617 10242203
2313A0242203K331492r13056j0629746q038157L817036N264834m126503m925537
2305f977434O610994J1836444K710976o116406m840339k324794m045530o33584
2297c779673J1023845J7341556J0488608J840673J346096J560433n552095j2449999
2289B1819444r690999k241669j29487l732978p664710r173099o310558J477950
2281a5646106P327662M270168l66633N373072J3921872O290317j3017648j6864585
2273h711881M82308J0360512m172125j9278737r517791J0913205J3969235K918618
2265c036656K96137O776390N231062l985239m373306M610936O861189l18969l078592
2256H982952J672046J962695m150012m218319L792451N858673k968997r311136
$$ plain form
2313 10242203 12573695 11660639 1030893 -7007264 -3190228 2074606 -2051897 -6977434
2305 -6977434 -366440 11470004 14180980 8064574 3224235 899441 -3146089 -3779673
2297 -3779673 7244172 24585728 35074336 36915009 38261105 39821538 34269443 21819444
2289 21819444 12128445 9886776 9757289 6024311 -1640399 -10813498 -17124056 -15646106
2281 -15646106 -8318444 -4048276 -4414909 958163 14880035 21170352 8152704 -8711881
2273 -8711881 -8229573 2130939 -2041186 -21319923 -30837714 -19924509 -5955274 -3036656
2265 -3036656 -2740519 4035871 9266933 5281694 908388 5519324 12380513 12061544 8982952
2256 8982952 10654998 12617693 8467681 4249362 8041813 13900486 10931489 1620353
2248A620353m564113K239032K507175J059034K600980J998996k578471k057693
2240B825293P597270J4935245R378516k541323p599168l961104L68438K9968m756453
2231A6276682j1568326j5522639j1462756j672475M518983K855063r20676j564844
2223a9060988j362109k518559j755200J930575L063753l27396j331152L893260
2215a7467816P602080L039566k465335J732885J1382795J2481924K252866p338479
2207A1220486p529803k964442j059644j180045M3701L19284l648343p538545m196424
2198a6533775L914761N828692j917771q569724m355174M302475M207036l843775
2190a6967255o054755K151572Q384970K993643n875135n836854J339869N944209
$$ plain form
2248 1620353 -2943760 -704728 1802447 2861481 5462461 7461457 4882986 2825293
2240 2825293 10422563 25357808 34736324 32195001 24595833 20634729 21003167 21033135 16276682
2231 16276682 4708356 -10814283 -22277039 -23949514 -19430531 -16575468 -17496144 -19060988
2223 -19060988 -20423097 -22941656 -24696856 -22766281 -19702528 -20029924 -21361076 -17467816
2215 -17467816 -9865736 -6826170 -9291505 -7558620 3824175 16306099 18558965 11220486
2207 11220486 3690683 726241 -333403 -1513448 -1469747 -1150463 -4798806 -12337351 -16533775
2198 -16533775 -12619014 -6790322 -8708093 -17277817 -21632991 -17330516 -13123480 -16967255
2190 -16967255 -23022010 -20870438 -12485468 -9491825 -15366960 -21203814 -19863945 -13919736
2182a3919736O524124P185987N528104k199544q636826m095866M493498P95904
2174d324355j3868190j8600234l067441J6755376K1022283J0608511k2821l173425
2166E329704j008696K675592L699143k546814j3313699j6828073o981101N935850
2158b3038094P563757k364015j2113905j3608187q144845l71741N966937R031998
2150c7078095J1065053J5815248K0007235J4423961j018560j2256949r655024
2143A302869k532472l758639q429386l178731R024237J1826499K563787k497332
2135D320832N426339J3157475O766601o271702q777395M77015O389224L03159
2127B1791548q776775q104658J623992P968784K618560r266926j6561494j5463960
$$ plain form
2182 -13919736 -7395612 -209625 5318479 3118935 -5517891 -9613757 -5120259 -4324355
2174 -4324355 -18192545 -36792779 -39860220 -23104844 -2082561 8525950 8503129 5329704
2166 5329704 4321008 6996600 10695743 8148929 -5164770 -21992843 -28973944 -23038094
2158 -23038094 -15474337 -17838352 -29952257 -43560444 -51705289 -52077030 -46110093 -37078095
2150 -37078095 -26013042 -10197794 9809441 24233402 23214842 10957893 1302869
2143 1302869 -1229603 -4988242 -13417628 -16596359 -7572122 4254377 6818164 4320832
2135 4320832 9747171 22904646 29671247 23399545 14622150 15099165 21488389 21791548
2127 21791548 13014773 4910115 6534107 14502891 17121451 7854525 -8706969 -24170929
2119b4170929j0872442n683578L566175J6655513K3332805J5830931K486266k388371
2111A8756370O22021j334087j0092400j1951621j567924N908876k234875j4402191
2103a6295831j1282457M068822J0551337N86646j0270396p547263L625325R889448
2095a6674369P605526K373217o50317N36525M802164N695530l146267j5680019
2087a5138010j5891176O08461J7153352J7545371P552968K671401L152436k113089
2079A5541714j1895580j2626110k782121K457303l583944p746243m43228O553181
2071a4525028j81422j1576806r038406O521191J6513626J1863795J607144m712423
2063c528329p254820o947293j292402O746497Q360364K477949j249298J929417
$$ plain form
2119 -24170929 -35043371 -40726949 -37160774 -20505261 2827544 18658475 21144741 18756370
2111 18756370 19378391 18044304 7951904 -3999717 -5567641 341235 -1893640 -16295831
2103 -16295831 -27578288 -23509466 -12958129 -12371483 -22641879 -30189142 -26563817 -16674369
2095 -16674369 -9068843 -6695626 -7345943 -6809418 -2007254 3688276 542009 -15138010
2087 -15138010 -31029186 -30420725 -13267373 4277998 11830966 14502367 17654803 15541714
2079 15541714 3646134 -8979976 -11762097 -9304794 -12888738 -20634981 -21078209 -14525028
2071 -14525028 -14706450 -26283256 -35321662 -28800471 -12286845 -423050 1184094 -3528329
2063 -3528329 -10783149 -17730442 -19022844 -12276347 -3915983 -1438034 -2687332 -757915
2055g57915M307045K40027k642087L857736J2876991J0854401k577511j3566503
2047A2592184j2160042l155668K462013J263677k80246M310911J1373405R951959
2039B6358193k712679j3124111p083286R017456J4533507L763067n777145j072380
2031B3902622N713810k075685j6432314j5630388J198028J1837417M940868l981395
2023I472963J643085J4247534J5238637K516491r064292r509649l162448K154442
2015B3536763M326156L703809o60646p880466j3549822j4562669j2464493r592202
2007b7143570m717065M369590J5182127K0588634J5638784L429414p019998r324512
1999A1003404n734995l455947n037414m864299K536270J2362659J2449587j481297
$$ plain form
2055 -757915 3549130 3789157 1147070 5004806 17881797 28736198 26158687 12592184
2047 12592184 432142 -2723526 -261513 1002164 721918 5032829 16406234 26358193
2039 26358193 23645514 10521403 3438117 12455573 26989080 30752147 24975002 23902622
2031 23902622 29616432 27540747 11108433 -4521955 -3323927 8513490 13454358 9472963
2023 9472963 11116048 25363582 40602219 43118710 34054418 24544769 21382321 23536763
2015 23536763 27862919 31566728 30906082 23025616 9475794 -5086875 -17551368 -27143570
2007 -27143570 -31860635 -27491045 -12308918 8279716 23918500 27347914 20327916 11003404
1999 11003404 5268409 1812462 -3224952 -8089251 -5552981 6809678 19259265 17777968
1991A7777968j7164600j7839711k964093R109864L034709j3327453j7591694r79583
1983c9944593K0151198K4167751R115407q046984j2840899o242255K215296N896367
1975e528712L676905j897950n125052r16075P568978R649906J106023o647638
1967A886385L58420J7614316K4052207Q384223j4935616k2900033j1461688K716582
1959E714796N072224k299075r518243j2202651j1047080n846714K742369R452802
1951a7931572R248267M141835J04448p27341K6178J852260M009171K172784n706650
1942b810620j1806947o117204P604435J3601871N267067n101044l931391M226736
1934I32903L838215r525306k3465753k4225607j0585208Q020271K1170830K3738036
$$ plain form
1991 17777968 613368 -17226343 -20190436 -11080572 -8045863 -21373316 -38965010 -39944593
1983 -39944593 -19793395 4374356 13489763 5442779 -7398120 -13640375 -11425079 -5528712
1975 -5528712 -1851807 -3749757 -8874809 -9790884 -2221906 7428000 8534023 1886385
1967 1886385 2244805 19859121 43911328 52295551 37359935 14459902 2998214 5714796
1959 5714796 10787020 8487945 -1030298 -13232949 -24280029 -30126743 -27384374 -17931572
1951 -17931572 -8683305 -4541470 -4437022 -5164363 -5138185 -3285925 723246 2896030 -2810620
1942 -2810620 -14617567 -20734771 -13130336 471535 5738602 637558 -3293833 932903
1934 932903 4771118 -4754188 -28219941 -52445548 -63030756 -55010485 -33839655 -10101619
1926a0101619J7163660P289130m79970m803895o887009o772862l269866L086490
1918d775941R072121J0958993P203704R7004m765487k772290M458135R753357
1910B9229596P753038L51468n981986o719335k708946R18404q29294p235452j1399489
1901C378004q428141k513519q41729k303745j88385M215055J369809r731410j5507489
1892c0551550n832306J0552734J7448705J1181343J33186r118733j4355825j1552785
1884c2095231J058006J4371062J5776715N789399k640470k132224J477007J000693
1876B604957j912944j785703K268598O163403M935557k693413j0138624p078113
1868g636282N881041J2541918J751567j3093136j0469213O777602J4742872N128743
$$ plain form
1926 -10101619 7062041 14351171 13871201 9067306 2180297 -4592565 -7862431 -4775941
1918 -4775941 4296180 15255173 22458877 22555881 17790394 15018104 19476239 29229596
1910 29229596 36982634 37334102 31352116 24632781 21923835 22842239 22012945 14777493 3378004
1901 3378004 -5050137 -7563656 -8405385 -10709130 -10897515 -6682460 -5312651 -15044061 -30551550
1892 -30551550 -36383856 -25831122 -8382417 2798926 2932112 -6186621 -20542446 -32095231
1884 -32095231 -31037225 -16666163 -889448 4899951 2259481 127257 1604264 2604957
1876 2604957 692013 -1093690 1174908 7338311 12273868 9580455 -558169 -7636282
1868 -7636282 -1755241 10786677 12538244 -554892 -11024105 -4246503 10496369 15625112
1860A5625112l646373J118582N864683l352047j4967472j1916234j703342k415193
1852a5392284r213847j998566J7273584K3201906O597791j0618235r742594j569141
1844a461386m019558j2538601j1526464k105709K283825Q39442N166444J5810942
1836g551065J8457516P014456n487133n577506K935327P210725K746174m403727
1828A5344767o741090j384183P799504J0713459J46847j6383819k1874530j1167116
1820b3546161K140608N831027N029170Q499710J0400858R61323j2123505j1478015
1812a4284985K696907J1451175N256482l933941m021604M31j104399m041907k52965
1803h234806Q756068J3651718R535232r69046j1494535j4282651o004366M979398
$$ plain form
1860 15625112 11978739 13097321 18962004 15609957 642485 -11273749 -12977091 -15392284
1852 -15392284 -24606131 -26604697 -9331113 13870793 20468584 9850349 107755 -1461386
1844 -1461386 -5480944 -18019545 -29546009 -31651718 -29367893 -28528451 -23362007 -7551065
1836 -7551065 10906451 17920907 12433774 6856268 9791595 17002320 19748494 15344767
1828 15344767 8603677 7219494 15018998 25732457 25879304 9495485 -12379045 -23546161
1820 -23546161 -21405553 -15574526 -10545356 -2045646 8355212 9316535 -2806970 -14284985
1812 -14284985 -11588078 -136903 5119579 1185638 -2835966 -2835535 -3939934 -7981841 -8234806
1803 -8234806 521262 14172980 23708212 22739166 11244631 -3038020 -9042386 -4062988
1795d062988O358911J91050Q53871R831524R354090q373088k3233214j5265020
1787b4344864M083573R711255Q37928k766873M054064O684088J94703j869514
1779c415640O416091J1200131K325379r284818r155592o34902K691865l259811
1771c117297j0598504j0885809k743028P488465J0071571J925372p839515q754619
1763b4453364k450151L464576R495823J8560407K1357042O518574j5619897k0544755
1755c671745m146923J0957917R294584J507293P93793J683889m163015q980641
1747C275152k167035R938438J2753511L425289r246490j6696101j3994726r98395
1739a3710357J2581089J3722736L521768l969952m112580o553078j3028654j0814121
$$ plain form
1795 -4062988 2295923 2486973 3340844 13172368 22526458 14153370 -9079844 -24344864
1787 -24344864 -20261291 -10550036 -9712108 -12478981 -8424917 -1740829 -1546126 -3415640
1779 -3415640 3000451 14200582 16525961 7241143 -1914449 -2549351 142514 -3117297
1771 -3117297 -13715801 -24601610 -27344638 -19856173 -9784602 -7859230 -15698745 -24453364
1763 -24453364 -26903515 -23438939 -13943116 4617291 25974333 32492907 16873010 -3671745
1755 -3671745 -7818668 3139249 12433833 13941126 14734919 16418808 12255793 3275152
1747 3275152 1108117 11046555 23800066 27225355 17978865 1282764 -12711962 -13710357
1739 -13710357 -1129268 12593468 16115236 12145284 8032704 1479626 -11549028 -22363149
1731b2363149L052858J2468389Q526712L492113N925925N151708m318664p669194
1723D266698K292042P400711l768970j1938405j022953J0256258J554869r609469
1715e69219J621338J9438375J1901155j2925854j9899781n013260M242570O9661
1707a135015J038155J0482596J1914624N297512N883976Q315708m972727k2005793
1699A4819036j4840560O942045P661058j0024630r333614R807933R133352j1242750
1691B921870q104273J7609257J4166447j0515969K9001808J42258167J90011929
1684C77349236O4496594j28890196j90913211r1155757J4366371J6515829k6417711
1677C5351155k4538072Q512946J5333749K42407J624624J4482901Q628371r969988
$$ plain form
1731 -22363149 -19310291 -6841902 1684810 5176923 11102848 16254556 11935892 4266698
1723 4266698 6558740 13959451 10190481 -1747924 -2770877 7485381 9040250 -569219
1715 -569219 1052119 20490494 32391649 19465795 -433986 -5447246 -1204676 -1135015
1707 -1135015 -96860 10385736 22300360 27597872 33481848 41797556 36824829 14819036
1699 14819036 -21524 6920521 14581579 4556949 -4776665 5031268 14164620 2921870
1691 2921870 -5182403 12426854 26593301 16077332 45079140 187337307 377349236
1684 377349236 441845830 312955634 122042423 30886666 45253037 61768866 35351155
1677 35351155 10813083 19326029 34659778 34902185 36526809 51009710 59638081 49668093
1669D9668093j3268378l359678k938989j1482372j1795252n392622n480342p973888
1661a2023428j786653M912813p11519p956354M92453J4600438J1229111n662736
1653C094125j0218166L699017J5153249J0160068k461531j0681597j2606122q462736
1645a2323693J468393R608975Q720020O110061J3206215K2978093J7108950m345815
1637F2531199k0296457j8151508p606399j356386J15195o35416n326548j0879938
1629a606258p903065L767422J1014936P012942K473661P904125J5759280J2074715
1621E0497758j676883j0763077p882957q65163J54917n107386r857571r892288
1613D607350p081872m700478k454115J653314N670654M637958r38270l092898
$$ plain form
1669 49668093 36399715 33040037 30101048 18618676 6823424 1430802 -4049540 -12023428
1661 -12023428 -13810081 -8897268 -9608787 -17565141 -17072688 -2472250 8756861 3094125
1653 3094125 -7124041 -3425024 11728225 21888293 19426762 8745165 -3860957 -12323693
1645 -12323693 -10855300 -1246325 7473695 13583756 26789971 49768064 66877014 62531199
1637 62531199 42234742 24083234 16476835 15120449 15235644 14600228 9273680 -1606258
1629 -1606258 -9509323 -5741901 5273035 12285977 14759638 22663763 38423043 50497758
1621 50497758 48820875 38057798 30174841 29309678 29464595 24357209 14499638 4607350
1613 4607350 -2474522 -7175000 -9629115 -7975801 -2305147 2332811 1394541 -1698357
1605a698357K251741P112833K069055q755022j2629530o240739J545017M895615
1597a1449387P688327J2155532J1999700L294303n996953n437077L442260R079577
1589B4776282M117839p218414j4628184j1635793j508031N433921K907216l077417
1581h32581j869319N989977Q349717m31137r638670o924348L865429Q148002K85143
1572F942213j0637828j3513887o569106L894395J0267817Q741315K156582k010780
1564g29279K58849M561640M350722l89014n130567q234789j0199683q430086r37474
1555b4879681O227210M738251k382426l104533N215227J0559133M590417m128074
1547c164476l598168L458552N616139J146067j573509O19223J988132k51474j447473
$$ plain form
1605 -1698357 553384 7666217 9735272 980250 -11649280 -17890019 -16345002 -11449387
1597 -11449387 -3761060 8394472 20394172 23688475 17691522 12254445 15696705 24776282
1589 24776282 28894121 21675707 7047523 -4588270 -6096301 -662380 2244836 -832581
1581 -832581 -2701900 3288077 11637794 11206657 1567987 -5356361 -1490932 6657070 6942213
1572 6942213 -3695615 -17209502 -23778608 -19884213 -9616396 -875081 1281501 -729279
1564 -729279 -470430 4091210 8441932 8052918 2922351 -5312438 -15512121 -23942207 -24879681
1555 -24879681 -18652471 -13914220 -16296646 -19401179 -14185952 -3626819 963598 -3164476
1547 -3164476 -6762644 -3304092 2312047 3458114 1884605 2503828 4491960 4240486 2793013
1538B793013Q74187K448326N45226j532411j749262l163880o344495n938387k46902
1529a2314585L328722m79946m496417J207065J3308922J8252646J0001329l494547
1521B5313189j1888866j3198434j1199908q108264l493629K206701O237758N996677
1513h134776K573292M77591J575491P69999o874737j4802458r440074R860151
1505b3995521K4274879J7135367m440578j9195105j7793728q074738J625485J0284864
1497b0179075J5448965J1350792M45252m961488Q28272P841920M763148m924577
1489A0613209q651205j877031P417293R001717M79392j1190011j5719202r197266
1481a9123104J400934O478421N541061N040705O040130L143843l540891o119814
$$ plain form
1538 2793013 3667200 6115526 6660752 5128341 3379079 215199 -6129296 -12067683 -12314585
1529 -12314585 -8985863 -9465809 -13962226 -12755161 553761 18806407 28807736 25313189
1521 25313189 13424323 225889 -10974019 -19082283 -22575912 -20369211 -14131453 -8134776
1513 -8134776 -5561484 -5083893 -3508402 -2738403 -9613140 -24415598 -33855672 -23995521
1505 -23995521 279358 17414725 12974147 -6220958 -24014686 -32089424 -30463939 -20179075
1497 -20179075 -4730110 6620682 7065934 2104446 2932718 10774638 15537786 10613209
1489 10613209 1962004 84973 7502266 16503983 16983375 5793364 -9925838 -19123104
1481 -19123104 -17722170 -11243749 -5702688 -661983 5378147 8521990 4981099 -1138715
1473a138715k087525Q32191j734851l037257J830501N558758P67520o370605n762831
1464a1142814L98469K918531J498057K650320N563145L540457j663830k06129
1456C556206R515781J6264416J1211027o48178p850681n440621J521141L332938
1448C1462029n092139j6538835j6520807j843594J1385980P915690l987325m083885
1440B697114Q348280J2282306k734837j9755633j8793092l704766P213662P045899
1432g401067L239904J403999J6711j025832J082067M272236K078730n871154j1073177
1423a3277583o555887M818215J4343545J5802902Q679520k566240j0220561p983444
1415C040467K540131J1416565R609966j245229j0647429j1436262p414071o348103
$$ plain form
1473 -1138715 -3226240 -2394049 -4128900 -7166157 -5335656 223102 990622 -5379983 -11142814
1464 -11142814 -10744345 -7825814 -6327757 -3677437 1885708 5426165 3762335 3556206
1456 3556206 13071987 29336403 40547430 39899252 32048571 26607950 28129091 31462029
1448 31462029 26369890 9831055 -6689752 -8533346 2852634 10768324 6780999 2697114
1440 2697114 11045394 23327700 20592863 837230 -17955862 -21660628 -14446966 -7401067
1432 -7401067 -4161163 -2757164 -2740453 -3766285 -2684218 1588018 3666748 -2204406 -13277583
1423 -13277583 -19833470 -15015255 -671710 15131192 23810712 21244472 11023911 3040467
1415 3040467 5580598 16997163 26607129 25361900 14714471 3278209 -4135862 -10483965
1407a0483965q150679n688833K722185Q902130O371704k90658l364810l146810
1399a3129736l354655j125830P311830J4529190R102492n156038j1725100o019550
1391i567397j955613p239563q624738N044849J8942134J0981766j2161167j9771381
1383b4351110N7758K2132062J8060500o041495j9744926q986918Q793440J0960841
1375H80152j603200r474944j985323J0367984J1656834R35499q519941o952855
1367d695794J324898N416837J008732n918013o298646J931423J0196046P901623
1359A0867106l308460q889330n97958R689862O088097n884277o118476P456830
1351I303394J2628880k969247k0558896j7569094n84416Q161327N375903M805786
$$ plain form
1407 -10483965 -18634644 -24323477 -21601292 -12699162 -6327458 -6618116 -9982926 -13129736
1399 -13129736 -16484391 -17610221 -10298391 4230799 13333291 8177253 -3547847 -9567397
1391 -9567397 -11523010 -18762573 -27387311 -22342462 -3400328 7581438 -4579729 -24351110
1383 -24351110 -24293352 -2161290 15899210 9857715 -9887211 -18874129 -10080689 880152
1375 880152 -723048 -10197992 -12183315 -1815331 9841503 10777002 2257061 -4695794
1367 -4695794 -3370896 2045941 3054673 -2863340 -9161986 -7230563 2965483 10867106
1359 10867106 7558646 -1330684 -1928642 7761220 13849317 7965040 1846564 9303394
1351 9303394 21932274 18963027 -1595869 -19164963 -19749379 -11588052 -6212149 -1406363
1343a406363P767507J908357j0505402r805900Q088442J9782424Q499828r495230
1335A4833663r210435O948348J5924226P570697o825576j4518017j3033239m291520
1327b601853P715616J3568282O122610p443977j2508386o123627J764154N579511
1319F072330R355745J3284939R518319l234711j3492900j2706377o821924m588138
1311b612717m200220p10906K099395j578463p205087n753037J920278P387336
1303a0653421Q292645Q695707Q131252K441528m897108m930649J370804K249496
1295A0700254o219260j2506614p141470K648699M456743j371036n069548k872932
1287a7375164P75470K529500K361613n96830n558553o155449J524377R166458
$$ plain form
1343 -1406363 6361144 8269501 -2235901 -12041801 -3953359 15829065 24328893 14833663
1335 14833663 5623228 12571576 28495802 36066499 29240923 14722906 1689667 -2601853
1327 -2601853 5113763 18682045 24804655 17360678 4852292 -1271335 492819 6072330
1319 6072330 15428075 28713014 38231333 34996622 21503722 8797345 1975421 -2612717
1311 -2612717 -6812937 -7523843 -5424448 -7002911 -14207998 -19961035 -18040757 -10653421
1303 -10653421 -2360776 6334931 14466183 16907711 12010603 7079954 8450758 10700254
1295 10700254 4480994 -8025620 -15167090 -12518391 -8061648 -9432684 -14502232 -17375164
1287 -17375164 -16599694 -14070194 -11708581 -12305411 -17863964 -24019413 -22495036 -13328578
1279a3328578N236948o734462j0472762L51368J2937565J3303285L494683n185503
1271c97456p462213m902687J641110J1109859J7400260J4263159M249176l545680
1263C2355528m107984k26615K744248R90354o784407j6728857j9829887j1169508
1255b2757128J205765L750101m964482j1063360l258114J1803483J7644164Q566915
1247I27344l925063n766689L343236J1166188Q291936j698880q242325o554276
1239b458529j189304J485816k813l425152o439866p100424m255407M8003J292227
1230b2045449j898261n324533m689246q29448K892266N220736N966051L705938
1222a7001946j438262n602010o148193o096044q562764r403064j856312J2290172
$$ plain form
1279 -13328578 -8091630 -14826092 -25298854 -24947486 -12009921 1293364 4788047 -397456
1271 -397456 -7859669 -12762356 -11121246 -11387 17388873 31652032 35901208 32355528
1263 32355528 28247544 28020929 30765177 31755531 24971124 8242267 -11587620 -22757128
1255 -22757128 -21551363 -17801262 -22765744 -33829104 -37087218 -25283735 -7639571 927344
1247 927344 -2997719 -8764408 -5421172 5745016 14036952 12338072 4095747 -2458529
1239 -2458529 -3647833 -2162017 -2164830 -5589982 -12029848 -19130272 -23385679 -23337676 -22045449
1230 -22045449 -23943710 -29268243 -33957489 -34786937 -31894671 -26673935 -20707884 -17001946
1222 -17001946 -18440208 -24042218 -30190411 -36286455 -44849219 -54252283 -56108595 -43818423
1214d3818423K2487362K1102993J0664888o14895n924979k838597N209122R661540
1206A5929011M214479p088766j3118553p822876M351718J4512187J6070128O734346
1198C3781674r209462k0195900j6610989k846815O804892O248221L424362N100287
1190F496270N976451m0221o874905n287576J039196P64632o130155p601595P54824
1181a0903079P720959L814128l488263j153979Q610195J0178117k966158j7492660
1173e680740j6952700l160493O663656K692868n549373l432365Q641228J6667617
1165a10302J2753304M619311K411782L700243q12172j0330236j2614179j626559
1157b008808J1766930J3071657L470622k607723J500329N788406J75954q555135
$$ plain form
1214 -43818423 -21331061 -228068 10436820 9821925 3896946 1058349 6267471 15929011
1206 15929011 20143490 13054724 -63829 -7886705 -3534987 10977200 27047328 33781674
1198 33781674 24572212 4376312 -12234677 -15081492 -8276600 -2028379 1395983 6496270
1190 6496270 12472721 12432500 5557595 270019 1309215 2073847 -4056308 -11657903 -10903079
1181 -10903079 -3182120 632008 -2856255 -4010234 4599961 14778078 11811920 -5680740
1173 -5680740 -22633440 -25793933 -19130277 -16437409 -21986782 -25419147 -16777919 -110302
1165 -110302 12643002 17262313 19674095 23374338 22562166 12231930 -382249 -2008808
1157 -2008808 9758122 22829779 26300401 23692678 25193007 30981413 31157367 22602232
1149B2602232o539702M373602O953294n703508j7826816j2844887K539243Q879577
1141B433035K557628j852248K834547N206763m210823j5142044j1703076L563347
1133a6312871J2380230N264737p279883r686821K9158J0258698J0839229L893553
1125I386030j236847j448998l126852r396543j0823679J756842J8455283J8297990
1117B1863226j374421j7986322j3907873k2827L093210l997747m667906M626856
1109a2373804J0115309N280614M85059L101038M811825k212381r687496n679986
1101f159822N698765R569827J595148o940573n082283N084738J3218612J2632370
1093B9616782N231590k314280n078839l157406K64611K457553J715634l223114
$$ plain form
1149 22602232 16062530 20436132 27389426 21685918 3859102 -8985785 -6446542 2433035
1141 2433035 4990663 3138415 5972962 11179725 6968902 -8173142 -19876218 -16312871
1133 -16312871 -3932641 1332096 -5947787 -15634608 -15605450 -5346752 5492477 9386030
1125 9386030 8149183 6700185 3573333 -5823210 -16646889 -14890047 3565236 21863226
1117 21863226 20488805 2502483 -11405390 -11428217 -8335007 -12332754 -17000660 -12373804
1109 -12373804 -2258495 3022119 3507178 6608216 11420041 9207660 -479836 -6159822
1101 -6159822 -461057 9108770 10703918 3763345 -1318938 3765800 16984412 29616782
1093 29616782 34848372 32534092 27455253 24297847 24562458 27020011 28735645 25512531
1085B5512531j0661790j4157598q252252L632358J1593301J0199029K783846n023241
1077A5626184j0320975j1047617o111422K91793J110299l733909o187057j897479
1069b2270183L638131M730380L723642L879731J743420n223747r747687l712548
1061b3238861P641964J1153383M120405k986820k761589J96255l99259k052880
1053h327402P68313N793570M925514l587514j0209701m571526R988162J6763194
1045A1542610M939374j3931304j7037474M55324J7173059J2756121o051716j6806982
1037f960988j1452440j304161M066370P094283J0549094J0636835O140413K119665
1029B0889071j57810n281423j1165788p799521M509616R707098n52852j1126057
$$ plain form
1085 25512531 14850741 693143 -7559109 -3926751 7666550 17865579 20649425 15626184
1077 15626184 5305209 -5742408 -11853830 -11562037 -10451738 -14185647 -20372704 -22270183
1069 -22270183 -18632052 -13901672 -10178030 -6298299 -4554879 -9778626 -19526313 -23238861
1061 -23238861 -15596897 -4443514 -323109 -3309929 -6071518 -5875263 -6274522 -8327402
1053 -8327402 -7559089 -1765519 3159995 -427519 -10637220 -15208746 -5220584 11542610
1045 11542610 16481984 2550680 -14486794 -14031470 3141589 15897710 9845994 -6960988
1037 -6960988 -18413428 -19717589 -15651219 -8556936 1992158 12628993 18769406 20889071
1029 20889071 20731261 15449838 4284050 -3515471 994145 10701243 10148391 -977666
1021i77666n317691Q287159Q671562m873004j2714006n726250L520294L152528
1013e977074k215691l919966k107382J227971Q350961J6284747J3941440p42671
1005B4842335j2094026p387584L454543L003551o685783q906721K16651P324782
997C767748N149614K244845M784217N166545k575545r744790o924325o33374k630862
988a395927r338593o729325O566119J5613535J0783097N60504k558423P29804
980A4230791J119986l691355o851413l972530P66677J487297j605299l958726
972b474572l118910k25017L481118P757462J0415745P534338p0388m044092J743634
963B0999318J0039711P186257o912394j5498108p739117M567645L876559o518582
$$ plain form
1021 -977666 -6295357 1991802 10663364 5790360 -6923646 -12649896 -9129602 -5977074
1013 -5977074 -8192765 -12112731 -14220113 -12992142 -4641181 11643566 25585006 24842335
1005 24842335 12748309 5360725 8815268 11818819 5133036 -3773685 -3557034 3767748
997 3767748 8917362 11162207 15946424 21112969 18537424 8792634 1868309 1234935 -1395927
988 -1395927 -10734520 -17463845 -10897726 4715809 15498906 16059410 13500987 14230791
980 14230791 15350777 11659422 4808009 835479 1602156 3089453 1484154 -2474572
972 -2474572 -5593482 -5818499 -2337381 5420081 15835826 23370164 23299776 19255684 20999318
963 20999318 31039029 38225286 31312892 15814784 8075667 12643312 16519871 10001289
955A0001289p911694L977980J2030177M673665o659307o459644J744055L912867
947A5309388k246449p583373q034409o675488l008936N332116J1859172P032541
939A1984562m667165q351099j932437k21280j0096810j6972323o384271J3046597
931b3594226K1141362J2793134K76375n954582o170680l517001R61207M989768
923I25357N447554K710071j152274o263656j0655248o719296Q080951K0525188
915A2898647J4607558n032627j6204161q439813M149217M813427l898257r285600
907f391609q944686r517362j1072680o454197M292059J0403178M748015n690782
899b8628064q169239N86912J1262420J3159302O126805Q45K269179Q941750J0797288
$$ plain form
955 10001289 2089595 6067575 18097752 22771417 16112110 9652466 11396521 15309388
947 15309388 13062939 5479566 -2554843 -9230331 -12239267 -6907151 4952021 11984562
939 11984562 7317397 -1033702 -2966139 -3187419 -13284229 -30256552 -36640823 -23594226
931 -23594226 -2452864 10340270 10616645 4662063 -1508617 -5025618 -4064411 925357
923 925357 6372911 9082982 7930708 1667052 -8988196 -15707492 -7626541 12898647
915 12898647 27506205 22473578 6269417 -2170396 1978821 6792248 2893991 -6391609
907 -6391609 -15336295 -24853657 -35926337 -42380534 -38088475 -27685297 -22937282 -28628064
899 -28628064 -36797303 -36210391 -24947971 -11788669 -5661864 -5661019 -3391840 5549910 16347198
890A6347198O492843L184868L893709K283174o032081j4062459j2016737j092778
882a002263Q000906Q081662J712714l536127j579346P668918J5842949J1818962
874D7008375m908052k0488429k2353673j4106355p423362m257584K103785J1111026
866a3314269J3080780M724549m857119p165646l884292n2270L175697M798061
858c494509J817310m049339n402583j70628M133186K706113J541311N675597P453365
849A0209823k844047j9346994k4851327j2033724Q309415K0634357J9403359R938789
841I419651P19382l115955j986940N83783K701845M791841N710139K588376l923195
832A7488927r224938j1348014j1951451r315866N69850J2472880J3146531J393700
$$ plain form
890 16347198 22840041 26024909 29918618 32201792 26169711 12107252 90515 -1002263
882 -1002263 6998643 15080305 16793019 13256892 11677546 19346464 35189413 47008375
874 47008375 42100323 21611894 -741779 -14848134 -22271496 -26529080 -24425295 -13314269
866 -13314269 -233489 4491060 -366059 -7531705 -11415997 -11468267 -8292570 -3494509
858 -3494509 -1677199 -5726538 -11129121 -11299749 -7166563 -4460450 -2919139 2756458 10209823
849 10209823 7365776 -11981218 -36832545 -48866269 -40556854 -19922497 -519138 9419651
841 9419651 10139033 7023078 5036138 5619921 8321766 13113607 18823746 21412122 17488927
832 17488927 8263989 -3084025 -15035476 -24351342 -23781492 -11308612 1837919 3231619
824C231619n568374K841643J1567698K321795j5327136j6719131o51569R023752
816i279703J018962q635172n611590K167107M049700N839648J3990369J7675494
808B1214815N404113j2137192j5063247k962184P217810P170609L903775K779628
800A7528127M98857m111904o141753l588241J43264L284074N803328L954313m422131
791A2947934j0950011n709993N692358Q068660J01188l872291J509767L476238
783A1263850n843854j3652947o311932P568382R264383k336717j1048213q485145
775a9582193l662466n805763j0206569o898679M230677J3596894J4392795R989913
767c945391Q421553J1731351J3155829O178225n585759j1535113p120768Q83737
$$ plain form
824 3231619 -2336755 504888 12072586 14394381 -932755 -17651886 -18303455 -9279703
816 -9279703 -8260741 -16895913 -22507503 -20340396 -16290696 -10451048 3539321 21214815
808 21214815 26618928 14481736 -581511 -3543695 3674115 10844724 14748499 17528127
800 17528127 18026984 13915080 7773327 4185086 4328350 7612424 13415752 17370065 12947934
791 12947934 1997923 -3712070 1980288 10048948 10150136 6277845 7787612 11263850
783 11263850 5419996 -8232951 -14544883 -6976501 2287882 -48835 -11097048 -19582193
775 -19582193 -23244659 -29050422 -39256991 -46155670 -41924993 -28328099 -13935304 -3945391
767 -3945391 4476162 16207513 29363342 35541567 29955808 18420695 11299927 12183664
759A2183664L551798k17959m950458n620909j239453M584801N106155k620175
751A0777464j0995814q831350K675891R346855L756195l914621k097671M368961
743E085910L414657m439922q377710n250278j759079m52809K866610P403163O430129
734D920671M47845j483848K501177K333693p005935j4954258r860360M555831
726a8545184J5352395J6121286R161788j384507j0355120j1163598l321721L588317
718e46344J438847m589096l764595L782409P399952J558728p058654q814148j605438
709a2198339Q321063J1957169N006120o540477j0839258m257847L070886J275325
701d205358m777012l401416N459374J0343720N764316j044795k210764J236568
$$ plain form
759 12183664 15735462 15517503 10567045 4946136 3706683 8291484 13397639 10777464
751 10777464 -218350 -9049700 -6373809 2973046 6729241 2814620 716949 5085910
743 5085910 8500567 4060645 -4317065 -9567343 -11326422 -11779231 -8912621 -1509458 4920671
734 4920671 5368516 3884668 6385845 8719538 1713603 -13240655 -23101015 -18545184
726 -18545184 -3192789 12928497 22090285 20705778 10350658 -812940 -4134661 -546344
718 -546344 892503 -3696593 -7461188 -3678779 3721173 5279901 -1778753 -10592901 -12198339
709 -12198339 -3877276 8079893 13086013 6545536 -4293722 -8551569 -5480683 -4205358
701 -4205358 -8982370 -12383786 -6924412 3419308 9183624 8138829 5928065 7164633
693G164633M326841M887967K861082n92783j751556J624912M585529O95494o581880
684A7220239p208989n4569N058111K695544j695507l738955o635602j0547274
676d907002p792153L477721J1970941R137723K392238J978181M108171m27489
668A9938331q846768j1378010p720725m515432j413703N399650R905092L329850
660D698285p183099n111277Q759719J4634461L635817q550972o702518J624861
652E805277J418377n118927m763347L772315R066444O124431J965151J876289
644B0146010K362339K94602j238121o75428l239988j1811150j7992202j0994234
636b3148172N315296J3020218K282340j3423675j2752184N025194J7968631J0717277
$$ plain form
693 7164633 11491474 16379441 19240523 18647740 16896184 18521096 23106625 23802119 17220239
684 17220239 10011250 9956681 15014792 17710336 16014829 12275874 5640272 -4907002
676 -4907002 -12699155 -9221434 2749507 11887230 14279468 16257649 20365820 19938331
668 19938331 11091563 -286447 -8007172 -12522604 -13936307 -8536657 1368435 4698285
660 4698285 -2484814 -7596091 1163628 15798089 19433906 10882934 4180416 5805277
652 5805277 7223654 2104727 -2658620 1113695 10180139 16304570 18269721 20146010
644 20146010 22508349 22802951 21564830 20889402 17649414 5838264 -12153938 -23148172
636 -23148172 -17832876 -4812658 -2530318 -15953993 -28706177 -23680983 -5712352 5004925
628E004925n767208j1721917n648967r74740k329445j395479M968436Q766621
620i097774N741193J740053j44902n187156j3933421j6460012p326425M897440
612c9771004J0631831J1193463J0471540O426917l73081j649224M818713P903797
604I652952J074925m365177K366547J1798987R426226K49106j165431K994846
596C2032981q98691j1002979j1437956j40185P045045K774830k214622n50891
588A5607532P46770k737677l664227Q39615J315516n873155q900799m73697P336777
579D196655J496898j0982811j4419006p316547j29579K599485M679139P460915
571a2414851P757895L883022l375907j1575838j3900553l752936J2443121J7642527
$$ plain form
628 5004925 -762283 -12484200 -18133167 -19107907 -21437352 -22832831 -17864395 -9097774
620 -9097774 -3356581 -1616528 -1761430 -6948586 -20882007 -37342019 -44668444 -39771004
612 -39771004 -29139173 -17945710 -7474170 -1047253 -1420334 -3069558 1749155 9652952
604 9652952 10727877 6362700 8729247 20528234 29954460 30203566 29038135 32032981
596 32032981 31134290 20131311 8693355 8553170 15598215 18373045 16158423 15607532
588 15607532 16354302 13616625 9952398 10792013 12107529 6234374 -2666425 -3140122 4196655
579 4196655 5693553 -5289258 -19708264 -27024811 -27154390 -24554905 -19875766 -12414851
571 -12414851 -4656956 -773934 -4149841 -15725679 -29626232 -33379168 -20936047 -3293520
563c293520P041603l235200j33682O678942K734576o287270n606135K077508K007439
554A984261n542154n489466M929529J0242522K133607p456580n682957L265376
546a615862P680891M864247L77520j513757o25405N35589j910213q059590j0699797
537a0966377m294420M270916M164377j753551q52049P708652J0807729L678047
529A2763324k187699K97380J848965m792345j0174007m953637K255064r0485m601920
520i635360K947734J6642750J6422488l26237j3383065r352907J346105M208194
512H869702J575594L000191O614893L815961l936801o758534k864839j056072
504I260095n353310q219835l537750K874232K995544K17012L459021J0730545
$$ plain form
563 -3293520 3748083 512883 379201 7058143 9792719 3505449 -2100686 -23178 1984261
554 1984261 -3557893 -9047359 -4117830 6124692 8258299 801719 -4881238 -1615862
546 -1615862 6065029 10929276 11306796 9793039 9167634 9703223 7793010 -266580 -10966377
537 -10966377 -15260797 -10989881 -6825504 -8579055 -9431104 -1722452 9085277 12763324
529 12763324 10575625 10873005 12721970 7929625 -2244382 -7198019 -4942955 -5033440 -9635360
520 -9635360 -6687626 9955124 26377612 26051375 12668310 3315403 4661508 8869702
512 8869702 10445296 13445487 20060380 23876341 19939540 13181006 10316167 9260095
504 9260095 3906785 -4313050 -7850800 -4976568 -1981024 -1764012 1695009 12425554
496A2425554R917880k330875j3206513j0944525q91874L991490K350985L257405
488D569527Q758550R965976K303234o188294o624120j305701J774091N46372r59883
479A2839752p8487K120378L290254J055102n093890j0396140p888965J492203
471b659793P176403K486838n277932n186372J257341L276189k007934n598707
463f533967j290904M764729L821105k326250m096457K512101J0685354J1200255
455A8735966K983474n941085p161350p28020N173499L507568l787699q595027
447D187326o407520r92560J182639j092031l344353k059188Q45348J327913p94484
438g146910j785488M00056L583112N397797O347140O442783K544306o440996j4360859
$$ plain form
496 12425554 22343434 20012559 6806046 -4138479 -5030353 -1038863 1312122 4569527
488 4569527 13328077 23294053 25597287 19408993 12784873 11479172 13253263 13799635 12839752
479 12839752 12761265 14881643 18171897 19226999 14133109 3736969 -4151996 -2659793
471 -2659793 4516610 7003448 1725516 -3460856 -2203515 1072674 -935260 -6533967
463 -6533967 -7824871 -3060142 760963 -1565287 -5661744 -3149643 7535711 18735966
455 18735966 21719440 15778355 8617005 7888985 13062484 16570052 12782353 4187326
447 4187326 -2220194 -3212754 -2030115 -3122146 -6466499 -8525687 -7680339 -6352426 -7146910
438 -7146910 -8932398 -8532342 -4949230 448567 6795707 13238490 15782796 9341800 -5019059
429e019059j3759236o092463J57248J591647L193101P773972R353440J774149
421a027201j0671325j6482432r277665N879985J7120130J5994732N679388j258406
413E957206K774254R576659N598083p486295j3125376l764168P344608N477076
405A2352047m857831q998544l834539J872471L418989L417718K323681j334347
397D359645l024702K350626P915132J974884j1265753j3707682m26902J0749770
389a074982M784639r261398j3368547n546781L293272Q388402J1973547J0885279
381A0073431k9226j3266240j3402684O89539J2028634Q709119j234673m677825
373a109925j973324j368650l526378l069283n28402r32770k506474J726227J0535886
$$ plain form
429 -5019059 -18778295 -24870758 -24713510 -23121863 -19928762 -12154790 -2801350 -1027201
421 -1027201 -11698526 -28180958 -37458623 -31578638 -14458508 1536224 7215612 5957206
413 5957206 8731460 18308119 23906202 16419907 3294531 -469637 6874971 12352047
405 12352047 7494216 -1504328 -5338867 -3466396 -47407 3370311 5693992 4359645
397 4359645 1334943 3685569 11600701 13575585 2309832 -11397850 -11824752 -1074982
389 -1074982 3709657 -5551741 -18920288 -24467069 -21173797 -12785395 -811848 10073431
381 10073431 10044205 -3222035 -16624719 -15935180 -3906546 4802573 3567900 -1109925
373 -1109925 -3083249 -4451899 -7978277 -11047560 -11575962 -12508732 -15015206 -13288979 -2753093
364b753093J3474837N992018l942289q198307q433914q366098n088641L715463
356a3600024J0905418Q241077o13482n346707m194404l479479m244006j446401
348a3778008L431099J988468n838967q689897j270751O892676P257671N100090
340d907619O954124O538606l292552j3200806q639189N580602R537212k513074
332c942696j3862192j0535790O14177O495720P011737Q786737R726148L395358
324G689199o205904p873003p09201L483292k126363r314231p460325J308900O681755
315a4525881N251012L041373M458795O636870O091348M053777K051952j747053
307A5312193p248672r010156m279154L29821j856053n417154j85042J1099816
$$ plain form
364 -2753093 10721744 16713762 12771473 4573166 -3860748 -12226846 -17315487 -13600024
356 -13600024 -2694606 5546471 4932989 -413718 -4608122 -8087601 -12331607 -13778008
348 -13778008 -10346909 -8358441 -14197408 -22887305 -24158056 -17265380 -10007709 -4907619
340 -4907619 2046505 8585111 5292559 -7908247 -16547436 -10966834 -1429622 -3942696
332 -3942696 -17804888 -28340678 -27726501 -21230781 -14219044 -5432307 4293841 7689199
324 7689199 1483295 -6389708 -7098909 -3615617 -5741980 -15056211 -22516536 -21207636 -14525881
315 -14525881 -9274869 -6233496 -1774701 4862169 10953517 15007294 17059246 15312193
307 15312193 8063521 -946635 -5225789 -4895968 -6752021 -12169175 -12354217 -1254401
299a254401J4592716O173487k050697m36501M985272M862465J148132L50699J315395
290B9686567j83254k214455k194421m292364j0397799j1190981M62459J3262687
282A2938439J0134429n851694j4237970o049195N239960M547510n944851j3365457
274a2588829r998625J417968J1421493J1317333K555616l142410P99809N660924
266G443279J818522m508070k758663J653530k759350r616106l875052Q134766
258d467144N175055j0807119j3310631M210967J4010923o75417j6153533o394389
250b8411288J4999241J8225734K970707q543211r310672q258310m291161R049520
242a3569440J9655962R365864j1622283j3901908N611279J7437318M900399j2844925
$$ plain form
299 -1254401 13338315 19511802 17461105 17024604 22009876 26872341 28020473 28371172 29686567
290 29686567 29503313 27288858 25094437 20802073 10404274 -786707 -324248 12938439
282 12938439 23072868 17221174 2983204 -3065991 2173969 6721479 776628 -12588829
274 -12588829 -22587454 -21169486 -9747993 1569340 4124956 982546 1782355 7443279
266 7443279 9261801 4753731 1995068 3648598 889248 -8726858 -12601910 -4467144
258 -4467144 707911 -10099208 -23409839 -19198872 -5187949 -5863366 -22016899 -28411288
250 -28411288 -13412047 4813687 7784394 -758817 -10069489 -18327799 -22618960 -13569440
242 -13569440 6086522 15452386 3830103 -10071805 -4460526 12976792 17877191 5032266
234E032266j3679203k979168K946358K961936M440640O091976L292584l72625
226G734764k07311l14611n542764j1490473j1743282p494794k406500L908308
218b7556663J0442686J1779166P171035L306867K072176l164635j2282138j3124593
210b1356099j650929O618403o75796j1072002o013642Q327071R916992l858755
202a9764757j1882310j906127J2726204J5147786O782193j820104p874152j2662549
194b1253816j1442704l49228J2306561J4265476O524964J165614K793178L365239
186G375284k774346r556296r545932m542825M51460N815743J1797521J1632420
178A0653029R33307j0968902j1439215l430477k56874k923778O59527J1639343
$$ plain form
234 5032266 -8646937 -11626105 -8679747 -5717811 -1277171 4814805 8107389 7734764
226 7734764 7527453 7212842 1670078 -9820395 -21563677 -29058471 -31464971 -27556663
218 -27556663 -17113977 -5334811 1836224 5143091 7215267 4050632 -8231506 -21356099
210 -21356099 -23007028 -16388625 -17064421 -28136423 -34150065 -25822994 -15906002 -19764757
202 -19764757 -31647067 -33553194 -20826990 -5679204 1102989 -717115 -8591267 -21253816
194 -21253816 -32696520 -33045748 -20739187 -6473711 51253 1216867 4010045 7375284
186 7375284 4600938 -4955358 -14501290 -19044115 -18592655 -12776912 -979391 10653029
178 10653029 11586336 617434 -10821781 -14252258 -14509132 -17432910 -16773383 -5134040
170e134040J4280612J833650r862316o971051O36057j755647p865785l444998
162a8283518O388074O020581j720040l65627R462257R658588l671436j2948650
154e459771q438920j465489j133017l68515N156377N745053k258169m811974O737319
145f297106J8026568J2975812j852194j0119085r935555r089334p761816k561847
137a6614557K040911J961013L670490J1207408J3848644L387549p374298k845643
129I281517Q196888N517422r285395j5774798p800898q7392j236032k658941J749203
120a2098426N158700L096322J975668N566378P391557L011881k470432m393035
112G238613m784876m924686k817970n78443k436530l881506L421102J4096520
$$ plain form
170 -5134040 9146572 10980222 1117906 -5853145 -5217088 -6972735 -14838520 -18283518
162 -18283518 -11895444 -5874863 -7594903 -7960530 1501727 11160315 7488879 -5459771
154 -5459771 -13898691 -15364180 -16497197 -16865712 -11709335 -5964282 -8222451 -13034425 -6297106
145 -6297106 11729462 24705274 22853080 12733995 2798440 -6290894 -14052710 -16614557
137 -16614557 -14573646 -12612633 -8942143 2265265 16113909 19501458 12127160 9281517
129 9281517 17478405 22995827 13710432 -2064366 -9865264 -9952656 -11188688 -13847629 -12098426
120 -12098426 -6939726 -3843404 -1867736 3698642 11090199 14102080 11631648 7238613
112 7238613 2453737 -2470949 -5288919 -5867362 -8303892 -12185398 -8764296 5332224
104E332224J2692506j051606q150732Q38973J0287221M107150r322958j1534512
96C198266k014189M287719R46825l918669l290652J40052J631596J141157O54548
87B776653P05156Q21225K76175j397458l045803k794523j141717k38839P1715
78c967416J354160K083662k88856l118983j450546K872669L173876n73453j738863
69a653750L70725j084580o819115q111637j792746L457495K024574N73303M427062
60h608669O624427Q50446n287094k074162N587344O134323k94340m333175l552918
51d953818l328166m484276k444916K285335L606489j45543m256478n188930k853030
42b1763333K624094Q945326R441559J268705p050088n334316L558461Q206331
$$ plain form
104 5332224 18024730 16973124 8822392 9661365 19948586 24055736 14732778 3198266
96 3198266 1184077 5471796 6418621 2499952 -790700 -650648 980948 2122105 2776653
87 2776653 3481809 4303034 4579209 3181751 135948 -2658575 -3800292 -4039131 -3967416
78 -3967416 -2613256 -529594 -818450 -3937433 -5387979 -2515310 658566 85113 -1653750
69 -1653750 -1283025 -2367605 -9186720 -17298357 -19091103 -15633608 -13609034 -13035731 -8608669
60 -8608669 -1984242 -1133796 -6420890 -8495052 -2907708 3226615 2932275 -1400900 -4953818
51 -4953818 -8281984 -12766260 -15211176 -12925841 -9319352 -9464895 -13721373 -18910303 -21763333
42 -21763333 -19139239 -10193913 -752354 516351 -6533737 -11868053 -8309592 -103261
34a03261N282884J256479p68476m126972q135721o208603K772077J0679988J0890326
25A1538721N221281j711647p298232q497694k923878N133590P331138K319848
17A1113127k902086m216314m766321o085896m168472J678996M988213K522204
9a836549N42804M386792Q894639O651483R2707k767415q67029j85820l304634
0A1606978
$$ plain form
34 -103261 5179623 6436102 5667626 1540654 -6595067 -12803670 -10031593 648395 11538721
25 11538721 16760002 15048355 7750123 -747571 -3671449 1462141 8793279 11113127
17 11113127 8211041 3994727 -771594 -6857490 -11025962 -9346966 -4358753 -1836549
9 -1836549 -1293745 3093047 11987686 18639169 18731876 15964461 15097432 14911612 11606978
0 11606978
$$ Imaginary data points
##PAGE= N=2
##DATA TABLE= (X++(I..I)), XYDATA
65535a7241863N510753N635814O056552P027574P278357N886908J778800n657824
65527A6275071j3294046j4612465o568992N371417J1997289R810840L648200r88
65519A2626326j09852m98298l466079o281026m887246K94680M353016L725173
65511E756694J1768l023248m356504n455887o126678l790976J911765O374415
65503h698651M884485n54936l011746j98066J948296j509268n691156k482144
65495a5313186O031087Q901593K371276l884101r27119O376968P208855M30192
65487A1195565n523655n405171j975202Q17029K457336L396856L237861J839921
65479A0040540q61883m626995n991969K8254J0886711J4887631N694626p027803
$$ plain form
65535 -17241863 -11731110 -6095296 -38744 6988830 14267187 20154095 21932895 16275071
65527 16275071 2981025 -11631440 -18200432 -12829015 -831726 8979114 12627314 12626326
65519 12626326 12516474 12018176 8552097 2271071 -2616175 -2321495 2031521 5756694
65511 5756694 5768462 2745214 -1611290 -7067177 -13193855 -16984831 -15073066 -8698651
65503 -8698651 -3814166 -4369102 -7380848 -7578914 -5630618 -7139886 -12831042 -15313186
65495 -15313186 -9282099 -380506 1990770 -1893331 -2820450 3556518 10765373 11195565
65487 11195565 5671910 266739 -1708463 -891434 1565902 4962758 8200619 10040540
65479 10040540 9178657 4551662 -1440307 -1412053 9474658 24362289 30056915 23029112
65471B3029112j0410060o463160n982256q817858m848254O242690J1741207N585745
65463A0077166k517164k643191K549191N915930N883436K923973l751518j0318660
65455H119163q880683N93893Q122997P924483M472096O76159o768971j4715186
65447d56049j1620233K632248J0322205J409850r182264m591326P513424R533241
65439E561096L108595K309471O058020J126794j0792119j3029931k227082N588493
65431b296663J664960l059798Q98610O390993M749554L04954o68825k123235p857610
65422a997060j0006404o01736J2766275J5163553M354558p488379j0171363n469872
65414c450428j218267j304768k575889K65616O791951R493924L590969m434514
$$ plain form
65471 23029112 12619052 6155892 173636 -8644222 -13492476 -7249786 4491421 10077166
65463 10077166 7560002 4916811 7466002 13381932 19265368 22189341 18437823 8119163
65455 8119163 -761520 -167627 7955370 15879853 20351949 21028108 14259137 -456049
65447 -456049 -12076282 -9444034 878171 2288021 -6894243 -11485569 -3972145 5561096
65439 5561096 8669691 10979162 17037182 18163976 7371857 -5658074 -7885156 -2296663
65431 -2296663 -631703 -3691501 -2792891 3598102 8347656 8652610 7983785 5860550 -1997060
65422 -1997060 -12003464 -12605200 161075 15324628 19679186 12190807 2019444 -3450428
65414 -3450428 -4668695 -5973463 -8549352 -8283736 -1491785 8002139 11593108 7158594
65406G158594m880567L53559M08639o809158j0597228m378708M143122N434583
65398i167164J520617J23411K777600N425945M897300m63971j0209739j7273289
65390b2369290j1945731M084512J5990603J4332885O288642J346879l085909j0904147
65382f261556j3059769j39261J7235419J8569190K886073q968508l898365O811740
65374A3174963O135898n766122j5154341j3117097k953719N964742O371782j346444
65366f690338q663325p537479o31522K422986l78607m95270O561467J2448122
65358b963966Q022158k667673q242573n431198n65128J762750L128007M483695
65350b473928K655842l747100r869065r387477j775725P068544J0545407P268656
$$ plain form
65406 7158594 2278027 2631586 3040225 -3768933 -14366161 -18744869 -14601747 -9167164
65398 -9167164 -7646547 -7523136 -4745536 680409 5577709 5113738 -5096001 -22369290
65390 -22369290 -34315021 -30230509 -14239906 92979 6381621 7728500 4642591 -6261556
65382 -6261556 -19321325 -19460586 -2225167 16344023 19230096 10261588 6363223 13174963
65374 13174963 19310861 13544739 -1609602 -14726699 -17680418 -11715676 -5343894 -6690338
65366 -6690338 -15353663 -22891142 -23522664 -21099678 -21478285 -21973555 -15412088 -2963966
65358 -2963966 5058192 2390519 -5852054 -11283252 -11848380 -10085630 -6957623 -2473928
65350 -2473928 181914 -3565186 -13434251 -22821728 -24597453 -17528909 -6983502 285154
65342B85154K102159R11564L668643M613287P62190k866234l57499N380283O033430
65333B0532977L66955l886712k415758j018097n012572q655178l441410O611922
65325C082127Q202164k021118j1115152p110517M931451J0819155O250791j53865
65317A2885036j007416J014125J74306l140991m365422k215375L08584J225882
65309D878729J937721L489198L366164j338795q312191j0929022o444224l10336
65301a3662756J315308R05622N104865J1444476Q505918o476227j8726725j3297125
65293b4886644L915584J3083851O566339k982671k156107O044593R564645M027686
65285A3177276m400669q317688n356077K203916R215956J0419939M904217k852267
$$ plain form
65342 285154 2387313 3298877 6967520 11580807 12342997 9476763 9119264 14499547 20532977
65333 20532977 20899932 17013220 14597462 13579365 8566793 -88385 -3529795 3082127
65325 3082127 11284291 9263173 -1851979 -8962496 -4031045 6788110 13038901 12885036
65317 12885036 11877620 12891745 13066051 9925060 5559638 3344263 3652847 4878729
65309 4878729 6816450 10305648 13671812 12333017 4020826 -6908196 -13352420 -13662756
65301 -13662756 -12347448 -11441826 -6336961 5107515 13613433 7137206 -11589519 -24886644
65293 -24886644 -20971060 -7887209 -1320870 -4303541 -6459648 -415055 9149590 13177276
65285 13177276 8776607 458919 -4897158 -2693242 6522714 16942653 21846870 18994603
65277A8994603p885554r009450p490223m540474j503690M50126J976767L882131
65269e125764L690340j370975p417807o338068K484090R460095P568523J468564
65261D418998j029887m08933j859381n176924n623721j918634L034393O685047
65253a879042O507645p91543j2618723j7143320n991113J1659898J7583359P224820
65245D551981n448372p067218M34254P045276P871231M369568p30086m201291
65237F825343k636277L204349P690057P364852N029564L862294K057155k633381
65229C0763956p259455p633381m974108l623345m256276m114925k424618r40765
65221d462917j6612J666328L991548N651938O695858P255921M957401j984176
$$ plain form
65277 18994603 11109049 2099599 -5390624 -9931098 -11434788 -10984662 -9007895 -5125764
65269 -5125764 -1435424 -2806399 -10224206 -16562274 -14078184 -4618089 2950434 4418998
65261 4418998 3389111 2980178 1120797 -4056127 -9679848 -11598482 -8564089 -1879042
65253 -1879042 4628603 3837060 -8781663 -25924983 -31916096 -20256198 -2672839 4551981
65245 4551981 -896391 -7963609 -7529355 -484079 7387152 11756720 11026634 6825343
65237 6825343 4189066 7393415 15083472 22448324 27477888 31340182 33397337 30763956
65229 30763956 23504501 15871120 10897012 7273667 3017391 -1097534 -3522152 -4462917
65221 -4462917 -4479529 -2813201 1178347 6830285 13526143 20782064 25739465 23755289
65213B3755289r769961j2023584p890729k352344J546924M885077O542488K332894
65205G026054n993355q502420l89229Q497558N956261m960371j0620529o682829
65197a5668860j715110r34561O25304N119454N331991j482023n234308J139868
65189a2818245Q067186M708574j240599M075879J4598237J0944682p517179j8467959
65181B350576r806665K678062Q05226r691646j1934853m059284K874188M493046
65173b2291350N229872O013120L994256J535763L008957N060611J675649l508736
65165G18142j939855M461111N085211k247535q021954o271702j904165l24219
65157a0444966J19492J894207L010710J715735P4939L72207K922407P535255J1674989
$$ plain form
65213 23755289 13985328 1961744 -5928985 -8281329 -6734405 -1849328 4693160 7026054
65205 7026054 1032699 -7469721 -7858950 638608 6594869 1634498 -8986031 -15668860
65197 -15668860 -17383970 -18318531 -17693227 -12573773 -7241782 -8723805 -13958113 -12818245
65189 -12818245 -4751059 -42485 -1283084 2792795 17391032 28335714 20818535 2350576
65181 2350576 -7456089 -4778027 -3972801 -13664447 -25599300 -29658584 -26784396 -22291350
65173 -22291350 -17061478 -11048358 -7054102 -5518339 -2509382 2551229 4226878 718142
65165 718142 -1221713 3239398 8324609 6077074 -1944880 -8216582 -10120747 -10444966
65157 -10444966 -10325474 -8431267 -5420557 -3704822 -3629883 -3257676 -335269 7199986 18874975
65148A8874975R291069q62882q590565m103527N786621N769651m606529j0251174
65140A1307639m760517N73479k956084p665456m251845L098660O343341O855315
65132H544532Q428273P186871p6455o271265m679907j632958n911151j1970983
65124f383043p648159N323121J2444581P045792k486198o403980m026857M65735
65116a669008L641203K913165j776536n793523n118640k528519k393606k208578
65108a4934042K702171Q757877Q121948J913894q22717K347367L992056n9449
65100A2019105l986854j841204L766033O611399M301024j989904r218157j1706586
65092b045144n239705N169650P962817o85467j0534746r447093J837976J0892972
$$ plain form
65148 18874975 28166044 27303162 18712597 14609070 20395691 26165342 21558813 11307639
65140 11307639 6547122 7120601 4164517 -3500939 -7752784 -4654124 1689217 8544532
65132 8544532 16972805 24159676 24083221 17811956 13132049 11499091 5587940 -6383043
65124 -6383043 -14031202 -8708081 3736500 10782292 8296094 1892114 -2134743 -1669008
65116 -1669008 1972195 4885360 3108824 -2684699 -7803339 -10331858 -12725464 -14934042
65108 -14934042 -12231871 -3473994 4647954 6561848 5739131 8086498 12078554 12019105
65100 12019105 8032251 6191047 9957080 16568479 20869503 18879599 9661442 -2045144
65092 -2045144 -7284849 -2115199 5847618 5162151 -5372595 -14819688 -12981712 -2088740
65084b088740P421255o420629j8130665j6826260m469917O372746P839692N504810
65076b0797708P276131R734147M996767l085120k517278P398173J3484104Q050177
65068B4539393j666185p116797q785628p792215o40760R739424J0661497k062317
65060A6876412j3863420j1316663j731015Q12018j274873K946808R571652N289332
65052G310251o745131q489995L308796J0321811K168397p021922k377369Q518007
65044F992845J0359991M342389J186576K46399n953404j2475262p045529O748386
65036D402391J0508481j339636j2324812r186163p92827j267074o935426m428486
65028b1363552N915421J0573204M607966j901219j253579J170634p82884j988388
$$ plain form
65084 -2088740 5332515 -1088114 -19218779 -36045039 -40514956 -34142210 -26302518 -20797708
65076 -20797708 -13521577 -3787430 1209337 -1875783 -4393061 3005112 16489216 24539393
65068 24539393 22873208 15756411 6970783 -821432 -1462192 8277232 18938729 16876412
65060 16876412 3012992 -8303671 -10034686 -9222668 -10497541 -7550733 2020919 7310251
65052 7310251 565120 -7924875 -4616079 5705732 7874129 852207 -1525162 6992845
65044 6992845 17352836 21695225 22881801 23128200 17174796 4699534 -2345995 4402391
65036 4402391 14910872 13571236 1246424 -7939739 -8732566 -9999640 -16935066 -21363552
65028 -21363552 -15448131 -4874927 -266961 -2168180 -3421759 -2251125 -3034009 -5022397
65020e022397M368169J2049067Q279599o346077j5504665q125288O597083J1494614
65012G790105L444429n067592m388046J589351N081504N755468O356820M007627
65004B4569666m656394j2950295r681251L992607J3425051R479089n88958n946834
64996A7642681o404921o467971m198348L026970P982228K052584q544094q777847
64988c688718K640851J0403357N428759k639921j968475M042690M834793m14112
64980A8639224m206521l888738l682018n764962o955908l702874L940991J1629954
64972F009148J2110171K283247q921816p829379M443482R994789m80250j1774862
64964E834530o465683P219284Q060569l919156q184208J359509O150554m604346
$$ plain form
65020 -5022397 -654228 11394839 19674438 13328361 -2176304 -10301592 -3704509 7790105
65012 7790105 11234534 6166942 1778896 3368247 8449751 14205219 20562039 24569666
65004 24569666 19913272 6962977 -2718274 1274333 14699384 24178473 23589515 17642681
64996 17642681 11237760 4769789 571441 3598411 11580639 13633223 5089129 -3688718
64988 -3688718 -1047867 9355490 14784249 12144328 10175853 14218543 19053336 18639224
64980 18639224 14432703 10543965 6861947 1096985 -5858923 -9561797 -5620806 6009148
64972 6009148 18119319 20402566 11480750 3651371 8094853 18089642 17609392 5834530
64964 5834530 -631153 6588131 14648700 10729544 2545336 3904845 10055399 5451053
64956E451053j3665749l202442J4363660J3250225o896796k0333019j1952394
64949b2985462M310393Q378483M20262m574357L50370P212290O911712J620042
64941A643733K83786N105541P497172j27261j1750509j3250916j211217J1064561
64933g45110J0627123J294722m108970k404303q21516j868001K76650O624391
64925H874986Q758206K936573j653763K600320P397445M52604j3172631j5771766
64917D21974l172876P845772L428871q059198r519950Q43228J0189516J0593311
64909A2570648N801600L30301n895096j0748733r156122k616555N63414j246815
64901a0397358M91510Q815072J3097542N639934l567863j249325P259853N642232
$$ plain form
64956 5451053 -8214696 -11417138 2946522 16196747 9299951 -11033068 -22985462
64949 -22985462 -18675069 -10296586 -9876324 -14450681 -14100311 -6888021 23691 1643733
64941 1643733 1927519 7033060 14530232 14402971 2652462 -10598454 -11809671 -745110
64933 -745110 9882013 11176735 7067765 4663462 3841946 1973945 2250595 8874986
64925 8874986 17633192 20569765 18916002 21516322 28913767 29366371 16193740 421974
64917 421974 -2750902 5094870 8523741 464543 -9055407 -8212179 1977337 12570648
64909 12570648 18372248 18702549 12807453 2058720 -7097402 -9713957 -9150543 -10397358
64901 -10397358 -9905848 -1090776 12006766 17646700 14078837 12829512 20089365 25731597
64893B5731597p284158j5338358r885975j476896j615005o085558m287322M429412
64885a5812263J2209139J4009009J0108973K232408o449329j1247313j0858000
64878e807376q777105o730265k157267M439231O834549K839593p27145P36470
64870i349315J122657n295237j1636335q039044K031869P128472N645101N396576
64862a2995256P784480O730615L311599N888090J2483314Q911350q504239k2937292
64854F72661j9841497o940598Q71225M659020J2956178J9191166Q969237j2034292
64846H503100j9527783m974657J1027042R264846j311258j305195Q214334J0714161
64838B0604590K497436l620232j573794o39581p066441j2399096p229170M220225
$$ plain form
64893 25731597 18447439 3109081 -6776894 -8253790 -9868795 -15954353 -20241675 -15812263
64885 -15812263 -3603124 10405885 20514858 22747266 16297937 5050624 -5807376
64878 -5807376 -14584481 -21314746 -23472013 -19032782 -12198233 -9358640 -10085785 -9349315
64870 -9349315 -8226658 -13521895 -25158230 -33197274 -31165405 -24036933 -18391832 -12995256
64862 -12995256 -5210776 1519839 4831438 10719528 23202842 32114192 23609953 672661
64854 672661 -19168836 -26109434 -25238209 -20579189 -7623011 11568155 20537392 8503100
64846 8503100 -11024683 -15999340 -4972298 4292548 2981290 1676095 9890429 20604590
64838 20604590 23102026 19481794 17908000 17268419 10201978 -2197118 -9426288 -5206063
64830e206063J0680320P744771l50207o649487n334237L699204J1147767O844006
64822B2576074n494495j1480956o841298k861645o003487o570380K635696J0620137
64814c420354N383073m892102m887470K387956K169609n638536o888216J743397
64806a4042643Q004847N718683K636865L546526L075826p4597J457338P900006
64798A8222851P728062l427169j3170405j0096840O32238P235046O247285R89026
$$ plain form
64830 -5206063 5474257 13219028 12868821 6219334 885097 4584301 15732068 22576074
64822 22576074 17081579 5600623 -1240675 -4102320 -10105807 -16676187 -14040491 -3420354
64814 -3420354 1962719 -2929383 -7816853 -5428897 -3259288 -8897824 -15786040 -14042643
64806 -14042643 -6037796 -319113 2317752 5864278 8940104 8865507 10322845 18222851
64798 18222851 25950913 22523744 9353339 -743501 -111263 7123783 13371068 14360094
$$ [...]
##END NTUPLES=NMR SPECTRUM
##END=
