##TITLE=31Pdec_PR192_S
 Met-d4, 24 sc
 1.10.2020
##JCAMPDX= 6.0         $$ Bruker NMR JCAMP-DX V2.0
##DATA TYPE= NMR SPECTRUM
##DATA CLASS= NTUPLES
##ORIGIN= UXNMR, Bruker Analytische Messtechnik GmbH
##OWNER= root
$$ XWIN-NMR		Version 3.5
$$ Thu Oct  1 09:56:16 2020 Russian Standard Time (UT+4h)  she@DPX200
##.OBSERVE FREQUENCY= 81.013821
##.OBSERVE NUCLEUS= ^31P
##.ACQUISITION MODE= SIMULTANEOUS
##.ACQUISITION SCHEME= undefined
##.AVERAGES= 24
##.DIGITISER RES= 17
##SPECTROMETER/DATA SYSTEM= spect
##.PULSE SEQUENCE= zgpg30
##.SOLVENT NAME= CDCl3
##.SHIFT REFERENCE= (INTERNAL, CDCl3, 0, 182.463)
##AUDIT TRAIL= $$ (NUMBER, WHEN, WHO, WHERE, WHAT)
$$ ##TITLE= Audit trail, XWIN-NMR		Version 3.5
$$ ##JCAMPDX= 5.01
$$ ##ORIGIN= Bruker BioSpin GmbH
$$ ##OWNER= she
$$ F:/spectra/data/she/nmr/P31/1/pdata/1/auditp.txt
$$ ##AUDIT TRAIL=  $$ (NUMBER, WHEN, WHO, WHERE, WHAT)
(   1,<2020-10-01 09:55:18.34 +0400>,<she>,<DPX200>,
      <created by zg, POWCHK disabled, PULCHK disabled
       configuration hash MD5:
       00 E9 B6 7A A2 85 ED C7 34 08 36 98 17 FE 4E 26
       data hash MD5: 32K
       39 19 63 B4 43 36 C9 EE 1C E6 57 0D 3D 02 A7 CE>)
(   2,<2020-10-01 09:55:31.34 +0400>,<she>,<DPX200>,
      <Start of raw data processing
       efp BC_mod = 2 LB = 1 FT_mod = 6 PKNL = 1 PHC0 = -2746.118 PHC1 = 71.00175 SI = 64K 
       data hash MD5: 64K
       C9 60 98 84 27 03 0D C3 F7 F1 85 49 49 57 B1 E0>)
(   3,<2020-10-01 09:55:49.15 +0400>,<she>,<DPX200>,
      <pk PHC0 = 1.798694 PHC1 = -36.2 
       data hash MD5: 64K
       AD 2A D6 2B 52 58 4F 32 FF AB 67 A6 CF C8 99 BE>)
(   4,<2020-10-01 09:55:54.82 +0400>,<she>,<DPX200>,
      <abs ABSG = 5 
       data hash MD5: 64K
       CD 94 72 06 A6 8F 52 84 2B 0C 39 F3 41 24 D9 85>)
$$ ##END=
$$ 
$$ hash MD5
$$ 13 F3 2D 81 A4 A4 8D 9F 11 75 31 4F 37 07 2B 20
##$RELAX= 
##$RELAX= 
##$RELAX= 
##$RELAX= 
##$RELAX= 
##$RELAX= 
##$RELAX= 
##$RELAX= 
$$ Bruker specific parameters
$$ --------------------------
##$DU= <F:/spectra>
##$EXPNO= 1
##$NAME= <P31>
##$PROCNO= 1
##$TYPE= <nmr>
##$USER= <she>
##$AMP= (0..31)
100 100 100 100 100 100 100 100 100 100 100 100 100 100 100 100 100 100 
100 100 100 100 100 100 100 100 100 100 100 100 100 100 
##$AQSEQ= 0
##$AQ_mod= 1
##$AUNM= <au_zg>
##$AUTOPOS= <>
##$BF1= 81.014009
##$BF2= 200.13
##$BF3= 200.13
##$BF4= 200.13
##$BF5= 200.13
##$BF6= 200.13
##$BF7= 200.13
##$BF8= 200.13
##$BYTORDA= 1
##$CFDGTYP= 0
##$CFRGTYP= 5
##$CHEMSTR= <none>
##$CNST= (0..31)
1 1 145 1 1 1 1 1 1 1 1 1 1 1 1 1 1 1 1 1 1 1 1 1 1 1 1 1 1 1 1 1 
##$CPDPRG= <waltz16>
##$CPDPRG1= <>
##$CPDPRG2= <waltz16>
##$CPDPRG3= <>
##$CPDPRG4= <mlev>
##$CPDPRG5= <mlev>
##$CPDPRG6= <mlev>
##$CPDPRG7= <mlev>
##$CPDPRG8= <mlev>
##$CPDPRGB= <>
##$CPDPRGT= <>
##$D= (0..31)
0 1 0 0 0 0 0 0 0 0 0 0.03 2e-05 3e-06 0 0 0 0 0 0 0 0 0 0 0 0 0 0 0 0 
0 0 
##$DATE= 1601531717
##$DBL= (0..7)
120 120 120 11 120 120 24 19 
##$DBP= (0..7)
150 150 150 150 150 150 150 150 
##$DBP07= 0
##$DBPNAM0= <>
##$DBPNAM1= <>
##$DBPNAM2= <>
$$ [...]
##$SUBNAM3= <"">
##$SUBNAM4= <"">
##$SUBNAM5= <"">
##$SUBNAM6= <"">
##$SUBNAM7= <"">
##$SUBNAM8= <"">
##$SUBNAM9= <"">
##$SW= 369.568048894756
##$SWIBOX= (0..15)
0 1 3 0 0 0 0 0 0 0 0 0 0 0 0 0 
##$SW_h= 29940.119760479
##$TD= 32768
##$TD0= 1
##$TE= 0
##$TE2= 300
##$TE3= 300
##$TEG= 300
##$TL= (0..7)
0 120 53 12 22 120 120 120 
##$TP= (0..7)
150 150 150 150 150 150 150 150 
##$TP07= 0
##$TPNAME0= <>
##$TPNAME1= <>
##$TPNAME2= <>
##$TPNAME3= <>
##$TPNAME4= <>
##$TPNAME5= <>
##$TPNAME6= <>
##$TPNAME7= <>
##$TPOAL= (0..7)
0.5 0.5 0.5 0.5 0.5 0.5 0.5 0.5 
##$TPOFFS= (0..7)
0 0 0 0 0 0 0 0 
##$TUNHIN= 0
##$TUNHOUT= 0
##$TUNXOUT= 0
##$USERA1= <user>
##$USERA2= <user>
##$USERA3= <user>
##$USERA4= <user>
##$USERA5= <user>
##$V9= 5
##$VALIST= <valist>
##$VCLIST= <CCCCCCCCCCCCCCC>
##$VD= 0
##$VDLIST= <DDDDDDDDDDDDDDD>
##$VPLIST= <PPPPPPPPPPPPPPP>
##$VTLIST= <TTTTTTTTTTTTTTT>
##$WBST= 1024
##$WBSW= 4
##$XGAIN= (0..3)
0 0 0 0 
##$XL= 0
##$YL= 0
##$YMAX_a= 4976
##$YMIN_a= -7868
##$ZGOPTNS= <>
##$ZL1= 120
##$ZL2= 120
##$ZL3= 120
##$ZL4= 120
##$ABSF1= 182.463
##$ABSF2= -187.1042
##$ABSG= 5
##$ABSL= 3
##$ALPHA= 0
##$AQORDER= 0
##$ASSFAC= 0
##$ASSFACI= 0
##$ASSFACX= 0
##$ASSWID= 0
##$AUNMP= <proc_1d>
##$AZFE= 0.1
##$AZFW= 0.5
##$BCFW= 0
##$BC_mod= 2
##$BYTORDP= 0
##$COROFFS= 0
##$CY= -3
##$DATMOD= 1
##$DC= 0
##$DFILT= <>
##$DTYPP= 0
##$F1P= 0
##$F2P= 0
##$FCOR= 1
##$FTSIZE= 65536
##$FT_mod= 6
##$GAMMA= 0
##$GB= 0
##$INTBC= 1
##$INTSCL= 5.30512e-09
##$ISEN= 30
##$LB= 1
##$LEV0= 0
##$LPBIN= 0
##$MAXI= 10000
##$MC2= 0
##$MEAN= 0
##$ME_mod= 0
##$MI= 50
##$NCOEF= 0
##$NC_proc= -10
##$NLEV= 6
##$NOISF1= 182.463
##$NOISF2= 159.3651
##$NSP= 0
##$NTH_PI= 0
##$NZP= 0
##$OFFSET= 182.463
##$PC= 4
##$PHC0= -2744.319
##$PHC1= 34.80175
##$PH_mod= 1
##$PKNL= yes
##$PPARMOD= 0
##$PSCAL= 0
##$PSIGN= 0
##$REVERSE= no
##$SF= 81.0140089999434
##$SI= 65536
##$SIGF1= 159.3651
##$SIGF2= -187.1042
##$SINO= 113.3802
##$SIOLD= 16384
##$SREGLST= <1H.CDCl3>
##$SSB= 0
##$STSI= 65536
##$STSR= 0
##$SW_p= 29940.119760479
##$SYMM= 0
##$S_DEV= 0
##$TDeff= 32768
##$TDoff= 0
##$TI= <>
##$TILT= no
##$TM1= 0
##$TM2= 0
##$TOPLEV= 0
##$USERP1= <user>
##$USERP2= <user>
##$USERP3= <user>
##$USERP4= <user>
##$USERP5= <user>
##$WDW= 1
##$XDIM= 65536
##$YMAX_p= 498719757
##$YMIN_p= -144762771
$$ End of Bruker specific parameters
$$ ---------------------------------
##NTUPLES= NMR SPECTRUM
##VAR_NAME=  FREQUENCY,     SPECTRUM/REAL,   SPECTRUM/IMAG
##SYMBOL=    X,             R,               I
##VAR_TYPE=  INDEPENDENT,   DEPENDENT,       DEPENDENT
##VAR_FORM=  AFFN,          ASDF,            ASDF
##VAR_DIM=   65536,         65536,           65536
##UNITS=     HZ,            ARBITRARY UNITS, ARBITRARY UNITS
##FACTOR=    0.456856943014862, 1,           1
##FIRST=     14782.0589164792, 0,            0
##LAST=      -15158.0608439998, 0,           0
##MIN=       -15158.0608439998, -144762771,  0
##MAX=       14782.0589164792, 498719757,    0
$$ Real data points
##PAGE= N=1
##DATA TABLE= (X++(R..R)), XYDATA
$$ [...]
38205 -30870456 -33364188 -33560316 -41938474 -54857286 -57304735 -42234601 -18849956 -3416005
38197 -3416005 -5400223 -18858142 -25898371 -14624190 5630606 15349647 11877985 13128103
38189 13128103 29126869 42706699 29882954 -7424570 -40316200 -42256571 -11757816
38182 -11757816 31430209 63903040 71878581 55002052 23394372 -8326960 -27362516
38175 -27362516 -28756071 -18882532 -10494718 -10563035 -15353292 -20310257 -28323824 -40612035
38167 -40612035 -46167187 -33590553 -11021023 927258 -2263086 -3141609 9483995 21868801
38159 21868801 15930302 -2456525 -9601348 5755012 29347241 37816320 21833998
38152 21833998 -5838286 -21725900 -14371616 1744866 773928 -23016379 -46596769
38145 -46596769 -46407150 -25736433 -5159324 4917981 8705003 8216654 -710380 -14668985
38137 -14668985 -20589807 -13347719 -3790362 -1747183 -937017 8868793 21649321 21039578
38129 21039578 6075641 -2620647 11225769 37028065 50870217 46433784 39946035
38122 39946035 44209360 51185963 47277259 35551763 31125356 38839398 47599483 47506137
38114 47506137 42682064 43189526 50340642 54815048 47768087 31664040 19368112 20643253
38106 20643253 29993758 33308269 27727395 25711314 33650491 37050332 19056015 -13233273
38098 -13233273 -35480739 -36142780 -25911258 -18766519 -17549778 -18016483 -13605494 3538091
38090 3538091 32154807 53260163 48363291 26779298 16564959 26165143 35208318 27684110
38082 27684110 11952473 88731 -8812312 -12886088 -266041 24212764 28956393
38075 28956393 -2382898 -37223039 -31866143 8769239 39925465 39251016 28600161
38068 28600161 33090878 48733672 58743819 57428312 46743580 27878679 7324435
38061 7324435 -3462911 -4233545 -8911808 -23343109 -32138709 -18165388 13481201 40376978
38053 40376978 45932258 31653410 12800783 7202001 21578285 43038750 49278883
38046 49278883 31647900 3354272 -17442014 -25488273 -26200320 -24169155 -20496104 -15942983
38038 -15942983 -10064745 -440115 12133985 20499575 18042063 7250264 -2552845 -5716158
38030 -5716158 -5818546 -10105174 -19856933 -28474222 -30000610 -26177317 -20894994 -12060115
38022 -12060115 1001803 4214221 -20629112 -66103618 -97150528 -91622837 -68450084
38015 -68450084 -58880939 -63080374 -57883290 -38567142 -24994177 -26941370 -31120402 -28663274
38007 -28663274 -29815660 -39875596 -43130676 -27593012 -9379212 -13316393 -38234868
38000 -38234868 -58764655 -57522813 -41032352 -24190173 -10556999 7766531 34840133
37993 34840133 59271307 61406918 35256545 -98165 -17143343 -6010692 20792448
37986 20792448 43297291 45351300 20502213 -17756873 -38360247 -24381832 1799889
37979 1799889 5598790 -12404788 -22549312 -17081913 -20927538 -44521329 -61775886 -52240462
37971 -52240462 -33422105 -28459914 -29659875 -20817719 -10831682 -13980377 -17215944 -1708388
37963 -1708388 18038622 13385672 -8946869 -13552282 10150651 35828573 42632816 36445078
37955 36445078 24717879 3039858 -23759682 -36688321 -32065617 -31480755 -48642473
37948 -48642473 -67905082 -70026593 -59480521 -50367795 -42806326 -31500596 -23975569 -29927578
37940 -29927578 -39642207 -32065155 -3658406 24840250 32876528 22231218 10629735
37933 10629735 7457229 1918204 -20660739 -54094587 -74425299 -71915942 -65281846 -71161385
37925 -71161385 -73674394 -46728801 1248396 32284265 29244575 14564836 12236778
37918 12236778 16094066 7744954 -14170920 -35989309 -45071611 -34302310 -7133414
37911 -7133414 13136260 -777016 -42360716 -69580880 -57081473 -30582582 -28966013
37904 -28966013 -49818598 -58325805 -38507778 -7899375 13535523 22134898 17588508
37897 17588508 -4044205 -37170936 -63684143 -70863409 -61422722 -42286970 -15265604
37890 -15265604 15777003 38163687 38914131 18403695 -6882362 -16153780 -3053806
37883 -3053806 15631465 16325184 -3301789 -21201740 -20077748 -7874540 -1100690 -490861
37875 -490861 4096602 15430742 30398956 50533978 74784387 89360014 82028502 60699112
37867 60699112 41105781 23008944 -1970249 -25367540 -28505782 -12676577 624902
37860 624902 1048505 -1508356 -1654870 -8401469 -23672895 -33288201 -28726962 -18500560
37852 -18500560 -9367201 3306949 16439035 12840537 -10471842 -26936217 -12836535
37845 -12836535 18544246 33609148 18818896 -11926044 -39621735 -52970361 -48719788
37838 -48719788 -37132497 -39178712 -60968598 -79122483 -69965800 -44430833 -31434737
37831 -31434737 -33337458 -25849732 -2512174 11198811 -870192 -16271049 -5658464
37824 -5658464 22676777 33016940 11361715 -16488048 -19598879 -355189 10861037
37817 10861037 -5702241 -34916043 -44151637 -20687726 14768744 32576465 24610874
37810 24610874 5387133 -9662749 -16952163 -19331564 -19559016 -19986154 -19627740 -11189488
37802 -11189488 9246561 29278415 29540478 10017090 -5660401 249957 17185895
37795 17185895 23896466 18382132 15114218 17562481 11644963 -10330558 -34587853 -43643910
37787 -43643910 -38975453 -34396820 -32334466 -20928402 3382498 23723669 22979647 9098977
37779 9098977 7227578 26889426 49919279 55831400 46646157 35934748 23912314 1648873
37771 1648873 -23075172 -26373379 -2988109 17760798 6683652 -25419706 -41074285
37764 -41074285 -24546016 2601079 14915783 11145071 1015137 -15806245 -39611556
37757 -39611556 -52531589 -35118777 142776 15521105 -4066680 -29809643 -29501728
37750 -29501728 -12301279 -10863295 -27920012 -29552330 3083477 41435937 46109821
37743 46109821 19422411 -182610 10606853 35869007 48086516 40145369 22805480
37736 22805480 5938336 -5938664 -8700989 -2056936 5014333 2269188 -8267090 -13307584
37728 -13307584 -3265877 17920623 37144958 42676173 32349706 16360489 11071824
37721 11071824 24475582 46540903 57868925 49439103 31153367 19828690 21365149
37714 21365149 26602960 23356843 10148170 -3101283 -7065401 -2529845 4081100 10511253
37706 10511253 17260167 18603546 6547122 -12464541 -17036504 3042220 29628313
37699 29628313 38348503 30128062 23420134 20586362 6050718 -19501796 -29923924 -11529704
37691 -11529704 13409217 20784018 21368659 35905163 49609477 28889321 -20019140
37684 -20019140 -48938943 -33525684 -4877239 2074271 -2007004 9854534 30220559
37677 30220559 31959642 16494392 8433918 10355410 2705019 -12227853 -7250923 21098576
37669 21098576 40408545 34409398 29987484 48982475 66695613 50624181 14855860
37662 14855860 -1585730 5912958 8689126 -3949301 -14206975 -14906791 -20433540 -33071915
37654 -33071915 -34439179 -21822780 -20300490 -42240359 -63072395 -57340674 -35514054
37647 -35514054 -23754143 -27113965 -35166064 -46372460 -61916195 -69236461 -57960438
37640 -57960438 -42127263 -40225066 -41582560 -22055690 11224309 23949087 7284677
37633 7284677 -6750838 4520223 18885225 6294624 -20963782 -25419636 -2236397
37626 -2236397 11998689 -7102510 -35797001 -35684087 -7015345 13092056 1888957
37619 1888957 -21317775 -25928105 -10674021 2801601 6567041 14627439 34986064 55129742
37611 55129742 62413777 60660250 56678285 47799139 35695906 34593403 47344612 49642735
37603 49642735 22290713 -12794829 -17194019 10089765 34161943 37953489 40246926
37596 40246926 53692633 59601015 41478724 15407276 5182648 8481968 10102281
37589 10102281 10985311 19764928 28700673 22892059 5182362 -10330018 -22147669 -36843266
37581 -36843266 -47919098 -43404195 -30529345 -28072348 -35284219 -33332279 -18475337 -7059635
37573 -7059635 -2927128 11081187 37287639 47284901 22933391 -8986706 -10781410 10721594
37565 10721594 13888651 -14902758 -39107876 -23143952 17491924 35848265 11709500
37558 11709500 -29284867 -52050935 -49313669 -36895009 -26633640 -18062974 -11559492
37551 -11559492 -13335213 -22658660 -26044480 -14139045 1419464 -1009583 -25807179 -53035040
37543 -53035040 -61163982 -50083515 -36947736 -32967893 -30596358 -15884447 9376277
37536 9376277 24045144 10858293 -19695615 -37026218 -23947687 4767728 21050500
37529 21050500 13930158 -3502894 -10899248 1197746 23393586 31678941 7652365
37522 7652365 -37233747 -65861300 -54801783 -22471806 -5660787 -15054944 -29972851
37515 -29972851 -32178621 -24719949 -15948367 -4875976 9884670 21650514 25483875 25962138
37507 25962138 27206603 24272230 12629256 -542530 -2316391 11778373 33095325
37500 33095325 46393937 41139907 21806791 5793363 4250457 7789857 704486 -14364299
37492 -14364299 -19505118 -7814964 8361396 16017453 13621475 4457330 -6166657 -7220692
37484 -7220692 5909517 15268828 -1673340 -35721022 -52993842 -43205350 -32175800
37477 -32175800 -37444580 -44403520 -42595136 -50639310 -78986521 -99367109 -84475505 -52177493
37469 -52177493 -33924142 -22595610 6285507 40657581 47910951 34152983 36301805
37462 36301805 57139011 59839800 32736726 8495093 6123793 3752703 -11160313
37455 -11160313 -13276298 10132549 24163024 -664488 -35369395 -34482315 -5095475
37448 -5095475 9300656 -4390877 -22117905 -31651897 -44188235 -58672844 -54646191
37441 -54646191 -26864077 4488085 24681009 38270964 46261838 36610545 7649546
37434 7649546 -21024757 -31553776 -24351130 -4923288 25908878 58482205 69688970
37427 69688970 47302011 8814340 -15531491 -11603983 12950490 41404624 57526537
37420 57526537 51328834 26227237 -1995357 -18756034 -20850473 -12532836 1214915
37413 1214915 14443003 20517923 17653525 10520938 4510115 2257295 5387332 13997808
37405 13997808 24943570 36019159 48871071 60636297 58632231 36407004 11309281
37398 11309281 8856955 28434002 42012896 31472203 9906281 -1496427 -640025
37391 -640025 2373731 3919615 4439724 -230145 -8688435 -4011286 27487226 70255784
37383 70255784 88920464 66302668 21603710 -10942792 -13590773 4968211 22882849
37376 22882849 25500933 16137084 7941443 5996146 2557526 -9394787 -27180665 -46696012
37368 -46696012 -67665154 -82541765 -73891993 -38137191 -1498139 8047308 -46298
37361 -46298 9905545 48476612 84117528 85461602 60084304 37129452 27060218 17228960
37353 17228960 -639845 -17708021 -22741248 -15610845 -3401798 7660617 14328497
37346 14328497 17831939 24709175 39130748 52960562 50974639 29290538 2595392
37339 2595392 -10593349 -4701440 13802502 36482978 54734324 57346020 38449359
37332 38449359 9546097 -5969904 4256062 28798645 45998761 45040909 30116119
37325 30116119 10983585 -2901950 -4320596 5066235 11857010 5297687 -5939531 -3669850
37317 -3669850 10908259 12911587 -12983013 -47516339 -59014628 -43071693 -23789323
37310 -23789323 -18003874 -16468043 -5383439 9768642 14149641 7897659 5530624 12494784
37302 12494784 15693373 2086416 -22432878 -40531318 -44824054 -42346613 -38782005 -29565215
37294 -29565215 -12142328 2189709 -356197 -16491272 -29195984 -30212606 -27105473
37287 -27105473 -25711202 -19331027 -2984057 13393057 17370937 11563225 6684158 3500386
37279 3500386 -4618392 -15201039 -17813146 -11095686 -4195400 182477 9450583 23753503
37271 23753503 29462229 18632216 4144254 4758889 20725818 33353642 26639019 3654072
37263 3654072 -17410650 -21588225 -13723519 -14861715 -35701351 -57157980 -50686051 -18651231
37255 -18651231 3030111 -9442050 -36259176 -42899882 -27666629 -19961400 -35453073
37248 -35453073 -53547152 -44535972 -6189714 33636086 45080464 23547730 -7594472
37241 -7594472 -20564829 -10647112 2923215 4172537 -927481 854684 7618000 7076534
37233 7076534 -3994497 -19727979 -39142861 -63596830 -83142690 -83540852 -67703895
37226 -67703895 -52802092 -43589370 -26556344 4303271 33947767 47059010 46473951
37219 46473951 40895335 29206640 9642435 -7864460 -12665852 -7888901 -1198497 10683731
37211 10683731 34675967 64143666 81181254 72835798 38322069 -11303058 -52691762
37204 -52691762 -62679831 -45282974 -34185347 -51081977 -73438937 -65645078 -31579359
37197 -31579359 -7278320 -6046285 -4860681 10345829 21948118 18668925 23287331 55561385
37189 55561385 91311926 91486734 59326137 34840240 36297959 40833981 28634331 14841484
37181 14841484 20748369 35433463 29091252 -4149071 -36147534 -36711614 -3321758 40947624
37173 40947624 69614070 71931493 57153924 42387788 34674431 27403116 15662040
37166 15662040 6947139 9095569 15458901 15214691 13900330 26240851 47525064 52289585
37158 52289585 30746979 8145905 11380992 29724020 29907330 3182098 -25586358
37151 -25586358 -34490255 -27413625 -16979714 -7039931 -328712 -3554258 -13956010 -18544806
37143 -18544806 -17835428 -30771912 -61159202 -79956987 -62923184 -28826955 -13899794
37136 -13899794 -21010524 -23445809 -10468711 3076881 8945434 13523995 12248287 -9400802
37128 -9400802 -42235184 -54685244 -39743591 -27838164 -37299914 -45618071 -32317801
37121 -32317801 -17942582 -29198364 -51331831 -51883179 -34038497 -27671966 -37354987 -37863511
37113 -37863511 -18707339 2823175 15314261 26849359 38684263 35325196 11641904
37106 11641904 -14026695 -25056192 -26346020 -30781149 -42599058 -59854365 -76792080
37099 -76792080 -80155829 -61151294 -34031396 -23620408 -32341298 -40813588 -41746623 -46494024
37091 -46494024 -54729144 -49454315 -31727457 -27019995 -41284596 -44026734 -17247101 10563764
37083 10563764 7907392 -10529744 -12319625 -1257603 -3050910 -13371267 -3983991 24959597
37075 24959597 40668773 28565959 11263560 10299211 20502487 30846119 42606927
37068 42606927 56357223 64115659 63487055 59719029 49167554 23404793 -6212719 -14673153
37060 -14673153 -1712061 3066198 -15579270 -36138346 -36126691 -23331065 -13448569 -2701109
37052 -2701109 14109597 21312435 6435301 -10211949 -526264 26129452 31429768 -1785496
37044 -1785496 -52061065 -89122740 -98651897 -79994244 -43086798 -9926700 947777
37037 947777 -5203734 -10116885 -12250035 -25881227 -49955526 -61106933 -45513053 -18427374
37029 -18427374 -1905171 1083900 98905 -206124 1673099 11119176 28280340 39999989
37021 39999989 34948461 21870098 19179540 28417496 31167930 14500177 -10711533 -21773845
37013 -21773845 -8914384 16326019 34400113 35518301 25172489 15910835 15984301 24758284
37005 24758284 35113352 37517064 24352079 -3745204 -33315062 -43875686 -24650463
36998 -24650463 12120275 38398069 36663218 19197783 14531203 31840051 47440430
36991 47440430 34893777 253263 -27315006 -35490237 -39419053 -50309710 -56073086
36984 -56073086 -44440470 -25778734 -16318509 -14395679 -12710484 -20262093 -47437961 -77678366
36976 -77678366 -81555082 -58150252 -36640653 -33221757 -30577399 -8059556 28154674
36969 28154674 55150178 57984514 36540116 2778064 -21543180 -19562078 314369
36962 314369 12398504 7569343 2448553 8600595 13714789 6079906 -2301343 4609799
36954 4609799 19076045 21391747 9536714 -1624275 -3683695 -333463 4565634 8682321
36946 8682321 5248628 -10106871 -28994109 -37677959 -31639753 -15550696 3303855 13791791
36938 13791791 5333199 -14676328 -20397296 1056157 29682407 39276722 30602845 20169428
36930 20169428 11317669 390379 -1412589 18425020 45432888 52763293 40691744
36923 40691744 33477244 40137875 48382776 55169019 68897305 79081367 61212234 20838478
36915 20838478 -3953971 1824502 8190164 -6608041 -17562576 2869261 32159892
36908 32159892 26966716 -12518256 -44291581 -42558004 -21800045 -5895899 -1483439
36901 -1483439 -3316728 -3413055 7504189 30015820 47057749 40857536 17925973 1731485
36893 1731485 1912529 6675285 5191103 930772 -285463 -1934076 -11001757 -27444746
36885 -27444746 -41789900 -40977323 -20865533 4361249 14685906 11087931 15854018 36751559
36877 36751559 48675507 28645092 -6790426 -23408520 -17927049 -16741629 -29895459
36870 -29895459 -35103463 -12286998 28734685 61866195 69587757 51236240 22985296
36863 22985296 11399733 29742953 58302197 64640393 44238482 23210173 20486695
36856 20486695 28266671 32595213 31026204 23893325 9135670 -6765468 -12144229 -10615242
36848 -10615242 -17244756 -28517555 -21971171 3120720 12533952 -16089571 -56864211
36841 -56864211 -70339757 -56238007 -44347716 -45296504 -40151162 -15890008 15103585
36834 15103585 34751684 39526945 35895619 29031933 21408742 14736473 9991504 8357133
36826 8357133 10056987 10365080 3433623 -7230549 -12606937 -16569757 -34753957 -64933663
36818 -64933663 -76155374 -46374527 1262006 22327191 5365313 -19923009 -26241007
36811 -26241007 -17364879 -10290109 -10585283 -15150081 -23583248 -34120452 -36916732 -23347728
36803 -23347728 -51021 13979158 6109027 -16061165 -31165681 -25877497 -8872281
36796 -8872281 1294486 515256 1910400 12699428 21307999 15819506 4481441 5745989
36788 5745989 23806435 44635524 52390167 42033681 20890098 4067055 1379362
36781 1379362 4122655 -3607300 -15136322 -1767816 43164859 81061071 72341865 29528212
36773 29528212 -1312792 -2342418 3427688 -3354984 -15025928 -22027928 -29239450 -35387099
36765 -35387099 -22512164 17749470 65297735 92897810 92916151 73826241 45934093
36758 45934093 20816654 9652744 10591201 10448987 7996210 20638792 56893317 97006871
36750 97006871 114627304 105844961 83929771 58030296 33094506 20265693 27124019
36743 27124019 40006786 33209410 -612792 -38901914 -51505417 -30330170 4290094
36736 4290094 24994187 24515266 18800327 21724123 26175076 20581926 13712228 22430787
36728 22430787 39557455 40264107 22863463 14209779 24855339 28944471 6989322 -18932590
36720 -18932590 -18606229 -562010 4882689 -5850938 -11292694 -7024312 -11726310 -30297495
36712 -30297495 -41409469 -29087672 -3432284 17743871 28837882 31472217 27529175
36705 27529175 25059971 35993240 59184247 76340881 70969828 43549871 7024574
36698 7024574 -22254937 -29996155 -14675012 5733686 11470890 6313659 10559926 29499339
36690 29499339 48392452 60659100 76718510 95879164 94949208 63371727 29846497
36683 29846497 29428694 55064942 66727931 44871438 11827237 -1335069 11108122
36676 11108122 34136574 53389923 61901285 56851821 41565517 26926733 22729856
36669 22729856 28487600 36474832 41415819 43462358 43535827 39478954 27184923 5579845
36661 5579845 -17357964 -24847146 -4811066 32983196 60002171 57021508 35410818
36654 35410818 21600997 23575342 25506925 15774688 3467352 -710353 -3640479 -14777421
36646 -14777421 -24029105 -14811235 6660299 16552559 6805490 -7561935 -15228362 -19707955
36638 -19707955 -20102243 -7177269 10755597 4426755 -36000189 -78992127 -90421623
36631 -90421623 -74612466 -55145177 -36727542 -15555097 -7996517 -30245425 -59572823
36624 -59572823 -57154741 -27092020 -10633422 -18355140 -13810340 21107611 49760551
36617 49760551 37261165 6947773 4695605 31388012 48588823 37577282 17455888
36610 17455888 10533334 19651168 36863487 48879827 37324078 -893091 -36013685
36603 -36013685 -34688794 -6665565 5031298 -16309645 -39851768 -34528804 -10155820
36596 -10155820 4742944 3568235 -1494137 -8604924 -28317466 -60584113 -88506121
36589 -88506121 -96461915 -83442684 -59133861 -36376472 -26084498 -29489962 -34769890
36582 -34769890 -29645947 -18076727 -16410987 -31295932 -49800190 -56151111 -51436458 -48540919
36574 -48540919 -50296434 -43428468 -19126173 8350823 14815530 -2968583 -21921672
36567 -21921672 -23245469 -16214577 -19855572 -30673913 -27615375 -7396012 6401756 -3700998
36559 -3700998 -25976565 -41650924 -53192106 -71385616 -86014913 -74859770 -40840187
36552 -40840187 -16090362 -21768187 -42135005 -48349653 -33296439 -11851017 546182
36545 546182 -3480450 -25279131 -54935130 -69597891 -52088805 -9769900 35184010
36538 35184010 69332255 90161319 92557870 72615824 44241356 31798842 40361836
36531 40361836 49216679 41711739 26622125 21212781 27147779 34839889 40255144 43353326
36523 43353326 37001517 12249998 -26152844 -59325042 -70380646 -57436839 -33492473
36516 -33492473 -16187277 -12569197 -11106464 5234707 36394781 64143044 74691019
36509 74691019 70440643 57079253 35292469 11919443 1856675 7860324 14020154
36502 14020154 10209001 5309020 3751737 -8469983 -34352953 -45003112 -16438034
36495 -16438034 29734305 53364857 49641005 42873505 39733799 28395182 16468067
36488 16468067 25079041 44593726 41339078 14887430 2967525 17299849 21906155
36481 21906155 -4031400 -27607419 -15913735 12214463 23059473 20974247 24842797
36474 24842797 22592824 -5093194 -38201747 -42528168 -26941235 -27769288 -44458601 -39724563
36466 -39724563 -4021985 26793332 26258619 9146292 -2632515 -9238503 -14072796 -9355054
36458 -9355054 1776882 -2670100 -29847628 -53832435 -50425777 -30359829 -18856089
36451 -18856089 -19897451 -21374553 -21512477 -27574538 -35444471 -30823421 -10095654 13515018
36443 13515018 25017857 20880871 8779207 366902 2658891 12478717 20398855 19965393
36435 19965393 10072253 -7508874 -24780723 -26544502 -6125245 19950034 28326242
36428 28326242 19605660 15525637 24303266 30055296 23238849 18871106 29975752 41107116
36420 41107116 27459513 -10162046 -46627621 -61777625 -54233345 -33280674 -12197142
36413 -12197142 -4589244 -12294440 -19260541 -10144152 7842060 14701575 6849244 1551884
36405 1551884 10883002 25619031 30332397 23006593 12283000 4049850 146187 4772722
36397 4772722 20400784 36920959 36001422 13061714 -11600754 -13606384 4733276 14834033
36389 14834033 -3571523 -37357155 -55980489 -45206229 -16354049 12247479 31424578
36382 31424578 39948214 38611763 30626602 24113576 30332076 55579706 89140266 102124608
36374 102124608 72996276 19594104 -10917667 3620493 32155685 34554953 18077866
36367 18077866 22453511 57590003 89496610 90626140 72795198 59565014 52553082
36360 52553082 41102894 25961915 16065712 13216432 12574412 10369645 4692232 -2204983
36352 -2204983 -705475 14089499 28312168 26053770 18307567 29123641 51558256 51150708
36344 51150708 22888600 6905491 26809471 49288613 36861844 9334296 11024502
36337 11024502 37574305 42181417 7655425 -31632170 -42408701 -29377963 -11436700
36330 -11436700 6867627 27304230 44899456 55580997 61607787 62982022 57526203
36323 57526203 51221464 51849972 51613814 35130070 6584837 -11526660 -10613422 -6092930
36315 -6092930 -9112792 -9114022 4913767 23177700 27982182 16826477 2942472 979967
36307 979967 16943886 42164268 53810275 33782775 -8042122 -40754408 -46216935
36300 -46216935 -34149234 -21586560 -12955299 -5750128 -233182 4579603 11279864 13244873
36292 13244873 -2282671 -31626825 -49966166 -41452369 -21983651 -17614993 -28676509
36285 -28676509 -30976534 -9973599 20016568 33902009 25691596 14888831 22533891
36278 22533891 44281818 55029416 42745561 25473632 23713188 28347395 16181417
36271 16181417 -9948527 -22381845 -10002800 8205831 16400417 21946352 31762966
36264 31762966 34535497 22602687 9649054 8723897 12252159 12519816 21826721 49152586
36256 49152586 74546957 73879321 56048518 47400450 49453383 42867958 27340680 24096908
36248 24096908 37454583 45731665 37111160 25713469 21979562 14253578 -5508443 -21249312
36240 -21249312 -16249781 1358826 15447682 28623133 50679676 71448309 69017297
36233 69017297 42351501 16281333 13221193 34237150 67150686 98432989 116776637
36226 116776637 120408134 124440494 147961574 190027364 230667626 258811127 284145637
36219 284145637 314467205 337418301 337743630 320169967 299052086 274582632 238316495
36212 238316495 197031762 168975364 154522175 131478077 87595565 41681264 22422053
36205 22422053 37451523 70518661 97598609 100065859 77150953 54041118 61156626
36198 61156626 93848610 110519742 86161271 48347946 38094708 53322849 60721769
36191 60721769 49785629 38788962 33559942 20921122 6112782 15215486 47265374
36184 47265374 62100420 36565612 229064 -9428132 1483579 5094477 -146605
36177 -146605 2824828 11677168 9978707 263400 -1560830 1733549 -5806904 -20371032
36169 -20371032 -23335586 -17048871 -21827943 -35493915 -31654227 -6873565 5206482 -17269592
36161 -17269592 -51187402 -63925276 -56953658 -51562784 -51675833 -46010017 -32990787 -19149701
36153 -19149701 -2789444 18107103 30183104 20062718 -156337 -5192281 9486201
36146 9486201 28179690 45364517 68874572 91480808 88727903 55598772 19985532
36139 19985532 4563937 -2534268 -20068833 -37117110 -30493558 -6125876 6679404
36132 6679404 -1248906 -9737572 -6247017 -4548366 -16734729 -30116654 -27113308 -11464077
36124 -11464077 123854 -989008 -15602844 -42748798 -69597491 -70548429 -37761642
36117 -37761642 -1787585 1814175 -20150151 -28460754 -4866800 29586515 48862071
36110 48862071 48676778 36255350 19362053 11541944 22752799 36346024 21151622
36103 21151622 -22498381 -55425617 -52362035 -33466359 -23273040 -8792409 29721435
36096 29721435 70547655 74428482 45688516 27641537 37714638 46838750 31256187
36089 31256187 8081977 1933896 5275300 -3989441 -23331880 -28931572 -11300762 12463318
36081 12463318 21892590 14986805 4116036 -1513578 -4162783 -9705165 -15491697 -11167380
36073 -11167380 7035373 29095689 42915050 47018697 45953860 41543808 37876994 45623612
36065 45623612 67421351 85939151 82872780 65361775 56274320 61750133 67902856 68142663
36057 68142663 71271649 79636819 82965096 82483515 99018996 142845981 192530074 220701881
36049 220701881 230007319 247174326 287122765 336628651 371663423 381424478 375076655
36042 375076655 369011735 367494135 357842046 328905850 288450576 251415865 216990225
36035 216990225 174824775 131058615 105527389 100470400 96425822 86195238 86120548 100159526
36027 100159526 100276259 65587572 20049252 4127869 22632100 46559956 55556550
36020 55556550 51727346 40010210 23668507 15159614 23199991 30609946 13821238 -14825172
36012 -14825172 -15750084 20138785 54058329 53730958 36232740 35539832 50820780 54056815
36004 54056815 34947517 10502110 -4261620 -10552973 -11810472 -6973268 -113780 1032230
35996 1032230 -525451 6063909 18739955 21049093 7277121 -7140042 -9490264 -8899837
35988 -8899837 -18556194 -31564362 -31437690 -18424308 -6846854 -702319 7970403 16783545
35980 16783545 10851972 -11401199 -30883348 -36479561 -41260992 -54130148 -53283234 -12845134
35972 -12845134 51941736 92236627 80064301 35114486 -5479776 -23825585 -21623388
35965 -21623388 -5116933 14904431 20661302 2370540 -27158248 -44036512 -38194099
35958 -38194099 -19846008 -4200925 2512924 3504854 6256846 18725399 44267252 74733588
35950 74733588 90217802 73512667 31379327 -2532352 2275723 37535185 62511183
35943 62511183 51923927 24229200 11734162 17751865 21957828 16683454 13573739 19337483
35935 19337483 30102266 48419262 79471044 108410409 109406158 83896672 62583430
35928 62583430 60136535 56440783 36518013 19478793 26394107 44503872 48917690 40181151
35920 40181151 34057002 31129851 24741676 24838174 42710109 60577497 48018410 6783810
35912 6783810 -28391988 -34254602 -20120257 -4029949 8055338 15331405 15087616 8127722
35904 8127722 -3373868 -23860156 -54494173 -77110027 -67888460 -29753104 5997103
35897 5997103 14070268 -2048350 -21742025 -27272649 -12553389 13363612 31271567
35890 31271567 32057441 28257410 33311052 38409963 27881810 8098108 -1601639 975517
35882 975517 4617115 10156407 22765603 26541872 3087721 -27272754 -24052326 9508843
35874 9508843 24934575 2348832 -19493913 -7081063 18837153 28184024 34568386
35867 34568386 62987578 95889336 97320551 71036683 49900326 41105640 26956275
35860 26956275 12039951 22226774 54684480 73230795 63401435 52866005 61893807
35853 61893807 68963930 47692364 10027322 -13342357 -16206354 -13744832 -8842869 10239324
35845 10239324 40725964 58185211 45329490 13805978 -9162587 -6716854 19210281
35838 19210281 55124130 83186816 88125635 69147181 45280873 38665315 48858673
35831 48858673 52295259 32433714 1243378 -18145237 -21612064 -23600984 -31901932 -38764470
35823 -38764470 -35997773 -23424686 -1846685 26445977 48515314 49397276 33877178
35816 33877178 23006254 25212144 29524367 31347472 41016733 57411164 59110008 38270087
35808 38270087 19596617 24934299 40216542 40904956 29896528 22781028 14556794 -5426096
35800 -5426096 -19717938 -2514970 33240645 47672390 33090665 22951872 36256372
35793 36256372 51055734 45575207 29994195 18528208 1201133 -31928881 -62273859
35786 -62273859 -65355222 -46354153 -29074207 -21790670 -16696358 -12354687 -12131490 -6739079
35778 -6739079 16349805 46032574 52539752 24553388 -15267346 -37875836 -37521780 -27458519
35770 -27458519 -18272559 -10553933 -2370474 6017382 13133024 15198148 5553730 -17615310
35762 -17615310 -42315581 -49292732 -32442958 -7630640 5142357 4677574 5963149 17501727
35754 17501727 31632269 37228905 30889356 14563518 -5198131 -14022197 -2269868
35747 -2269868 14316678 6226655 -27779885 -52044692 -43392768 -26558362 -36510965 -65811015
35739 -65811015 -80968343 -76012534 -72414250 -73986905 -62933820 -40297908 -28294035
35732 -28294035 -26325769 -7649589 27061579 36707514 3531672 -29858119 -19316056
35725 -19316056 16781966 29044484 8841400 -10732012 -10421595 -2128983 2662710 6487404
35717 6487404 8811294 4440509 -955431 1462074 2293152 -15031286 -43232030 -56386287
35709 -56386287 -46501941 -30705522 -20903683 -11073926 1455802 5968025 -3025878 -15817611
35701 -15817611 -21690413 -17104139 1210717 32176578 58721081 61982050 49161146
35694 49161146 44304945 49832832 44861443 26108602 17112409 24271230 18805077 -14845058
35686 -14845058 -44786202 -38070225 -16337503 -25410074 -63690004 -84112123 -65109041
35679 -65109041 -37205387 -30032487 -31568835 -20059103 -5634167 -10972921 -28402153
35672 -28402153 -28256039 -5737057 8885082 -7112388 -37064781 -47201382 -27391826
35665 -27391826 3889952 27665482 41724518 49732716 48246238 33867231 15827099
35658 15827099 9501942 17231752 25016858 21968827 15395809 19098919 30733109 31479213
35650 31479213 11516498 -12576524 -15103451 5864771 23379988 14334948 -10860514
35643 -10860514 -21486108 -6052476 14298280 14545169 -5138641 -27798040 -46384452
35636 -46384452 -66823413 -87835843 -94659221 -78555542 -51123698 -30593320 -20674083
35629 -20674083 -12375014 -3107320 -2424800 -15853001 -32392583 -36717766 -29780967 -26040990
35621 -26040990 -28782074 -21701127 4738699 29423672 22028333 -12999912 -34450048
35614 -34450048 -13854963 30064217 58370309 59181697 52210851 56084261 69633096 82233026
35606 82233026 86540297 80916890 71053095 67942209 73933661 74387429 54937895 23207464
35598 23207464 660153 -3221345 4494156 15830336 25887677 26025923 12099754 -2623241
35590 -2623241 -1591371 10242388 15844685 16980470 30820197 56088304 70402781 64890860
35582 64890860 52905385 39559616 15613340 -8805550 -1917843 38880692 69220032
35575 69220032 57180945 28776844 22886485 30693282 19248735 -8042408 -19600268
35568 -19600268 -10549209 -3779652 -2285180 14518158 45553138 61365735 50027073
35561 50027073 32873101 25057111 14185010 -10347003 -37159783 -54269611 -64016919
35554 -64016919 -66819261 -56818399 -42526757 -43283546 -55734174 -54289882 -35161804 -25004303
35546 -25004303 -30789978 -20395306 21129500 52548907 29905063 -27184011 -61074679
35539 -61074679 -50288427 -21597939 -1788362 5062939 -281637 -16511246 -29340792
35532 -29340792 -25413683 -18361540 -33317379 -65836574 -83436627 -69360650 -39421776
35525 -39421776 -13712003 3557101 13710051 18115839 27379423 52558053 81769723
35518 81769723 87417348 62528265 29672972 9269902 180594 -3834429 -1833935 2873931
35510 2873931 2030493 1933592 20480293 54014102 71137317 54702633 28049967 21108271
35502 21108271 29487128 28287038 11249063 -6713207 -15708948 -17526589 -12608362 -665099
35494 -665099 9676842 10351212 10411110 25365923 50550628 62258798 48101150 21886534
35486 21886534 4220530 874662 6719167 20767720 46484402 79068189 101289517
35479 101289517 97626428 71734069 44426139 30886679 24592393 9931227 -14259888
35472 -14259888 -34208219 -41591372 -41338717 -38575854 -31934663 -23688670 -23246760 -34478822
35464 -34478822 -49868038 -60829789 -62392147 -46549179 -8556208 34428955 50019772
35457 50019772 26854892 -11119686 -35910043 -43462161 -39896013 -21740951 10999376
35450 10999376 39269351 44612014 33516141 23998602 19886948 15995269 14349920 14966563
35442 14966563 5664412 -15801234 -25319379 -5707839 18159580 9504818 -26496770
35435 -26496770 -53327098 -57309092 -52088109 -36988936 1658969 45861776 53233384
35428 53233384 22288871 2797041 19656021 31708017 -2718123 -58173315 -78904656
35421 -78904656 -55334104 -23165470 -4936955 7321613 21164182 32240994 40792949
35414 40792949 50350744 52187155 35771943 11061362 -3058814 -8074024 -19680801
35407 -19680801 -35909054 -35894478 -10292251 28080929 63077460 85392998 86962175 66097872
35399 66097872 36509363 12080524 -12736229 -46232963 -71045266 -61918772 -29626902
35392 -29626902 -13937188 -27151667 -36865187 -16754840 15095799 26106313 13497014
35385 13497014 -1038962 -2790487 8875744 30258216 51751262 57493921 42563743
35378 42563743 21600172 8391069 -1305824 -14371421 -22383582 -15619897 -2469109
35371 -2469109 3714576 7038071 18889935 33777834 36618226 29006712 26369062 30670584
35363 30670584 27658390 13044690 649898 -877740 -555369 -5579042 -5329934 12839769
35355 12839769 41730188 60311547 57715279 43639453 37345194 50179214 75324286
35348 75324286 92100289 84525196 57385583 29616968 12508304 2686872 -2722142
35341 -2722142 3850618 27955083 59069720 78172545 75740357 56499827 31615029
35334 31615029 13202859 11124500 24847380 39440578 38380477 21318104 2828137
35327 2828137 -6268306 -8831656 -11707366 -14666739 -13589546 -8389330 -1626667 6847496
35319 6847496 17001665 22191066 13515247 -7201081 -24978606 -27343824 -19481940 -17806491
35311 -17806491 -28482803 -38508103 -31467529 -7583684 17419589 30543865 30886677
35304 30886677 21463797 2980398 -17903407 -24360672 -7553984 14073216 10452066
35297 10452066 -20096136 -41800510 -24493648 15133834 32370121 9937715 -24831521
35290 -24831521 -40198810 -36918425 -34908331 -41118274 -48655840 -56485045 -67675999 -71954479
35282 -71954479 -53835305 -21460233 -3574793 -7132385 -387214 41990755 93328966
35275 93328966 101484971 55786521 892353 -18981672 -5577362 11635610 16655697
35268 16655697 14802369 15319567 23161652 38203662 48510097 34949216 -2093049 -31688120
35260 -31688120 -27171781 -2729381 7027157 -3784935 -11247338 -6291099 -6596093 -17211034
35252 -17211034 -14098527 14783694 41028938 33633127 4160141 -12736235 -7422375
35245 -7422375 4493572 16807409 35294132 51737311 47976607 27259305 13374465
35238 13374465 15055429 17281350 12680854 15557430 36196936 63709538 83108294 89311671
35230 89311671 78009109 45725490 7225896 -11693331 -10245787 -17303097 -46465719
35223 -46465719 -71559377 -65192636 -38874477 -23306702 -28143463 -42838398 -58379834
35216 -58379834 -64676559 -45189573 -1814137 30181394 21139879 -11396286 -28857591
35209 -28857591 -26355809 -28162623 -39648987 -43200278 -38569803 -45245157 -58762403 -45242537
35201 -45242537 5481886 55536086 67667797 51101099 37803783 35986185 31382242
35194 31382242 18937558 8253625 4142092 1290783 -3765129 -8709150 -12629217 -18612140
35186 -18612140 -29370401 -43433024 -54115270 -53950326 -44934719 -39306845 -41490130 -37329067
35178 -37329067 -15914528 6482829 5625418 -13215889 -22767658 -16302286 -12618807 -16186236
35170 -16186236 -6258252 23739831 48604522 49176346 37813075 27495075 6209404
35163 6209404 -32223940 -58971127 -44275177 -2813988 26513726 33330336 38099144
35156 38099144 51198851 60377543 56671070 47590134 43453716 47414024 56308017 59135039
35148 59135039 44461649 22788815 25866959 64708386 105228716 109575318 85056311
35141 85056311 63951596 51819418 31823151 8353240 4173256 16291537 15863825
35134 15863825 -3070518 -12672158 2236605 22039476 28326928 29200916 34155500 33862474
35126 33862474 22218849 12480053 13841640 15005003 7845540 5267448 18080142 34886551
35118 34886551 42732043 48037233 59112334 67741394 67755640 72289840 89713477 99676206
35110 99676206 79116853 39946842 15177566 16115351 27660459 38752659 51340854
35103 51340854 61734033 58710099 43844478 34006397 39332080 54217741 72197734
35096 72197734 93361160 113198756 120362520 113516384 108288417 117457360 131028889 126090920
35088 126090920 95947059 62593909 55687267 79726851 107886986 113203392 100058905
35081 100058905 94129209 105416935 119063643 125006921 134924166 157938978 179050708
35074 179050708 180637975 171267136 171020473 177908617 173974334 160902133 162836361 189768367
35066 189768367 221798155 238968830 246890781 259696322 273341824 273467621 262243031
35059 262243031 259822601 277846143 302958025 311370535 294929789 269225706 257403228
35052 257403228 267596435 285600411 288289272 264013612 222083955 185441849 173624946
35045 173624946 188346886 213124109 228934824 231114980 228848211 229946302 232495779
35038 232495779 231402160 224531064 209953389 186886208 164623416 160433282 179574212
35031 179574212 204923742 216286981 213467506 209087762 204962035 191591819 170957745
35024 170957745 163471678 184256796 221489481 247476959 248510502 236677901 231241727
35017 231241727 233925921 228660028 205336944 174949261 154402038 144212261 134622109
35010 134622109 129277986 143122805 173636847 195486787 194279313 185864805 186494966 183075384
35002 183075384 156835038 122859468 115859817 139483430 158585676 146868846 118018886
34995 118018886 100761643 103225218 113616164 120691217 120795981 114592974 107134443 104378993
34987 104378993 103750931 96440176 83477243 78825684 90433863 108901423 122121918
34980 122121918 130593985 139346891 144211240 137200622 120117768 103514638 95109883 94476145
34972 94476145 94510867 84734623 60772486 34658682 25938588 36779031 47091006 41944715
34964 41944715 30655486 27192668 25805198 14021043 -926204 -1297271 10714426 16140300
34956 16140300 12482554 17469652 33788896 38017301 20204055 9582180 35381408
34949 35381408 77861648 89030859 57364058 21413597 14479052 23925989 19101606
34942 19101606 -2560330 -17728292 -13183124 618102 7379027 176854 -19097529
34935 -19097529 -41787383 -54138723 -47454105 -26324283 -186900 27417203 51949240
34928 51949240 60009003 44927390 23422519 16456002 17361270 2689347 -25432811 -35588392
34920 -35588392 -13401359 14801520 18159003 -1335311 -22433118 -33774177 -31918116
34913 -31918116 -11729638 19401752 36229381 28135456 19630490 32691459 47084161
34906 47084161 31458407 -329508 -4459116 26023027 51737257 49028042 40960249
34899 40960249 52790182 72149410 74316880 60157048 46669956 39344675 34109578
34892 34109578 31855364 34239321 37924732 45229692 64566406 88216827 89318154 58011255
34884 58011255 22556449 14435631 27836305 35474855 31216101 32045772 45414858 59050346
34876 59050346 61520832 54144959 44012265 39869547 50073025 69582904 75945261 55545315
34868 55545315 26726389 17078445 24591854 24939514 12909985 8348396 18495821 23692740
34860 23692740 11068053 -3521772 -3640483 -927232 -13755572 -31588604 -26228882 5295838
34852 5295838 32517305 30581115 9845479 -2067529 5001353 18769730 26806367 29420608
34844 29420608 30463189 28874964 25889271 30788042 48816263 68072090 69768002 50491402
34836 50491402 24000461 1385386 -18578078 -37162143 -46879758 -42318993 -31257229
34829 -31257229 -27383804 -36095463 -50399198 -55692799 -39339840 -5138931 22560776
34822 22560776 22679325 5510680 -347869 9231734 7875995 -16258401 -36460651 -26917136
34814 -26917136 -2776273 3886843 -10189032 -25460236 -36601522 -52046186 -65500271
34807 -65500271 -60912306 -43305398 -33757604 -33245917 -21096390 8374054 37176111 55444909
34799 55444909 71443716 83039879 71261508 35345690 4965835 641080 7458095
34792 7458095 6005045 4246814 16170934 30534268 28056796 15676805 16889264 35143832
34784 35143832 49600580 43805490 21085545 -4819000 -19880501 -15146796 5349253
34777 5349253 26998543 43665638 63811013 87328764 92123922 62352061 18177877
34770 18177877 -4123359 4818509 23184887 29938862 22224196 7932022 1259420 18983360
34762 18983360 58496311 84767114 64806763 14032620 -17655184 -8093116 14905430
34755 14905430 18491502 4718311 -5860040 -6524981 -3779139 -1330986 -860263 -6987128
34747 -6987128 -18566938 -25496357 -24314075 -24862032 -31411722 -31930663 -20161646 -14215529
34739 -14215529 -33877645 -67892577 -84020367 -68633574 -38318107 -12915524 4581757
34732 4581757 16991209 18360368 1934323 -24210889 -40003974 -32529912 -8208152
34725 -8208152 14880558 24439088 22136167 16444244 12836383 13337155 18975156 25554523
34717 25554523 22728941 7891422 -3589756 3726991 19942475 20848397 5484821 205872
34709 205872 17583429 35131665 30559294 16547022 17888616 30580194 30820373 14953191
34701 14953191 2186142 1494278 2979595 1622015 2872064 2276063 -13026009 -35509691
34693 -35509691 -36346260 -5144178 31804461 46347913 41173988 32830954 21698563 -1427634
34685 -1427634 -32282391 -56098104 -65521256 -61279114 -44884913 -24642073 -17337534 -27457877
34677 -27457877 -35180534 -22936451 -4277936 -6084318 -29233070 -48791214 -49694958 -40638119
34669 -40638119 -33273151 -28679168 -26909004 -30909696 -35967290 -30366827 -11172665 12024568
34661 12024568 29627913 36336853 26005521 -1220783 -28205180 -35827060 -28511787
34654 -28511787 -24937283 -23617191 -2930189 39079524 71599017 70752479 50507662 38995379
34646 38995379 43208015 53497497 65138421 75541457 73381930 51281264 21814586
34639 21814586 4230277 1539586 3712230 4848686 4067738 -771304 -6188343 -3020
34631 -3020 20463828 37867684 37676940 29434163 28007155 27337491 15087168 1269774
34623 1269774 4766580 17919414 13588280 -13512231 -39910528 -49257150 -47934090 -40375178
34615 -40375178 -16597697 24619842 62760892 79239124 77720094 70073485 56990242
34608 56990242 33214047 534438 -31983846 -51248746 -43285665 -9309270 21046397
34601 21046397 15055343 -19206445 -38308601 -21476007 3276209 5039503 -6234540
34594 -6234540 -5300147 3264120 -2755921 -20441779 -25261564 -12606801 -4007231 -9441638
34586 -9441638 -11505270 4657799 28280472 41523496 44709945 50196236 61373755 69840228
34578 69840228 68840177 60609077 51280753 43267111 33640289 20023761 7566315 5895985
34570 5895985 16907264 31484810 42683779 54043487 66256895 64071290 31642436
34563 31642436 -21007206 -62116667 -71968826 -60717581 -48609250 -40284297 -26646414
34556 -26646414 -4073811 18367544 28783801 22728050 4395385 -17136046 -32469354
34549 -32469354 -37067960 -34153069 -30718123 -29373170 -26523590 -21276217 -22651326 -39779668
34541 -39779668 -63763134 -70128356 -47690121 -16593149 -5028658 -13608317 -19036363
34534 -19036363 -10702527 -2972828 -6718164 -10562648 -3430241 2267109 -10903082 -34560762
34526 -34560762 -43084086 -29743517 -15473470 -18977289 -32137065 -31391846 -6753960 25583082
34518 25583082 39042138 25163548 4393839 2838802 20787103 36329804 39709595
34511 39709595 44626636 58156159 61894244 40848967 13162175 7137091 19804129
34504 19804129 23622380 8409661 -8379449 -11238256 -3661936 3670908 831727 -22534994
34496 -22534994 -62435047 -86723986 -64765643 -13813267 14452773 1190410 -17654908
34489 -17654908 -9871170 6666413 851651 -17518790 -15819390 5507976 12932093 -8003313
34481 -8003313 -34334939 -43620870 -40700495 -36215144 -23754599 3507554 29588593 30719188
34473 30719188 8534039 -10538486 -10986567 -7268633 -18249520 -34130560 -25731979 13413412
34465 13413412 51049602 52224646 20822442 -8618702 -15211591 -12063466 -22011359 -47976519
34457 -47976519 -72878623 -78730767 -60448995 -28472746 -1919143 6935125 3147075
34450 3147075 -1187217 -3980399 -9050736 -10225087 1462107 14905819 6618912 -22090266
34442 -22090266 -39629453 -28098424 -8856749 -6114087 -8666174 5341651 24209327
34435 24209327 17607083 -12840129 -33312197 -27913978 -15154447 -9125987 1391801
34428 1391801 21262092 27953976 5213101 -24974317 -30601747 -15283536 -8881435 -20960688
34420 -20960688 -30724535 -21923284 -2921668 12204702 21842158 29357157 34997319 43367819
34412 43367819 63148392 89307661 99857596 82764854 54130020 35737340 25824257
34405 25824257 9891029 -8466663 -11177245 888477 2753489 -18631999 -43621893
34398 -43621893 -47770644 -34814215 -26760321 -32559430 -42736429 -47224790 -42470471 -26999459
34390 -26999459 -7093562 -2450238 -26301005 -59729575 -66705637 -40795243 -17654034
34383 -17654034 -29541702 -63334882 -80480152 -68728850 -53411590 -57505645 -69667660
34376 -69667660 -61665888 -26548748 13987616 37396599 42191990 38955863 32188494 21230201
34368 21230201 10211169 2140446 -12281056 -41616787 -69694943 -66434792 -29153221
34361 -29153221 8901659 22471007 23528099 29639144 28599450 3614934 -25619943
34354 -25619943 -24928753 -812231 5615411 -18602878 -38885151 -25771627 5628988
34347 5628988 22659072 14959609 -6617034 -27553297 -32638482 -12553479 20077678
34340 20077678 40209421 43612890 47546788 52541992 35702537 -4014541 -27802015
34333 -27802015 -6829410 38696670 73489203 90820831 95896684 77603374 33481225
34326 33481225 -2461476 1548144 25547374 27434080 8005202 4285467 27584894
34319 27584894 51902668 60532379 61904801 58246392 39239675 11778823 -1743941
34312 -1743941 -1825442 -13414828 -41476465 -59065250 -49239022 -27145040 -10946171 -1591838
34304 -1591838 -451020 -14956449 -35614942 -38625612 -23109006 -14932534 -22640774 -23530878
34296 -23530878 -6894105 5790903 2381685 4368712 25219473 40128662 27498531
34289 27498531 8690754 12186328 25980278 23374467 12662713 19684745 37934106
34282 37934106 39153263 23749841 18430813 27546427 27375820 10554679 -1606146 2258735
34274 2258735 6297076 -1355797 -9568741 -8709828 -8887982 -19249364 -28932674 -23592657
34266 -23592657 -6875917 6997990 11675138 10707873 10316885 16521325 30731230 43835969
34258 43835969 43781243 31835344 20947719 15567241 5407979 -16432409 -41606473 -59205530
34250 -59205530 -69099930 -74357933 -69771267 -48796271 -17585753 7777975 18252637
34243 18252637 20140064 25286645 36616577 45743971 43922134 32446725 20533019 15328685
34235 15328685 17265602 22760957 26726100 25343972 22636488 29623563 47207691 55951490
34227 55951490 38934383 11048327 4146880 22484666 38201737 36511046 36052545 51075338
34219 51075338 63577945 54854634 37677498 29929913 21027100 -2261111 -18110691
34212 -18110691 1818653 39725894 50572897 27470573 5288681 973356 -3788167
34205 -3788167 -14660483 -7085935 25849505 49159237 34034705 -2131854 -28593842
34198 -28593842 -45373944 -66851685 -85190636 -81715994 -60846967 -44798311 -42688477
34191 -42688477 -47066656 -53165164 -60699693 -61959052 -46659343 -16889711 14103753 33466731
34183 33466731 32318890 9102439 -21214442 -34254613 -24000697 -10931618 -12157084
34176 -12157084 -19432114 -19564577 -17710416 -21714371 -20311633 480775 32075086 56546380
34168 56546380 73012482 87953368 92299425 75907876 55128759 54590057 65442794
34161 65442794 53642306 11459567 -29553486 -42715755 -35330027 -25395120 -16353820
34154 -16353820 -8181929 -10160152 -25277751 -38352644 -35923240 -25797251 -22823396 -25948347
34146 -25948347 -23204328 -11376985 1918209 9868379 9678004 -341148 -16641098 -26663330
34138 -26663330 -17649475 11657989 51234296 86757753 102759821 86738080 40109312
34131 40109312 -15157952 -47565017 -39388825 -3341620 23734011 11941514 -29834405
34124 -29834405 -59944118 -51281976 -24341878 -18359799 -37715187 -49987296 -35534115
34117 -35534115 -11624923 -248783 1080572 1919062 -3340179 -19208869 -29398147 -18083534
34109 -18083534 1770954 6480943 -1052275 1516895 17242823 27209370 26623415 33363153
34101 33363153 52477459 59992316 37518649 1407660 -20756482 -25508056 -25016817 -17888733
34093 -17888733 5017810 31086457 30405064 -4149889 -42511836 -53113239 -36604204
34086 -36604204 -12474695 12057559 40784572 64813573 63999507 36359982 8056737
34079 8056737 3832454 18541954 28579031 23233463 12364002 7832508 11095379 19221568
34071 19221568 30904974 43310270 52907976 63838778 86700157 123056697 158474872
34064 158474872 179174013 192166896 221045513 281146324 362555546 437809304 484290112
34057 484290112 498719757 490013172 460128167 399671028 308429867 212008354 142773686
34050 142773686 104807451 74144661 37333431 10922861 12303313 29596472 38949268
34043 38949268 39130711 46593344 62319285 67183108 50948801 25055926 2877264 -13967435
34035 -13967435 -24543491 -22747794 -11136844 -3824729 -4855004 1190141 24079222 46930147
34027 46930147 46536139 25650921 8107096 6746739 12595023 14647620 15445463 23995476
34019 23995476 42900709 65119556 78194316 73508927 57576395 50038049 61645427
34012 61645427 78190489 77181852 57598684 40414919 40375547 50854658 58303170 57540358
34004 57540358 47876159 27744679 2442991 -12452457 -6464510 11150109 20608338
33997 20608338 13525455 62036 -3690303 9178432 31934835 50515261 54681685
33990 54681685 45052640 29422952 14079963 1700546 -5357199 -6550014 -6327246 -7146991
33982 -7146991 -58216 25794815 60888725 75206891 49305593 -2577617 -49112018
33975 -49112018 -74434464 -83878077 -82591894 -62786912 -16909430 43159121 87229159
33968 87229159 90948510 59786888 24746697 9672618 8237026 1747336 -8636833
33961 -8636833 -6293531 7150441 8483258 -9485177 -23957277 -21599535 -25409956 -56292984
33953 -56292984 -89499413 -84174827 -44398786 -13097447 -8987848 -8778261 3743649 11012381
33945 11012381 -1432066 -16530055 -15189143 -5298157 1639201 15758039 42699252
33938 42699252 56089453 31098276 -10170456 -24235145 -8424262 1812758 -4521429
33931 -4521429 1910755 32741803 49992295 19251099 -35007586 -62139449 -57375198
33924 -57375198 -63593928 -102543870 -139572025 -130849597 -81963663 -38350152 -28094216
33917 -28094216 -35440893 -30927389 -10007595 6830734 3086773 -15016667 -27434460
33910 -27434460 -22079083 -7245519 -3426847 -19914751 -39650589 -35868924 -8148181
33903 -8148181 9786160 -9537847 -48648673 -65988775 -51698578 -38641155 -52693433
33896 -52693433 -76462127 -77279277 -52381962 -26322256 -15811555 -18449823 -28945669
33889 -28945669 -44121420 -53128381 -43242801 -19267676 -1691749 -755473 -4047253 5917719
33881 5917719 30836891 56476277 67139386 59851625 48270895 48178291 55163447 48416143
33873 48416143 25781336 16658007 38499025 57410910 26627221 -42336087 -87320111
33866 -87320111 -79065132 -55526443 -57199104 -68972272 -54873142 -17799879 12005801
33859 12005801 25908677 36281718 41937007 32836316 20377491 23993894 31603881 13781736
33851 13781736 -21009393 -27918355 6699261 40024330 35070707 12053712 9826053
33844 9826053 25978926 30744444 20850122 19806441 30966610 27621721 -4934197 -46234365
33836 -46234365 -68907481 -68344632 -53984322 -29755197 2470254 31332474 42557936
33829 42557936 34349116 18707091 9538185 12451468 21677788 24172321 11894648 -7132687
33821 -7132687 -14947723 -2892527 20644103 42533026 56639420 60556434 51184773 31618131
33813 31618131 14987455 11138683 12636761 3174497 -21165169 -46690912 -57557159
33806 -57557159 -49311376 -27462426 -1237095 17975859 18993539 -1109193 -31437034
33799 -31437034 -53716502 -57148739 -47845523 -42223387 -48475648 -55674833 -46452424 -20770257
33791 -20770257 1248102 4241396 -4352805 -10007603 -15146426 -31795276 -54938382 -63157240
33783 -63157240 -49250047 -31842507 -28124111 -31145396 -26340780 -17017976 -17651378 -30748921
33775 -30748921 -46399212 -58577849 -65989375 -62025534 -41978048 -18298850 -10537123
33768 -10537123 -19450416 -28214837 -29641757 -32268294 -36963338 -31392330 -16593150 -14262702
33760 -14262702 -30938023 -36888963 -4388963 48660806 80593761 82059519 80949857
33753 80949857 93918372 103169996 87938407 53817993 19799272 -4832773 -20186850
33746 -20186850 -28689313 -37578096 -52710429 -62327789 -46533333 -13347248 -1902243
33739 -1902243 -31195725 -67317463 -67171124 -37151555 -16869837 -16966722 -11426569 10461357
33731 10461357 25352643 18996953 11438887 20846281 33160855 31229432 27761733 40399618
33723 40399618 54346912 43288403 15290347 3008716 12901531 18855532 8632703
33716 8632703 2944424 17930888 37656491 39994309 27649926 15945933 7577393 -1287361
33708 -1287361 -2656484 15280208 47277234 73341846 78618474 61343402 28244926
33701 28244926 -6386760 -23580215 -14647319 9083530 29483001 39642794 42295199
33694 42295199 39448081 33327987 28609898 22957347 5358592 -23622399 -41600124 -31441326
33686 -31441326 -8900322 -3388640 -18502966 -33308978 -36921313 -36273804 -30934388 -8454690
33678 -8454690 28363546 53805789 50153285 29130262 13733738 13465932 23088950 29758282
33670 29758282 17133111 -19137287 -55788151 -62693156 -43792835 -32907971 -43133981
33663 -43133981 -50824975 -40599958 -29720828 -26443571 -2479534 57659133 111529367
33656 111529367 108528601 64428361 37516036 42717149 42128204 18401418 1521642
33649 1521642 10708373 20960611 10030316 -4389965 -2677111 -2632563 -28187516 -65975254
33641 -65975254 -86296847 -86495068 -81085439 -66696370 -32221396 7067139 20738549
33634 20738549 5181321 -15534557 -28782571 -44529067 -66248832 -78269945 -68356871
33627 -68356871 -41848337 -8999558 22423120 39863798 33377920 15538921 12956337
33620 12956337 31042135 47104849 45866588 40645777 48274240 63350852 72413592 76524353
33612 76524353 82640059 86289163 80623487 71336794 64235487 48207426 11996775 -28117491
33604 -28117491 -40572795 -18664320 12170615 30065929 39448228 50788672 56967750
33597 56967750 44837309 19417141 478862 -1777171 4899005 10528600 16096417 26840793
33589 26840793 38841537 39076533 19703574 -10335036 -31010197 -30504886 -18034876 -14552766
33581 -14552766 -29809552 -51008132 -55788329 -34859922 -269655 27168047 36247263
33574 36247263 31742531 25719651 25324480 28909043 30713363 26040103 13061978 -5730677
33566 -5730677 -22372392 -27904777 -21331527 -11525421 -7056746 -6757037 -4496954 -1024159
33558 -1024159 -4720928 -19062266 -33703441 -31929370 -7572096 26169915 46451071
33551 46451071 41814192 23156722 10154551 7423842 1374703 -16658181 -33278087
33544 -33278087 -27428371 3078582 38174964 55598303 46657487 16787099 -18152505
33537 -18152505 -37853709 -32213446 -12145248 3008903 8681621 15545609 27630350
33530 27630350 33632709 23038541 -1832989 -33785859 -67435763 -92191925 -92183890 -62788673
33522 -62788673 -18502237 21902887 48690257 56616748 43021776 19086592 7463668
33515 7463668 16621946 30362010 33352113 31520519 34616599 37127036 34135008 37050868
33507 37050868 50384759 50833571 18706274 -24136714 -41202662 -35537538 -39110792 -54314104
33499 -54314104 -50065192 -19958265 839944 -9019706 -25415455 -22489273 -11418673
33492 -11418673 -10994002 -12439919 -2801286 4144134 -7805119 -23816406 -20559244 -4264506
33484 -4264506 4582755 8175328 21206935 38074124 43038779 41200384 46186038 48110548
33476 48110548 29620570 5243604 6026004 28966155 41220722 34262971 32914370 45983235
33468 45983235 49608483 30779071 8597172 -2381818 -13247200 -28237473 -27889164
33461 -27889164 -6628532 7509736 -2553712 -10730508 8123639 30527296 19406926
33454 19406926 -13620661 -23135858 2945264 31427834 36668459 28282726 22572859 20038497
33446 20038497 21004794 35507511 63230551 83180667 77271911 51616407 25026607
33439 25026607 7883910 54118 -2022844 -5629623 -20399056 -46767404 -69922494
33432 -69922494 -72453459 -51942343 -23278319 -5029614 -3695878 -9022271 -5907276 6796949
33424 6796949 12845071 -2145028 -32707094 -60740635 -76001691 -81933089 -85226395 -88164393
33416 -88164393 -88489183 -79073728 -51722504 -10551871 22622713 28308602 13746685 5959123
33408 5959123 19733765 42639859 52956764 42405876 18423334 -6905602 -24718495
33401 -24718495 -30840986 -24347608 -6361436 17053978 31749154 24482374 167087
33394 167087 -19236170 -20743133 -15032422 -15397907 -15560590 -5233892 4574248 -4120478
33386 -4120478 -23260486 -27304320 -13699514 -5759622 -11116913 -8585555 12064040 28532828
33378 28532828 24410584 21516247 45580123 80143082 88291544 68644769 53857520
33371 53857520 56373490 52199238 25684723 -3187138 -12678915 -13936820 -29589280 -55903469
33363 -55903469 -70651328 -67845847 -59805300 -49440090 -26121128 7810073 29877510
33356 29877510 27532723 18528437 27804092 55236995 79590324 85282623 70239251 34775437
33348 34775437 -16885263 -63465423 -75669693 -48751200 -13787138 -5197602 -23979872
33341 -23979872 -42475426 -39357212 -19109272 93572 6785164 2951993 -2435780 -3832434
33333 -3832434 -5572888 -17498868 -41717056 -65824179 -73251229 -59666848 -36698300
33326 -36698300 -20636776 -18906001 -25343380 -27445495 -20520121 -14131144 -20437391 -38300616
33318 -38300616 -56483841 -69919005 -80269451 -81205982 -61582066 -29068414 -10793528
33311 -10793528 -18456624 -31642327 -31800241 -32547465 -51751200 -70605128 -53926210 -3981735
33303 -3981735 40746870 59812301 67487332 69886892 46390612 -5576326 -42138534
33296 -42138534 -22834362 30059798 55314266 27578176 -20848793 -49667380 -52988580
33289 -52988580 -47334550 -42752313 -39970422 -41761878 -51385096 -63538877 -67283256 -58725836
33281 -58725836 -46024805 -40705910 -45689303 -52247120 -48210113 -29376931 -3981845 12958760
33273 12958760 10763914 -8103037 -29424678 -40523526 -42189431 -42187835 -38482429 -21466104
33265 -21466104 3379603 12572754 -2044709 -13052355 7339268 42051367 46282409
33258 46282409 7076911 -41885274 -66736472 -66177123 -52229907 -29531809 -8138830
33251 -8138830 -8616324 -32739756 -49650605 -32979057 4315341 31744564 40914986 41302224
33243 41302224 33060666 12132707 -7037744 -2886443 20929638 38779239 39299650 37167241
33235 37167241 46065233 58757457 60211141 47811948 32315965 24402018 22151399 11207700
33227 11207700 -16768358 -45776088 -49556351 -27514664 -6500197 1825695 19075475
33220 19075475 57341305 86537355 75165463 41618866 27250146 33753476 29778991
33213 29778991 11445932 9258679 31946460 48159822 35333100 8065463 -15477839
33206 -15477839 -38623024 -61149875 -64480388 -43535893 -23494039 -22119524 -22150030 -4664650
33198 -4664650 15199004 12279415 -9351451 -27344077 -34128472 -34369080 -26129685 -10225402
33190 -10225402 -2842777 -11464642 -11908125 20386749 65538333 77834372 46852445 10233094
33182 10233094 2227155 15276549 20735245 8207700 -6804525 -4721548 16182278
33175 16182278 37605854 41772872 33857453 34134126 45906781 49123913 34488102 21593671
33167 21593671 25757022 29351670 12313882 -7728038 845629 31546447 47524810
33160 47524810 36628689 22628258 21400766 22470541 20057815 26994464 45650743 56194157
33152 56194157 49043125 42654857 53745928 73247113 85503004 87291707 74138553
33145 74138553 35142544 -19312442 -50715919 -37437390 -5380155 9988945 10100520
33138 10100520 14136159 16304512 290658 -17241547 -484160 48871832 87634174
33131 87634174 90206927 77287430 74755276 76265281 64952833 46606539 38423956 41544666
33123 41544666 46685995 55474200 74201462 92231169 87805327 57014795 22005739
33116 22005739 6424169 12455124 25576346 33987358 37499585 40260034 40487132 30620810
33108 30620810 7085276 -24103401 -53549799 -75133218 -82085527 -65264586 -28475836
33101 -28475836 -324068 -10539443 -49803126 -72049983 -47849934 -450871 24730455
33094 24730455 12946179 -14334521 -34940648 -44781189 -46013767 -39835169 -33636177 -36211140
33086 -36211140 -41555441 -34629401 -17935558 -13843029 -31777191 -50665822 -47330697 -28551007
33078 -28551007 -18839056 -25106449 -29909413 -16365523 13428474 43345024 56912208
33071 56912208 48799492 31488058 27014166 43496912 64186210 68323235 56239934
33064 56239934 42411505 31218410 16583078 2398677 3746510 24401242 49437919
33057 49437919 65296223 72185534 70153149 48729208 3058390 -49093101 -79179385
33050 -79179385 -73535272 -40793690 146158 32149079 46113164 45000628 39943528
33043 39943528 36614294 28474354 8392757 -17830323 -36378659 -40522403 -34011634 -22131326
33035 -22131326 -7336963 6079710 10300019 1229460 -14399719 -22666714 -15715994 -1473791
33027 -1473791 3513088 -6294372 -17042778 -11904643 8175666 27563302 35846735 34587038
33019 34587038 27303377 16377477 10464099 20404328 43369157 63166222 70199993 69017790
33011 69017790 63695854 51914827 38595409 36479417 43300137 37346029 9739026 -17079704
33003 -17079704 -21141345 -14498669 -22333951 -41778658 -48368743 -36422744 -25285437 -26754309
32995 -26754309 -32573103 -36831773 -45816544 -58890588 -61631692 -47939083 -31955115 -28734384
32987 -28734384 -37150234 -48938778 -59654360 -63007482 -50155965 -25485331 -9998559
32980 -9998559 -16985555 -33826096 -38182455 -23504306 776661 24848803 43144849
32973 43144849 50852622 47555758 40083072 32197525 15601837 -18991563 -63938805 -96749816
32965 -96749816 -100943739 -80114393 -51683785 -30472585 -18614088 -9884838 -2470961
32958 -2470961 -2985889 -13804956 -22407154 -14531861 3030125 5935505 -16837357 -46150139
32950 -46150139 -53975181 -35012387 -10348001 -2837538 -13448629 -21667557 -9581859
32943 -9581859 14339934 22119581 1540332 -26066456 -34770127 -28981715 -29794211 -35987934
32935 -35987934 -27495126 -6672639 -2901372 -26412964 -48994068 -47965254 -40908483 -52619871
32927 -52619871 -71515613 -69283819 -47527362 -31297486 -24069012 -3436548 35953772
32920 35953772 64685748 54511344 13642407 -23873417 -33417992 -18998598 -4952517
32913 -4952517 -10765481 -29482317 -34705932 -14170544 13203899 23423954 18145532 13801563
32905 13801563 12645063 6760289 2195551 12846339 33402136 44935596 47420162 58868595
32897 58868595 78577546 81177049 57703475 34635270 35955090 49945581 52757616
32890 52757616 44904488 42537676 48022831 52123505 53954716 55823268 47388580 19924169
32882 19924169 -8622977 -9573750 13970889 26417279 9430584 -11065086 -2705142
32875 -2705142 26319104 39109484 20600995 -5789277 -13027831 -2794776 5215459
32868 5215459 2197961 -4474077 -7278065 -5990232 -1740191 3621273 3256411 -5830223
32860 -5830223 -9522222 10169944 43042747 51680931 18413707 -25162851 -34821985 -7791588
32852 -7791588 22081521 34307244 39443409 48223232 52280121 44565456 35829723 37817372
32844 37817372 46170973 50896234 49612759 41293275 22277921 -762265 -8949022 5217237
32836 5217237 25434197 34391272 34837173 35073604 29755245 13726785 1809327 12453064
32828 12453064 38749956 56440405 56044000 47713796 39105457 30010731 26848391 39318168
32820 39318168 59435785 64427826 46419693 22396554 9687213 8329388 13064851
32813 13064851 24462220 38753171 42725641 30615342 14262724 6549437 6376423 9159714
32805 9159714 18166291 32862296 39761238 31604903 24810596 38178861 61042805 63947852
32797 63947852 39145697 9722079 -3008807 -619892 8437614 24147312 42593999
32790 42593999 46544970 25803340 -3419217 -16067339 -8438374 4877651 18202797
32783 18202797 39336984 66506136 80227882 66608667 36435005 12357247 5593857
32776 5593857 12847851 27880495 45361268 56342806 49629748 20399040 -24098929
32769 -24098929 -66188226 -85609287 -72198425 -35352398 1694034 19365330 12489630
32762 12489630 -12144522 -39961817 -52151552 -38684766 -11647673 6234801 9470434
32755 9470434 11372262 14308070 1073369 -30822156 -49902061 -29993473 8374537
32748 8374537 25048237 17103371 15258875 28925062 32526328 11867242 -11313810 -14433166
32740 -14433166 -4311719 3382691 9102706 16419414 17331834 9544616 7754900 18652664
32732 18652664 25119202 15886893 9691307 24960023 45312160 45105902 32926926 35158094
32724 35158094 47391807 40882749 14592475 1035413 13189990 21623051 -476574
32717 -476574 -38518573 -61651670 -64451748 -62415784 -60714979 -48936340 -21235258 13897894
32709 13897894 42150696 52923641 44152083 25059780 11112378 10705948 18368928 22251758
32701 22251758 14558561 -4705563 -27875877 -43279294 -44555489 -35432509 -20755641
32694 -20755641 1098445 28234924 46371235 45087339 36443214 38414480 44171141 31400971
32686 31400971 2509971 -11359216 5509062 30016321 33912095 18949967 2368101
32679 2368101 -12705936 -31008761 -43482650 -36077876 -15057457 -3146966 -10495954
32672 -10495954 -23974903 -25867004 -12532050 5554921 14523023 8737752 -3158827
32665 -3158827 -6938468 -1077195 114943 -13259940 -30668675 -32143784 -9992182 24621562
32657 24621562 50088716 47457158 16280683 -18549252 -28271465 -13652620 -3221714
32650 -3221714 -13250072 -27633631 -26504437 -14301007 -4939883 877480 4763261 -3600147
32642 -3600147 -25737858 -35559342 -9709417 33721833 55738031 48574520 38011198
32635 38011198 38794212 39965924 34704416 31885372 31714952 20066953 -3174047 -17590316
32627 -17590316 -15609977 -16492046 -32997477 -48207165 -42224471 -21047090 -1852704 10428051
32619 10428051 13746245 -2612418 -36040653 -54236296 -29777114 18142731 44574703
32612 44574703 36560606 22128659 22907277 28602717 26872340 29714943 50546000 73421064
32604 73421064 69170364 35926765 2440050 -9656319 -8493081 -10723723 -13981061 -4724595
32596 -4724595 15653435 31315120 38136016 49819440 69616306 73564897 39543647
32589 39543647 -16255467 -52250808 -49586704 -29489906 -21109815 -29868257 -43011811
32582 -43011811 -49134733 -41615252 -16339850 19829391 45543565 43185671 19029912
32575 19029912 -2825650 -5179324 8708258 23426096 28212498 26399285 29649887 41394784
32567 41394784 49336411 41264868 24604138 18029521 24308475 26489678 14193377 -2245710
32559 -2245710 -10427178 -13007502 -16506201 -17216253 -10266730 -1022187 4437417 8993578
32551 8993578 12630519 3344597 -24805801 -55168633 -67310973 -64529411 -64970267 -71412831
32543 -71412831 -68747733 -49331714 -23840633 -6633524 -3374227 -11724850 -22261764
32536 -22261764 -21642007 -6806286 8179324 10791986 7431403 7680714 2773243 -17488847
32528 -17488847 -34729429 -18835671 24275570 51321658 36388654 1570106 -18278730
32521 -18278730 -18205517 -15718671 -19970442 -26054925 -27502654 -19488265 551180 23440333
32513 23440333 29351606 9758166 -20277770 -40062311 -42636572 -29149731 -215111
32506 -215111 34123364 51530750 42977227 30594475 40744674 66158076 73801933 46719262
32498 46719262 822520 -37054725 -50392965 -33895199 6940138 51517305 74326381
32491 74326381 68332560 50889666 41327097 39331922 30963735 11877391 -2093738 9113166
32483 9113166 42883344 68281001 56352029 15601943 -15245570 -13769980 1851275
32476 1851275 4475514 -2444700 4297459 27059292 40800842 27440879 -2029492 -23917845
32468 -23917845 -26105272 -11445123 11028075 31802068 44317928 46457615 36427003
32461 36427003 11625120 -21478961 -43496875 -41519662 -28771578 -30174900 -49766827
32454 -49766827 -67662621 -68755848 -57318476 -41655572 -23597156 -9289566 -11289039
32447 -11289039 -28233554 -37004746 -18952806 14950105 36235342 28898004 -1082630
32440 -1082630 -36359385 -57291784 -49059207 -14141289 24330135 41729615 33622682
32433 33622682 13148272 -7493851 -24562142 -36800820 -42597530 -42341473 -36440741 -22981812
32425 -22981812 -4525917 5519528 -6730183 -37139362 -62881251 -64207558 -43339930
32418 -43339930 -18803711 -3867273 4295526 12846129 17191098 6605304 -13567444
32411 -13567444 -19477518 501124 23416206 18025714 -11503519 -29756679 -19188193
32404 -19188193 -1571915 -1879013 -13515524 -15583251 -6442845 910277 4552644 11286860
32396 11286860 14502439 -1852210 -35432131 -60771110 -57953561 -33192217 -7176740
32389 -7176740 5322590 634645 -16815898 -35139342 -39988127 -26946897 -7237090
32382 -7237090 2973749 -1173450 -8782845 -5257015 10968332 25907562 27398196 21231397
32374 21231397 21952107 30517853 33781053 26137241 16066514 8542621 -486306 -6575396
32366 -6575396 3543425 23388069 22854462 -7967600 -35309491 -28212296 -6221893 -6524223
32358 -6524223 -21052492 -9046584 34325310 66436394 58164997 26060767 -4517675
32351 -4517675 -29097878 -43460689 -31237833 6467798 38548736 42210269 29697694
32344 29697694 19942302 10371096 -4255425 -12608332 -8522353 -5870384 -8858671 4891744
32336 4891744 44658295 77853059 73643384 50547499 44183284 50509775 43091854 27499741
32328 27499741 29386298 38980102 20156412 -24511757 -48053185 -27661586 5483112
32321 5483112 17561784 12240595 4333083 -6980249 -18836141 -14682203 3696805 6900837
32313 6900837 -14809289 -26526478 -182609 37113991 40662371 12938846 -5698791
32306 -5698791 2963445 20806238 32007156 40691686 49816084 52501666 49009362 49121891
32298 49121891 53617820 52733505 44971832 38597966 33294141 20195457 2616982 -3845102
32290 -3845102 2973226 6083982 -2613935 -7766442 3646780 17892637 12282644 -11717294
32282 -11717294 -29178118 -21840073 5440398 35970837 55289657 52837666 24667096
32275 24667096 -15599540 -37737044 -22248424 12826672 26500222 2761902 -28071413
32268 -28071413 -27219171 3245305 25663255 16156397 -11505647 -31963952 -36677783 -29688501
32260 -29688501 -15155562 -463136 4430954 1773401 4101184 7502622 -11574083 -55867183
32252 -55867183 -86700035 -70498850 -28404675 -7613550 -15488159 -19094612 -5153023
32245 -5153023 1294435 -14972891 -32065955 -29632179 -22920320 -34395963 -54188010 -54616136
32237 -54616136 -30475146 -2135481 13355677 16281734 15619462 19936546 30135499 32052116
32229 32052116 8275209 -32508234 -55246072 -43737632 -27279699 -37990912 -58379794
32222 -58379794 -45721504 -1211809 25709876 9225536 -14967285 -3975688 30283844
32215 30283844 43629356 26468340 13463558 29255497 55901795 63320591 48953263
32208 48953263 32259236 24741826 22737298 22310780 23786168 22730965 12094665 -3484900
32200 -3484900 -8504760 2669110 16618332 18827911 10337848 -1422586 -16643471 -35340118
32192 -35340118 -45751316 -37763086 -21763058 -14805945 -11522075 8127980 40511856
32185 40511856 53905805 32840786 3490382 -1666033 14404569 26038744 22791449
32178 22791449 11401130 -6768947 -31626289 -44065806 -21688451 21394943 39883264
32171 39883264 14422173 -20139195 -20135703 11307131 34362298 27244726 8202578 3334736
32163 3334736 11010383 6515772 -25447112 -70323336 -96528623 -87912868 -61199600 -46805913
32155 -46805913 -53755290 -62762865 -56509728 -43898610 -43336941 -51695383 -47838069 -25822481
32147 -25822481 -5409435 -2139861 -3673547 8802470 26810693 24759221 3357326
32140 3357326 -1916107 31428513 75409941 83285146 48965206 9870787 -6959499
32133 -6959499 -12852955 -24174643 -31200188 -22067069 -15651607 -39142666 -81432266 -100421343
32125 -100421343 -78240649 -41563466 -20924106 -16468675 -16175981 -22749793 -40726124
32118 -40726124 -53391202 -38822467 -4643965 15055782 -223042 -35618258 -61712628
32111 -61712628 -63955431 -47166405 -22625530 446803 15508467 19000355 11878590
32104 11878590 -354197 -9822087 -10427214 -2067903 9981194 21198431 31547786 41603564
32096 41603564 47919438 45574930 34021397 18368198 6892738 8741298 29510427
32089 29510427 63563597 92149212 95550579 71027234 37921844 21807105 30480152
32082 30480152 46007533 44945482 27262724 17228874 30261536 49103066 46149669
32075 46149669 22645046 6990157 14996957 32563651 42328227 45880605 49145376 46323976
32067 46323976 34345336 26266658 31632687 37841519 31673787 26334530 42281804 69839364
32059 69839364 77905399 56610589 25623095 1444592 -17028914 -29347021 -28140564
32052 -28140564 -18804469 -17997833 -24095075 -14593577 17003224 47348554 58310723 59365013
32044 59365013 59907556 47558858 16074454 -10746072 -10133612 5586752 14049642 21208522
32036 21208522 41220193 56113582 36630610 -5296293 -26840499 -15814706 -1841205
32029 -1841205 -3955587 -8777272 -8996210 -21028063 -47877642 -63090214 -52483873 -36302410
32021 -36302410 -27686186 -7855974 26956463 33991420 -15201291 -73077834 -71119077
32014 -71119077 -20261600 3083229 -31760198 -73464924 -74552533 -53599319 -44255706
32007 -44255706 -34881806 -2773300 28160725 16442392 -27080759 -48780219 -29921692
32000 -29921692 -10478649 -26075296 -57876108 -63968837 -35848335 -2204108 9991601
31993 9991601 -529009 -17656266 -25421478 -18966150 -7309858 -4396785 -12880257 -20520095
31985 -20520095 -16980949 -8459602 -8513312 -18354487 -24820613 -17316140 514360 17047517
31977 17047517 24103299 19026533 920064 -28000499 -57014404 -69534453 -57229983
31970 -57229983 -30578710 -9921834 -5029404 -8846656 -12789796 -19120408 -30437850 -34877216
31962 -34877216 -17021216 15783492 33113253 15418892 -21802790 -47567712 -51600339
31955 -51600339 -48738670 -51464821 -53624466 -45177918 -30483039 -22649579 -25652419 -30883170
31947 -30883170 -29571613 -21832437 -13677939 -10114937 -11288242 -11928224 -5904668 4651188
31939 4651188 7524154 -5309270 -23335792 -27423020 -15490446 -6744353 -15039162 -30084885
31931 -30084885 -34945520 -30806142 -29364169 -29500420 -21793215 -12356408 -17873605 -33610770
31923 -33610770 -32276883 -6281008 13435576 320239 -26474589 -30261930 -12751518
31916 -12751518 -10312618 -38268544 -70311077 -77683743 -60808565 -33527339 -2580598
31909 -2580598 23497151 28733785 11722245 -4294807 -1997276 4604493 -5350593 -24793517
31901 -24793517 -32384248 -29635571 -36241441 -52541589 -55542854 -35765754 -12281844 -2877796
31893 -2877796 -1364885 4194807 9653202 5707901 -3057340 -5301041 -803893 1317110
31885 1317110 -3749178 -14208298 -26335600 -32807683 -24443280 -3768215 11043889 7600952
31877 7600952 -2223057 1519060 18083689 29290019 28582333 29076882 40543554 55211916
31869 55211916 62745626 64772359 65222548 58267792 38379994 14953872 3539348 5194875
31861 5194875 6347519 -746943 -7802742 -3338330 12199432 27851366 33286065 25339095
31853 25339095 8082033 -9845615 -20704896 -23202469 -20970686 -15653622 -6096551 5133779
31845 5133779 11933796 15106154 24236043 41242872 49666121 33734903 5656259 -2067018
31837 -2067018 23599471 57385728 65558014 44729685 19683273 9578433 10707784
31830 10707784 11658171 11150685 14701467 21692503 23489121 13263405 -5439580 -20055109
31822 -20055109 -19517214 -4822442 12379463 22835281 27128690 27739008 22020300 11907521
31814 11907521 12993706 37928910 71530552 80275322 53254868 18724982 9184327
31807 9184327 22223302 30668251 23327200 16810983 26323216 41512267 39977121 16750953
31799 16750953 -8353937 -11940410 7813761 27610075 21784744 -9759007 -39316538
31792 -39316538 -41107665 -19871351 -3184388 -8071621 -25201313 -36612008 -37022940 -31700223
31784 -31700223 -23887143 -15110339 -11666616 -18281852 -27651569 -29053368 -27199695 -37326652
31776 -37326652 -57143789 -61481276 -38338478 -14936467 -24794166 -55925361 -61078069
31769 -61078069 -24225289 13607765 12172266 -10958817 -10487904 16497198 28390821
31762 28390821 4554523 -25569075 -29662062 -15527699 -7193053 -5184006 2207730 6335064
31754 6335064 -11523261 -44104248 -61617068 -52621005 -37599655 -36724814 -43851366 -40770130
31746 -40770130 -23146553 -3655299 2568335 -9011657 -27925986 -37458357 -34176855
31739 -34176855 -33495290 -44873521 -49772930 -23971659 22061721 49806289 42760919 24880509
31731 24880509 21357577 27074294 28021692 28506369 34979953 33062131 8055457 -24096009
31723 -24096009 -34260767 -21895212 -12602606 -17142672 -20042766 -10753316 30534 1958260
31715 1958260 540610 2378349 4526993 7925498 22140569 44450543 51766102 29373747
31707 29373747 -4910758 -21277629 -13564062 -193592 2012056 -9487322 -28534774
31700 -28534774 -42249155 -32929894 4026194 44672552 54939157 27313030 -12476333
31693 -12476333 -36715829 -42008042 -42375521 -48265621 -58317561 -64630116 -60823166 -47629789
31685 -47629789 -31176793 -13724646 8874666 34553352 47699888 36704086 13332876
31678 13332876 -523457 -1559344 -2840568 -6290802 -935247 9887078 7741290 -4922481
31670 -4922481 2296425 39668830 69535878 55131856 16247449 975279 15123664
31663 15123664 20219674 -1438563 -23256870 -25315546 -27807108 -51189819 -74672152
31656 -74672152 -64247957 -22592269 18344736 42289711 57704982 68425849 63644758
31649 63644758 39362242 8128679 -16863549 -31204071 -31518098 -16578707 -264109
31642 -264109 -4611269 -30275248 -48817857 -37136550 -8936812 3062591 -9327379
31635 -9327379 -21002459 -10610278 9228993 10446789 -9592351 -22960558 -10379764
31628 -10379764 10681925 10669560 -10186305 -25611299 -26060705 -31903057 -55185662 -73088983
31620 -73088983 -59840705 -28372803 -14175059 -24826798 -32339729 -17048858 5294830
31613 5294830 8990249 -7503152 -25832109 -35371281 -42821940 -56003437 -67487846 -60374574
31605 -60374574 -32046314 -6716170 -12286525 -42894402 -61053181 -46382669 -23464358
31598 -23464358 -23596727 -37544238 -33849153 -10434296 7039021 11841337 21264952 33285400
31590 33285400 21738879 -12608376 -29457401 -10453285 7010639 -9615713 -29000843
31583 -29000843 -1936623 56897773 83805751 55023744 12563165 -2776902 -738637
31576 -738637 -9995724 -32610706 -51624990 -61448369 -69506630 -79915925 -90919434 -100476310
31568 -100476310 -104116565 -94448213 -70517656 -42163828 -21215297 -14032981 -22448183
31561 -22448183 -42181726 -59348625 -59438933 -42924627 -24257485 -15169122 -16529436 -23316259
31553 -23316259 -26953060 -17391436 3088587 13002139 -3499780 -28222108 -27144546 2358591
31545 2358591 26090133 19760173 -2479928 -15009421 -13249430 -6367940 1664492 7410909
31537 7410909 1394899 -16152499 -26147877 -14213345 7411961 17065926 12432351 6656823
31529 6656823 5499088 4432384 417807 -8566396 -27668608 -53972840 -69978996 -64090772
31521 -64090772 -48240890 -37571173 -23547334 8805401 43961549 45639984 6600561
31514 6600561 -37474104 -52365729 -41156182 -24322217 -5579573 22691030 52615065
31507 52615065 62846923 47991545 29299984 29000775 42560587 45065824 23143446
31500 23143446 -7976808 -23578112 -19620921 -13893562 -17573287 -18472171 -210782 30746504
31492 30746504 48155058 33496281 -6294542 -45130090 -56986256 -35982678 -5249138
31485 -5249138 903724 -26975986 -60655176 -65266928 -35109695 10106943 51280743
31478 51280743 75942885 71827078 40553251 12813718 21430336 56414938 73567092
31471 73567092 54216215 28726647 28244754 40848085 37244369 18242569 8447116 14473660
31463 14473660 18111617 8100969 -6480133 -16808302 -27076137 -41100016 -53028261
31456 -53028261 -58075060 -59084719 -56447832 -44481250 -25099709 -12735872 -15857611 -23502333
31448 -23502333 -21075280 -11070440 -5320378 -3716840 2654681 9692975 1255720 -22928579
31440 -22928579 -38723306 -28860565 -8338480 -2621652 -11843204 -17529820 -17859351 -29312968
31432 -29312968 -51283105 -58057569 -38813210 -20065482 -27651756 -46586687 -44976886
31425 -44976886 -23334551 -8935898 -8270955 276564 23647022 37575754 24800211
31418 24800211 2057673 -7424975 -5739497 -6126151 -6350267 2233652 13159230 14477168
31410 14477168 10275811 12038977 16688686 14129118 9883513 17387300 31030111 30377555
31402 30377555 11864917 -6413497 -14590323 -22387164 -33542255 -32546205 -10946604 12363770
31394 12363770 15492483 4627679 883892 5400453 271497 -17927356 -28556187 -17209525
31386 -17209525 2735072 10770670 9303331 17966685 42681839 65399937 67263203 51255048
31378 51255048 35795159 32010231 34236795 30642662 17093358 -16265 -10962107
31371 -10962107 -11663224 -7068513 -5575088 -9828663 -15647270 -20905934 -29746754 -43208809
31363 -43208809 -51811599 -46996943 -36842785 -38053302 -51049326 -56068152 -40138788 -16629726
31355 -16629726 -7945916 -16508197 -25084088 -22536449 -16349606 -17348562 -22100423 -17283484
31347 -17283484 2089254 25050817 36633065 34253762 28288879 26690567 25367057 17855673
31339 17855673 7287433 -910095 -12868780 -37893104 -66182781 -71832808 -44717155
31332 -44717155 -5998420 15761348 11931795 -9051960 -35933336 -55150409 -53634791
31325 -53634791 -37236901 -32708302 -53389764 -76119106 -73388434 -55243636 -51621186
31318 -51621186 -62241081 -57750173 -29980073 -6201562 -6105378 -17261889 -25227763 -35528328
31310 -35528328 -47384444 -37219943 3751545 40032638 33666654 475768 -10310997
31303 -10310997 14947291 40802617 38356881 20517408 12825867 17465435 20960614 17194081
31295 17194081 7599245 -6274966 -16709141 -10179365 11754808 24412616 9691303
31288 9691303 -15881037 -22009836 -7372216 1068452 -8158426 -12585921 7982734 37406740
31280 37406740 45488029 32954599 29431401 46775029 58928311 39141353 -973533
31273 -973533 -26548284 -22914377 -5496287 7931266 14445031 15091304 7162314 -5625855
31265 -5625855 -11390068 -7833390 -8528537 -21357255 -32922169 -26808503 -7314350 8641722
31257 8641722 14996816 17064452 15263579 5394053 -7697274 -13651129 -13614721 -17112226
31249 -17112226 -20156489 -4773961 31772635 62626465 59071544 24607922 -10053048
31242 -10053048 -21162397 -10630683 6303071 19498627 25939735 22221244 5219889
31235 5219889 -19010561 -35219738 -34577332 -26378489 -25074985 -27228717 -14546541 15943863
31227 15943863 39012557 29791884 -4338683 -32836855 -35584319 -15095655 16258620
31220 16258620 44628614 55532281 44386401 25439460 16483516 18700359 25399478
31213 25399478 39855679 61155216 62877321 20930620 -38509835 -59086408 -31509729
31206 -31509729 -9416751 -29582290 -58750891 -51340801 -21702617 -14226924 -28641988
31199 -28641988 -27641067 -5910768 2526663 -13776236 -24578853 -10717410 7803405
31192 7803405 11729225 12027743 20688107 26505328 22270240 26100493 50298379 73344324
31184 73344324 69219218 45574683 27969730 22647303 19000271 14293023 11854093 6878981
31176 6878981 -3461491 -7179261 4375938 18119449 19688204 17306311 22447050 24507050
31168 24507050 13256234 8245103 29273290 51954046 36730822 -4638217 -20487021
31161 -20487021 435400 11761213 -13304700 -38490149 -25395328 5799679 13529548
31154 13529548 -356988 -4850071 3413840 1293902 -13466629 -16678435 1212793 21410915
31146 21410915 27078717 21514461 13839629 9128670 14345007 33035454 52340405 54491190
31138 54491190 42152121 33780969 34145401 29716963 14448432 -579690 -6188568 -4198292
31130 -4198292 5547079 27109601 52590725 63611241 54826277 39358465 27579970
31123 27579970 19319503 19307812 36378495 60803278 67805493 54210998 46166911 56625000
31115 56625000 61755786 39196923 4716580 -14017897 -18169591 -23158609 -22576888 -2184108
31107 -2184108 21656147 16421694 -15353648 -35856593 -27813298 -16736226 -27074128
31100 -27074128 -46670541 -50744296 -36360425 -14559314 11836450 41870197 61743022
31093 61743022 57061597 33082304 7969677 -7404973 -10777171 788902 25108632
31086 25108632 45107202 41615543 16355270 -9431905 -19457500 -16249581 -11544286
31079 -11544286 -12444225 -17889944 -21083563 -13921542 5439943 28284221 42112138 41876868
31071 41876868 32828752 24153353 20925625 18948139 7642303 -15589502 -34636576 -30098336
31063 -30098336 -8333108 393315 -18002742 -38910531 -32155878 -4491386 11784249
31056 11784249 3900716 -12166662 -24155175 -37714860 -53293239 -54968482 -35243136
31049 -35243136 -11483760 -2924638 -6097708 -7206992 -5042646 -5325548 -3684314 7233167
31041 7233167 20550941 22725077 14282155 7062017 4503172 1554255 2074836 17634728
31033 17634728 46519088 70750381 78986099 77601932 72818775 56273891 18934209
31026 18934209 -29512080 -65162071 -70225157 -45436948 -9413139 10965279 -564671
31019 -564671 -33085673 -57345256 -56452619 -40770041 -28560914 -22914532 -15900844 -5388841
31011 -5388841 3419368 6645659 2526816 -9644021 -22961963 -24922314 -16851686 -19570806
31003 -19570806 -43366601 -63125785 -46072292 1105586 38331538 45170346 40272684
30996 40272684 41897417 38519329 15409706 -13662012 -25164714 -21241396 -21760636 -29546483
30988 -29546483 -28142874 -12077471 2927501 3177074 -6357552 -12543079 -8484457 4584537
30980 4584537 17987019 17849579 -452178 -20482955 -22849483 -15677453 -27408685 -63108355
30972 -63108355 -88767787 -73454140 -31725133 -6068444 -15817982 -40816846 -51072131
30965 -51072131 -36200004 -6793972 18720586 27310742 22924389 25281536 46282116
30958 46282116 68966382 64525605 31858115 2900430 578658 7811356 -6090764
30951 -6090764 -38443002 -53076018 -27553810 17023633 41113192 30531864 5195399
30944 5195399 -9832907 -10332765 -9090291 -15004486 -22248773 -18764864 -1587557 17985627
30936 17985627 24550459 13797786 -3080911 -11170323 -7816218 -5353595 -16931091 -40238844
30928 -40238844 -56853481 -49431375 -20575170 6771229 11232564 -3730531 -12956998
30921 -12956998 317742 22687373 27590616 11837564 1939820 18775581 48141766
30914 48141766 58376608 40407074 16030387 8166080 17162924 29101431 34475544
30907 34475544 32193178 24617893 16324544 12209515 11829387 11068702 12001912 22121829
30899 22121829 39362788 48935134 43048364 33243594 32968084 38675802 41361333 45283821
30891 45283821 55506653 54622216 17926672 -45917309 -93263275 -93148257 -58250804 -20738704
30883 -20738704 2267080 7398283 -8573001 -39137725 -58405903 -45414092 -13429093
30876 -13429093 4629506 -3668033 -23036266 -38530945 -48152222 -47899183 -29785416 -2605461
30868 -2605461 7769858 -7603657 -23293470 -11311031 22323721 48601339 52658284
30861 52658284 42136059 25999343 6759482 -5738801 5672941 41110681 72465543
30854 72465543 70609248 39440254 10695615 4319133 5468377 -11870017 -46406738
30847 -46406738 -68942506 -61381704 -40678404 -32924016 -35775280 -25694132 1961622
30840 1961622 22922468 18886373 1835946 -6892064 -4240344 1670836 11076374 27782395
30832 27782395 46023746 59518713 73455546 88395139 82891698 38005195 -24767358
30825 -24767358 -57774858 -43221163 -10908695 5545505 5904632 7001926 13153673 19314320
30817 19314320 25813417 31597958 25620213 2925761 -20436735 -26541712 -22822754 -32064381
30809 -32064381 -57755630 -75902247 -63294305 -22811199 21172301 44821918 41834397
30802 41834397 25081914 13308827 15120193 27290604 44807456 62476163 68503956
30795 68503956 53537276 30535520 26524475 44655955 54274819 33873380 3997617
30788 3997617 -4247999 4230085 1942436 -12806238 -13971757 8029564 31535356 37670195
30780 37670195 32627312 28890471 26926725 23529138 19450324 12703299 1633987 -3174149
30772 -3174149 9181607 24630329 16281153 -13540220 -31905500 -24667628 -16446105 -26640790
30764 -26640790 -36973952 -25643897 -6659078 -7207596 -26714501 -46931836 -64679069
30757 -64679069 -83905979 -90016761 -65760153 -24608977 2922543 10525497 14321834
30750 14321834 16940909 6964165 -8777419 -8663748 4363187 2066662 -21948169 -37637699
30742 -37637699 -23482410 5189446 27947510 47837243 67282701 65785211 32204300
30735 32204300 -2377433 729417 31298331 42754110 18582296 -6759984 511056
30728 511056 29427437 46217312 40224251 28558725 24111017 18390903 -1257723 -29415393
30720 -29415393 -45412956 -35477076 -6345561 23329624 40093694 42401889 36669103
30713 36669103 32761732 38709133 51344534 55157815 40336119 19582710 14396513 24984935
30705 24984935 29045625 13784026 -7107675 -15542830 -11898967 -4831475 6255790 22698356
30697 22698356 32707664 25708735 14102307 20415472 43640903 56743181 40876837
30690 40876837 7427511 -18480027 -24602955 -16864280 -7467351 -3029711 376402 11292428
30682 11292428 27569485 31931523 13501196 -10970448 -14316611 2304759 7843765
30675 7843765 -14201927 -39415552 -35650060 -7993543 10106640 4505655 -2611274 13349748
30667 13349748 45453717 64640064 54376587 26750541 6582216 5672866 13871841
30660 13871841 14034357 3630988 -3144072 2655814 7726425 -7827255 -39029521 -53534407
30652 -53534407 -27248834 26615866 73139122 93780260 97168240 95349331 85730429
30645 85730429 63716369 41485233 39743175 61011481 81646454 75903816 44345444
30638 44345444 14111273 11676689 37676238 68344020 79171065 65304874 40285718
30631 40285718 19702661 9834422 9560178 16200176 26471104 35925888 41574279 43546542
30623 43546542 41984017 34672450 20396035 2626613 -12503743 -20361780 -19485466 -13022621
30615 -13022621 -9241990 -14528120 -23999067 -27145993 -25769763 -34295331 -54522908 -64577801
30607 -64577801 -48688146 -25529367 -23744588 -36174890 -27613142 9925306 41107827
30600 41107827 38545710 21115715 20239837 31794299 29601057 10989740 -2728449 -4683740
30592 -4683740 -10977712 -30693600 -53986556 -72272854 -84593644 -80286932 -43969000
30585 -43969000 11747666 45975060 39342110 21327170 26862803 45328007 39669530
30578 39669530 3781866 -29167133 -32105177 -9844409 21678220 53701966 73461982
30571 73461982 61165304 17256557 -23263435 -25160254 4439364 25159505 12636063
30564 12636063 -16912888 -32103658 -21913014 -327694 14427293 17510335 18200543
30557 18200543 27870522 46038313 58616664 54251013 40729232 36221392 43155799 43186693
30549 43186693 25047166 4832953 4587845 18920523 21596900 3689603 -14987312
30542 -14987312 -17191695 -11118836 -10806141 -11420625 -2100384 8628510 2545169 -17697567
30534 -17697567 -30088324 -26622525 -23893896 -34381781 -46885498 -46094065 -34830372 -23440739
30526 -23440739 -11733237 1806524 4802784 -14217412 -42166906 -54118860 -47894466
30519 -47894466 -44621800 -53803191 -61092405 -57016267 -53335965 -56801062 -48681982 -12343747
30511 -12343747 33671076 54987363 45397299 26595761 9760942 -13386728 -39988615
30504 -39988615 -48235467 -31935642 -15896538 -19513830 -27856725 -20121110 -6620303 -10467561
30496 -10467561 -27005420 -32632653 -26775681 -32342603 -54199840 -69035816 -63023916 -50223565
30488 -50223565 -43077698 -32817444 -14543577 -5446262 -16933989 -30338399 -25014150
30481 -25014150 -13518392 -21315852 -43428000 -51081067 -36399022 -21474690 -22394544 -30935999
30473 -30935999 -36690836 -42933649 -51582814 -52744769 -40807057 -26232390 -20983261 -23471068
30465 -23471068 -25374876 -21954352 -9414886 14710838 40300611 46489586 25333690
30458 25333690 -5777166 -24462493 -27347692 -26019985 -29429845 -39423081 -53054657 -58773997
30450 -58773997 -41852710 -7611203 11602886 -8280319 -46593564 -58114848 -29920488
30443 -29920488 3311346 7227546 -9079218 -12258877 6992771 25340914 23418753
30436 23418753 10968219 8359211 17433687 24253983 24227043 28325903 42557249 55812155
30428 55812155 56192919 48652143 44866899 42644139 29336039 3308370 -21637460 -34013141
30420 -34013141 -34865528 -29074808 -18847971 -8676648 -4497471 -3721427 2308398 11924747
30412 11924747 12265527 98782 -11117104 -12690193 -12982243 -16668273 -9421640 17224179
30404 17224179 38987531 22226964 -29626961 -76262617 -87318232 -67407111 -33052288
30397 -33052288 9318306 50916776 68519002 46029521 -561502 -36656916 -43792887
30390 -43792887 -29199139 -6955485 14355759 26323127 20154086 -1604833 -23494210
30383 -23494210 -35146308 -43356398 -57808663 -71162397 -65593452 -38673540 -11067075
30376 -11067075 -4151263 -18319819 -38510055 -52901171 -57992317 -51817052 -33940455
30369 -33940455 -11288849 5550562 12955259 15134422 16053853 17629374 22857983 31066910
30361 31066910 33092662 23573339 15606948 26883608 50519931 58966130 42769761 25565205
30353 25565205 29297046 43086633 43105859 28642485 18485820 20693558 26079311 27248588
30345 27248588 26156655 24644945 22199424 20883780 19792095 9231319 -15765490 -42067981
30337 -42067981 -54683080 -60091030 -73753943 -89111279 -83218113 -54419446 -29717517
30330 -29717517 -27497937 -34625945 -30900499 -17413455 -7829550 -6876528 -11709140 -23148137
30322 -23148137 -41083445 -55787436 -56290332 -43786575 -28652152 -18310384 -14041854
30315 -14041854 -14711273 -17873049 -20792176 -22966759 -23250211 -15810360 1810539 17733307
30307 17733307 16111823 -154178 -12111096 -13250896 -17692078 -33094964 -44293317
30300 -44293317 -35959514 -15034755 3713112 18897329 31908158 29549569 467573
30293 467573 -38174249 -53795725 -37935687 -13909619 -3678602 -3847726 1883166 20384723
30285 20384723 44106337 58396777 50599327 20726883 -13881147 -31400659 -25017733
30278 -25017733 -5391690 13574343 24082322 22911896 11165458 -4217719 -17111516
30271 -17111516 -29962802 -46827272 -60317673 -56091203 -31877397 -3472006 10497764
30264 10497764 4521022 -11664379 -20363838 -8664808 17065658 32744986 23544543
30257 23544543 5566142 6109813 24679358 32834494 15733631 -7849827 -17163101 -20180384
30249 -20180384 -34176798 -51461548 -50188132 -33330754 -29164229 -48301631 -64741603
30242 -64741603 -51823753 -17175491 15499297 42962625 75619468 102735267 96360851
30235 96360851 55888427 19345878 13645913 17780021 492284 -23978725 -12924528
30228 -12924528 37090507 76785401 67545526 26921563 -5246959 -18985692 -29179895
30221 -29179895 -39106700 -38418096 -27896565 -18131515 -6311178 19642585 51528443 60114636
30213 60114636 33332214 -3302258 -17132023 -7164758 892693 -8269082 -21454762
30206 -21454762 -17285392 5215286 25509642 26244242 9996325 -12374912 -39928289
30199 -39928289 -75224354 -104971808 -106099013 -74646009 -32062394 1369704 20674269
30192 20674269 19866557 -10378632 -53746106 -66545828 -32153924 6496915 2220862
30185 2220862 -28316633 -32426177 -3420598 14506157 1568892 -10463506 778902
30178 778902 10216652 -5628371 -22783475 -8185803 24822945 36602251 19605718
30171 19605718 2855612 7919861 28620633 47385915 48385838 23209637 -13370679
30164 -13370679 -23169990 13644417 63524629 73965045 39362068 3488536 -4166625
30157 -4166625 -2094266 -15616797 -31128559 -15864131 29689639 64673607 56052124
30150 56052124 17792800 -8189144 -3138099 10856431 7000209 -9179075 -15191273
30143 -15191273 -12222222 -22628342 -46695253 -53926725 -30411944 -5479951 -9484487
30136 -9484487 -30072878 -37904010 -34176616 -38031294 -42019328 -21005108 18542985 38101873
30128 38101873 20911615 -8267359 -24590860 -30759594 -31696906 -15085145 22120380
30121 22120380 52517737 46818829 9178436 -32121060 -54872012 -50954013 -22528604
30114 -22528604 12361414 26024771 12008706 -2118340 9898545 36899928 47617101
30107 47617101 32469830 8018432 -10293778 -17414792 -8018174 18031486 40496492
30100 40496492 33419523 -137540 -27753839 -28222470 -14711090 -9637525 -13819193 -13710412
30092 -13710412 -6870247 -3757046 -8820521 -14616422 -15516289 -15189959 -15514017 -7283799
30084 -7283799 17878439 48763105 59466300 39008815 8670473 73683 18860830
30077 18860830 40743113 43387349 29966242 17175509 12142806 10205266 7526755 5759482
30069 5759482 7640501 14436460 23796166 26621378 15047080 -222823 6860768 43909031
30061 43909031 80321076 80458143 50765636 30959586 38035077 44982165 25083489 -7145642
30053 -7145642 -19882832 -12362776 -11835601 -26740209 -31372511 -5436690 33329774 51743898
30045 51743898 42603732 25845653 16524918 11589214 6908260 6999356 12318831 14219508
30037 14219508 11426023 15807647 29743181 33155082 11103003 -17175068 -19245939 5904311
30029 5904311 27460005 25284927 7989800 -13519041 -41949944 -72017879 -79841980
30022 -79841980 -54044046 -18803614 -4694306 -10421473 -14064453 -8890474 -3904442 909495
30014 909495 12149652 20170348 7181787 -20001253 -31948068 -17412728 2408097
30007 2408097 9402940 14142118 31275530 50312536 51682750 38779375 32033954 37025557
29999 37025557 38957082 28643070 16147666 13629576 17926298 18544305 15203602 17379431
29991 17379431 27368249 32221043 17556927 -13524150 -41046574 -47524090 -31135981
29984 -31135981 -313267 33880933 55313642 46640574 10026515 -24179685 -27179735
29977 -27179735 -6925593 4313540 -4463542 -12197720 -4266440 3281648 -8429214 -29372645
29969 -29372645 -36366171 -27690015 -21322574 -25465632 -30486692 -28130984 -21432799 -14160823
29961 -14160823 -4416477 7959324 17544502 19896484 15722297 8354236 2395685 2456550
29953 2456550 7173687 8592454 4881516 7976710 27859401 53596950 62945678 49368879
29945 49368879 27152042 10278039 -820107 -10415461 -18563779 -24606474 -28650525 -26025180
29937 -26025180 -10569370 12772470 28513539 28047777 17926890 8181502 2912144 5603404
29929 5603404 20274654 39383898 42691714 20274264 -10515886 -23024470 -12439329
29922 -12439329 1770984 3136103 -1757275 7361148 39975682 81688208 105057195
29915 105057195 95217967 64890923 40605452 35024833 38970964 39117890 32444048 21211702
29907 21211702 6990307 -3808159 -1277373 11602038 16171381 4023051 -6186487
29900 -6186487 5185015 24754473 19422174 -18326178 -58613367 -70148866 -50919487
29893 -50919487 -20185689 2179987 2578973 -21930619 -54912876 -69187319 -55580174
29886 -55580174 -33508945 -24117198 -24532410 -20073356 -9957575 -4536132 -4461599 -654473
$$ [...]
##END NTUPLES=NMR SPECTRUM
##END=
