##TITLE=31Pdec_PR192_R
 Met-d4, 24 sc
 1.10.2020
##JCAMPDX= 6.0         $$ Bruker NMR JCAMP-DX V2.0
##DATA TYPE= NMR SPECTRUM
##DATA CLASS= NTUPLES
##ORIGIN= UXNMR, Bruker Analytische Messtechnik GmbH
##OWNER= root
$$ XWIN-NMR		Version 3.5
$$ Thu Oct  1 10:05:14 2020 Russian Standard Time (UT+4h)  she@DPX200
##.OBSERVE FREQUENCY= 81.013821
##.OBSERVE NUCLEUS= ^31P
##.ACQUISITION MODE= SIMULTANEOUS
##.ACQUISITION SCHEME= undefined
##.AVERAGES= 24
##.DIGITISER RES= 17
##SPECTROMETER/DATA SYSTEM= spect
##.PULSE SEQUENCE= zgpg30
##.SOLVENT NAME= D2O
##.SHIFT REFERENCE= (INTERNAL, D2O, 0, 182.463)
##AUDIT TRAIL= $$ (NUMBER, WHEN, WHO, WHERE, WHAT)
$$ ##TITLE= Audit trail, XWIN-NMR		Version 3.5
$$ ##JCAMPDX= 5.01
$$ ##ORIGIN= Bruker BioSpin GmbH
$$ ##OWNER= she
$$ F:/spectra/data/she/nmr/P31/1/pdata/1/auditp.txt
$$ ##AUDIT TRAIL=  $$ (NUMBER, WHEN, WHO, WHERE, WHAT)
(   1,<2020-10-01 10:04:07.29 +0400>,<she>,<DPX200>,
      <created by zg, POWCHK disabled, PULCHK disabled
       configuration hash MD5:
       00 E9 B6 7A A2 85 ED C7 34 08 36 98 17 FE 4E 26
       data hash MD5: 32K
       D0 41 DE F9 BB 52 F8 4F 65 C4 2A 0F 90 7C 23 C5>)
(   2,<2020-10-01 10:04:15.06 +0400>,<she>,<DPX200>,
      <Start of raw data processing
       efp BC_mod = 2 LB = 1 FT_mod = 6 PKNL = 1 PHC0 = -2744.319 PHC1 = 34.80175 SI = 64K 
       data hash MD5: 64K
       00 67 F1 FB BE F8 63 65 27 29 27 98 02 EF 3C 8B>)
(   3,<2020-10-01 10:04:32.68 +0400>,<she>,<DPX200>,
      <pk PHC0 = -217.2847 PHC1 = 452.9997 
       data hash MD5: 64K
       7E 6C 09 D3 56 92 7F F9 93 DE D9 01 DC 42 CE 5A>)
$$ ##END=
$$ 
$$ hash MD5
$$ D4 DC F2 34 6A 0C 6C FF A6 BC E3 6B F0 E0 1B 6F
##$RELAX= 
##$RELAX= 
##$RELAX= 
##$RELAX= 
##$RELAX= 
##$RELAX= 
##$RELAX= 
##$RELAX= 
$$ Bruker specific parameters
$$ --------------------------
##$DU= <F:/spectra>
##$EXPNO= 1
##$NAME= <P31>
##$PROCNO= 1
##$TYPE= <nmr>
##$USER= <she>
##$AMP= (0..31)
100 100 100 100 100 100 100 100 100 100 100 100 100 100 100 100 100 100 
100 100 100 100 100 100 100 100 100 100 100 100 100 100 
##$AQSEQ= 0
##$AQ_mod= 1
##$AUNM= <au_zg>
##$AUTOPOS= <>
##$BF1= 81.014009
##$BF2= 200.13
##$BF3= 200.13
##$BF4= 200.13
##$BF5= 200.13
##$BF6= 200.13
##$BF7= 200.13
##$BF8= 200.13
##$BYTORDA= 1
##$CFDGTYP= 0
##$CFRGTYP= 5
##$CHEMSTR= <none>
##$CNST= (0..31)
1 1 145 1 1 1 1 1 1 1 1 1 1 1 1 1 1 1 1 1 1 1 1 1 1 1 1 1 1 1 1 1 
##$CPDPRG= <waltz16>
##$CPDPRG1= <>
##$CPDPRG2= <waltz16>
##$CPDPRG3= <>
##$CPDPRG4= <mlev>
##$CPDPRG5= <mlev>
##$CPDPRG6= <mlev>
##$CPDPRG7= <mlev>
##$CPDPRG8= <mlev>
##$CPDPRGB= <>
##$CPDPRGT= <>
##$D= (0..31)
0 1 0 0 0 0 0 0 0 0 0 0.03 2e-05 3e-06 0 0 0 0 0 0 0 0 0 0 0 0 0 0 0 0 
0 0 
##$DATE= 1601532246
##$DBL= (0..7)
120 120 120 11 120 120 24 19 
##$DBP= (0..7)
150 150 150 150 150 150 150 150 
##$DBP07= 0
##$DBPNAM0= <>
##$DBPNAM1= <>
##$DBPNAM2= <>
##$DBPNAM3= <>
##$DBPNAM4= <>
##$DBPNAM5= <>
##$DBPNAM6= <>
##$DBPNAM7= <>
##$DBPOAL= (0..7)
0.5 0.5 0.5 0.5 0.5 0.5 0.5 0.5 
##$DBPOFFS= (0..7)
$$ [...]
##$SUBNAM2= <"">
##$SUBNAM3= <"">
##$SUBNAM4= <"">
##$SUBNAM5= <"">
##$SUBNAM6= <"">
##$SUBNAM7= <"">
##$SUBNAM8= <"">
##$SUBNAM9= <"">
##$SW= 369.568048894756
##$SWIBOX= (0..15)
0 1 3 0 0 0 0 0 0 0 0 0 0 0 0 0 
##$SW_h= 29940.119760479
##$TD= 32768
##$TD0= 1
##$TE= 0
##$TE2= 300
##$TE3= 300
##$TEG= 300
##$TL= (0..7)
0 120 53 12 22 120 120 120 
##$TP= (0..7)
150 150 150 150 150 150 150 150 
##$TP07= 0
##$TPNAME0= <>
##$TPNAME1= <>
##$TPNAME2= <>
##$TPNAME3= <>
##$TPNAME4= <>
##$TPNAME5= <>
##$TPNAME6= <>
##$TPNAME7= <>
##$TPOAL= (0..7)
0.5 0.5 0.5 0.5 0.5 0.5 0.5 0.5 
##$TPOFFS= (0..7)
0 0 0 0 0 0 0 0 
##$TUNHIN= 0
##$TUNHOUT= 0
##$TUNXOUT= 0
##$USERA1= <user>
##$USERA2= <user>
##$USERA3= <user>
##$USERA4= <user>
##$USERA5= <user>
##$V9= 5
##$VALIST= <valist>
##$VCLIST= <CCCCCCCCCCCCCCC>
##$VD= 0
##$VDLIST= <DDDDDDDDDDDDDDD>
##$VPLIST= <PPPPPPPPPPPPPPP>
##$VTLIST= <TTTTTTTTTTTTTTT>
##$WBST= 1024
##$WBSW= 4
##$XGAIN= (0..3)
0 0 0 0 
##$XL= 0
##$YL= 0
##$YMAX_a= 7137
##$YMIN_a= -10280
##$ZGOPTNS= <>
##$ZL1= 120
##$ZL2= 120
##$ZL3= 120
##$ZL4= 120
##$ABSF1= 0
##$ABSF2= 0
##$ABSG= 0
##$ABSL= 0
##$ALPHA= 0
##$AQORDER= 0
##$ASSFAC= 0
##$ASSFACI= 0
##$ASSFACX= 0
##$ASSWID= 0
##$AUNMP= <proc_1d>
##$AZFE= 0.1
##$AZFW= 0.5
##$BCFW= 0
##$BC_mod= 2
##$BYTORDP= 0
##$COROFFS= 0
##$CY= -3
##$DATMOD= 1
##$DC= 0
##$DFILT= <>
##$DTYPP= 0
##$F1P= 0
##$F2P= 0
##$FCOR= 1
##$FTSIZE= 65536
##$FT_mod= 6
##$GAMMA= 0
##$GB= 0
##$INTBC= 1
##$INTSCL= 5.30512e-09
##$ISEN= 30
##$LB= 1
##$LEV0= 0
##$LPBIN= 0
##$MAXI= 10000
##$MC2= 0
##$MEAN= 0
##$ME_mod= 0
##$MI= 50
##$NCOEF= 0
##$NC_proc= -9
##$NLEV= 6
##$NOISF1= 182.463
##$NOISF2= 159.3651
##$NSP= 0
##$NTH_PI= 0
##$NZP= 0
##$OFFSET= 182.463
##$PC= 4
##$PHC0= -2961.604
##$PHC1= 487.8015
##$PH_mod= 1
##$PKNL= yes
##$PPARMOD= 0
##$PSCAL= 0
##$PSIGN= 0
##$REVERSE= no
##$SF= 81.0140089999434
##$SI= 65536
##$SIGF1= 159.3651
##$SIGF2= -187.1042
##$SINO= 113.3802
##$SIOLD= 16384
##$SREGLST= <1H.CDCl3>
##$SSB= 0
##$STSI= 65536
##$STSR= 0
##$SW_p= 29940.119760479
##$SYMM= 0
##$S_DEV= 0
##$TDeff= 32768
##$TDoff= 0
##$TI= <>
##$TILT= no
##$TM1= 0
##$TM2= 0
##$TOPLEV= 0
##$USERP1= <user>
##$USERP2= <user>
##$USERP3= <user>
##$USERP4= <user>
##$USERP5= <user>
##$WDW= 1
##$XDIM= 65536
##$YMAX_p= 332632677
##$YMIN_p= -64922835
$$ End of Bruker specific parameters
$$ ---------------------------------
##NTUPLES= NMR SPECTRUM
##VAR_NAME=  FREQUENCY,     SPECTRUM/REAL,   SPECTRUM/IMAG
##SYMBOL=    X,             R,               I
##VAR_TYPE=  INDEPENDENT,   DEPENDENT,       DEPENDENT
##VAR_FORM=  AFFN,          ASDF,            ASDF
##VAR_DIM=   65536,         65536,           65536
##UNITS=     HZ,            ARBITRARY UNITS, ARBITRARY UNITS
##FACTOR=    0.456856943014862, 1,           1
##FIRST=     14782.0589164792, 0,            0
##LAST=      -15158.0608439998, 0,           0
##MIN=       -15158.0608439998, -64922835,   0
##MAX=       14782.0589164792, 332632677,    0
$$ Real data points
##PAGE= N=1
##DATA TABLE= (X++(R..R)), XYDATA
$$ [...]
40259 10153324 9752150 8050884 5856101 8410360 18223899 28432077 29367588 20440574
40251 20440574 10094139 4909099 3851942 2716071 -602482 -5453233 -9689215 -11884593
40243 -11884593 -13969248 -18802273 -22881967 -16719609 2343492 22411371 28988140 21379856
40235 21379856 10561110 4577191 4217590 9623733 20523702 30234631 29417148 17528787
40227 17528787 2940658 -8724983 -17919422 -22395344 -15698705 1217244 15265401
40220 15265401 14572064 2468483 -6368719 -1518985 13497167 25027327 22359499 8789594
40212 8789594 -2373428 -5213320 -9100681 -23126986 -39417175 -42963206 -33528955 -24097462
40204 -24097462 -19707209 -13435585 -3894003 464636 -1402106 1484417 12487478 19047210
40196 19047210 12853420 2950228 -1880741 -8380479 -22928084 -34653595 -30901289 -18124195
40188 -18124195 -10120543 -5730648 2861284 8763201 -840830 -20045285 -30531244 -29254259
40180 -29254259 -27413954 -24620376 -10442079 6747202 1809158 -26870319 -46294496
40173 -46294496 -33202131 -6148516 5195165 1970917 4291426 13778548 15322849 7886526
40165 7886526 6341951 14130074 18188589 13214194 9491790 12122380 12174660 5392053
40157 5392053 1838438 7628636 12632824 7607181 279183 1195749 4221917 -3498703
40149 -3498703 -18690226 -25070184 -17191042 -6152759 -173087 6622823 20619905 34867604
40141 34867604 37227455 26286852 11234259 -567475 -8229959 -11404841 -8174293 -794906
40133 -794906 3060596 -1056071 -8334847 -11233662 -8903702 -5675293 -3008945 870061
40125 870061 4500032 3725044 -9320 618602 6984035 9114231 -1575153 -18535312
40117 -18535312 -26451825 -19651713 -7569338 -2341849 -7052726 -16899844 -26353542 -32602586
40109 -32602586 -34867291 -32550062 -24165397 -9611329 5678461 12686316 8237618 -975428
40101 -975428 -7390535 -10834016 -12904059 -10023713 -1435572 1697753 -11306029 -30967714
40093 -30967714 -35050667 -17535392 3774564 12270332 10783893 8674098 5478775 -1991211
40085 -1991211 -8074485 -6260740 -373897 3838004 10404131 24061803 36506403 35424876
40077 35424876 22647104 10492506 4533266 2983517 7801543 20269852 28973270 20797460
40069 20797460 4303219 3058863 21507577 35936805 27362118 6765871 -3591984
40062 -3591984 -92673 5018656 6450951 9884769 16644034 18459134 9593433 -4238369
40054 -4238369 -12173330 -9969774 -3916642 -3427553 -9660310 -14050088 -11185823 -8164657
40046 -8164657 -13026778 -18629158 -11697808 3265008 6428517 -6875040 -16264102 -6421086
40038 -6421086 9745698 12123779 3649325 2061588 10970836 17719989 14827611 6169368
40030 6169368 -5091981 -18274983 -26634315 -22791395 -12033216 -5584072 -2216086 7076150
40022 7076150 17113488 11153665 -10564021 -24566661 -15385474 3442401 10948690 7409148
40014 7409148 7385957 13858248 15277111 5639833 -5306491 -3758608 12579569 31596498
40006 31596498 37385251 25924060 10853435 8610812 17379284 19322093 6411886 -6897974
39998 -6897974 -4035567 10343597 18124301 12502202 2886211 -2160749 -4674203 -8727172
39990 -8727172 -12177871 -11269604 -7394519 -4559212 -2857371 1508626 9611654 15743127
39982 15743127 12652220 1294026 -8142714 -8086988 -2929692 -1044461 -1208566 3832087
39974 3832087 12087151 13134889 6589093 6431605 20037011 34397854 32750236 15899051
39966 15899051 -2821313 -15105278 -18723220 -9342224 13624275 37000508 44699757
39959 44699757 37940230 31776542 32200335 30485515 21444791 12717405 10844525 10213730
39951 10213730 2835052 -9611560 -19641599 -22452842 -15342833 3269958 27189066
39944 27189066 41232497 35038627 15323250 -1613839 -7280371 -6126349 -6075169 -9641602
39936 -9641602 -14167334 -16923684 -18672753 -22359376 -27828756 -29805339 -24738079 -17956006
39928 -17956006 -17789420 -22532157 -20932642 -8204543 6046850 10653531 7322217 6141417
39920 6141417 11217723 17405741 18870069 15121787 9704133 6998594 9018718 12500094
39912 12500094 11638746 6386910 4131891 9387961 16434140 17671111 14980077 15544923
39904 15544923 19506173 20497493 17500489 16801982 20293774 20344210 10745862 -3343807
39896 -3343807 -11695237 -11449059 -8237781 -7162616 -7601419 -6716995 -4324605 -2948575 -4372038
39887 -4372038 -7003758 -7068241 -3074525 1724126 3647456 5155204 13100653 28153236
39879 28153236 39713829 36471726 21120277 8941743 9822091 16500664 15168737 4659614
39871 4659614 -2054899 3344979 11436232 6819307 -10389160 -22625739 -15445903 6334579
39863 6334579 25880078 32031883 24876189 8428240 -13730279 -35119928 -46160162
39856 -46160162 -41810769 -26689748 -9651660 4617827 16031350 23624141 24341763 18018784
39848 18018784 10178993 7317244 10112475 13114803 11426843 6450858 3874110 6193798
39840 6193798 8846198 5271424 -4486862 -12216997 -9993974 419128 8096179 3266255
39832 3266255 -13337233 -31082610 -38425002 -31820596 -17960205 -8276654 -9479574 -17437953
39824 -17437953 -21027606 -13681372 -350718 8815401 10198051 8541960 7945161 6866683
39816 6866683 4381212 5439433 13899825 23457107 23001191 11340493 -61643 -1455316
39808 -1455316 3515216 4354702 -2088846 -9158686 -10357550 -6318655 -1046455 4229600
39800 4229600 10148064 14049925 10190826 -2481594 -14725380 -13756668 2134989 18715961
39792 18715961 19784473 5197173 -9472731 -11365912 -2990132 5541115 10681631 15915000
39784 15915000 21562005 22202433 15445575 7125434 4358671 6887624 8701179 6216276
39776 6216276 1640498 -851109 441747 3804550 5533043 2767471 -2945509 -5501754
39768 -5501754 -530536 8204371 12425825 10548048 10662174 18438424 25888394 19368877
39760 19368877 -1173735 -18456102 -17315388 -2754939 7206312 3967724 -3070830 -506321
39752 -506321 12789593 26363411 30807500 25031163 12727900 -2629438 -16863038 -23079663
39744 -23079663 -16455323 -2148889 6486968 1846286 -8622951 -12655594 -10957321 -16386093
39736 -16386093 -33332774 -47061168 -40773894 -17475839 4207146 13225968 15341480
39729 15341480 18994123 22103329 17917760 7543229 -249796 -117045 4109701 5951899
39721 5951899 5783441 10337189 21358058 28388499 19405615 -1190801 -13891671 -7810276
39713 -7810276 5364584 8443032 1001087 -6664084 -13772251 -26601547 -39462934 -37927357
39705 -37927357 -23474628 -15456532 -21573116 -24955549 -11774242 5143987 5540965 -8807814
39697 -8807814 -21394859 -27437786 -33170705 -35223021 -23041899 -2107987 5992610 -7430047
39689 -7430047 -24922021 -26105067 -12098265 801442 2093603 -6272183 -17037534 -23269025
39681 -23269025 -20603326 -10355574 427493 4619449 -88151 -11030811 -21817180
39674 -21817180 -24922480 -17954232 -6814965 1548942 7247054 13191568 17187795 16748122
39666 16748122 17661254 26133203 34646635 29479996 12802438 2605710 7654196 17424367
39658 17424367 21848998 24902862 29821245 26753573 9056577 -9979425 -12793573 -2634701
39650 -2634701 2631849 -2938397 -8711702 -7513468 -4843177 -5963490 -6726820 -2124319
39642 -2124319 4831391 7628855 4236806 -2548069 -8737331 -11334561 -9859220 -6250700
39634 -6250700 -1426476 6182163 16159840 23612845 24864817 21675655 15656959 4177631
39626 4177631 -11750561 -21541996 -16304692 -2198119 6834526 6161097 341233 -9699467
39618 -9699467 -25641981 -39121123 -35597968 -14805855 5428476 11196473 7535669 5980304
39610 5980304 8070975 9149585 9453198 11635659 12799049 8217900 292080 -3309543
39602 -3309543 1148550 10887659 20973976 27263286 27545673 23389849 18831763 15472788
39594 15472788 12336571 11448312 17407938 28629483 35418795 30864047 18035014 3027945
39586 3027945 -11737031 -22429922 -20769369 -4736311 13667468 20540673 15855726 9002473
39578 9002473 3745588 -1858303 -4016809 5722127 26642375 45706720 50760234 40700365
39570 40700365 22499052 5125242 -3882797 -3799984 -3470186 -11403867 -22898034 -25104031
39562 -25104031 -15430551 -5650230 -5550003 -11603851 -15248335 -13745184 -8492274 -506111
39554 -506111 7466153 11271655 12029882 15033810 18183383 11525958 -5041211 -14541470
39546 -14541470 -4513362 12584954 14427844 -638918 -13139502 -11076497 -3342643
39539 -3342643 -1613777 -3227494 593014 9864893 18057404 22719874 25670177 26656912
39531 26656912 24410972 21989703 24592036 32254608 38984745 39070626 31719441 20599439
39523 20599439 11208471 7248950 7266246 6302458 2641529 638349 4677763 12817526
39515 12817526 18789029 17473515 6170387 -14605376 -36220012 -42316539 -23518933
39508 -23518933 7678850 25219060 16772328 -2653164 -8831862 4011012 19049973
39501 19049973 18134849 950690 -17762623 -24404303 -16175499 1752608 22011437 36695233
39493 36695233 39339262 31134095 23138145 25537385 33650235 31088770 10244410 -16027827
39485 -16027827 -28396212 -22364788 -9537525 -1626539 -1337043 -6634423 -13710925 -14791071
39477 -14791071 -3308124 14913416 24581621 20060043 13078386 15007443 20459593 18441024
39469 18441024 12385303 15235747 27242183 33409721 25271163 12023884 4749724 1269932
39461 1269932 -5037880 -10882113 -8767882 -1607459 378696 -4299369 -6819931 -3479142
39453 -3479142 -1634111 -5874461 -7848309 2190520 19430944 29043748 24574886 13830133
39445 13830133 6855008 5922703 8797089 13871267 17913189 15390634 6081513 -1591434
39437 -1591434 -1731194 -1176935 -9473608 -21116940 -19470415 -196256 20835841 28481081
39429 28481081 26632519 27147930 29755572 25450937 14608571 7570030 8244771 10740036
39421 10740036 13522231 22476631 34906301 34896889 14929887 -8579534 -14376177 -4510825
39413 -4510825 535495 -8067861 -17118257 -13102479 -1018632 5089886 1321729 -4683531
39405 -4683531 -6747053 -6523328 -7921614 -11089145 -13151309 -12232729 -9909842 -10338973 -16127156
39396 -16127156 -24311852 -27936486 -23016689 -12984803 -5164544 -3688501 -6560373 -8614053
39388 -8614053 -6622981 -2279138 -402981 -3460803 -8376140 -10142018 -7536362 -2826125
39380 -2826125 3005088 10666109 18207786 21158645 18765025 15695125 15002280 13799571
39372 13799571 9636979 6920180 11232897 19566382 22693888 17386787 10641193 10355740
39364 10355740 16537768 23901538 28802263 29882627 24938899 12658090 -2124237 -9485457
39356 -9485457 -3979381 8425555 16194388 14888562 10623475 9967926 10917535 7910315
39348 7910315 2110190 -364333 361609 -3188852 -13254429 -20973515 -18340975 -9862440
39340 -9862440 -5677183 -7621511 -9239894 -6066756 1645337 13290914 26316580 32262832
39332 32262832 24025229 7105353 -5127609 -7489723 -5455348 -2402625 3900762 10794692
39324 10794692 10240080 3630995 4086961 16926209 30222339 33138444 30477067 28116716
39316 28116716 18691135 -1298067 -12667367 4867161 37897668 50998180 33929515
39309 33929515 13120163 10889084 17411327 14731085 6813771 7703639 15221166 16880853
39301 16880853 12786093 12540468 14240644 6224479 -10762344 -21124382 -16939006 -7244125
39293 -7244125 -104016 9738546 26804779 40685931 38525382 25748341 21449556 33115497
39285 33115497 46265446 43163470 24847513 8050769 3502632 5654382 5454327 4661679
39277 4661679 10191738 19774702 24199068 22797915 24647806 31573853 32331372 20472129
39269 20472129 6798941 4010909 8022574 6697404 221232 -1156939 4528459 9521633
39261 9521633 11527061 15557229 20060949 15895111 2407801 -8473329 -8631609 -2926273
39253 -2926273 1837565 5366769 6990671 2808596 -4323972 -4254009 3918386 7243899
39245 7243899 -387052 -5791969 3641460 19305606 24814722 20522043 18414945 19750351
39237 19750351 16072834 9076206 10367865 20400388 25229272 18450535 10966412 12863987
39229 12863987 19116840 20785416 18410065 15137720 6857733 -9386630 -23963200 -23911084
39221 -23911084 -11255156 -1587285 -4094724 -11316502 -10514352 1328516 16880719 28148325
39213 28148325 32449075 30503556 23337212 13273421 5689609 5608238 11514293 15957609
39205 15957609 14439604 10403003 8563008 7739089 5823682 7709913 19115745 33205814
39197 33205814 33868790 16438206 -2861932 -4579827 11378189 26916547 27163187 15220971
39189 15220971 5530361 6106485 9513400 2703942 -14270983 -24335674 -13858258 6773937
39181 6773937 13517422 27748 -13782699 -9799144 4243544 9634686 5774947 8349328
39173 8349328 21752427 30583998 22529792 5840911 -3550960 -1988133 4305929 13749045
39165 13749045 28986705 44414373 47117812 34031915 18782101 14960382 18876816
39158 18876816 17195841 8152457 4447364 13311162 23965664 22035803 9931641 3220625
39150 3220625 8974143 17749300 18496140 12409511 7791826 8222420 11502395 15383253
39142 15383253 18268210 17446441 12292656 6903179 4513838 1852631 -5361939 -13701700
39134 -13701700 -15568922 -10357500 -4952142 -2942606 -686159 4339692 8643177 9408867
39126 9408867 9235002 9380091 4577224 -8105687 -19290481 -15469122 2587610 17693454
39118 17693454 15610537 769648 -11287042 -12362176 -6896124 -1856745 1200799 3205693
39110 3205693 3322867 1357563 461778 3388830 8454478 12770737 17011051 22830545
39102 22830545 28056672 29775539 30073313 31821007 30160574 17749585 187825 -4787701
39094 -4787701 9755115 26535103 23386287 789502 -20279800 -24903225 -17228550 -7377985
39086 -7377985 2284636 13301081 22797385 25988213 22698423 16753553 11894129 10562500
39078 10562500 12328008 11284430 593879 -16986206 -28862630 -27430098 -19636732 -16142745
39070 -16142745 -16279894 -11403308 397418 11716229 17116312 19264888 23200112 30597576
39062 30597576 40032273 47178535 45013070 30640404 12628981 4510476 9250476 16771879
39054 16771879 18466061 16417903 15474479 15032283 14266719 17545367 26965992 35549247
39046 35549247 36039971 31506710 28725176 26077815 18422636 10137510 10908531 19689991
39038 19689991 25546319 25041117 25471938 28496258 25448037 15134290 11598149 23602735
39030 23602735 38451280 39385110 29883956 25858460 30121987 30906505 22968027 13906879
39022 13906879 8931268 4286851 -1449733 -3095064 -15048 508394 -4156123 -7109837
39014 -7109837 -4659549 -3212107 -7777962 -13887731 -16930479 -19055283 -20363954 -14890368
39006 -14890368 -3762259 -166672 -9808823 -17867872 -9857816 4203958 3928668 -9681444
38998 -9681444 -16319653 -8200371 502226 -979889 -4042304 2325644 13678275 19128172
38990 19128172 17520604 14753306 12434394 8256795 2925388 -473681 -1076986 -45200
38982 -45200 963128 -493205 -4105429 -2541883 10861832 28645225 34371096 25195726
38974 25195726 17084099 20588095 24473669 14888481 -661591 -4246980 4742465 10229125
38966 10229125 5112221 -1194112 -2109966 -3786638 -9916706 -11237098 -50858 14396893
38958 14396893 16080581 3250812 -9913611 -11199737 -2832223 4110827 2577202 -4847878
38950 -4847878 -10743921 -11149989 -8310156 -5742681 -3566804 -1026227 -506120 -4222180
38942 -4222180 -8735560 -8647646 -5065559 -3969106 -6125482 -5904299 -1273544 2997801 4577230
38933 4577230 7318405 11366769 8571421 -4890907 -19048331 -22709045 -19526080 -20557743
38925 -20557743 -25166455 -22583771 -11610817 -4529903 -7822448 -11840406 -6814222 966308
38917 966308 -1648491 -15624361 -29001516 -31351209 -21293579 -3289382 14996253 24935899
38909 24935899 24752153 23104130 27127787 29976135 20590145 4106462 -579235 13882027
38901 13882027 32723725 38728386 31116179 18434797 4538680 -8026785 -10484900
38894 -10484900 2731699 22072403 32915072 34156646 35190036 38358032 38567130 38484133
38886 38484133 47774266 64607029 73326083 66390922 55350310 52598667 54052469 48769627
38878 48769627 35575361 20466241 6433979 -3725989 -2691941 11049676 24022473
38871 24022473 21850847 9288718 3833502 11077553 18795279 16110121 6904227 965754
38863 965754 866797 2123446 863397 -2222385 -3062516 1241264 7690805 10491060 11371906
38854 11371906 19969067 37758684 49966495 44247087 30026174 24757311 26722078 20205957
38846 20205957 5501682 1058671 11068930 13880550 -5275842 -29198149 -32757264
38839 -32757264 -17626654 -4621772 -1892272 -995500 1182408 -2195111 -10479869 -12330091
38831 -12330091 -4356132 1971178 -1755465 -7710845 -3734413 9844418 21957116 23888126
38823 23888126 15583025 3274545 -5192424 -6116603 -3703716 -4965953 -9795530 -10529795
38815 -10529795 -2745571 8504449 15599781 17280142 17967330 21071340 24968359 23956096
38807 23956096 13522930 -2581805 -12149601 -6175042 10342219 24554428 30812962
38800 30812962 32044720 28076341 14533675 -3860451 -11565017 -1771131 12037904 14236720
38792 14236720 9255646 13094648 26975082 34226103 24824036 9438596 2700290 2688918
38784 2688918 -3097761 -16546474 -24799601 -18103540 -3071674 6439718 6413415 4254264
38776 4254264 5468392 6654474 4162309 2762804 9119224 19922925 24131545 16825493
38768 16825493 4169180 -6009193 -11604702 -12770221 -9195240 -4728367 -6897796 -15870909
38760 -15870909 -20809405 -14508006 -5031919 -3470559 -6278774 -2385511 6096157 6363095
38752 6363095 -921801 2513046 24869340 47348685 47503306 29509909 16736777 19931900
38744 19931900 27916727 27991541 20470045 10814887 1066474 -5373037 -1675649 11828451
38736 11828451 22919389 21614037 13600596 11580863 17138830 19565499 11192525 -3452888
38728 -3452888 -14083085 -15055125 -8957869 -3202446 -2616062 -3682802 760797 8952124
38720 8952124 8713218 -5512261 -20863587 -21299531 -9879085 -3082067 -5169171 -3725404
38712 -3725404 7149324 15793609 12487394 5077292 3795025 3047939 -6615567 -17131816
38704 -17131816 -11261461 10561996 28257617 27929446 15653595 3554651 -4044656 -6341011
38696 -6341011 -1049960 8827173 13026768 6964607 -378272 1153326 8715835 12099219
38688 12099219 8383225 3066251 89892 -1341934 -1546695 1081388 6258820 11409111
38680 11409111 14943180 16398575 14551405 9625592 6676793 11979429 24506558 33981094
38672 33981094 30257670 14978912 1995844 3109384 13143080 14450713 -93084
38665 -93084 -15003962 -11477701 6141185 15790464 8189223 -3210186 -5472254 -2898376
38657 -2898376 -2930187 -1362043 6026497 10624124 5152655 -277518 6342415 16473987
38649 16473987 14130959 4714764 7195952 19609556 18519480 -2404349 -19074437 -13692788
38641 -13692788 -2059080 -7221993 -23744472 -29333294 -20718705 -15274184 -21098658 -26457082
38633 -26457082 -20531773 -7697170 3091437 9508773 10826284 3124112 -12093902 -21506074
38625 -21506074 -11686958 13659747 34425693 34289010 18010059 5981184 11293712 25565642
38617 25565642 30932333 22772317 12852831 10286961 9758222 3261934 -5891325 -8810445
38609 -8810445 -3963175 4352336 14913306 27231452 34540981 29901373 17471720 8082455
38601 8082455 5454143 6610514 13015359 27629244 40521509 33367904 5249222 -18747458
38593 -18747458 -15566904 6406556 16861028 -463523 -30349875 -44294919 -29476586
38586 -29476586 1051467 22023091 18135439 -4244596 -24807136 -28375605 -17162839
38579 -17162839 -6085987 -7749929 -21004037 -32057871 -27568451 -8458985 10826589
38572 10826589 18625366 17815180 17309391 17201327 11276222 1751946 -99433 9618678
38564 9618678 20360653 20950407 12407416 2430663 -4834096 -7591593 -2604770 9402322
38556 9402322 19746425 20943101 15812854 10321578 2314444 -12860680 -28435082 -29789621
38548 -29789621 -13928234 4300342 10002932 5334949 3214098 8749892 13983898 10135463
38540 10135463 -1291531 -11962948 -17059557 -17747248 -15051420 -7548512 2446474 6140813
38532 6140813 -2035799 -14664633 -18628857 -11975333 -6082392 -9483909 -17034085 -18723762
38524 -18723762 -12560841 -3500082 5121638 12752953 17370452 16245779 10328345 4127723
38516 4127723 1780153 4800425 11409162 16483057 15116156 7700866 -1515754 -10630643
38508 -10630643 -19396928 -22952429 -15219294 -489427 8867170 10511107 16179452 30559406
38500 30559406 39274384 30152867 14931894 12938711 20773410 17946684 234773 -13087518
38492 -13087518 -8535726 3396688 6728923 2112374 882202 7077972 14768025 17280050
38484 17280050 12669207 4972383 3540645 14572790 30513884 36221417 29259981 24300980
38476 24300980 31566407 40721276 34929772 13737409 -7398063 -15726560 -11111586 -1173619
38468 -1173619 5542023 4072407 -2470654 -4576607 2847155 14475344 23536466 31277242
38460 31277242 40690641 45986381 38055153 18843444 1113058 -6917069 -9142499 -12129973
38452 -12129973 -14981785 -12475050 -4200320 4017788 7415298 8362752 13519829 24768028
38444 24768028 34779563 34097260 22051108 7583768 -603721 -1132253 2587457 6922405
38436 6922405 8840753 7272279 5968281 10647769 20892537 28899701 28686541 23035737
38428 23035737 19583614 23387596 33743424 43766028 43346093 28984724 11368533 6180567
38420 6180567 16351779 30413690 38006378 37568581 29461322 15098513 5039666 12034201
38412 12034201 30166823 37322820 26875790 19005628 27666677 35193842 19975043 -5624485
38404 -5624485 -10903143 7053663 19633983 8596707 -12636389 -23701647 -22418855
38397 -22418855 -18204790 -16888729 -19507749 -23747728 -21517695 -6533724 12706895 19815101
38389 19815101 12700596 5730279 7826316 13398740 17892528 25188937 33495729 30868672
38381 30868672 13936962 -3474125 -9802071 -9887745 -9854641 -2762837 17020139 37291763
38373 37291763 41797952 33191189 27654059 31186922 34173572 27379914 13178156 1601294
38365 1601294 1194216 11413043 20962935 18971809 9513275 5915662 8928253 4900997
38357 4900997 -8533434 -12344586 5761931 28131048 28903505 8458467 -10918011 -15586771
38349 -15586771 -9727025 -669438 7453070 9707122 5776040 5090618 12281390 14750988
38341 14750988 1769928 -12581881 -7836810 7529000 6046019 -13979842 -22847547
38334 -22847547 -5504231 14712089 12325297 -3574470 -7624241 3657632 12786284
38327 12786284 10742277 5998831 7459532 13512624 18176672 18371067 14707515 10330460
38319 10330460 7679584 4570140 -1625545 -5151492 3601315 21690224 32587675 27027970
38311 27027970 13927460 3852129 -5878651 -19253895 -26647632 -16771166 3094850
38304 3094850 13348311 5544498 -12031543 -28753471 -39384176 -39589463 -26586098 -6044961
38296 -6044961 10516123 16970516 16061298 13429184 13574364 17820477 19600338 7196239
38288 7196239 -19801520 -42334005 -41661338 -23073570 -7126988 -1141558 4647863 13569704
38280 13569704 13919703 -480234 -16748756 -18930503 -6711862 9276143 20655154
38273 20655154 22510241 12213594 -3506984 -9734202 -2287450 2653824 -10189302 -31290794
38265 -31290794 -37941947 -25731030 -12626720 -11612756 -15377550 -13492811 -10803778 -18230313
38257 -18230313 -33177811 -40524902 -31280266 -12060334 4206775 11039524 10579399 7469755
38249 7469755 3743748 -724542 -4614400 -4444518 682852 5466024 3884114 -1684439
38241 -1684439 -2257780 4929022 11331005 8673213 -517168 -9963794 -20563794 -33914353
38233 -33914353 -39488129 -23500815 7270510 25869675 17608055 -236351 -2812357
38226 -2812357 8296265 11329780 -970392 -12123237 -9210120 -1435068 -3229026 -12540141
38218 -12540141 -17499276 -15743672 -14376558 -15180624 -12214165 -3818690 2886633 1630150
38210 1630150 -5223063 -10201809 -7781933 2347476 14956400 22425361 22113867 19685872
38202 19685872 21006917 22804119 17618193 6943991 1425517 6225307 13717221 14769948
38194 14769948 11390053 12633616 21489788 31489725 35030822 30439615 21025213 11142346
38186 11142346 4406538 3355565 8685901 18277080 27036954 28715693 20032502 4280641
38178 4280641 -10084172 -15917051 -12944189 -6986260 -3813444 -3486959 -666132 8699877
38170 8699877 20974859 27199138 23195135 15114518 12413821 17028711 22506129 22182695
38162 22182695 14407910 1410749 -11251888 -14255743 -851643 22651363 38097187
38155 38097187 32882337 14193877 1366492 4956575 17234565 23031516 16005495 2684187
38147 2684187 -7204498 -11653127 -16523019 -25409475 -32438230 -28876604 -15968682 -5211072
38139 -5211072 -3180482 -1846693 9765566 27442454 33651264 18823256 -5968789 -21191405
38131 -21191405 -19221424 -8467080 -642832 339054 -2679868 -6594416 -10169968 -11327155
38123 -11327155 -5657897 9764439 29998524 41628956 33400582 9956125 -9044881
38116 -9044881 -8846795 3235669 7324029 -2284460 -8803486 3891459 28152498 42499496
38108 42499496 40303739 35611335 39171265 42465140 33839990 20146341 18636866 30596271
38100 30596271 37217569 24832972 2866634 -10162005 -10313827 -8359464 -10383133 -9635085
38092 -9635085 52774 11558204 11933679 -495392 -12904122 -12749543 -1764137 7264699
38084 7264699 5833758 -1149717 -2001297 8046408 21596873 27298561 21725487 11939408
38076 11939408 6494567 5438388 1132150 -10508246 -21837034 -19983651 -2323052 17848926
38068 17848926 24470515 16339590 7603062 10221903 20482886 25806091 20876492 11110598
38060 11110598 1570002 -9534915 -22989508 -31180652 -26209577 -12727758 -4204299 -5577772
38052 -5577772 -7466473 -759236 10320414 15291750 11780966 5478383 -337988 -6559695
38044 -6559695 -11102315 -9200005 -1916052 3823488 5827605 9236601 15058854 14372936
38036 14372936 492934 -18693410 -27776196 -20225041 -2136397 16795018 29243090
38029 29243090 29978205 18383234 2500175 -5986437 -3754747 726996 -2112638 -11357828
38021 -11357828 -16816620 -11135587 383846 3323988 -10474601 -31615325 -41464503 -33088468
38013 -33088468 -18719909 -13287010 -16600117 -18113309 -14407471 -12726723 -18109471 -25534630
38005 -25534630 -26749306 -19311249 -7424701 1968503 3666539 -1003436 -4379921 -1947452
37997 -1947452 -135620 -8642640 -26145658 -40940503 -45641336 -43231764 -37687934 -27735088
37989 -27735088 -13358964 -465757 5928108 7275421 6295595 2330081 -3852325 -7049258
37981 -7049258 -4854804 -2261577 -3321629 -3743875 1490452 8127388 8229186 2282351
37973 2282351 -2620446 -4406727 -6948827 -10047095 -7805882 976602 8658098 8452598
37965 8452598 2263760 -4538746 -10189052 -13674134 -10342050 2353824 17272794 23552470
37957 23552470 20244305 16571047 16930371 14139925 3132795 -6338059 -802649 16712857
37949 16712857 29194035 28113293 20986523 14160582 2789670 -13912902 -21467822 -8560914
37941 -8560914 12431776 19832525 12323233 6852022 9580176 8540939 -2303971 -10978384
37933 -10978384 -6890359 3563587 9814541 11893545 12767100 8882826 -69153 -3182320
37925 -3182320 6807574 19483371 20888894 14553376 14497150 22293143 25215702 15262371
37917 15262371 -1948863 -16346973 -21923654 -17914830 -10061836 -7914942 -12853523 -13284955
37909 -13284955 -633476 15938666 21982434 18802665 18251688 21389575 18636013 9307709
37901 9307709 3997689 6288681 8097695 6015543 6851316 12498288 13892138 6130858
37893 6130858 -3208915 -7145113 -8733750 -11010773 -9287859 -1171837 6145420 6603644
37885 6603644 4224356 4143606 3951204 1518925 2094292 8804846 14267596 10698042 1343201
37876 1343201 -6395018 -11560862 -14465115 -9326867 6055482 19234338 14967547 -3760435
37868 -3760435 -17869857 -15246743 -2468205 6975197 8046810 5660583 6026225 8963921
37860 8963921 7995559 -1046856 -12374927 -16086926 -11448246 -6430368 -3105018 4896596
37852 4896596 15941288 15390247 -2884925 -22334887 -24676633 -14877118 -9524731 -9376806
37844 -9376806 -3361828 5360321 605971 -18015251 -29695752 -22779024 -11368386 -11609530
37836 -11609530 -18040556 -16818311 -9478304 -7794088 -12923443 -15504226 -13209193 -13920797
37828 -13920797 -21052378 -27255966 -25383006 -17527723 -10251925 -6604830 -5385741 -4121147
37820 -4121147 -864664 3944687 6650275 4368051 -109672 -941058 3095280 7774979
37812 7774979 10977201 15756659 22976450 25983776 18590794 6130243 1679130 10446265
37804 10446265 23898828 31625766 32979443 32490709 29379956 19471526 5317669 -3965223
37796 -3965223 -3850034 1174804 5413148 7920762 9491594 10449182 13201175 19837571
37788 19837571 25034631 19655107 4980071 -5484230 -3390318 4297118 8294746 9503710
37780 9503710 10253795 5147487 -6267735 -8653765 9140137 30190193 26862532 398808
37772 398808 -18879130 -13881642 -1030116 -174746 -5749075 -2803417 4659100 556708
37764 556708 -16640885 -31942954 -35053470 -29313255 -21632936 -16118208 -16506791 -23251085
37756 -23251085 -28096838 -21808070 -7836057 698689 -2218804 -10613914 -18093152 -23791954
37748 -23791954 -25052025 -15314074 5025601 23573557 28311111 20363650 9606472 2028655
37740 2028655 -3415173 -8889578 -14153247 -17582922 -16954814 -10498809 -50633 8540451
37732 8540451 11007563 9090905 6927610 5374714 3267556 1951348 3726529 6656050
37724 6656050 6004945 1331364 -2492433 -2196485 1055108 7444009 20728873 39924104
37716 39924104 54166915 53381040 41233753 29242397 19509504 3559579 -20114053
37709 -20114053 -38607376 -40489298 -29650608 -15588010 914133 21072610 34514815
37702 34514815 28168885 7234343 -8097386 -8967591 -6496816 -10156112 -13138646 -8341408
37694 -8341408 -4935543 -14680934 -30268924 -33054496 -18973095 -2259429 5947881 8642335
37686 8642335 10420104 7526649 -2854820 -13071702 -13379658 -4815961 3513423 6904032
37678 6904032 8349907 11004268 13620436 14492784 15630324 20337237 27689374 31396742
37670 31396742 25568255 12017860 317503 -1426368 4913516 10634378 11122909 9872879
37662 9872879 11206437 13766211 14084657 12612992 11347537 7667512 -3105511 -18086608
37654 -18086608 -25866232 -19366366 -5916938 1249828 133043 1665482 12583880 23614309
37646 23614309 20507780 2692792 -16490725 -26843884 -30688102 -33819230 -34795167 -28147013
37638 -28147013 -13929087 979724 9452625 9274559 3962228 430115 2697917 5956171
37630 5956171 1296393 -10737637 -16902997 -6861720 12862586 27453908 32314671 34367495
37622 34367495 37321467 36239001 28150154 18525917 13288989 11603525 10769012 11945639
37614 11945639 16121102 19508353 18191525 13595675 8760742 2959172 -4935269 -11080369
37606 -11080369 -10574300 -4999529 -724318 -528730 -1418808 -47453 3701833 7714630
37598 7714630 8657295 3663400 -4710597 -7346624 1548971 14183070 15570490 1186355
37590 1186355 -17963399 -29395919 -31560032 -29136715 -22717186 -9301015 10025274 27987180
37582 27987180 35608003 27234638 5410438 -16417399 -22152145 -10307084 1316394
37575 1316394 -4422478 -22516356 -32498301 -24368463 -7953125 3659028 9071742 13241665
37567 13241665 16790159 17511079 16744805 17545459 19475031 19802074 17186478 11016610 694458
37558 694458 -11145203 -18364548 -17363484 -9945479 1429301 15568665 27425994 28609154
37550 28609154 17839779 4346031 -3775752 -6999647 -5514195 6003646 25336928
37543 25336928 35005629 21465555 -4617821 -21209363 -22356848 -18066341 -12620010 -1751104
37535 -1751104 10421299 11505647 491392 -10149139 -14938243 -20311823 -25565410 -18807486
37527 -18807486 548899 14441431 11888945 4950850 7526613 15133692 19152649 24136454
37519 24136454 33736149 34272593 13111204 -16273792 -27733165 -14684857 8206931
37512 8206931 27933891 39376306 36508262 19102942 4091757 8495798 22779887
37505 22779887 22406945 4797134 -8253541 -6381228 -3825153 -10377209 -13980428 -5032779
37497 -5032779 2974782 -5469612 -20914270 -21911753 -6816906 4842671 -16137 -13279628
37489 -13279628 -19340829 -13292001 -2207223 6090595 11021372 15633390 17829544 11328177
37481 11328177 -2063898 -9342650 -3599474 3140962 -3093877 -14249457 -9865484 11363958
37473 11363958 28047749 26086074 14197163 5245822 221773 -2218522 2202094 12091047
37465 12091047 16317077 11095400 6929388 9343831 8728900 592924 -1433755 11662344
37457 11662344 24244160 17626484 -676714 -9582725 -6533420 -5258967 -8175975 -4121434
37449 -4121434 8151727 15939032 14126646 12231986 16345195 20147280 18415662 15544433
37441 15544433 15641414 15840290 13983163 12680882 11795363 6390350 -4002734 -12501859
37433 -12501859 -14507903 -12490848 -8578787 -254508 13247161 26776201 34668721 35704154
37425 35704154 31436509 24105634 16485128 9820485 3188703 -1544968 1387324 11653124
37417 11653124 17265996 8554821 -6214973 -10017487 145877 10156508 7347563 -7486774
37409 -7486774 -24928344 -33996977 -26925507 -7867866 5554137 998257 -11251708 -12612236
37401 -12612236 -3792514 -1056577 -7067078 -6624995 4746764 9105943 -7501574 -33888357
37393 -33888357 -49965218 -50191871 -40114274 -23175254 -4187613 4987884 -1917976 -13406151
37385 -13406151 -13023968 111210 13602868 19507246 19302807 14837373 4970126 -8944229
37377 -8944229 -21174793 -25582669 -19007146 -3864304 10652155 15507487 12560523 11617241
37369 11617241 14219067 9919737 -5734303 -19411478 -15405160 3512240 19544150
37362 19544150 20279924 9044612 -1155616 1210017 16499566 31199857 30606896 17360323
37354 17360323 9384443 15985877 26813919 30214877 29584523 31400049 29096288 13237720
37346 13237720 -9764869 -23337821 -20937368 -9139308 4494034 15275119 18298967
37339 18298967 13641100 10732611 16569534 24412497 25377316 24608517 31714983 40937890
37331 40937890 38023963 24253002 15778252 18623026 21695541 17527883 13234401 14990522
37323 14990522 16044689 8269864 -4606667 -12414866 -9796039 2022055 16717872 23061234
37315 23061234 12650491 -8516625 -24145842 -26219433 -20934012 -13969254 -1267826
37308 -1267826 19445802 37750582 40058295 25618726 7210284 -956016 6610334 23569822
37300 23569822 35810416 33046420 18583779 4335993 -2572821 -2746274 2453671 10744357
37292 10744357 13453055 2795186 -14120852 -21151427 -15226530 -8991131 -7817215 -42003
37284 -42003 21841214 45063057 53447825 49186373 45395328 46055797 46219147 45013532
37276 45013532 45105107 43558600 35049213 21259447 7681302 -4837561 -16455912 -22107210
37268 -22107210 -19655023 -18590875 -27983391 -40099929 -39807511 -27412336 -17249255 -14569236
37260 -14569236 -10149741 -274566 4533802 -2198640 -9741922 -5597812 5389231 8533495
37252 8533495 682704 -6233278 -1394380 13014701 26223377 29856140 23923944 15342699
37244 15342699 11263751 12381135 12957316 7924727 -1293158 -8457267 -8319925 -455990
37236 -455990 10462060 17313558 15414249 6377462 -2833338 -4537741 5037056 22186102
37228 22186102 35306012 32882472 16316111 708668 -2819260 -1113959 -7081561 -18159871
37220 -18159871 -19487582 -8209975 641056 -2123945 -4913088 5350079 21010239 25355125
37212 25355125 18610629 15299660 19087281 18573492 9717555 4255048 9133799 13886717
37204 13886717 9145870 3821948 9560756 18866269 16363400 5605903 4974691 17925441
37196 17925441 27524043 24731939 22367669 30956114 37822259 25718787 1062470 -13507749
37188 -13507749 -8860000 4476417 16678743 28652894 40838325 46953064 43324468
37181 43324468 33716287 21536042 7243789 -3958151 -3550774 6336059 11736817 6546116
37173 6546116 2813766 12097555 25685949 25821218 11718465 1256399 6707346 19578643
37165 19578643 22778185 10607985 -7566015 -19547110 -21892943 -19869574 -18835074 -18496290
37157 -18496290 -16619918 -14945426 -16534418 -18756559 -15611305 -7633391 -2192438 -1737104
37149 -1737104 463469 8642988 15910539 13274980 1811808 -9910882 -15697135 -13924776
37141 -13924776 -5572562 4112676 7807296 6343814 10364534 24310901 36127763 33365397
37133 33365397 23178528 22689766 32453465 34624214 19365019 -282032 -5287270 6782697
37125 6782697 21557543 24158128 11598351 -6624613 -17611340 -17609419 -15147254 -18189274
37117 -18189274 -21937940 -17004903 -6045472 -589957 -1948663 1136385 12600705 20541417
37109 20541417 15863124 7622419 9061583 16397505 13904807 -2999608 -20741524 -24131537
37101 -24131537 -12220385 3881425 13825939 16635582 18763479 24662044 29896299 26277248
37093 26277248 14181186 5015189 8511097 21483818 32871914 36532588 34659905 31155499
37085 31155499 27018508 22250326 18432562 17995668 21746599 26975227 28256512 22198724
37077 22198724 12072311 5684312 7896408 16756920 26293911 30261831 24522723 11044701
37069 11044701 -132870 1149153 13193012 23373594 22897402 15275104 8113729 3332277
37061 3332277 -238980 -1148350 1188685 1876887 -3210474 -9158680 -7355661 1713193
37053 1713193 8026720 5427459 -501445 -626332 6013066 12714772 15381812 17356371
37045 17356371 22418087 26959588 24303548 15869097 10966983 12827546 12671625 4464635
37037 4464635 -1730153 7200610 24720377 29579957 14935769 -1861663 -4005511 3559807
37029 3559807 6570328 3755394 4426898 10853398 16134162 16838582 16335825 16103704 13402245
37020 13402245 8410324 5830503 7865573 11435430 13403811 13541389 11332465 4456291
37012 4456291 -7317475 -18754562 -21506837 -11000238 7693816 22637362 27489885
37005 27489885 29240927 37210960 46719492 44556081 30990480 21855671 23446400 20920873
36997 20920873 2555876 -18449826 -21929536 -10251109 -2148653 -3792828 -4999464 -1118945
36989 -1118945 953727 -134098 5111860 21240147 41509607 61135355 82471851 102038741
36981 102038741 106544704 89814851 63440662 43347470 33310013 26284319 14173792
36974 14173792 -6869233 -31955477 -45753863 -35705188 -10222281 7122236 5041468
36967 5041468 -5335815 -10907365 -12857906 -16417142 -19184224 -18936033 -20034830 -22190010
36959 -22190010 -15982682 -829082 6613273 -3171960 -12676530 -836572 22739871 28574848
36951 28574848 8655023 -14255372 -19479171 -11064734 -3068259 558124 3079235 4271558
36943 4271558 1679167 -4377865 -12810107 -23026780 -30953495 -30507237 -22244934 -13962211
36935 -13962211 -9898980 -6542694 -2480144 -4361336 -16806510 -31716862 -34710210 -20919448
36927 -20919448 -396979 11641082 8604401 -1726997 -4794960 4989520 16484706
36920 16484706 13567376 -5457569 -24880411 -28940819 -17629144 -3671757 1852263
36913 1852263 -1716066 -7291851 -8753198 -7369814 -9366179 -16346881 -21035256 -16263989
36905 -16263989 -5727821 -72768 -2935330 -6661921 -2558950 9510309 22498718 28733649
36897 28733649 24637650 13349235 3495809 1906062 7422017 14408704 19784368 22136463
36889 22136463 17789573 5696568 -5699403 -5501295 5760654 17508652 23755628 26696537
36881 26696537 26030062 17205225 3411216 -3307071 884334 4337465 -2953422 -14978763
36873 -14978763 -20742889 -19835756 -16787560 -8953481 6943322 22365046 25405685 19072911
36865 19072911 17539873 24665145 29439748 24440159 16064231 12135678 10632719 7433486
36857 7433486 6222347 11886699 19498878 19164492 10254639 2927621 4501761 10420413
36849 10420413 11498222 5618326 -2341083 -9572993 -17311258 -22462363 -15545358 5508156
36841 5508156 24569820 21832122 -531553 -18697203 -16740634 -4288650 1851337 1244073
36833 1244073 2935777 4949227 -2121196 -14582022 -16518241 -3141418 12315655 19418658
36825 19418658 23523255 30644876 33041613 21625226 3537945 -5824742 -3638129 -275370
36817 -275370 -1313227 -966373 5326025 12357231 13592202 10835516 9844129 10459182 6953335
36808 6953335 -2798488 -13139685 -16787840 -12431186 -4280731 4007889 11332865 15071084
36800 15071084 10255592 -2959194 -14384003 -13014834 -1004355 8045008 6206996 76077
36792 76077 -850855 1814002 -593270 -9155588 -14178227 -7275774 7836466 18164887
36784 18164887 13502871 -3945971 -20486711 -22502102 -8923385 8364391 16947376
36777 16947376 14669905 7740450 2264316 483930 2201958 6059987 10639426 16387134
36769 16387134 24481089 32607904 35931194 34770310 36388757 44772268 53120778 52063992
36761 52063992 41612483 29042751 18845670 11886229 10479410 14628832 15374612 3304435
36753 3304435 -15268196 -21966998 -10220567 4429412 4060552 -9311843 -18359437 -11951984
36745 -11951984 5139831 20311101 23960537 14501987 -892095 -10785829 -9393322 -2555995
36737 -2555995 -1668738 -12356658 -30172913 -44906916 -47685396 -37580291 -23870685 -18217606
36729 -18217606 -21796455 -24069385 -17212033 -6646599 -2670778 -6691543 -12090105 -14781952
36721 -14781952 -15506946 -13994469 -8468757 -381594 6531080 11129190 13416197 10617348
36713 10617348 2012859 -4294341 1214133 14850394 21766837 14708038 1906368 -6835579
36705 -6835579 -12756042 -21351805 -31128495 -37054773 -40012633 -44245001 -47745269 -43323874
36697 -43323874 -29810088 -16055678 -11308521 -14644329 -16446030 -9855155 1059913 6455369
36689 6455369 3773910 1336929 5869669 11860336 10806995 6775941 10836916 20556672
36681 20556672 19713191 3256205 -12013603 -11141298 -2292368 -855835 -3138222 6128454
36673 6128454 25822933 37820549 34242515 26631924 24384250 21697371 13020788 5232564
36665 5232564 3715937 -278520 -14955489 -30423678 -30735560 -17924901 -9308595 -12725896
36657 -12725896 -17848732 -12823028 2014329 19023216 31417015 33202509 20562073
36650 20562073 -892845 -16707767 -17515619 -8950065 -3569753 -6259210 -11558480 -12563968
36642 -12563968 -8243095 -3348935 -4173566 -13168529 -25490576 -32549542 -31274822 -27790961
36634 -27790961 -28850878 -31588238 -26475210 -10819653 5175207 8805771 -550810 -10441986
36626 -10441986 -8998863 3082448 15505129 20714122 19628437 15688740 8396119 -4043330
36618 -4043330 -18936150 -30562910 -36170414 -36209655 -29623359 -14604697 4907234 19244875
36610 19244875 22819063 19904608 17285857 15155651 10112772 4067570 3579925 10522429
36602 10522429 19114443 23486016 23399013 20434047 13014499 -722755 -16973923 -26927722
36594 -26927722 -23961450 -9417973 7971062 18071440 16898625 9723282 5065514 4538034
36586 4538034 1330927 -9140235 -20566528 -22399526 -13498341 -3466740 17124 -378566
36578 -378566 2110367 8861384 16273549 21604940 23826626 21534589 15041744 8520943
36570 8520943 4615086 -1531757 -16129977 -34546668 -42728449 -33477607 -15037631 -23030
36562 -23030 8018964 12314296 13571835 10565154 5909982 2750231 -2201541 -13533542
36554 -13533542 -25945318 -27984355 -18448420 -9396326 -9379907 -13141401 -13388854 -13299837 -18514010
36545 -18514010 -24165385 -21426854 -13258689 -11679164 -19836463 -27934042 -28512960 -25191883
36537 -25191883 -22733457 -18480644 -9781490 -1955107 -1227412 -4981902 -6333872 -4399595
36529 -4399595 -2737790 -829217 4688914 11458902 11992148 3794849 -7050166 -13330853
36521 -13330853 -12591867 -5430921 5634496 13811140 11003653 -2713567 -16714420 -21027356
36513 -21027356 -17166483 -14101425 -15829538 -17467122 -13331652 -5028029 341446 -1075734
36505 -1075734 -4693745 -2636013 5718610 11293148 6687919 -2115932 -1275658 12876374
36497 12876374 27189084 26277129 9456399 -10401150 -20964486 -19106011 -9272317 573828
36489 573828 2814416 -3843079 -11558742 -10964829 -2085773 6420117 9111433 9645400 12977591
36480 12977591 16912983 15828290 9948651 5694429 6762677 8972750 5854678 -2914908
36472 -2914908 -11250482 -14358765 -14031974 -14789844 -16656208 -15224670 -9493885 -5995533
36464 -5995533 -11548495 -22929076 -27911716 -18574446 -1344283 9362059 7501497 2045297
36456 2045297 4784290 14218038 17395718 8366994 -2656894 -3686469 2260018 4333309
36448 4333309 3612939 11764223 28435400 35242083 20611041 -1685577 -10771987 -6031768
36440 -6031768 -1664884 -865718 6077691 19344955 25270540 19756015 17930152 29929810
36432 29929810 41808851 35415146 17431645 11014322 21965996 30898927 22176355 5884212
36424 5884212 2563869 15195456 26851798 23250595 8548211 -2417965 -938221 9993632
36416 9993632 22422150 30072239 29395330 20323034 8557775 2605959 4558547 6734544
36408 6734544 1331757 -9569426 -17884826 -19551713 -14683093 -2122312 16607517 30126813
36400 30126813 25979226 8532677 -2843843 2889920 17209127 28144615 35705788
36393 35705788 43722913 47615482 41679080 31169166 25515320 24233923 20033736 11875846
36385 11875846 4885021 1043705 72545 5773139 20417674 35690241 40915252 38823947
36377 38823947 41680970 52497970 61540380 61564100 55485447 48521907 43252898 42290179
36369 42290179 44972229 42661646 30060593 19354213 26553408 43505002 43678509 21042304
36361 21042304 1845224 6678724 20788789 18660621 1943375 -7538418 -1687966 8786664
36353 8786664 17396950 28089518 38846002 38795075 25811862 11998549 6744086 5897796
36345 5897796 1819453 -5955102 -13852685 -19287256 -19389567 -12443418 -2765544 3077028
36337 3077028 5594496 9844454 14087863 11686001 5169375 5897722 16087775 23709947
36329 23709947 21161208 16793342 19466515 23010333 17654732 8334761 7775514 15684957
36321 15684957 18714429 10865602 1775854 1946816 9058503 13192715 9415502 1169766
36313 1169766 -4643841 -2664661 7742269 21165962 29471919 28585734 21924437 17135898
36305 17135898 19951177 29897101 40392602 44484833 42500462 42103745 48110027 54916250
36297 54916250 53548789 44035818 34334266 27441969 17538411 1732387 -11768682 -13138552
36289 -13138552 -3871692 6398776 13061325 19206244 26486269 31616562 33557436 36405242
36281 36405242 41139101 41075954 31583604 19544890 15591950 19276048 20063691 13230430
36273 13230430 7148196 12425347 29473824 49006865 59530483 52702405 28594250
36266 28594250 147038 -14101996 -8308509 3795351 6046176 -986257 -5192162 -2101040
36258 -2101040 1912697 3451337 6462482 10479972 6627482 -7796162 -19532971 -13358517
36250 -13358517 8339423 28106155 33616423 28222984 21913269 18811132 16243066 11929475
36242 11929475 8096222 8643797 14185969 21164418 25924567 28402316 30935658 35110961
36234 35110961 41433320 49651627 56226705 54447832 42701165 30537360 28759809 33903933
36226 33903933 32196223 21100845 15795328 27558874 45374515 49165106 35078343
36219 35078343 16758414 5784850 2805429 6147298 16056094 28011504 32906171 28429318
36211 28429318 22098404 19053841 14908606 5621878 -3160636 -3406053 3861791 10955734
36203 10955734 13734450 13793914 13865645 16664190 25348964 39272857 51402673 55509796
36195 55509796 54231037 54982844 60130812 66859702 74275627 83312073 90834130 92229152
36187 92229152 90667412 95546070 109450135 124846412 137618928 155417730 185159300
36180 185159300 217940813 235482080 229920694 210003757 188647560 171551757 158293054
36173 158293054 146979663 134501000 117178586 95047918 73139009 56446201 45904412
36166 45904412 40284013 38448073 37834231 34487542 27752624 22262060 22237983 26205576
36158 26205576 30303441 33961156 38138429 40290047 36666327 29318004 25480064 28618328
36150 28618328 34062678 35104146 30156408 22514367 16519800 15839351 21720275 29531216
36142 29531216 29939705 18347561 2546757 -3457979 5729267 21634431 32899849 37749952
36134 37749952 41653295 45071050 40647312 25444269 9983829 7562476 16087689 19463237
36126 19463237 9905629 294797 7064028 26963052 41300650 40807720 34201171 30687814
36118 30687814 27155747 19495638 14848682 20277059 26136076 15721098 -9379652 -27777582
36110 -27777582 -25524447 -12382003 -4479389 -2032678 4974672 16557999 21941964 17310493
36102 17310493 11545302 11843927 14309921 13624663 13097861 18050993 25546158 28623613
36094 28623613 26752754 24324095 21833903 17170897 13973155 18825174 29006613 32693970
36086 32693970 25151422 16405545 17312272 24883617 28348545 24711679 20632264 21764918
36078 21764918 27294436 33241173 35096653 29424521 19367419 15927225 25444920 37281802
36070 37281802 33891454 14162325 -3440776 -4287099 5880097 13438041 16066523 19664927
36062 19664927 22799400 17207263 3427365 -5562474 -583571 11213209 15406107 7627668
36054 7627668 -3436089 -8044405 -4894462 1409528 7272971 11766240 14371886 15046999
36046 15046999 15974336 19679033 24592015 25343967 18859831 8056049 -1444610 -5833573
36038 -5833573 -3852239 3014173 9340547 9180044 3499283 -179286 1468755 2897349
36030 2897349 149476 -1056635 4993353 12879096 14289408 11597910 11395912 9672643
36022 9672643 -1309975 -13882714 -10648647 8736035 24230558 23804421 17759320 17630187
36014 17630187 19081501 16899598 19335372 31785025 40664358 31963124 15161723 9559492
36006 9559492 15002418 16104983 9531292 5736752 6126920 63323 -13813475 -22565392
35998 -22565392 -18791239 -8963389 979013 12133862 21813195 23164630 19805755 23867618
35990 23867618 34324547 34962201 20808589 8230769 9039101 12528598 5913283 -4193196
35982 -4193196 -6288077 -5351314 -11740020 -20270328 -19697518 -14475777 -16794545 -22502435
35974 -22502435 -16145754 1524071 11604424 4901436 -6411567 -9195047 -4818168 1656809
35966 1656809 12000178 25412639 31487035 24025826 13393917 13872639 24114513 30705796
35958 30705796 28036559 24382786 28316647 37742814 44960254 46695948 45443740 44108177
35950 44108177 43353158 43697021 46854730 53181839 59240445 60547812 57037673 53402236
35942 53402236 52966198 53701769 52344722 50237635 51893378 58612500 66769984 73131427
35934 73131427 79985750 93835722 118991202 152453233 185791617 213082325 235919135
35927 235919135 258647569 280589853 297372991 308952161 319876833 330164963 332632677
35920 332632677 322985010 306983709 293003048 281976718 269199789 251488541 227598094
35913 227598094 196568599 162254761 135278488 122390614 116068915 102770657 80822293
35906 80822293 62268458 56289426 58359554 58569052 54635798 52115086 54599588 58359979
35898 58359979 57581892 52741634 50745229 55543514 62160595 64424311 65036428 69529622
35890 69529622 72266064 61578873 41719925 34381557 49146973 66299244 62821050
35883 62821050 43848665 30773015 27507828 21043301 11318162 14480862 32325303 43259352
35875 43259352 34604742 22865978 26447763 35258374 27163830 3888154 -10910362 -5711552
35867 -5711552 6074566 8525598 2091879 -4332446 -7273371 -7961151 -6355382 -2268230
35859 -2268230 2804570 8997280 17931463 25998341 24434018 11548336 -980740 -1581179
35851 -1581179 5279248 5471289 -4224069 -12371217 -11414881 -8755488 -12816559 -17666323
35843 -17666323 -12457255 -546133 3765400 -3940995 -13512005 -17276976 -18459563 -18941301
35835 -18941301 -12352367 3180089 17025122 19776988 15141078 9520645 966665 -10550977
35827 -10550977 -13807052 -2473402 9012063 3498105 -11740387 -14941796 -2419265
35820 -2419265 9072044 10417862 9177810 9580687 5245693 -3674776 -6375462 -601306
35812 -601306 2960789 1822790 7432015 21725835 28586904 19908525 10415711 12910183
35804 12910183 17518811 11407491 1472460 -823210 -1216872 -8978966 -15544192 -8985039
35796 -8985039 1756178 618618 -6885801 -3608948 7393676 7551278 -3767009 -8003089
35788 -8003089 -1061497 -854704 -14328963 -21871296 -6836108 18413667 29682239 20773576
35780 20773576 3787591 -10437711 -20562790 -28711607 -34223532 -32006343 -17265047
35773 -17265047 3277934 10029585 -7473206 -30978204 -32571986 -12266205 3180278
35766 3180278 961069 -1761724 8953723 18811822 10400909 -5808720 -7537651 4193966
35758 4193966 8868523 -347485 -8798209 -5020254 5690906 15234939 24231611 33611319
35750 33611319 36409672 25735012 5227205 -13480620 -20728594 -14635034 -773843
35743 -773843 12253989 19242565 20644060 17387642 6939147 -11008114 -27824071 -31917106
35735 -31917106 -22029803 -9092571 -2917244 -1192188 5135433 17808572 27394986 25758866
35727 25758866 19026719 21160694 33053879 36825256 18733899 -9232623 -23251729
35720 -23251729 -19688574 -17287502 -26109236 -32454892 -22978275 -7556536 -4353003 -13516002
35712 -13516002 -21391377 -23394641 -26198377 -30979224 -30939736 -25450539 -21879847 -21002859
35704 -21002859 -13567075 4348014 23067510 31358228 28619944 20834848 11849109 3523219
35696 3523219 -1461970 -2239338 -1937508 -4057432 -9062630 -15257546 -19485426 -17383396
35688 -17383396 -8163568 1228773 3247410 1059810 4727288 14892810 19858879 12739603
35680 12739603 1669295 -3743490 -6681713 -13473593 -17016084 -4651807 18358342 28570709
35672 28570709 13748749 -8610310 -12020005 5961685 22717783 20779987 7213811
35665 7213811 -388204 3337116 10973983 17567000 24735217 30816879 28658268 17154231
35657 17154231 6066910 3125131 2678004 -5482816 -20111454 -29191499 -25150882 -12850838
35649 -12850838 -3017360 -3033970 -12973272 -24951899 -27685913 -18296946 -8687215 -12528975
35641 -12528975 -26216281 -32199531 -22929244 -10421534 -6782828 -6684399 590005 10771127
35633 10771127 10976335 2516645 872915 11039058 18613798 12286235 1667778 1980924
35625 1980924 11272115 16014464 12181490 5921449 -2003088 -15052512 -24924268 -15886728
35617 -15886728 9924703 29404840 29417722 24155374 29524293 36551932 28114623 9499753
35609 9499753 181668 2140780 -29195 -9410654 -11286705 -583406 8158634 5968993
35601 5968993 4117212 12804040 23097086 23402253 19072959 20760560 24807058 20501724
35593 20501724 8551070 -1685633 -6754450 -8444305 -5129463 4007084 12128753 13826802
35585 13826802 14974261 22127612 29100569 26768679 19349130 16797695 17035080 10982178
35577 10982178 414271 -5277578 -6547876 -11242130 -16904404 -12844104 171463 8944108
35569 8944108 7875021 4370889 2787788 -1167938 -7524134 -9320213 -6608187 -8334603
35561 -8334603 -15988737 -19670704 -15067499 -10512180 -12395864 -16988776 -21015181 -26271532
35553 -26271532 -29533031 -23227313 -11185551 -7285310 -12328973 -10271170 4371821 15088274
35545 15088274 11556715 9592126 25442277 46421250 48209300 30533774 14418102
35538 14418102 10730232 11779380 10531356 9067090 8206246 4473913 -1808559 -7366493
35530 -7366493 -13408319 -20966371 -22582646 -12024325 1038294 1228238 -8980787 -11519290
35522 -11519290 471845 13169317 12710959 1979336 -7975285 -12112067 -11595496 -8442756
35514 -8442756 -5105862 -3997081 -5420569 -10485259 -23540676 -43293120 -54626879 -42122833
35506 -42122833 -12220949 11320141 16716207 15468395 19879496 24148639 18105479 8212592
35498 8212592 10261371 25302874 36160992 29444782 12038527 1715896 6016351 15155522
35490 15155522 15611005 7035883 1936392 8875720 21282531 26183256 19500122 7623322
35482 7623322 -2160770 -6001587 -1366778 10955867 23483331 28435158 27547219 28598026
35474 28598026 33011693 35092110 33197976 32062392 32519962 28695887 18744800 9410094
35466 9410094 5365723 2049247 -5410499 -12914264 -13043967 -4751072 8002143 22126226
35458 22126226 33833855 35780542 23838324 5878991 -2961281 4125491 18029049
35451 18029049 23763746 16730146 6583790 4130431 7449711 6207326 -939591 -2202259
35443 -2202259 9132652 21067373 17690426 2550772 -5122545 3549048 16924121 20360607
35435 20360607 13149555 4650344 2439419 8009372 17239174 22542784 20568048 17862622
35427 17862622 21392461 25161844 17569871 1601224 -6729266 -2785315 -416062 -8276643
35419 -8276643 -14784034 -7333157 6882783 12738292 9975176 9812730 15444397 20007263
35411 20007263 20221530 19372017 18709457 16793552 15991198 19866739 24908994 23353770 13889199
35402 13889199 2860448 -4247877 -7251960 -9276014 -14503130 -24126828 -31041321 -25046229
35394 -25046229 -7723334 6739739 11558931 16671500 28844572 36316593 28570678 18641166
35386 18641166 24308205 35658576 27113033 -936998 -20405837 -19005670 -16722412 -27658591
35378 -27658591 -32888315 -11956111 18914412 26422631 7814903 -7045888 1189133
35371 1189133 19789706 29172839 29050964 29418838 29936547 22123146 6276003 -5828824
35363 -5828824 -5269040 4469544 13786779 17607757 16963954 13510026 7376786 666499
35355 666499 -1516477 3111859 9552889 11143092 8648296 8860803 13860208 17336941
35347 17336941 13989521 7280072 3537256 2563821 103214 -2812342 -530986 6490342
35339 6490342 9183252 2486085 -5072564 -1616625 10371672 15156989 4679226 -9384908
35331 -9384908 -10118150 3661766 18633093 25625800 27180995 26717241 21119214 8803913
35323 8803913 -2934784 -5334950 1333459 9429568 12211368 6866304 -5625983 -19058991
35315 -19058991 -24963642 -21452768 -14859238 -9578545 -3094564 4700873 6353850 -1141254
35307 -1141254 -7482317 -2486074 8131277 11494040 6457392 1555306 -1232461 -6830646
35299 -6830646 -13584561 -13496645 -6006135 705697 2233843 592246 -4155532 -12409123
35291 -12409123 -17039475 -11191611 -2730279 -4867382 -13087797 -10127260 4525770 11139320
35283 11139320 1010255 -10435534 -10821494 -9532574 -16019671 -19439872 -7515627 10244625
35275 10244625 17240528 15393661 17386576 23793267 26755528 27358324 30049020 27569897
35267 27569897 11651093 -7266829 -11618408 -3650894 190184 -1493014 5554621 22327555
35259 22327555 30807647 22745661 13501550 18432845 31768001 37920470 31031258 15964423
35251 15964423 1151740 -3948744 4751393 17843613 21669762 17577523 18147365 22957410
35243 22957410 17006766 -1107810 -10568723 311021 13441344 8226497 -6406964
35236 -6406964 -7339259 6565569 15702651 11750311 6740666 9848707 14029630 10546147
35228 10546147 2981687 693113 6907148 17368141 24765978 23156892 13994581 7858070
35220 7858070 13867221 27799279 37064969 36142049 29626047 21420980 10291989 -2915813
35212 -2915813 -12551468 -15476953 -14468911 -12179591 -7844591 -1689194 3882630 9711519
35204 9711519 20019250 33950886 42725116 39366028 27465343 16955272 14184337 18353314
35196 18353314 24207714 25771337 20679005 13437500 11842917 18173265 26472194 29992936
35188 29992936 28010909 23311432 16843006 8724491 2233659 2068644 8112122 14036370
35180 14036370 14182020 11070600 13613690 25801568 38455826 36824673 18386293 -1496949
35172 -1496949 -6401887 2020752 8347024 5097366 1287521 6786965 16280933 15703518
35164 15703518 1196839 -15373047 -20264488 -12416266 -1974516 2988496 4538176 9034227
35156 9034227 16820253 22253206 23365429 25237241 30883404 35023715 32917419 30075619
35148 30075619 34017076 39275166 32307038 12619299 -2722157 -737643 11265413 18289019
35140 18289019 17788349 17558841 19820072 19443303 16131608 16693243 23234950 28307019 25460593
35131 25460593 17819413 12177256 9989683 8566401 6992709 6026387 4689857 1633339
35123 1633339 -1223450 -257007 5177464 13002922 23019705 37216228 54070008 66070195
35115 66070195 66445780 57261442 47331180 41789277 37266197 29101485 19621352 15168359
35107 15168359 17246944 22379682 30269704 44638228 62782710 71478627 60847435 39255449
35099 39255449 26172860 29856359 39316628 40623659 34425518 32267464 39819051 50345261
35091 50345261 54283277 49981687 43328377 39907489 39605558 37770273 30861974 22020927
35083 22020927 20534019 32431471 50444419 57894781 47269887 31931975 32084084 49232200
35075 49232200 63384803 59078231 44651465 37205140 36550465 28617435 12612388 7402648
35067 7402648 24412766 48240800 55947224 46814361 39599511 44973998 55139319 60755527
35059 60755527 64070838 69734937 72811432 64991827 49232581 40684971 51259474 75134818
35051 75134818 91432838 83840179 58748794 40247709 43873575 59841183 68008704
35044 68008704 64452922 63219698 73551451 87279209 91610019 84668384 74096429 68085447
35036 68085447 71634436 83858425 94814251 92948911 80389282 72505523 76858020 81992189
35028 81992189 75069070 61485981 55968553 60998246 67098851 71111250 80554902 98919799
35020 98919799 117898982 127875908 129086866 129457822 135564472 146375242 152806901 145664629
35012 145664629 128273544 117257595 124180312 140216708 147317630 141627494 136475117
35005 136475117 143810269 162094454 181612824 192577524 189149135 175374556 166342067
34998 166342067 172981894 186226020 187238890 172786952 158217926 155543595 162519045
34991 162519045 174006632 187775754 195871467 188024081 170333670 163493449 173965345
34984 173965345 184151804 181385525 177576002 184922482 190791392 178305617 158075502
34977 158075502 154435902 167977129 177200489 174231013 173428626 182625794 189647017 184188964
34969 184188964 173569467 168148448 166650646 164277225 162269819 161863968 160456619 160132026
34961 160132026 167794375 179999287 180337130 160994855 136256562 124936331 128223410
34954 128223410 134179450 135937504 135262721 134148025 132708426 132007995 132194858 131539843
34946 131539843 131607957 136969600 145066734 144766608 131768106 116962036 111254798 110655605
34938 110655605 106653805 103198657 109735313 121907847 123823587 109758314 91795357
34931 91795357 83885334 87470952 95126504 100699244 102651849 102390134 102151719 102781358
34923 102781358 103611734 105100185 108011896 108377040 99438788 82574018 69159698 65652236
34915 65652236 64501604 57663737 50405042 50476052 51920569 45110763 37473216 45701230
34907 45701230 68112324 84091646 84817995 85585738 98920949 112299758 106178265 82593736
34899 82593736 60549623 49316104 41343544 30095868 21432564 23896000 36298307
34892 36298307 49824563 58549823 63888729 69473656 74717101 76118204 74562223 76016601
34884 76016601 80856311 78062609 59128021 35018404 27362567 41589428 61018770
34877 61018770 70768018 73545463 74901026 68441674 49846769 33839628 38084350 55010067
34869 55010067 59174061 43248515 28079378 31476098 43446549 42617292 25440811 6896332
34861 6896332 -815344 1675075 8599211 15734189 19723158 19425185 18897686 22493344
34853 22493344 26599689 22959042 11418756 2724775 5986002 18932136 33494866 45210707
34845 45210707 52622366 52822228 44690835 34266930 30187434 34167945 41127309 47541264
34837 47541264 53409022 56588456 53094890 44905491 40054897 41693921 43885050 42125741
34829 42125741 40466394 42162771 40756043 29623260 15365679 10988889 17799056 24623176
34821 24623176 25024515 24915215 30699580 38957276 42134252 37996211 29646952 21291367
34813 21291367 16831319 17839697 20651568 20082719 17220296 17842830 22134309 23292668
34805 23292668 18786011 15269828 18150087 22982116 22131477 14701710 5701486 107567
34797 107567 487265 4889544 5603089 -1945783 -7653346 3917375 27959995 37571232
34789 37571232 17718347 -12005148 -22830855 -13936713 -5902175 -4832773 4266108 28239948
34781 28239948 51807497 59818395 56749694 54763025 55160770 52201191 46347539 42969868
34773 42969868 42481856 40105334 33228040 23962445 16520017 14513765 17493509 19064601
34765 19064601 13559079 5342080 4452397 11339206 14505580 7159009 -2297841 -2263360
34757 -2263360 6546762 14067573 13890954 7174136 -1622306 -7025644 -4914493 2022686
34749 2022686 5474654 2877753 2168195 9582886 18795975 19836089 14012109 11410055
34741 11410055 16714059 25987158 35412573 44558465 51234611 50749706 41756178 28443056
34733 28443056 17091401 13315291 19302580 28915219 29742985 17075159 2498299 712353
34725 712353 10776907 19634326 22010515 25575765 35602493 45693525 47664317 42001019
34717 42001019 34015100 26456883 20361185 17710273 18980226 21526485 22421047 19507947
34709 19507947 10421180 -3220691 -11699435 -6659595 4292378 3568803 -11860688 -23365498
34701 -23365498 -15174013 4401146 15890724 14273303 10112303 11241135 16120804 22456645
34693 22456645 29842782 34100380 30064203 20932622 15155831 13271221 7833843 -2231893
34685 -2231893 -8275186 -6465281 -4810070 -9478402 -13545077 -7645109 5192147 14442744
34677 14442744 16842817 16882505 16108196 12443723 9399993 15166196 29522647 40125986
34669 40125986 36564609 22049076 6335390 -7195559 -20471819 -30669612 -30548599
34662 -30548599 -19813599 -8507615 -5577698 -9503144 -14152843 -18278920 -22784182 -23217807
34654 -23217807 -14824496 -4171971 -4666805 -17291650 -26475505 -21729262 -13440495 -16715532
34646 -16715532 -27460338 -28710680 -16600179 -3675460 3506900 12085682 23384706
34639 23384706 24285951 9551007 -2940126 4129462 19464479 18183321 -1167575 -15843674
34631 -15843674 -14291850 -9996756 -14200599 -15944840 -2728823 14225521 13189041 -6440256
34623 -6440256 -22221411 -17383107 1337483 15784817 16050190 5205008 -7702634 -14872808
34615 -14872808 -14001997 -8938488 -5155337 -4011751 -2678825 953661 5054678 5103692
34607 5103692 -1971090 -12895754 -17661498 -8922885 6861799 14003047 6760535 -2784478
34599 -2784478 -1314318 8480573 15144991 16223567 17735236 20127619 17694235 11382326
34591 11382326 9681864 14841343 19213303 17910740 14505859 11106472 4134891 -5104351
34583 -5104351 -7109106 1118688 8119078 3835559 -5181672 -7108439 -4450180 -9522418
34575 -9522418 -23444909 -32388891 -25841629 -8943903 5545620 10238734 5894000 -2669208
34567 -2669208 -10393373 -14842468 -16448032 -14338735 -4460734 13586912 30131071 32708284
34559 32708284 20392982 5366179 -918054 1555777 5510452 6314570 5090878 4674689
34551 4674689 5116700 3223238 -3133975 -10289793 -11305673 -5037901 1267045 2205914
34543 2205914 2766789 10371341 21314077 23344302 12028493 -2594269 -7539372 115622
34535 115622 13080375 21969136 22233504 17126099 14936310 20140529 27560238 28783979
34527 28783979 22775723 15101963 8598541 1865118 -3675063 -3293686 3252637 10454333
34519 10454333 14498877 14900536 8804142 -6528694 -23676066 -28730085 -20044298 -12810767
34511 -12810767 -17876214 -25874778 -21887422 -7406510 4219575 8542712 12792981 19811212
34503 19811212 22527678 16929484 10108355 10658631 17566593 22791420 20693893 12075282
34495 12075282 2225351 -2888856 -1065606 4146001 7781017 9588682 13132488 19361497
34487 19361497 24873327 27037169 27317172 28202936 29218209 27300895 20260127 9882992
34479 9882992 2105907 2544730 10602035 19971639 26155947 30122807 32530298 29566377
34471 29566377 19725741 10349022 9746733 14819393 15059579 9085776 7934560 18074553
34463 18074553 28877613 24260811 3607868 -16077096 -19515545 -9662302 -2407679 -7870951
34455 -7870951 -21137809 -31119513 -33159044 -29359432 -21085361 -8687466 2415693 4228825
34447 4228825 -2726935 -8416825 -6849535 -2849323 -791716 4301009 16583072 28418808
34439 28418808 30007951 24171623 20517753 19750675 16137562 11911138 15038969 23590633
34431 23590633 26570838 21374611 16558053 15205352 10222598 450013 -3478030 3263232
34423 3263232 9622445 5901841 189770 6708255 25422324 43166327 49317797 42462731
34415 42462731 27614315 14167525 10368511 13201517 10753460 186500 -6835395 -4414590
34407 -4414590 -5609498 -22388455 -42754822 -44317343 -24777932 -2917211 7064759 6891954
34399 6891954 2826722 -1417344 -1485102 3448460 4490431 -4944157 -13773546 -6936180
34391 -6936180 7651064 6622411 -12492636 -24884820 -15035699 2297369 8208934 5537945
34383 5537945 3780535 -2157228 -17774773 -28606392 -18049589 2926162 8113100 -5220524
34375 -5220524 -13538602 -4280023 6708293 1835432 -13087025 -21149142 -18111288 -11973391
34367 -11973391 -7842215 -4792801 -2885981 -3618602 -5407355 -5025145 -1670470 4353083
34359 4353083 13152727 20921040 18946930 3784535 -14550308 -21857477 -16204790 -8647295
34351 -8647295 -8225301 -13323021 -18397136 -21011104 -18653393 -6562781 13639870 27870058
34343 27870058 22095255 1131818 -13929940 -10132314 3019890 8426979 3499806 -660890
34335 -660890 2318270 6849285 6384756 2012686 -2665727 -7217937 -10566297 -7957730
34327 -7957730 2522027 14441650 19524680 17505099 15294122 17838687 22962928 24263304
34319 24263304 17722539 7211422 3083239 11061171 22784080 23995034 13032109 2722447
34311 2722447 1508245 3518461 3094273 6862639 20212654 31889094 27193458 10770179
34303 10770179 523568 2066417 5588375 6847494 12959197 24270528 28466534 20128591
34295 20128591 11099338 12438763 19214135 22984187 26787638 35682516 43159640 40773944
34287 40773944 32981230 27996573 20943013 2639937 -18804857 -23340427 -7213389 10088767
34279 10088767 11406738 1145049 -6473459 -6472668 -3040261 222666 1470346 -1731085
34271 -1731085 -8281532 -11634678 -8474870 -4839446 -6764435 -8857384 -551167 17644717
34263 17644717 32249486 32504717 22026301 12744282 11889850 17813570 25318564 31149483
34255 31149483 34674836 35993904 34955739 32060440 29556593 30172967 33698220 35780449
34247 35780449 32074915 23572837 15700689 11461802 8043438 2485952 -1529685 2823109
34239 2823109 14645886 22546075 16031626 -2672582 -21263105 -29844303 -27682038 -20110640
34231 -20110640 -13628501 -12588511 -15026511 -12193928 1628778 18778727 25010800 18197829
34223 18197829 12030780 17305158 27618539 29676432 20882167 9352046 2049417 738315
34215 738315 4872497 10086903 7974853 -3842271 -15249385 -16262495 -11433184 -10556995
34207 -10556995 -9944854 1825243 21206794 30323301 23235049 14358979 14367682 14554268
34199 14554268 5537921 -3578324 892258 14879079 23240545 21454987 16221912 10528386
34191 10528386 3173091 -1309683 1948957 5442650 -1718486 -13118507 -11102854 4423444
34183 4423444 12098990 771995 -12728465 -8997533 5596188 11394537 5940214 3891196
34175 3891196 10799811 15282924 9376039 1369624 2142698 9765348 15465661 17162156
34167 17162156 18425735 18805295 14421108 6649668 1588087 -44013 -4423696 -12738148
34159 -12738148 -15277337 -4348018 11510816 15481861 4336739 -6464415 -2165624
34152 -2165624 14454644 29872025 35962145 32590651 20658385 2846996 -11480614
34145 -11480614 -13277865 -6688089 -5179697 -12418151 -16683285 -9113138 1569531 510963
34137 510963 -13056488 -25884570 -27809940 -20150995 -8332420 4819934 16301692 20597907
34129 20597907 14891691 3833160 -4180551 -4672902 -118595 3157064 635275 -5816881
34121 -5816881 -8461735 -1207195 12303224 20835380 18147361 11206819 11843783 20485831
34113 20485831 23271685 8816039 -15217992 -27977299 -18172564 4311282 21514134
34106 21514134 26297002 23388861 17089557 7190090 -3653149 -8261992 -4432066 688162
34098 688162 329904 -2883637 -2309158 3062427 9916984 17536308 26291770 31251409 25247374
34089 25247374 9749706 -3215232 -3092242 8100226 18897292 21096318 17624737 17539936
34081 17539936 23651476 27550605 20761377 9545902 10631724 28641348 46245223 45203728
34073 45203728 30924929 24201452 31566908 38743952 36073883 35070821 50160230 75196925
34065 75196925 92268419 99463167 115104224 151454062 195125456 221187489 222480700
34058 222480700 217646148 229226862 258547822 286332451 296715920 294053648 291935874
34051 291935874 291787372 282930504 263265817 246821725 244189217 245876320 235609203 213002357
34043 213002357 190307765 171107691 147692986 119971461 100841518 96775023 96528565
34036 96528565 88128050 76059559 70531812 68819251 61326607 50658444 48610623 54712054
34028 54712054 53439563 37014079 17883746 11488568 16693440 21589474 20824045 17625883
34020 17625883 13792425 7846462 1513682 -581484 1694237 2741884 -1892828 -10860404
34012 -10860404 -18280791 -17030610 -4086907 13387494 21699384 16162573 8273573 9933217
34004 9933217 16062254 14087251 6498140 8556234 22996556 33539849 28955445 18039477
33996 18039477 11821171 5788038 -6546781 -14442270 -2759867 21104684 31511788
33989 31511788 16893098 -6648351 -16873544 -8607232 8184446 22876273 31146867
33982 31146867 34330923 36509620 38810766 36465573 26450651 15477853 11757761 11176819
33974 11176819 3776425 -6347688 -2839156 17096050 34195896 32895218 21502326
33967 21502326 15220381 12143901 2364166 -8192694 -3166751 16471062 28539383 17893479
33959 17893479 -5108362 -20176259 -20538207 -14122332 -9174494 -6343187 -1543008 8666489
33951 8666489 23039618 34617931 35766071 25444714 9632836 -4649746 -12541973
33944 -12541973 -10899410 -1024780 8724683 10271751 6592383 7840817 15423276 18771372
33936 18771372 11807267 3726666 6370605 17473172 24983866 24049134 20860061 21145831
33928 21145831 23092077 22313487 17260675 8353975 -2775433 -11541204 -12782023 -7075204
33920 -7075204 -628660 3309302 8653896 18587338 27206233 24891348 11550844 -931818
33912 -931818 -1640286 7448162 15209511 14418295 7391522 286970 -3274597 -2476859 1718271
33903 1718271 5338017 3087318 -5263288 -12952568 -13982001 -9940259 -5427596 -245714
33895 -245714 8067824 16278392 17262104 9971845 1455739 -1887647 165619 4825815
33887 4825815 8682407 6710310 -3459111 -14507675 -14661406 -3141188 7417562 7905451
33879 7905451 3561846 2190396 750153 -6962856 -16195299 -16451819 -7834616 -1408177
33871 -1408177 -4170741 -13044124 -23282320 -33371132 -40764344 -41680509 -37347441 -33377204
33863 -33377204 -31335540 -27459217 -20460644 -13298160 -6336190 3169818 13174847 16861294
33855 16861294 12952815 7663265 3874210 -2185635 -9798020 -9784498 2059653 16935568
33847 16935568 25640512 30249416 35350401 37368967 33006851 29050012 30712087 28225679
33839 28225679 11041120 -10136368 -14071608 -154567 10690147 8313198 6163259
33832 6163259 14936168 23442062 18747745 9279275 11011264 21610970 26387086 23241112
33824 23241112 23183950 28789083 30460793 25284376 22272044 24097109 19424603 2202333
33816 2202333 -13949044 -12642183 1039954 5419024 -10446930 -33787543 -43401240 -31373475
33808 -31373475 -7568536 12920589 22916593 24566416 21912388 17027083 13906921 19018039
33800 19018039 31434905 37242438 23849009 -1050001 -15386483 -9140930 5499993
33793 5499993 12886256 10986097 4799690 -4329045 -13775741 -15625829 -9385306 -8683944
33785 -8683944 -21430450 -32378066 -22795162 -1104742 6458499 -6439892 -19726614
33778 -19726614 -20164299 -17990293 -22443951 -23050843 -10024328 4340407 3286983 -7092172
33770 -7092172 -7354376 5553284 16510492 16394444 10551257 4446703 -2312073 -6237821
33762 -6237821 168641 14569016 23242612 18123780 5649212 -4377453 -8501757 -5408889
33754 -5408889 6032570 18759057 18362810 157983 -22141341 -32333831 -30006094 -25820687
33746 -25820687 -24789051 -22941965 -17013272 -8878970 -1006056 6524786 14249155 21865189
33738 21865189 27906415 29409097 24367307 15616606 8449272 3445514 -2791282 -8482427
33730 -8482427 -6318203 3665418 9353555 1914602 -10859722 -15274358 -10897589 -9560095
33722 -9560095 -17906166 -29959147 -36173455 -32530951 -21551602 -10749557 -8659879 -16128200
33714 -16128200 -23439579 -22069277 -15792231 -12797458 -11661666 -5982275 795543 -636298
33706 -636298 -6913767 -3108241 13540795 26057403 21945533 12007588 13789120 26044700
33698 26044700 32941822 27854203 19286837 15110518 13751592 12562741 14143804 20012187
33690 20012187 25284369 24719278 20111202 17599740 19505821 21576356 17912654 7951153
33682 7951153 -1021731 583058 14469389 30362057 34676712 23768949 7090923 -2598031
33674 -2598031 -456743 8562227 16396640 18921867 17383503 15167488 15125326 19530428
33666 19530428 28798175 37663349 36580865 22880320 8526456 8741717 22256509 31797795
33658 31797795 27348113 19147123 20747416 28299902 28014375 18804940 13712605 18862841
33650 18862841 23986808 18233359 5569565 -1896626 520368 7337590 11175615 7993001
33642 7993001 -2606943 -16391484 -25390503 -24857390 -18892132 -15363752 -16201189 -17088507
33634 -17088507 -16286252 -17853292 -23542444 -26559582 -19111020 -4420341 5333712 4508285
33626 4508285 1277824 5345769 13757488 16079512 10633390 6389325 8535632 11632889
33618 11632889 9851732 4883989 -888455 -9928930 -21376895 -25878071 -17797016 -5761844
33610 -5761844 -844331 -448084 4185228 10053355 6809301 -3676220 -8381309 -4064086
33602 -4064086 -720959 -1713760 2102231 12604576 16380480 6455000 -3668476 -615443
33594 -615443 7640314 6340207 -1380650 -1891498 4566327 5793518 263613 -804118
33586 -804118 6010760 10841453 7973714 3277683 262500 -6818901 -19686810 -27998050
33578 -27998050 -22337070 -6836572 7295252 13842111 13053085 8933779 9153269 19549692
33570 19549692 34630349 41748336 38031777 32930539 29920339 19268106 -2063727 -16739710
33562 -16739710 -7935084 14713331 26387292 20028642 11600031 13266687 17852582 14082276
33554 14082276 3570251 -4696923 -7487423 -7329521 -5394951 -1122751 4606282 10866084
33546 10866084 18416705 26265744 29424855 24163317 14056033 7793602 11266772 22378955
33538 22378955 32157466 31322309 18952979 5168423 2005058 11041955 23034353 29121581
33530 29121581 27526044 19553367 6412129 -7129767 -12759238 -7367602 2703636 10350471
33522 10350471 15707363 20913193 23088686 19974862 17611276 22711592 29787907 26337006
33514 26337006 10983727 -3799696 -8991445 -8819400 -9447858 -8158346 -769132 8425566
33506 8425566 12681207 12656784 11617054 6630426 -5087893 -15914327 -16744947 -13875987
33498 -13875987 -22317352 -41188321 -51668623 -45061389 -37270814 -44639504 -58460969 -58405403
33490 -58405403 -42388217 -25859773 -15949506 -5060763 9163069 16066371 10443256
33483 10443256 3461691 5720078 11151112 8653236 711394 -1787210 2460580 4800607
33475 4800607 1619622 -1744939 -1832464 -1973556 -5465080 -11965624 -21171898 -31653738
33467 -31653738 -35202664 -22375577 2193654 18843667 14065757 -3124769 -12978344
33460 -12978344 -8826482 -1107613 42701 -3397976 -5207477 -6531360 -13122134 -24192242
33452 -24192242 -30958692 -27384860 -17748429 -10866147 -9349643 -7441936 1561188 17647302
33444 17647302 32627008 35223691 20726947 -1726826 -15280450 -13291835 -7046056
33437 -7046056 -8875073 -12600712 -2839727 17892369 27649666 15948456 669956 3134157
33429 3134157 18737651 26930140 21502071 13897332 10812638 6164557 -4321482 -15863497
33421 -15863497 -24292501 -30137773 -31126836 -23107325 -10522396 -3564752 -3108495 -1751003
33413 -1751003 -1127566 -11442248 -29382183 -35018109 -19818678 -720610 5275686 4183101
33405 4183101 8358120 12408253 4569056 -9451265 -14582734 -10764899 -8944619 -8330236
33397 -8330236 1235730 17081922 25310610 24442494 26432479 32408423 29419076 16741314
33389 16741314 13474501 29358778 46473428 43612846 25180326 11961486 13299738
33382 13299738 21678923 27621067 27709283 22161497 13880980 7044246 1470355 -6527049
33374 -6527049 -14743507 -15479837 -9157372 -5892011 -7754511 -3452274 10343823 18022916
33366 18022916 9460339 762688 11290496 30925151 33373298 16695467 6096765
33359 6096765 15679646 30471040 31951760 21282442 8554116 -4023521 -17209429
33352 -17209429 -25719003 -25133595 -19125003 -11719942 -1265691 10511709 13577796 3564985
33344 3564985 -7535403 -5598996 6212402 12624570 7050262 -2670503 -7260289 -5454541
33336 -5454541 -196884 7236199 16812230 26515801 31210175 25795175 12186470 1825625
33328 1825625 4883671 16219410 19879290 10083312 -865275 235208 11401618 22277997
33320 22277997 27716511 27009235 18987581 8047273 6968148 21587502 38392333 39655866
33312 39655866 26358358 13728817 8657589 5815959 3064607 4542370 8274189 6402007
33304 6402007 114861 -204584 7103488 11210906 6966637 2463823 3582547 6112691
33296 6112691 9716441 23057539 44529206 53818805 37627559 11658372 696358
33289 696358 6278137 11420528 9764667 10088387 14963628 15220962 7759818 1558175 1688912
33280 1688912 2272186 482818 3519538 14290927 22202974 17596063 6923466 4212020
33272 4212020 12738711 23150212 26289718 21338904 13304726 7281432 4404717 1676852
33264 1676852 -2749983 -5306937 -2479671 1460754 134231 -2239708 5516163 22937733
33256 22937733 34538562 30393089 19313602 14284901 15137128 15079948 14851364 18108770
33248 18108770 19557841 11127484 -3555033 -13169556 -14715709 -13727700 -10845638 -1389820
33240 -1389820 11846152 18768116 17102038 15158509 16608636 14828929 6991752 1458217
33232 1458217 3771685 5857179 -1473133 -13156946 -16919458 -10072169 416625 10455920
33224 10455920 21123930 30095182 30895298 22580586 13200874 10968141 16049315 22539083
33216 22539083 25110783 22397260 16506050 10936450 8243757 9025652 12278829 15194733
33208 15194733 13743868 7352667 2824967 7903663 19413715 24813263 19418876 14446785
33200 14446785 20809722 31676230 31648917 19488094 9265471 8834856 9885069 3600945
33192 3600945 -5089560 -6780204 -3010204 -2434033 -5587696 -3825109 6336703 16367533
33184 16367533 16284778 6574485 -3959111 -8498967 -6436276 308298 10139945 20118204
33176 20118204 24884051 20032046 6417059 -9719835 -20777519 -22448222 -16553848 -10474046
33168 -10474046 -11617487 -19815755 -26369575 -23783991 -15855956 -14120768 -23550485 -35840977
33160 -35840977 -39022090 -30522723 -18148585 -10754620 -10726547 -13496418 -11669389 -1531064
33152 -1531064 11839217 17960776 12353870 2416384 -1402765 1961679 4811278 1995057
33144 1995057 -3642544 -7149055 -8053984 -9479020 -13227951 -16823710 -14803988 -4686482
33136 -4686482 6906160 8052525 -4093024 -16379758 -13944721 726595 11221990
33129 11221990 8939470 1414787 -3082376 -7901009 -17712049 -24720584 -16522500 5175080
33121 5175080 24225179 29373477 25588924 23291404 23288385 18120789 5130611 -8109940
33113 -8109940 -12289526 -6330542 3471265 12028511 19663725 27903637 35069611 38498356
33105 38498356 38542868 36880176 32264687 22112400 8349015 -2395458 -5967720 -5239762
33097 -5239762 -5648161 -8069819 -8208324 -2778134 4915792 6877051 -652658 -10964584
33089 -10964584 -13237659 -5860854 1708228 2925282 3236108 9181075 15177580 11351856
33081 11351856 598996 -4509142 -1098655 742592 -3908753 -6748312 -1553768 4740641
33073 4740641 4243595 1168562 3137976 7176175 4381902 -6642963 -19665499 -29467555
33065 -29467555 -33028919 -27327054 -13958240 -1136850 6221614 12579190 20686500 22872532
33057 22872532 14087328 5226883 8972894 18242222 15426621 341430 -8834723 -3303230
33049 -3303230 5266423 5668031 3042423 6272983 12228488 11485723 1469519 -12672236
33041 -12672236 -23557005 -24279873 -13599794 -1086534 1985636 -1381919 1606693 11311913
33033 11311913 13032329 1896526 -6357956 310367 10316877 6340805 -9374891 -22690308
33025 -22690308 -29802477 -34787300 -33280068 -17849529 4035884 15621136 13795029 10571089
33017 10571089 12209689 13055834 11237246 13970695 23210081 30738001 32917722 36971646
33009 36971646 46060456 50318964 40972796 23782401 10243876 3183086 -1280300 -4531036
33001 -4531036 -6344422 -9481879 -15372196 -18757418 -13628427 -2429456 5829602 5057933
32993 5057933 -3386415 -12912173 -15907728 -9151346 2515194 10986422 14170037 15935098
32985 15935098 17060534 13883819 7476613 5084017 8660939 10944613 7797875 4959076
32977 4959076 6028540 3764536 -7439195 -19266680 -20717393 -14404089 -9854750 -7216215
32969 -7216215 -1157662 4430820 1192693 -7313346 -10315609 -9377665 -15185973 -24098210
32961 -24098210 -18728409 2175537 15797871 8835696 -1057855 4918050 12669714 -3996907
32953 -3996907 -37812439 -52186855 -32417657 -6190672 -3378430 -17417429 -22342220
32946 -22342220 -12117251 -2825855 -3640230 -6444802 -4410159 -3155446 -8032920 -13403699
32938 -13403699 -12221106 -7137926 -3851954 -104194 9435783 21112335 24795331 18102980
32930 18102980 9840515 7608849 8926932 7747656 4033731 2242787 4027263 7493056
32922 7493056 11719195 16941013 20632132 18192479 8993086 -1453902 -7194375 -7655872
32914 -7655872 -6148172 -4369367 -833317 5572420 12512918 15652640 12770005 5997037
32906 5997037 -172482 -3265782 -5109702 -9141291 -15263874 -18456904 -13987403 -4012962
32898 -4012962 2884811 413051 -7978393 -12599700 -8670527 -1315366 1922660 488357
32890 488357 -683739 147854 -164811 -2418310 -2078212 3616519 10563105 14131249 16301193
32881 16301193 20443095 22258889 14567702 1288513 -2657452 10046689 27358182 31286180
32873 31286180 19208806 4936378 403736 3618263 5615652 2959827 -14172 2026361
32865 2026361 9372038 16501697 16362090 7620825 -1951278 -2808830 4578649 9612120
32857 9612120 5625300 -851037 475532 9030257 14747557 11893438 4214557 -2906505
32849 -2906505 -7096284 -4824792 7624499 24360561 30217388 19117204 5303825 5821554
32841 5821554 16366671 17633596 5011483 -2872579 9223461 30470238 38032866 26190423
32833 26190423 10081757 3972553 6957884 10308725 9351344 5285812 1902688 3424629
32825 3424629 10827109 18343888 18353094 11734316 8572252 15758679 27873681 33471919
32817 33471919 27500925 14978196 4958265 2867743 6448022 8274366 5127552 4294471
32809 4294471 14867841 32550902 41685902 35763298 26414150 25353078 27104869 20618432
32801 20618432 9919436 7612662 11393750 5220910 -13511620 -25620764 -17127031 1310
32793 1310 5861857 349906 -1354767 5755243 11034633 6713037 -1484595 -4069929 1727908
32784 1727908 13045700 24672422 29727068 24703641 15316617 10260197 8544153 1296072
32776 1296072 -12596545 -22180154 -19392795 -9799147 -3576575 -3093295 -4586715 -5502643
32768 -5502643 -4404369 918937 9736268 17224478 20881702 22479503 20489836 9056642
32760 9056642 -9745185 -21664962 -16833369 -3054881 6482328 10874010 15868970 18451206
32752 18451206 11533258 -797004 -7945225 -9636455 -12263875 -11062753 4890670 28529738
32744 28529738 36219413 19950489 -437821 -6313217 -3723232 -5674397 -8059815 -532968
32736 -532968 11179760 13508265 8330837 8957883 16446213 17811639 6971720 -8607628
32728 -8607628 -22165269 -32883438 -35851739 -23232465 38822 16171186 16591516 12259784
32720 12259784 15475431 22490409 22079909 12172902 -600898 -11036819 -17309103 -18640234
32712 -18640234 -17950228 -21279079 -27914278 -26944117 -11495114 8213368 14414728 1787523
32704 1787523 -19076280 -35406834 -42162148 -40338045 -33327953 -25297843 -17635898 -7268081
32696 -7268081 6959690 18208872 18384177 10055954 4504395 7101416 11536376 10578539
32688 10578539 5642856 1475505 -2775528 -10433635 -18120442 -17720644 -8999425 -3612880
32680 -3612880 -11477922 -26507471 -32355026 -22148413 -5982289 3370487 5404963 7288009
32672 7288009 10215500 9100802 3395299 -1444894 -3768475 -7765565 -13447758 -13665620
32664 -13665620 -5447926 3777089 7058677 8142530 14079726 23136929 27318870 22988488
32656 22988488 12420337 -1267369 -13693131 -17273372 -7810022 8197802 19227345
32649 19227345 20592531 15680251 8264184 -56973 -7160852 -11873836 -16508016 -22186082
32641 -22186082 -24466055 -20145556 -15058767 -17275131 -25426643 -31965688 -34586483 -34821612
32633 -34821612 -29048606 -13327825 4507760 11327910 7855420 7569887 14763119 18629550
32625 18629550 13311932 8262791 11219065 15209712 12307601 7711492 8770193 10701965
32617 10701965 5478321 -3936021 -10248069 -14272158 -18151356 -14805220 929327 17544366
32609 17544366 19927063 12966908 15069515 30117413 43045193 43264098 35209263 23858287
32601 23858287 7833989 -7985054 -10351443 2968379 15468128 12991937 1190381
32594 1190381 -6632588 -7488413 -4881984 1370989 9462193 9603036 -2558465 -14106157
32586 -14106157 -10855179 719218 2955372 -6006828 -12449145 -13374260 -22675980 -45077926
32578 -45077926 -61621082 -53287863 -27651615 -8419966 -5019160 -6358903 -2330876 2696739
32570 2696739 1300853 -3070818 -1437941 6435450 10956003 5375562 -6269891 -15447889
32562 -15447889 -19177358 -20801570 -23138927 -24751220 -22905220 -17040443 -8233404 2484443
32554 2484443 13615668 22180122 24839771 20446257 11812533 4934306 4335962 7334371
32546 7334371 5570635 -3715659 -10262938 -1407931 19741951 34662467 30975887 16293096
32538 16293096 5656885 2452092 -304666 -4962341 -5997943 -1131280 3297198 349516
32530 349516 -9451728 -19591534 -23531489 -19354929 -11725969 -7757215 -7809047 -4307198
32522 -4307198 5387046 11170911 4753553 -3382513 4187182 24225466 33336470 19853799
32514 19853799 -299911 -6702971 1334935 13606016 27614928 43288409 49720864
32507 49720864 35657836 8969019 -10911608 -18048712 -22096703 -26957775 -24950612 -14670982
32499 -14670982 -7387884 -9150194 -11092950 -5575037 966031 556035 -2748993 -2764686
32491 -2764686 -4041732 -11749863 -17378332 -9973879 3736251 7161754 -40485 -1009983
32483 -1009983 10882768 20706012 15193252 2580303 -2031480 -342235 -5783990 -20357995
32475 -20357995 -31251245 -30389285 -24571338 -22723776 -23303764 -20105153 -13083217 -6390240
32467 -6390240 -580074 5624868 8519195 2529473 -9677919 -17423468 -14470954 -5419812
32459 -5419812 3048949 11177145 21123598 27657829 21948681 4651219 -11327698 -13727627
32451 -13727627 -3227198 8872388 12569616 7378820 1086662 1929230 10524758 18848536
32443 18848536 18649269 10626372 2819014 248085 -97015 -3106592 -8252415 -10505598
32435 -10505598 -5909699 5187964 17657502 23376432 17622496 5935235 482737 6269610
32427 6269610 14533287 13677384 3435018 -6416170 -8534689 -3633871 4538841 13304376
32419 13304376 19486248 19247364 12072377 2330273 -4702562 -7073152 -6425186 -5699606
32411 -5699606 -6237158 -5906929 -1504795 5468066 8228969 3299230 -2853707 -762639
32403 -762639 9301722 16536845 11950872 -2598750 -18057599 -26593338 -25223860 -15173646
32395 -15173646 -790749 11730139 16446685 10397524 -3236195 -14941958 -16581004
32388 -16581004 -11461690 -11577668 -21346910 -30587083 -29802827 -25398995 -29527940 -39844434
32380 -39844434 -42519622 -34044444 -26104499 -26675347 -29491938 -26816010 -20470366 -13867053
32372 -13867053 -4329487 8264081 14485307 6726212 -8555867 -18134648 -16172028 -4450666
32364 -4450666 14297889 34456300 45054572 39595443 25363702 14862938 11333887
32357 11333887 10073106 9375283 10930276 12426979 8813996 -464613 -11878090 -22163183
32349 -22163183 -26472910 -18493607 -1049286 9950243 3329873 -10833417 -14687652 -7722590
32341 -7722590 -4317245 -9737844 -14678164 -13160635 -9800495 -7582619 -3560964 800437
32333 800437 -95889 -2614304 3356538 14317473 13054465 -4471195 -19198659 -15909035
32325 -15909035 -4539985 -2348604 -8352898 -9571443 -1956082 9120082 20453115 29180963
32317 29180963 27136557 11272238 -6244609 -11659982 -7767335 -5695158 -5281182 1155320
32309 1155320 10312267 10033855 -900830 -9878074 -8141222 665071 9617635 15080027
32301 15080027 15022654 11523896 12957078 22689251 29360299 21574628 7789023 5118361
32293 5118361 11867821 11243716 1680874 175945 10852371 14195561 -1996368 -22687185
32285 -22687185 -30705734 -32126193 -38737835 -42098859 -27519540 -3104742 8903285 5190747
32277 5190747 3793085 14253455 25877750 28585511 26881557 26660828 23526680 13302438
32269 13302438 2979589 1241486 4958473 4167170 -3021856 -7676442 -1132700 15365643
32261 15365643 31496733 36668337 29779896 20961654 20748717 27034101 27083547 14207264
32253 14207264 -2615942 -9853015 -6266050 -2309427 -3798619 -4171567 2947899 10079198
32245 10079198 4239143 -12215902 -20791671 -12217807 -1791538 -8057730 -23783761 -24678977
32237 -24678977 -5316709 12512532 12318127 5409778 9532396 20373561 21106377 10789693
32229 10789693 4504525 8520395 12640185 8169492 -882590 -7197709 -8930695 -6183602
32221 -6183602 860387 6827764 3158748 -10789209 -24966981 -29119781 -20898142 -4438938
32213 -4438938 12018315 18794840 14015839 8773330 13264151 20167152 14497843 -1832180
32205 -1832180 -11698469 -10248748 -11820587 -23301850 -29832105 -18824753 -1871353 2762265
32197 2762265 -2640825 -2130757 8355459 18964377 23864177 25161166 22049531 11144251
32189 11144251 -3185193 -11589446 -12441073 -11086959 -8443371 -1615955 6509268 10712869
32181 10712869 14628179 25135456 36579546 35226397 20619073 7894272 6089313
32174 6089313 8691215 9905053 15024281 27118172 37164892 37550914 34520702 36305135
32166 36305135 37611994 27800479 8913690 -5686701 -8088015 -2714169 1325777 -1903266
32158 -1903266 -12179580 -22101991 -22179412 -11972994 -1935708 593390 1001059 6688468
32150 6688468 14194831 16392332 15966977 19681029 23578820 17833434 5096262 -461615
32142 -461615 5626276 11858757 10446679 9789000 18786367 29723275 28625958 16340742
32134 16340742 7003770 7869015 12060388 12013624 9713238 9719489 10174132 7248447 4193899
32125 4193899 8938442 23257609 39627812 49795893 52404061 50308764 44108115 32413677
32117 32413677 17421131 5933076 3212847 7716838 13241649 15253893 14295458 13954179
32109 13954179 16023021 17495061 13420539 4035925 -3138416 -2292225 724101 -6143137
32101 -6143137 -23623556 -35659747 -27305728 -4190734 13068943 12863675 4062894 2448102
32093 2448102 12164763 24395144 30221852 29523276 27804280 28459238 29996661 29245997
32085 29245997 25147108 19015597 12458703 6388456 1657524 -789146 -447835 3058797
32077 3058797 10014165 18386123 22718285 18945006 10558601 5992280 8711080 13777679
32069 13777679 15559000 14276073 12832698 12190093 12932447 16171419 19140023 15935445
32061 15935445 7939901 6682644 17979468 28951978 22211425 472263 -15260526
32054 -15260526 -12724496 -1736064 2643160 -990790 -4453679 -3951818 -1732920 1074429
32046 1074429 5460598 10239846 11843327 7408820 -3996529 -20228088 -34213563 -37496858
32038 -37496858 -28631383 -14704425 -2828801 5190027 8302608 3734997 -6260282 -11581876
32030 -11581876 -4828845 9026460 18746126 19028327 12429339 4299845 1210269 8743264
32022 8743264 23702460 33346520 30120559 22451404 22308767 27475575 27928521 25778337
32014 25778337 33186308 49221898 54938653 38731711 14215561 2917608 7525287
32007 7525287 12889439 8408646 -1330245 -6447664 -2965263 6632488 17166725 23373506
31999 23373506 23023598 18415423 12040404 1969770 -14011505 -30279389 -35186267 -23521666
31991 -23521666 -3976394 8363496 5918278 -5461920 -12748469 -7752612 5132945
31984 5132945 13379381 10699044 5511535 10143584 21959159 23430556 5652061 -15845120
31976 -15845120 -18570316 -2934272 7739628 -1060573 -16126825 -17387052 -7483897 -6734551
31968 -6734551 -21837793 -34584071 -26002225 -857329 19451641 22053782 12730222 4053554
31960 4053554 1364399 1428654 -179003 -3487627 -5187726 -3699983 -1377296 -444451 971019
31951 971019 5153723 8981309 7566831 3306849 3937674 9901868 11911086 5485665
31943 5485665 -34043 5760220 18537160 25007263 21149620 15510484 15160485 16880530
31935 16880530 13849582 4553436 -7571317 -18873795 -26668936 -27526991 -17421447 4004152
31927 4004152 28124986 39876432 32137460 17006008 14220229 26540641 36524684 31605128
31919 31605128 20312430 15668796 15100717 9925701 4491429 8900104 18681564 19590248
31911 19590248 9996792 1099199 -3844414 -12034476 -22072944 -22036137 -11154121 -4620464
31903 -4620464 -9371812 -12551040 -3753676 7415339 8084587 2481349 1728515 4351060
31895 4351060 1665202 -5264107 -8464013 -7971685 -11022459 -18799031 -24099615 -20661514
31887 -20661514 -8265951 7846543 17457546 11480759 -6166515 -19518212 -19621193 -14808965
31879 -14808965 -15413808 -18038221 -14104071 -4606985 4256940 11737922 18025628 17530568
31871 17530568 7949272 -2254426 -6492906 -10492900 -18177550 -19250452 -6715098 5274398
31863 5274398 975357 -9621775 -5880436 8845510 13476331 5892764 5300580 17172513
31855 17172513 23998372 16548420 7919495 7686654 6634785 -1661443 -7011294 -3685355
31847 -3685355 -4187186 -16445243 -25928321 -17745985 -970138 6643041 4780300 3701421
31839 3701421 3078101 -3427540 -11013644 -9656901 -2037945 363487 -4727550 -9704610
31831 -9704610 -10537591 -9238093 -7156076 -5747873 -8334678 -12377700 -8414192 4128890
31823 4128890 11546911 7808063 7652778 21326605 31089060 16182253 -9818887 -14799677
31815 -14799677 3395276 14120007 1553053 -14251816 -12656253 -2519019 -2650959
31808 -2650959 -12596024 -19585278 -20236487 -19185785 -16126445 -8628355 -683418 3698579
31800 3698579 9172240 20487945 31177489 31677064 24115665 18405963 16753349 12235381
31792 12235381 1619751 -9146872 -12604087 -6727854 5621680 18824474 26065163
31785 26065163 23600719 14754151 7154797 5053011 5079480 -110845 -13108120 -26188591
31777 -26188591 -27728884 -17073706 -8273238 -12611928 -22192297 -21211097 -10305617 -5226125
31769 -5226125 -10491961 -11472712 396486 11033656 5155720 -8609641 -10833300 -1513197
31761 -1513197 1658102 -7063186 -12451693 -2746165 12638784 17674449 10772888 2136660
31753 2136660 -2187878 -3513380 -1836549 5594869 16326095 21315648 15409841 5123227
31745 5123227 1766923 8361362 17309745 21044418 20609647 21270335 23448898 23100016 19450666
31736 19450666 16116973 13919470 9259539 2486979 1167857 9161593 17359111 13395765
31728 13395765 -1052313 -10841588 -6215816 6258931 14449328 15494973 14350097 12529012
31720 12529012 6791831 -1388386 -3413789 5431510 17897335 23036790 19493131 14800051
31712 14800051 13409426 12456961 9498260 6659132 4497030 -765820 -9083996 -12282116
31704 -12282116 -4598222 7523874 13910425 15215440 20276091 30740397 37438143 32834958
31696 32834958 19826946 6859629 -130026 -604036 707904 -2171373 -7550983 -4604272
31688 -4604272 11417534 26539937 22370299 1784741 -12811477 -8256191 5623022
31681 5623022 14013471 14711943 11855735 5739603 -2192335 -5128026 -884747 3068124
31673 3068124 2572850 4512593 12777026 17920581 12437061 5911719 11120146 23416961
31665 23416961 28610319 24456422 19149864 14507664 7203487 2244117 7306631 15543978
31657 15543978 12111553 -1729530 -8666178 -1609582 7522399 9313849 9812489 15169849
31649 15169849 19154708 15274732 8523445 5459353 3333051 -1763804 -5815246 -5172481
31641 -5172481 -4763407 -8496115 -10019579 -3496481 3617205 -193384 -13203757 -22591123
31633 -22591123 -20710035 -10961877 -977460 2434089 -4238873 -15655148 -18515787 -6280974
31625 -6280974 10777906 18334557 16030298 12914445 9837753 18257 -13844810 -17822544
31617 -17822544 -6580344 6737720 7613357 -763904 -3442407 5651648 16556634 15973474
31609 15973474 2162695 -13547914 -17830177 -7389076 9112886 20164338 20881226
31602 20881226 13160083 342224 -13795437 -22641443 -19940929 -7689077 3303365
31595 3303365 4022608 -3250179 -8248361 -4416322 4558528 9469674 5240655 -4858061
31587 -4858061 -14056676 -19390307 -22403341 -23544919 -19655507 -8999722 3756523 10568560
31579 10568560 7428920 -2484954 -11475915 -11805921 -204235 18695261 33965742 35943680
$$ [...]
##END NTUPLES=NMR SPECTRUM
##END=
