##TITLE=31Pdec_PR192_M_pH7
 D2O, 24 sc
 22.10.2020
##JCAMPDX= 6.0         $$ Bruker NMR JCAMP-DX V2.0
##DATA TYPE= NMR SPECTRUM
##DATA CLASS= NTUPLES
##ORIGIN= UXNMR, Bruker Analytische Messtechnik GmbH
##OWNER= root
$$ XWIN-NMR		Version 3.5
$$ Thu Oct 22 13:24:30 2020 Russian Standard Time (UT+4h)  she@DPX200
##.OBSERVE FREQUENCY= 81.013821
##.OBSERVE NUCLEUS= ^31P
##.ACQUISITION MODE= SIMULTANEOUS
##.ACQUISITION SCHEME= undefined
##.AVERAGES= 24
##.DIGITISER RES= 17
##SPECTROMETER/DATA SYSTEM= spect
##.PULSE SEQUENCE= zgpg30
##.SOLVENT NAME= D2O
##.SHIFT REFERENCE= (INTERNAL, D2O, 0, 182.463)
##AUDIT TRAIL= $$ (NUMBER, WHEN, WHO, WHERE, WHAT)
$$ ##TITLE= Audit trail, XWIN-NMR		Version 3.5
$$ ##JCAMPDX= 5.01
$$ ##ORIGIN= Bruker BioSpin GmbH
$$ ##OWNER= she
$$ F:/spectra/data/she/nmr/P31/1/pdata/1/auditp.txt
$$ ##AUDIT TRAIL=  $$ (NUMBER, WHEN, WHO, WHERE, WHAT)
(   1,<2020-10-22 13:23:23.01 +0400>,<she>,<DPX200>,
      <created by zg, POWCHK disabled, PULCHK disabled
       configuration hash MD5:
       00 E9 B6 7A A2 85 ED C7 34 08 36 98 17 FE 4E 26
       data hash MD5: 32K
       3F AA A5 59 FD 4B 3D B3 47 13 69 F5 3C D9 5A 84>)
(   2,<2020-10-22 13:23:27.85 +0400>,<she>,<DPX200>,
      <Start of raw data processing
       efp BC_mod = 2 LB = 1 FT_mod = 6 PKNL = 1 PHC0 = -2398.634 PHC1 = 110.4007 SI = 64K 
       data hash MD5: 64K
       D4 8B 8C 29 E3 E6 64 94 D1 F9 FA 3F 40 CA 37 AE>)
(   3,<2020-10-22 13:23:45.62 +0400>,<she>,<DPX200>,
      <pk PHC0 = -4.458274 PHC1 = -37.40001 
       data hash MD5: 64K
       9D 08 BB 92 A6 68 43 B6 89 80 E9 BB A4 8D 80 BE>)
(   4,<2020-10-22 13:23:51.71 +0400>,<she>,<DPX200>,
      <abs ABSG = 5 
       data hash MD5: 64K
       BB 88 96 37 1F A4 CA CC 1D F9 83 F2 05 AA 42 68>)
$$ ##END=
$$ 
$$ hash MD5
$$ 8F 54 0E 02 43 7D 03 30 A1 02 9E D3 CC FE 91 FC
##$RELAX= 
##$RELAX= 
##$RELAX= 
##$RELAX= 
##$RELAX= 
##$RELAX= 
##$RELAX= 
##$RELAX= 
$$ Bruker specific parameters
$$ --------------------------
##$DU= <F:/spectra>
##$EXPNO= 1
##$NAME= <P31>
##$PROCNO= 1
##$TYPE= <nmr>
##$USER= <she>
##$AMP= (0..31)
100 100 100 100 100 100 100 100 100 100 100 100 100 100 100 100 100 100 
100 100 100 100 100 100 100 100 100 100 100 100 100 100 
##$AQSEQ= 0
##$AQ_mod= 1
##$AUNM= <au_zg>
##$AUTOPOS= <>
##$BF1= 81.014009
##$BF2= 200.13
##$BF3= 200.13
##$BF4= 200.13
##$BF5= 200.13
##$BF6= 200.13
##$BF7= 200.13
##$BF8= 200.13
##$BYTORDA= 1
##$CFDGTYP= 0
##$CFRGTYP= 5
##$CHEMSTR= <none>
##$CNST= (0..31)
1 1 145 1 1 1 1 1 1 1 1 1 1 1 1 1 1 1 1 1 1 1 1 1 1 1 1 1 1 1 1 1 
##$CPDPRG= <waltz16>
##$CPDPRG1= <>
##$CPDPRG2= <waltz16>
##$CPDPRG3= <>
##$CPDPRG4= <mlev>
##$CPDPRG5= <mlev>
##$CPDPRG6= <mlev>
##$CPDPRG7= <mlev>
##$CPDPRG8= <mlev>
##$CPDPRGB= <>
##$CPDPRGT= <>
##$D= (0..31)
0 1 0 0 0 0 0 0 0 0 0 0.03 2e-05 3e-06 0 0 0 0 0 0 0 0 0 0 0 0 0 0 0 0 
0 0 
##$DATE= 1603358602
##$DBL= (0..7)
120 120 120 11 120 120 24 19 
##$DBP= (0..7)
150 150 150 150 150 150 150 150 
##$DBP07= 0
##$DBPNAM0= <>
##$DBPNAM1= <>
##$DBPNAM2= <>
$$ [...]
##$SUBNAM3= <"">
##$SUBNAM4= <"">
##$SUBNAM5= <"">
##$SUBNAM6= <"">
##$SUBNAM7= <"">
##$SUBNAM8= <"">
##$SUBNAM9= <"">
##$SW= 369.568048894756
##$SWIBOX= (0..15)
0 1 3 0 0 0 0 0 0 0 0 0 0 0 0 0 
##$SW_h= 29940.119760479
##$TD= 32768
##$TD0= 1
##$TE= 0
##$TE2= 300
##$TE3= 300
##$TEG= 300
##$TL= (0..7)
0 120 53 12 22 120 120 120 
##$TP= (0..7)
150 150 150 150 150 150 150 150 
##$TP07= 0
##$TPNAME0= <>
##$TPNAME1= <>
##$TPNAME2= <>
##$TPNAME3= <>
##$TPNAME4= <>
##$TPNAME5= <>
##$TPNAME6= <>
##$TPNAME7= <>
##$TPOAL= (0..7)
0.5 0.5 0.5 0.5 0.5 0.5 0.5 0.5 
##$TPOFFS= (0..7)
0 0 0 0 0 0 0 0 
##$TUNHIN= 0
##$TUNHOUT= 0
##$TUNXOUT= 0
##$USERA1= <user>
##$USERA2= <user>
##$USERA3= <user>
##$USERA4= <user>
##$USERA5= <user>
##$V9= 5
##$VALIST= <valist>
##$VCLIST= <CCCCCCCCCCCCCCC>
##$VD= 0
##$VDLIST= <DDDDDDDDDDDDDDD>
##$VPLIST= <PPPPPPPPPPPPPPP>
##$VTLIST= <TTTTTTTTTTTTTTT>
##$WBST= 1024
##$WBSW= 4
##$XGAIN= (0..3)
0 0 0 0 
##$XL= 0
##$YL= 0
##$YMAX_a= 26813
##$YMIN_a= -36167
##$ZGOPTNS= <>
##$ZL1= 120
##$ZL2= 120
##$ZL3= 120
##$ZL4= 120
##$ABSF1= 182.463
##$ABSF2= -187.1042
##$ABSG= 5
##$ABSL= 3
##$ALPHA= 0
##$AQORDER= 0
##$ASSFAC= 0
##$ASSFACI= 0
##$ASSFACX= 0
##$ASSWID= 0
##$AUNMP= <proc_1d>
##$AZFE= 0.1
##$AZFW= 0.5
##$BCFW= 0
##$BC_mod= 2
##$BYTORDP= 0
##$COROFFS= 0
##$CY= -3
##$DATMOD= 1
##$DC= 0
##$DFILT= <>
##$DTYPP= 0
##$F1P= 0
##$F2P= 0
##$FCOR= 1
##$FTSIZE= 65536
##$FT_mod= 6
##$GAMMA= 0
##$GB= 0
##$INTBC= 1
##$INTSCL= 5.30512e-09
##$ISEN= 30
##$LB= 1
##$LEV0= 0
##$LPBIN= 0
##$MAXI= 10000
##$MC2= 0
##$MEAN= 0
##$ME_mod= 0
##$MI= 50
##$NCOEF= 0
##$NC_proc= -5
##$NLEV= 6
##$NOISF1= 182.463
##$NOISF2= 159.3651
##$NSP= 0
##$NTH_PI= 0
##$NZP= 0
##$OFFSET= 182.463
##$PC= 4
##$PHC0= -2403.092
##$PHC1= 73.00069
##$PH_mod= 1
##$PKNL= yes
##$PPARMOD= 0
##$PSCAL= 0
##$PSIGN= 0
##$REVERSE= no
##$SF= 81.014009
##$SI= 65536
##$SIGF1= 159.3651
##$SIGF2= -187.1042
##$SINO= 113.3802
##$SIOLD= 16384
##$SREGLST= <1H.CDCl3>
##$SSB= 0
##$STSI= 65536
##$STSR= 0
##$SW_p= 29940.119760479
##$SYMM= 0
##$S_DEV= 0
##$TDeff= 32768
##$TDoff= 0
##$TI= <>
##$TILT= no
##$TM1= 0
##$TM2= 0
##$TOPLEV= 0
##$USERP1= <user>
##$USERP2= <user>
##$USERP3= <user>
##$USERP4= <user>
##$USERP5= <user>
##$WDW= 1
##$XDIM= 65536
##$YMAX_p= 373309214
##$YMIN_p= -12170250
$$ End of Bruker specific parameters
$$ ---------------------------------
##NTUPLES= NMR SPECTRUM
##VAR_NAME=  FREQUENCY,     SPECTRUM/REAL,   SPECTRUM/IMAG
##SYMBOL=    X,             R,               I
##VAR_TYPE=  INDEPENDENT,   DEPENDENT,       DEPENDENT
##VAR_FORM=  AFFN,          ASDF,            ASDF
##VAR_DIM=   65536,         65536,           65536
##UNITS=     HZ,            ARBITRARY UNITS, ARBITRARY UNITS
##FACTOR=    0.456856943014862, 1,           1
##FIRST=     14782.0589164895, 0,            0
##LAST=      -15158.0608439895, 0,           0
##MIN=       -15158.0608439895, -12170250,   0
##MAX=       14782.0589164895, 373309214,    0
$$ Real data points
##PAGE= N=1
##DATA TABLE= (X++(R..R)), XYDATA
$$ [...]
$$ plain form
36752 2014555 1826679 960890 526725 723151 705187 90915 -365252 72868 969234 1266731
36742 1266731 677668 -69797 -349451 -414730 -793180 -1396278 -1765537 -1896292 -2086926 -2064406
36732 -2064406 -1178245 289462 965487 149549 -1070267 -1299902 -757253 -648598 -1131075
36723 -1131075 -1204016 -483376 273314 589515 936091 1572933 1913540 1648731 1444403 1769318
36713 1769318 1960365 1331297 419137 148978 396325 414542 171676 138347 113582 -517817
36703 -517817 -1487258 -1819543 -1409673 -1282386 -1981689 -2727847 -2637534 -1910950 -1246007 -801237
36693 -801237 -381002 -67583 50297 385180 1339141 2452839 2745647 1926959 735579
36684 735579 -18745 -282938 -426388 -483641 -174137 401280 561424 -151873 -1203472 -1574898
$$ packed form
36752B014555j87876q65789m34165J96426j7964o14272m56167M38120Q96366K97497
36742A266731n89063p47465k79654o5279l78450o03098l69259j30755j90634K2520
36732b064406Q86161J467707O76025q15938j219816k29635N42649J08655m82477
36723a131075p2941P20640P56690L16201L46576O36842L40607k64809k04328L24915
36713A769318J91047o29068r12160k70159K47347J8217k42866l3329k4765o31399
36703e17817r69441l32285M09870J27287o99303p46158R0313P26584O64943M44770
36693h01237M20235L13419J17880L34883R53961J113698K92808q18688j191380
36684G35579p54324k64193j43450n7253L09504N75417J60144p13297j051599l71426
$$ plain form
36674 -1574898 -1079465 -646408 -1018130 -1678193 -1625174 -848744 -287788 -435695 -785357 -771727
36664 -771727 -507136 -291887 -67594 220385 261754 -130733 -575740 -618369 -325396 17401
36654 17401 409093 865742 1050251 756825 438669 583606 810034 362771 -580949 -953299
36644 -953299 -289932 618710 923241 866382 1178504 1817659 2042601 1593077 1090635 1075875
36634 1075875 1156712 545110 -733231 -1640655 -1309818 -121489 738034 661126 118809
36625 118809 -245443 -461081 -850001 -1279615 -1345937 -1042851 -672085 -238061 460023 1210821
36615 1210821 1536276 1480584 1538456 1677716 1257001 243608 -360467 63789 666615 332138
36605 332138 -599151 -874789 -273597 231851 286926 808609 2286714 3529786 3068701
$$ packed form
36674a574898M95433M33057l71722o60063N3019P76430N60956j47907l49662J3630
36664g71727K64591K15249K24293K87979M1369l92487m45007m2629K92973L42797
36654A7401L91692M56649J84509k93426l18156J44937K26428m47263r43720l72350
36644i53299O63367R08642L04531n6859L12122O39155K24942m49524n02442j4760
36634A075875Q0837o11602j278341r07424L30837J188329Q59523p6908n42317
36625A18809l64252k15638l88920m29614o6322L03086L70766M34024O98084P50798
36615A210821L25455n5692N7872J39260m20715j013393o04075M24256O02826l34477
36605C32138r31289k75638O01192N05448N5075N21683J478105J243072m61085
$$ plain form
36596 3068701 1229221 -173324 -2537 1160764 2110241 2387893 2383482 2625011 3285151
36587 3285151 4136498 4816706 5252616 5755970 6470256 6920740 6610490 5982563 6097536
36578 6097536 7149314 7982992 7545607 6252025 5260992 4813543 4168661 3100139 2485495
36569 2485495 3012498 3996222 4132450 3123584 1923187 1407380 1382827 1133642 528331
36560 528331 117022 199504 273784 -295743 -1293752 -1779375 -1249558 -274171 268655 257938
36550 257938 235575 462234 601779 366038 -29021 -233211 -191472 20715 419387 857544
36540 857544 879059 281786 -331901 -64699 1157317 2358166 2566449 1855074 1162071
36531 1162071 1247366 2025378 2847690 3202086 3030121 2511538 1809408 1129902 804353 1000640
$$ packed form
36596C068701j839480j402545J70787J163301R49477K77652m411K41529O60140
36587C285151Q51347O80208M35910N03354P14286M50484l10250o27927J14973
36578F097536J051778Q33678m37385j293582r91033m47449o44882j068522o14644
36569B485495N27003R83724J36228j008866j200397n15807k4553k49185o05311
36560E28331m11309Q2482P4280n69527r98009m85623N29817R75387N42826j0717
36550B57938k2363K26659J39545k35741l95059k04190M1739K12187L98672M38157
36540H57544K1515n97273o13687K67202J222016J200849K08283p11375o93003
36531A162071Q5295P78012Q22312L54396j71965n18583p02130o79506l25549J96287
$$ plain form
36521 1000640 1381577 1380293 933416 656864 1077536 1901129 2325712 1990362 1354066 1152234
36511 1152234 1680778 2616693 3364159 3534435 3198790 2720667 2332147 1943559 1412214
36502 1412214 868201 626846 815437 1189369 1313164 913967 138084 -528580 -699882
36493 -699882 -442837 -74107 282216 636014 721740 167731 -777374 -1216459 -649883 348648
36483 348648 863482 660340 92311 -561043 -1096624 -1122395 -510478 106524 38369 -381301
36473 -381301 -196458 692264 1267278 795231 -238129 -883022 -809416 -318580 211134 547139
36463 547139 648509 732392 979050 1116921 775564 281691 443793 1363514 2146310 2084618
36453 2084618 1475771 947175 654946 530303 600002 602825 39641 -849660 -981150 -21067
$$ packed form
36521A000640L80937j284m46877k76552M20672Q23593M24583l35350o36296k01832
36511A152234N28544R35915P47466J70276l35645m78123l88520l88588n31345
36502A412214n44013k41355J88591L73932J23795l99197p75883o66664j71302
36493f99882K57045L68730L56323L53798Q5726n54009r45105m39085N66576R98531
36483C48648N14834k03142n68029o53354n35581k5771O11917O17002o8155m19670
36473c81301J84843Q88722N75014m72047j033360o44893P3606M90836N29714L36005
36463E47139J01370Q3883K46658J37871l41357m93873J62102R19721P82796o1692
36453B084618o08847n28596k92229j24643O9699K823n63184q89301j31490R60083
$$ plain form
36443 -21067 755285 183972 -925322 -875254 423129 1382003 1020137 -943 -738548
36434 -738548 -1139654 -1486404 -1682090 -1592498 -1397136 -1220275 -997315 -918375 -1313651 -1860125
36424 -1860125 -1661527 -483311 788563 1335559 1390576 1548488 1712698 1370354 535907
36415 535907 -187449 -330198 47473 538063 732142 563472 412364 603235 838746 619169
36405 619169 198005 401737 1341486 2107201 2089554 1812462 1964352 2358581 2452661 2193661
36395 2193661 1692795 788895 -281172 -526210 465190 1447110 970138 -493974 -1163060
36386 -1163060 -444449 561733 1037019 1405518 1957065 1975297 1032290 14149 -116472
36377 -116472 248326 172989 -218472 -54925 727576 1262751 1133896 884912 992449 1166837
$$ packed form
36443b1067P76352n71313j109294N0068J298383R58874l61866j021080p37605
36434g38548m01106l46750j95686Q9592J95362J76861K22960P8940l95276n46474
36424a860125J98598J178216J271874N46996N5017J57912J64210l42344q34447
36415E35907p23356j42749L77671M90590J94079j68670j51108J90871K35511k19577
36405F19169m21164K03732R39749P65715j7647k77092J51890L94229R4080k59000
36395B193661n00866r03900j070067k45038R91400R81920m76972j464112o69086
36386a163060P18611J006182M75286L68499N51547J8232r43007j018141j30621
36377a16472L64798p5337l91461J63547P82501N35175j28855k48984J07537J74388
$$ plain form
36367 1166837 1003217 687296 646249 934526 1342317 1772980 2137617 2145456 1613829 841164
36357 841164 287799 -36653 -496618 -1172187 -1681633 -1746075 -1555684 -1397696 -1248296 -971043
36347 -971043 -621864 -246273 370446 1360165 2350762 2806885 2692976 2392806 2070355 1565423
36337 1565423 846148 59013 -806208 -1719936 -2155052 -1594333 -559359 -227348 -751163
36328 -751163 -935690 -83679 854505 776149 147391 147106 794372 1180470 1097327 1084126 1096575
36317 1096575 547838 -317442 -495006 107380 401915 -111345 -619612 -560888 -590747 -1206322
36307 -1206322 -1623372 -1067187 -194408 -38370 -282151 148760 1265753 2060292 2100984
36298 2100984 1880793 1676668 1228305 622820 415773 634263 589612 -7195 -548753 -494545
$$ packed form
36367A166837j63620l15921m1047K88277M07791M30663L64637P839n31627p72665
36357H41164n53365l24452m59965o75569n09446o4442J90391J57988J49400K77253
36347i71043L49179L75591O16719R89719R90597M56123j13909l00170l22451n04932
36337A565423p19275p87135q65221r13728m35116N60719J034974L32011n23815
36328g51163j84527Q52011R38184p8356o28758k85O47266L86098q3143j3201J2449
36317A096575n48737q65280j77564O02386K94535n13260n08267N8724k9859o15575
36307a206322m17050N56185Q72779J56038k43781M30911J116993P94539M0692
36298B100984k20191k04125m48363o05485k07047K18490m4651n96807n41558N4208
$$ plain form
36288 -494545 -123623 46696 -32962 -210732 -531900 -917780 -921194 -299618 490989 810265
36278 810265 584162 171288 -236277 -629639 -792350 -401595 452708 1213277 1426174 1163435
36268 1163435 811724 605287 483612 368823 460912 1081285 2106874 2729994 2138167
36259 2138167 509831 -990240 -1425371 -1068729 -900459 -1294641 -1602425 -1101196 -20385
36250 -20385 655624 329902 -519032 -907957 -473326 196815 383085 128326 59486 443717
36240 443717 825185 741466 441327 513449 968843 1188958 866706 498679 610486 901037
36230 901037 726656 233672 270380 1067655 1762021 1627557 1124801 1107019 1506205 1613486
36220 1613486 1326804 1177068 1234386 1010007 562610 656240 1437260 1924946 1425395 630175
$$ packed form
36288d94545L70922J70319p9658j77770l21168l85880l414O21576P90607L19276
36278H10265k26103m12874m07565l93362j62711L90755Q54303P60569K12897k62739
36268A163435l51711k06437j21675j14789R2089O20373J025589O23120n91827
36259B138167j628336j500071m35131L56642J68270l94182l07784N01229J080811
36250b0385O76009l25722q48934l88925M34631O70141J86270k54759o8840L84231
36240D43717L81468q3719l00139P2122M55394K20115l22252l68027J11807K90551
36230I01037j74381m92984L6708P97275O94366j34464n02756j7782L99186J07281
36220A613486k86682j49736N7318k24379m47397R3630P81020M87686m99551p95220
$$ plain form
36210 630175 549068 1008970 1089915 595267 159947 127027 190676 112018 57565 182565 442061
36199 442061 823568 1292627 1561823 1362161 862930 440836 220759 220612 604524 1281826
36189 1281826 1653397 1392564 1056877 1171563 1189190 358632 -777859 -981759 -193046
36180 -193046 537202 913438 1653103 2663330 2637560 1165099 -234864 -156019 822332
36171 822332 1333106 1191984 993917 693120 -56281 -798617 -862049 -592020 -730058 -956487
36161 -956487 -385513 740658 1241512 836400 444974 542157 551417 197722 186907 951494
36151 951494 1759392 1768553 1179378 670305 353603 -19452 -342812 -353618 -220192 -329586
36141 -329586 -680911 -921833 -798865 -278016 480618 980405 629926 -464155 -1328940
$$ packed form
36210F30175q1107M59902Q0945m94648m35320l2920O3649p8658n4453J25000K59496
36199D42061L81507M69059K69196j99662m99231m22094k20077j47L83912O77302
36189A281826L71571k60833l35687J14686J7627q30558j136491k03900P88713
36180a93046P30248L76236P39665J010227k5770j472461j399963P8845R78351
36171H22332N10774j41122j98067l00797p49401p42336o3432K70029j38038k26429
36161i56487N70974J126171N00854m05112l91426R7183R260l53695j0815P64587
36151I51494Q07898R161n89175n09073l16702l73055l23360j0806J33426j09394
36141c29586l51325k40922J22968N20849P58634M99787l50479j094081q64785
$$ plain form
36132 -1328940 -1231636 -609402 -348379 -468323 -248097 496659 1089727 1069522 831906 862118
36122 862118 946011 645128 116372 -129368 -27021 90101 188199 494812 738711 206424
36112 206424 -1103937 -2062676 -1725452 -601949 66253 -49037 -247788 -158118 -246335 -804358
36102 -804358 -1316018 -1267699 -908985 -679826 -413219 291364 1243658 1795551 1647525 1102309
36092 1102309 622356 409161 289252 -109739 -829192 -1245148 -785063 -1187 -108959
36083 -108959 -1184013 -1791562 -993090 274488 709353 589831 977678 1696421 1617196
36074 1617196 651449 -67016 2787 232908 260571 644712 1654364 2538915 2552650 1857145
36064 1857145 1005557 318908 59487 388855 885408 926824 711298 959854 1519352 1457517
$$ packed form
36132a328940R7304O22234K61023j19944K20226P44756N93068k0205k37616L0212
36122H62118Q3893l00883n28756k45740J02347J17122R8098L06613K43899n32287
36112B06424j310361r58739L37224J123503O68202j15290j98751Q9670q8217n58023
36102h04358n11660M8319L58714K29159K66607P04583R52294N51893j48026n45216
36092A102309m79953k13195j19909l98991p19453m15956M60085P83876j07772
36083a08959j075054o07549P98472J267578M34865j19522L87847P18743p9225
36074A617196r65747p18465O9803K30121K7663L84141J009652Q84551J3735o95505
36064A857145q51588o86649k59421L29368M96553M1416k15526K48556N59498o1835
$$ plain form
36054 1457517 747946 447671 763455 502724 -772600 -1611754 -845846 480960 746442
36045 746442 176781 92987 648946 996902 1078828 1557164 2315288 2610697 2499336 2623809
36035 2623809 2793696 2304406 1531528 1578216 2283095 2244936 1115217 243053 527208 1151466
36025 1151466 1186956 1082766 1606602 2365483 2407924 1594709 528544 -305060 -644922 -284899
36015 -284899 546438 1136264 1164462 1130513 1467658 1860802 1946096 1998122 2278264 2321887
36005 2321887 1623237 577592 23406 163933 537637 757174 757588 601499 465059 516110
35995 516110 550191 244386 -27310 554522 1781282 2195309 1099235 -172706 -29505
35986 -29505 1153419 1828189 1620689 1419252 1517062 1264178 549842 123616 220479 227811
$$ packed form
36054A457517p09571l00275L15784k60731j275324q39154P65908J326806K65482
36045G46442n69661q3794N55959L47956Q1926M78336P58124K95409j11361J24473
36035B623809J69887m89290p72878M6688P04879l8159j129719q72164K84155O24258
36025A151466L5490j04190N23836P58881M2441q13215j066165q33604l39862L60023
36015b84899Q31337N89826K8198l3949L37145L93144Q5294N2026K80142M3623
36005B321887o98650j045645n54186J40527L73704K19537M14j56089j36440N1051
35995E16110L4081l05805k71696N81832J226760M14027j096074j271941J43201
35986b9505J182924O74770k07500k01437R7810k52884p14336m26226R6863P332
$$ plain form
35976 227811 29906 339162 1213523 1549899 754671 -228148 -388668 -145473 -405275 -956678
35966 -956678 -895511 -113028 690553 1136098 1355125 1300639 797071 171318 4980 285774
35956 285774 513668 576246 774530 1011261 766186 26258 -483103 -253601 384731 824738
35946 824738 853129 563047 135060 -30988 511397 1581615 2279184 1957928 1009371 355471
35936 355471 427788 930427 1317745 1192908 522471 -198205 -268198 351460 763785 179848
35926 179848 -989675 -1614349 -1275459 -633959 -395763 -539363 -722343 -865626 -1002107
35917 -1002107 -970462 -642597 -184439 230495 711621 1322316 1716750 1543608 1078621 992863
35907 992863 1497033 2130634 2443976 2462054 2341897 2018960 1495036 1121971 1171785 1327396
$$ packed form
35976B27811j97905L09256Q74361L36376p95228r82819j60520K43195k59802n51403
35966i56678O1167P82483Q03581M45545K19027n4486n03568o25753j66338K80794
35956B85774K27894O2578J98284K36731k45075p39928n09361K29502O38332M40007
35946H24738K8391k90082m27987j66048N42385J070218O97569l21256r48557o53900
35936C55471P2317N02639L87318j24837o70437p20676o9993O19658M12325n83937
35926A79848j169523o24674L38890O41500K38196j43600j82980j43283j36481
35917a002107L1645L27865M58158M14934M81126O10695L94434j73142m64987q5758
35907I92863N04170O33601L13342J8078j20157l22937n23924l73065M9814J55611
$$ plain form
35897 1327396 1074381 528863 370147 870779 1493407 1676663 1542494 1425326 1118161
35888 1118161 221432 -930650 -1414806 -915176 -169842 46709 -107895 63358 843441
35879 843441 1928373 2865707 3254700 2832666 1853826 1136518 1209612 1598733 1492192 916726
35869 916726 608084 840369 1135889 1157921 1097988 1005380 542701 -222794 -502998 219073
35859 219073 1405611 2153628 2210260 1861438 1310343 702084 333601 270871 126355 -241984
35849 -241984 -230683 659383 1840499 2257434 1766884 1171820 1036709 1184858 1275745 1185348
35839 1185348 858735 408415 256628 554184 673723 74530 -543041 15467 1534849
35830 1534849 2371239 1625121 280234 -285439 41057 540299 885760 1160063 1273288
$$ packed form
35897A327396k53015n45518j58716N00632O22628J83256j34169j17168l07165
35888A118161q96729j152082m84156M99630P45334K16551j54604J71253P80083
35879H43441J084932R37334L88993m22034r78840p17308P3094L89121j06541n75466
35869I16726l08642K32285K95520K2032n9933r2608m62679p65495k80204P22071
35859B19073J186538P48017N6632l48822n51095o08259l68483o2730j44516l68339
35849b41984J1301Q90066J181116M16935m90550n95064j35111J48149R0887r0397
35839A185348l26613m50320j51787K97556J19539n99193o17571N58508J519382
35830A534849Q36390p46118j344887n65673L26496M99242L45461K74303J13225
$$ plain form
35821 1273288 1159666 1156812 1527569 1934187 1947310 1739421 1750118 2006351 2274206 2518383
35811 2518383 2709156 2580500 2143513 2038256 2741690 3781538 4412292 4744612 5441666
35802 5441666 6531397 7369665 7749698 8259067 9390445 10880359 12058273 12406059 11759000
35793 11759000 10425827 9124740 8350984 7814181 6931735 5800717 5149444 5331244 5905589
35784 5905589 6283805 6308138 6125500 5966083 6160716 6962998 8231731 9597090 10935183
35775 10935183 12312268 13494359 13945515 13352877 11826269 9669752 7355943 5564763
35767 5564763 4681996 4294236 3701664 2866257 2299387 2124801 1942945 1594528 1326114
35758 1326114 1173233 939959 826718 1227487 1823555 1860900 1518159 1859029 2994084
$$ packed form
35821A273288j13622k854L70757M06618J3123k07889J0697K56233K67855K44177
35811B518383J90773j28656m36987j05257P03434J039848O30754L32320O97054
35802E441666J089731Q38268L80033N09369J131378J489914J177914L47786o47059
35793A1759000j333173j301087p73756n36803q82446j131018o51273J81800N74345
35784E905589L78216K4333j82638j59417J94633Q02282J268733J365359J338093
35775A0935183J377085J182091M51156n92638j526608k156517k313809j791180
35767E564763q82767l87760n92572q35407n66870j74586j81856l48417k68414
35758A326114j52881k33274j13241M00769N96068L7345l42741L40870J135055
$$ plain form
35749 2994084 3513388 2534587 1210849 1116015 1981807 2293258 1562378 692114 376019
35740 376019 423041 596939 918218 1059034 582579 -28694 286524 1449034 1954723 898692
35730 898692 -644718 -1025155 -89426 997832 1501646 1731985 2087324 2376187 2265057
35721 2265057 1832392 1446183 1386623 1679619 2061947 2108393 1667065 1166282 1179852 1637565
35711 1637565 1783213 1063356 -172947 -1035416 -1021833 -464977 -157927 -615124 -1588428
35702 -1588428 -2247325 -1973935 -1046073 -367388 -454585 -943002 -1237780 -1302598 -1431056 -1524993
35692 -1524993 -1205994 -602344 -358426 -658887 -860636 -478840 16227 -38386 -365848 -139603
35682 -139603 666685 1132854 701127 -83314 -429043 -328932 -334854 -683905 -1063695 -1051041
$$ packed form
35749B994084N19304r78801j323738r4834Q65792L11451p30880q70264l16095
35740C76019M7022J73898L21279J40816m76455o11273L15218J162510N05689j056031
35730H98692j543410l80437R35729J087258N03814K30339L55339K88863j11130
35721B265057m32665l86209n9560K92996L82328M6446m41328n00783J3570M57713
35711A637565J45648p19857j236303q62469J3583N56856L07050m57197r73304
35702a588428o58897K73390R27862O78685q7197m88417k94778o4818j28458r3937
35692a524993L18999O03650K43918l00461k01749L81796M95067n4613l27462K26245
35682a39603Q06288M66169m31727p84441l45729J00111n922l49051l79790J2654
$$ plain form
35672 -1051041 -482287 468120 1369435 1849728 1979181 2148020 2452747 2493094 1979257 1265880
35662 1265880 1003401 1407760 2059774 2283487 1655297 427829 -450839 -146740 1009228
35653 1009228 1706525 1198375 196935 -209938 -40917 -128470 -670695 -954187 -537301
35644 -537301 99291 342200 256950 246727 364257 393819 353612 513851 993144 1586723
35634 1586723 1959736 1892026 1429957 908190 715239 913914 1153761 1039791 544137 21387
35624 21387 -121821 250759 957758 1741493 2502831 3177758 3439646 2885715 1719217 868546
35614 868546 969373 1442871 1163068 3180 -914490 -675939 312984 1010969 1024341 698734
35604 698734 293910 -259292 -831709 -954691 -433045 284700 616807 507823 346925 400079
$$ packed form
35672a051041N68754R50407R01315M80293J29453J68839L04727M0347n13837p13377
35662A265880k62479M04359O52014K23713o28190j227468q78668L04099J155968
35653A009228O97297n08150j001440m06873J69021q7553n42225k83492M16886
35644e37301O36592K42909q5250j0223J17530K9562m0207J60239M79293N93579
35634A586723L73013o7710m62069n21767j92951J98675K39847j13970m95654n22750
35624B1387j43208L72580P06999P83735P61338O74927K61888n53931j166498q50671
35614H68546J00827M73498k79803j159888r17670K38551R88923O97985J3372l25607
35604F98734m04824n53202n72417j22982N21646P17745L32107j08984j60898N3154
$$ plain form
35594 400079 590546 757786 836840 743744 357499 -229925 -642746 -619539 -372116 -317199
35584 -317199 -529506 -737675 -817112 -911740 -993444 -741880 -135403 225231 -160685 -861859
35574 -861859 -921968 -55075 1047728 1641630 1663737 1412501 1022938 602158 464862 735516
35564 735516 935035 483742 -439200 -1020398 -842549 -342634 -120344 -237069 -430633 -590504
35554 -590504 -652752 -396490 166605 492300 194050 -174689 219221 1101836 1277551 409476
35544 409476 -376771 -211981 146629 -423048 -1509982 -1733389 -847835 -34730 -127553 -697597
35534 -697597 -1024771 -891204 -217887 969388 1894828 1509029 108082 -648321 20173
35525 20173 871107 564048 -369182 -577650 5232 408175 329041 269634 394377 526515
$$ packed form
35594D00079J90467J67240P9054r3096l86245n87424m12821K3207K47423N4917
35584c17199k12307k08169p9437r4628q1704K51564O06477L60634l85916p01174
35574h61859o0109Q66893J102803N93902K2107k51236l89563m20780j37296K70654
35564G35516J99519m51293r22942n81198J77849M99915K22290j16725j93564j59871
35554e90504o2248K56262N63095L25695k98250l68739L93910Q82615J75715q68075
35544D09476p86247J64790L58610n69677j086934k23407Q85554Q13105r2823n70044
35534f97597l27174J33567O73317J187275R25440l85799j400947p56403O68494
35525B0173Q50934l07059r33230k08468N82882M02943p9134n9407J24743J32138
$$ plain form
35515 526515 943263 1901897 2656793 2295928 1386452 1371304 2354875 2968600 2589495 2144923
35505 2144923 2281988 2248600 1363630 340260 186350 703399 1010062 881307 733723
35496 733723 795478 983676 1174483 1081122 354154 -762349 -1436430 -1304749 -887010 -597928
35486 -597928 -181109 383976 385948 -410847 -915504 -64826 1569945 2508474 2242681 1493198
35476 1493198 1012033 1037950 1579276 2326642 2564599 2003619 1387462 1452663 1700264 1201329
35466 1201329 270389 142108 1069378 1924010 1831493 1151533 566549 127235 -396218 -920345
35456 -920345 -1211999 -1192564 -869032 -353776 11741 -3591 -109383 96235 459008 587715
35446 587715 611525 888511 1197166 1124910 1072887 1750424 2670344 2428313 807289 -606898
$$ packed form
35515E26515M16748R58634P54896l60865r09476j5148R83571O13725l79105m44572
35505B144923J37065l3388q84970j023370j53910N17049L06663j28755j47584
35496G33723O1755J88198J90807r3361p26968j116503o74081J31681M17739K89082
35486e97928M16819N65085J972p96795n04657Q50678J634771R38529k65793p49483
35476A493198m81165K5917N41326P47366K37957n60980o16157O5201K47601m98935
35466A201329r30940j28281R27270Q54632r2517o79960n84984m39314n23453n24127
35456i20345k91654J9435L23532N15256L65517j5332j05792K05618L62773J28707
35446E87715K3810K76986L08655p2256n2023O77537R19920k42031j621024j414187
$$ plain form
35436 -606898 -458846 786353 1895329 2455002 2612649 2214072 1279894 674873 1168842
35427 1168842 2199452 2588142 2219823 1987289 2182485 2002294 849397 -721737 -1704731
35418 -1704731 -1716105 -1081714 -327487 104249 1197 -402505 -550328 -186994 245942 80818
35408 80818 -716368 -1351439 -993750 271592 1410402 1432092 350876 -893882 -1342859
35399 -1342859 -751635 327292 919303 316212 -1162271 -2211128 -1855680 -671299 -84077
35390 -84077 -444332 -601271 313973 1545158 1841118 1312138 1217824 2102476 3056099 3010619
35380 3010619 2114846 1458122 1740806 2523902 2734108 1811960 362081 -412608 28535
35371 28535 1050031 1695321 1751512 1649735 1576671 1237719 535163 -21559 136636 923296
$$ packed form
35436f06898J48052J245199J108976N59673J57647l98577r34178o05021M93969
35427A168842J030610L88690l68319k32534J95196j80191j152897j571134r82994
35418a704731j1374O34391P54227M31736j03052m03702j47823L63334M32936j65124
35408H0818p97186o35071L57689J265342J138810K1690j081216j244758m48977
35399a342859N91224J078927N92011o03091j478483j048857L55448J184381N87222
35390h4077l60255j56939R15244J231185K95960n28980r4314Q84652R53623m5480
35380C010619q95773o56724K82684P83096K10206r22148j449879p74689M41143
35371B8535J021496O45290N6191j01777p3064l38952p02556n56722J58195P86660
$$ plain form
35361 923296 1699252 2003520 1963278 1966856 2121883 2200507 2077273 2001478 2293854 2897025
35351 2897025 3414931 3538608 3260593 2751004 2247856 2002846 2063196 2133087 1921439 1593155
35341 1593155 1580469 1988555 2513199 2878420 2967328 2628709 1897999 1369046 1668707 2456853
35331 2456853 2679731 2060971 1576141 2040006 2986288 3558225 3838856 4490515 5511884
35322 5511884 6206934 6207594 5818654 5439113 5205522 5102948 4963341 4530268 3936343 3800361
35312 3800361 4371241 4990012 5018642 4853810 5231946 5952459 6283888 6353434 6979932 8173454
35302 8173454 8981357 8986437 8818376 8872049 8651070 7893662 7312313 7524805 8096932 8374938
35292 8374938 8531421 9012300 9588603 9785862 9737400 9796046 9781971 9498958 9571302 10740265
$$ packed form
35361I23296P75956L04268m0242L578J55027P8624j23234p5795K92376O03171
35351B897025N17906J23677k78015n09589n03148k45010O0350O9891k11648l28284
35341A593155j2686M08086N24644L65221Q8908l38619p30710n28953K99661P88146
35331B456853K22878o18760m84830M63865R46282N71937K80631O51659J021369
35322E511884O95050O60l88940l79541k33591j02574j39607m33073n93925j35982
35312C800361N70880O18771K8630j64832L78136P20513L31429O9546O26498J193522
35302H173454Q07903N080j68061N3673k20979p57408n81349K12492N72127K78006
35292H374938J56483M80879N76303J97259m8462N8646j4075k83013P2344J168963
$$ plain form
35282 10740265 12544147 13739573 14004794 14216526 14933721 15656359 15972892 16516647 18133971
35273 18133971 20720986 23570166 26463181 29729484 33465916 37441414 41802304 47222939
35265 47222939 54126299 62261544 71392472 81873262 93690015 104827822 111417973 110356043
35257 110356043 101873948 89233648 76012157 64073890 53873994 45600015 39325276
35250 39325276 34611698 30819738 27741900 25397912 23394211 21173179 18869387 17198335
35242 17198335 16347593 15650296 14608160 13557948 12906135 12347150 11473062 10660976 10546182
35233 10546182 10865360 10677707 9702885 8607642 7856778 7166827 6445340 6366252 7285864
35224 7285864 8251578 8061852 7006129 6538225 7251532 8197886 8445252 8288221 8334829
$$ packed form
35282A0740265J803882J195426K65221K11732P17195P22638L16533N43755J617324
35273A8133971K587015K849180K893015L266303L736432L975498M360890N420635
35265D7222939O903360Q135245R130928J0480790J1816753J1137807O590151j061930
35257A10356043q482095j2640300j3221491j1938267j0199896q273979o274739
35250C9325276m713578l791960l077838k343988k003701k221032k303792j671052
35242A7198335q50742o97297j042136j050212o51813n58985q74088q12086j14794
35233A0546182L19178j87653r74822j095243p50864o89951p21487p9088R19612
35224G285864R65714j89726j055723m67904P13307R46354K47366j57031M6608
$$ plain form
35215 8334829 8277614 7516193 6494258 6331067 7208164 8109251 8326669 8326599 8723143 9171634
35205 9171634 8937434 8094773 7459377 7526957 8058406 8590401 8794653 8390690 7314602
35196 7314602 6105695 5614687 6091693 6916507 7396288 7442383 7275462 6953648 6585284
35187 6585284 6593147 7203970 7911132 8064224 7916511 8438511 9981496 11720102 12673360
35178 12673360 12786523 12693662 12865519 13407009 14329026 15505775 16552411 17210506 17764848
35169 17764848 18730991 20277342 22277843 24654761 27176097 29178539 30181435 30696794
35161 30696794 31699220 33216115 34163750 33791475 32634068 31769184 31760543 32633239 34217595
35152 34217595 36080471 37733551 39408121 42034163 45922071 50143629 53954791 58165077
$$ packed form
35215H334829n7215p61421j021935j63191Q77097R01087K17418p0L96544M48491
35205I171634k34200q42661o35396O7580N31449N31995K04252m03963j076088
35196G314602j208907m91008M77006Q24814M79781M6095j66921l21814l68364
35187F585284P863O10823P07162J53092j47713N22000J542985J738606R53258
35178A2673360J13163r2861J71857N41490R22017J176749J046636O58095N54342
35169A7764848R66143J546351K000501K376918K521336K002442J002896N15359
35161C0696794J002426J516895R47635l72275j157407q64884q641Q72696J584356
35152C4217595J862876J653080J674570K626042L887908M221558L811162M210286
$$ plain form
35144 58165077 64067915 71472207 79042700 86485308 95093836 105827591 117941904 130009358
35136 130009358 141312926 151444543 159174156 162677967 160876345 154146764 143900050
35129 143900050 131800305 119146878 106558765 94268957 82854583 73354017 66305029
35122 66305029 60923918 55759993 50195005 44936012 40953022 38254038 35923162 33202723
35114 33202723 30256821 27824540 26366906 25784898 25818451 26292041 26895335 27222515 27379855
35105 27379855 28192383 30358884 33631253 37201836 40513492 43090066 43967867 42280085
35097 42280085 38441860 33893095 29516652 25140638 20783099 17344970 15446617 14366448
35089 14366448 12936404 11030260 9454176 8714591 8580685 8618629 8504953 7963425 6995588
$$ packed form
35144E8165077N902838P404292P570493P442608Q608528J0733755J2114313J2067454
35136A30009358J1303568J0131617P729613L503811j801622o729581j0246714
35129A43900050j2099745j2653427j2588113j2289808j1414374r500566p048988
35122F6305029n381111n163925n564988n258993l982990k698984k330876k720439
35114C3202723k945902k432281j457634n82008L3553M73590O03294L27180J57340
35105B7379855Q12528K166501L272369L570583L311656K576574Q77801j687782
35097D2280085l838225m548765m376443m376014m357539l438129j898353j080169
35089A4366448j430044j906144j576084p39585j33906L7944j13676n41528r67837
$$ plain form
35080 6995588 6113670 5846615 6055153 6131717 5775437 5184052 4621253 4208433 4006110 3878232
35070 3878232 3435671 2597403 2056865 2584934 3861355 4604506 4037785 2732369 1750847
35061 1750847 1389093 1154014 741341 552995 1128570 2314600 3264744 3315787 2694061
35052 2694061 2192633 2259080 2629721 2779627 2423914 1618669 744695 381973 749544 1254362
35042 1254362 1150024 680423 800993 1548777 1667149 473667 -828337 -721301 405363
35033 405363 878381 295106 57892 1155492 2653873 3015788 2094017 1078503 897445
35024 897445 1335100 1625840 1461788 1276944 1614457 2323963 2639308 2182087 1508584 1276533
35014 1276533 1242577 704659 -303018 -1011372 -1052434 -829704 -681746 -424228 80909 582570
$$ packed form
35080F995588q81918k67055K08538P6564l56280n91385n62799m12820k02323j27878
35070C878232m42561q38268n40538N28069J276421P43151n66721j305416r81522
35061A750847l61754k35079m12673j88346N75575J186030R50144N1043o21726
35052B694061n01428O6447L70641J49906l55713q05245q73974l62722L67571N04818
35042A254362j04338m69601J20570P47784J18372j193482j302004J07036J126664
35033D05363M73018n83275k37214J097600J498381L61915r21771j015514j81058
35024H97445M37655K90740j64052j84844L37513P09506L15345m57221o73503k32051
35014A276533l3956n37918j007677p08354m1062K22730J47958K57518N05137N01661
$$ plain form
35004 582570 927918 1285380 1608114 1464130 739700 3927 -183764 71929 307453 259079
34994 259079 -81737 -502666 -461240 509125 1991891 2818345 2359515 1228169 391370
34985 391370 98610 29358 -59135 -281029 -714280 -1070676 -744509 327995 1325495 1551032
34975 1551032 1285565 1093738 863717 302879 -88039 510477 1966031 3245252 3671411
34966 3671411 3409116 2821571 2172013 1955486 2648466 3916334 4804245 4988800 5196534
34957 5196534 6062126 7155976 7566320 7035942 6115913 5453845 5243822 5198736 4860962
34948 4860962 4083583 3251190 2795073 2557770 2078002 1489419 1488705 2195517 2746186 2515178
34938 2515178 2141648 2609847 3682929 4122818 3393101 2284000 1670146 1444431 1099610
$$ packed form
35004E82570L45348L57462L22734j43984p24430p35773j87691K55693K35524m8374
34994B59079l40816m20929M1426R70365J482766Q26454m58830j131346q36799
34985C91370k92760o9252q8493k21894m33251l56396L26167J072504R97500K25537
34975A551032k65467j91827k30021n60838l90918N98516J455554J279221M26159
34966C671411k62295n87545o49558k16527O92980J267868Q87911J84555K07734
34957E196534Q65592J093850M10344n30378r20029o62068k10023m5086l37774
34948D860962p77379q32393m56117k37303m79768n88583p14P06812N50669k31008
34938B515178l73530M68199J073082M39889p29717j109101o13854k25715l44821
$$ plain form
34929 1099610 693175 580033 616347 404562 158387 508149 1367880 1795456 1301868 586270
34919 586270 454255 636953 424902 -9667 87439 609718 552494 -373414 -1106840 -721822
34909 -721822 271269 780023 652108 560545 797487 1019475 997705 863107 682339 456896
34899 456896 478553 1012411 1651164 1699741 1270622 1253809 1994186 2723698 2663002 2046633
34889 2046633 1585256 1442946 1304170 1054897 796470 451589 -38073 -290678 113823
34880 113823 852924 1098965 626434 109106 118248 378493 374629 221306 388824 841912
34870 841912 1083498 1015063 1133641 1696799 2215521 2104207 1447616 748982 255200 421
34860 421 227099 1104716 2093896 2290104 1573884 826780 748013 1029069 1074587 972191
$$ packed form
34929A099610m06435j13142L6314k11785k46175L49762Q59731M27576m93588p15598
34919E86270j32015J82698k12051m34569R7106N22279n7224r25908p33426L85018
34909g21822R93091N08754j27915r1563K36942K21988k1770j34598j80768k25443
34899D56896K1657N33858O38753M8577m29119j6813P40377P29512o0696o16369
34889B046633m61377j42310j38776k49273k58427l44881m89662k52605M04501
34880A13823P39101K46041m72531n17328R142K60245l864j53323J67518M53088
34870H41912K41586o8435J18578N63158N18722j11314o56591o98634m93782k54779
34860D21K26678Q77617R89180J96208p16220p47104p8767K81056M5518j02396
$$ plain form
34850 972191 1147133 1440429 1253772 499677 -223647 -417291 -125363 400100 926576 1073001
34840 1073001 522055 -345657 -533274 478731 2034111 3020133 3011974 2376314 1533740
34831 1533740 633388 -97817 -213970 474378 1497511 2060939 1800347 1116100 731618
34822 731618 946309 1371266 1447032 1173784 1159192 1833803 2761841 3002417 2208633 1105710
34812 1105710 655872 923336 1123607 764370 269826 264496 680492 1016330 1178434 1470614
34802 1470614 1856480 1892721 1502860 1213528 1384738 1727691 1868618 1884450 1925601 1797544
34792 1797544 1367438 966119 894123 902187 678811 479466 678452 1047297 1168396 1262252
34782 1262252 1789797 2424492 2349055 1585903 1100537 1394090 1876055 1953512 1886626 2059151
$$ packed form
34850I72191J74942K93296j86657p54095p23324j93644K91928N25463N26476J46425
34840A073001n50946q67712j87617J012005J555380R86022q159o35660q42574
34831A533740r00352p31205j16153O88348J023133N63428k60592o84247l84482
34822G31618K14691M24957P5766k73248j4592O74611R28038K40576p93784j102923
34812A105710m49838K67464K00271l59237m94544n330M15996L35838J62104K92180
34802A470614L85866L6241l89861k89332J71210L42953J40927J5832M1151j28057
34792A797544m30106m01319p1996Q064k23376j99345J98986L68845J21099R3856
34782A262252N27545O34695p5437p63152m85366K93553M81965P7457o6886J72525
$$ plain form
34772 2059151 2150881 1731280 1178673 1280127 2147410 3101475 3483415 3143514 2321853 1497896
34762 1497896 1210597 1586979 2125503 2287085 2153873 2129655 2177097 1878238 1217249 749906
34752 749906 837702 1152908 1189953 934925 727610 705393 763197 959956 1527269 2356486
34742 2356486 2839930 2517462 1687887 1049076 847978 786602 731067 974269 1590115 2032633
34732 2032633 1794725 1137626 720580 739424 871943 874190 766194 590937 451627 610584
34722 610584 1060511 1229493 726570 147192 332756 942136 729685 -623822 -1946865
34713 -1946865 -2187349 -1648028 -1098085 -556733 261561 996187 1093277 830930 969929 1514843
34703 1514843 1632736 850844 -303244 -985587 -902161 -370393 142326 395930 452965 460109
$$ packed form
34772B059151R1730m19601n52607J01454Q67283R54065L81940l39901q21661q23957
34762A497896k87299L76382N38524J61582j33212k4218M7442k98859o60989m67343
34752G49906Q7796L15206L7045k55028k07315k2217N7804J96759N67313Q29217
34742B356486M83444l22468q29575o38811k01098o1376n5535K43202O15846M42518
34732B032633k37908o57099m17046J8844J32519K247j07996j75257j39310J58957
34722F10584M49927J68982n02923n79378J85564O09380k12451j353507j323043
34713a946865k40484N39321N49943N41352Q18294P34626R7090k62347J38999N44914
34703A514843J17893p81892j154088o82343Q3426N31768N12719K53604N7035P144
$$ plain form
34693 460109 414521 333871 579458 1528029 2786602 3314652 2691194 1724053 1305413 1187819
34683 1187819 603430 -281490 -433307 541629 1741425 2067780 1489166 939953 1218729
34674 1218729 2173948 2906618 2754600 2047774 1691201 2014290 2446097 2447675 2215122 2146741
34664 2146741 2176162 2089414 1980083 1881986 1513974 985167 1093707 2101498 2866744 2301885
34654 2301885 1190324 1205601 2374231 3032756 2401027 1623010 1758286 2218405 2088738
34645 2088738 1810367 2365984 3523563 4086674 3584842 2736391 2338998 2472424 2793216
34636 2793216 3023319 3071830 3009681 2916219 2632454 1945879 1168169 1030418 1658384 2197438
34626 2197438 1992455 1625745 2040183 3005827 3386208 2855076 2415453 2966599 4097333
$$ packed form
34693D60109m5588q0650K45587R48571J258573N28050o23458r67141m18640j17594
34683A187819n84389q84920j51817R74936J199796L26355n78614n49213K78776
34674A218729R55219P32670j52018p06826l56573L23089M31807J578k32553o8381
34664B146741K9421q6748j09331r8097l68012n28807J08540J007791P65246n64859
34654B301885j111561J5277J168630O58525o31729p78017J35276M60119j29667
34645B088738k78371N55617J157579N63111n01832q48451l97393J33426L20792
34636B793216K30103M8511o2149r3462k83765o86575p77710j37751O27966N39054
34626B197438k04983l66710M14438R65644L80381n31132m39623N51146J130734
$$ plain form
34617 4097333 4735459 4517394 4047289 4045838 4656144 5534183 6345681 7126943 8251589 10025632
34607 10025632 12249609 14201735 15117094 14739050 13467168 11992322 10729438 9572216
34599 9572216 8248021 6871938 5956908 5792513 6011920 5980278 5528046 5089109 5103302
34590 5103302 5450052 5573933 5135558 4447622 4170479 4556742 5129502 5222934 4703006 3950219
34580 3950219 3275047 2709205 2342324 2400425 2807012 3060813 2856700 2540319 2592342 2890590
34570 2890590 2927368 2644632 2527089 2781216 2949915 2668438 2379604 2714344 3309356 2976378
34560 2976378 1319729 -435731 -817485 74204 865378 850476 700325 1070071 1501316
34551 1501316 1307141 768782 629328 934912 1285135 1843393 3040963 4400235 4745879
$$ packed form
34617D097333O38126k18065m70105j451O10306Q78039Q11498P81262J124646J774043
34607A0025632K223977J952126R15359l78044j271882j474846j262884j157222
34599I572216j324195j376083r15030j64395K19407l1642m52232m38937J4193
34590E103302L46750J23881m38375o87936k77143L86263N72760R3432n19928p52787
34580C950219o75172n65842l66881N8101M06587K53801k04113l16381N2023K98248
34570B890590L6778k82736j17543K54127J68699k81477k88834L34740N95012l32978
34560B976378j656649j755460l81754Q91689P91174j4902j50151L69746M31245
34551A501316j94175n38359j39454L05584L50223N58258J197570J359272L45644
$$ plain form
34542 4745879 3780895 2544693 2001317 1948529 1686395 1078296 501602 255077 412543
34533 412543 874411 1288588 1299429 1046533 978984 1073361 808721 79007 -506148 -480448
34523 -480448 -75634 324829 654952 852911 785843 767354 1371605 2382391 2781629 2244884
34513 2244884 1738716 2024627 2512195 2413814 2166496 2696249 3944561 5166236 6147023
34504 6147023 7102926 7855077 8126008 8212490 8373562 8062632 6849687 5542852 5112055
34495 5112055 4996273 3955043 2235703 1231010 1144581 834586 121109 287822 1683470
34486 1683470 2664152 1951426 562022 196676 872716 1407160 1347235 1143104 1026501
34477 1026501 915433 1032848 1582283 2089013 1919237 1178629 388881 -322232 -962369
$$ packed form
34542D745879r64984j236202n43376n2788k62134o08099n76694k46525J57466
34533D12543M61868M14177J0841k52896o7549R4377k64640p29714n85155K5700
34523d80448M04814M00463L30123J97959o7068j8489O04251J010786L99238n36745
34513B244884n06168K85911M87568r8381k47318N29753J248312J221675R80787
34504F147023R55903P52151K70931Q6482J61072l10930j212945j306835m30797
34495E112055j15782j041230j719340j004693q6429l09995p13477J66713J395648
34486A683470R80682p12726j389404l65346O76040N34444n9925k04131j16603
34477A026501j11068J17415N49435N06730j69776p40608p89748p11113o40137
$$ plain form
34468 -962369 -1084710 -364118 578063 856543 612175 727408 1408699 1952338 1881808 1465208
34458 1465208 1044203 626835 284652 280610 604740 877425 825041 455271 -176252 -877229
34448 -877229 -1096182 -409761 743995 1395082 1171935 623097 438723 863621 1770815
34439 1770815 2662912 2699590 1554393 285723 419267 1928920 3098823 2818783 2013006
34430 2013006 2067943 2765666 2868330 2175173 1725390 2087923 2643775 2755629 2610084 2494390
34420 2494390 2135166 1371593 790052 913921 1214866 801524 -103032 -298517 659484
34411 659484 1727112 1798108 1187916 1044987 1688279 2296385 2155579 1487676 886290 545654
34401 545654 375498 420205 717425 989162 911029 606974 527241 839967 1210640 1216026
$$ packed form
34468i62369j22341P20592R42181K78480k44368J15233O81291N43639p0530m16600
34458A465208m21005m17368l42183m042L24130K72685n2384l69770o31523p00977
34448h77229k18953O86421J153756O51087k23147n48838j84374M24898R07194
34439A770815Q92097L6678j145197j268670J33544J509653J169903k80040q05777
34430B013006N4937O97723J02664o93157m49783L62533N55852J11854j45545j15694
34420B494390l59224p63573n81541J23869L00945m13342r04556j95485R58001
34411F59484J067628P0996o10192j42929O43292O08106j40806o67903o01386l40636
34401E45654j70156M4707K97220K71737p8133l04055p9733L12726L70673N386
$$ plain form
34391 1216026 792791 255003 -5477 156189 520225 755180 841647 1095463 1654566 2151821
34381 2151821 2140364 1693659 1289260 1193428 1286708 1444797 1701363 1962782 1924170 1441041
34371 1441041 728770 56883 -479970 -737526 -433720 378836 1034254 924762 340624
34362 340624 132926 531452 873269 699616 501329 885781 1512630 1626996 1393805 1731732
34352 1731732 2707374 3118018 2211419 955999 731815 1356605 1496634 743854 52741
34343 52741 33244 65242 -397603 -738394 -209284 746135 1173308 1082194 1191519 1479485
34333 1479485 1131568 23550 -795280 -541131 132593 -13837 -1211920 -2489479 -2866725
34324 -2866725 -2292506 -1431725 -863984 -606035 -326705 66029 193394 -303562 -1157940
$$ packed form
34391A216026m23235n37788k60480J61666L64036K34955Q6467K53816N59103M97255
34381B151821j1457m46705m04399r5832R3280J58089K56566K61419l8612m83129
34371A441041p12271o71887n36853k57556L03806Q12556O55418j09492n84138
34362C40624k07698L98526L41817j73653j98287L84452O26849J14366k33191L37927
34352A731732R75642M10644r06599j255420k24184O24790J40029p52780o91113
34343E2741j9497L1998m62845l40791N29110R55419M27173r1114J09325K87966
34333A479485l47917j108018q18830K54149O73724j46430j198083j277559l77246
34324b866725N74219Q60781N67741K57949K79330L92734J27365m96956q54378
$$ plain form
34315 -1157940 -1631082 -1262840 -216630 1078261 2251852 2915431 2740510 1908026 1139343
34306 1139343 915029 888180 459129 -237380 -405980 324442 1344544 1800070 1563981
34297 1563981 1177649 1010971 868197 479955 64662 123465 731167 1286218 1116262 248962
34287 248962 -593985 -804244 -531263 -390630 -659530 -1047104 -1296581 -1641208 -2341017 -3012337
34277 -3012337 -2954025 -2173641 -1535875 -1628913 -1980313 -1850333 -1392394 -1358576 -1841934 -2083478
34267 -2083478 -1623205 -936454 -635882 -622917 -439132 -16806 383239 673888 923021 1039771
34257 1039771 915077 749724 838835 1080061 1049282 589032 64902 -24325 427845 1012154
34247 1012154 1190891 877938 554660 616669 780491 575460 277698 622187 1498241 1828728
$$ packed form
34315a157940m73142L68242J046210J294891J173591O63579j74921q32484p68683
34306A139343k24314k6849m29051o96509j68600P30422J020102M55526k36089
34297A563981l86332j66678j42774l88242m15293N8803O07702N55051j69956q67300
34287B48962q42947k10259K72981J40633k68900l87574k49477l44627o99809o71320
34277c012337N8312P80384O37766r3038l51400J29980M57939L3818m83358k41544
34267b083478M60273O86751L00572J2965J83785M22326M00045K90649K49133J16750
34257A039771j24694j65353Q9111K41226l0779m60250n24130q9227M52170N84309
34247A012154J78737l12953l23278O2009J63822k05031k97762L44489Q76054L30487
$$ plain form
34237 1828728 1155716 455513 701511 1443316 1737703 1766439 2308218 3055237 2873006 1692816
34227 1692816 790919 936176 1459035 1556449 1413268 1459174 1470449 1115184 656500 410523
34217 410523 91861 -614062 -1279961 -1182601 -222584 1057618 2046557 2321683 1803748 1031987
34207 1031987 781208 1034510 954048 306776 117300 1149544 2456517 2463771 1060029
34198 1060029 -436870 -1115777 -1173925 -882142 -20004 1367053 2539711 2828905 2313279
34189 2313279 1520253 922567 808101 1097777 1208432 664645 -88769 -117846 664697 1309874
34179 1309874 1181440 753046 713115 974468 1060085 896013 676324 401565 108584 187871
34169 187871 910299 1903890 2587358 2849740 2823916 2319321 1111822 -393066 -1441499
$$ packed form
34237A828728o73012p00203K45998P41805K94387K8736N41779P47019j82231j180190
34227A692816r01897J45257N22859R7414j43181M5906J1275l55265m58684k45977
34217D10523l18662p05923o65899R7360R60017J280202R88939K75126n17935p71761
34207A031987k50779K53302q0462o47272j89476J032244J306973P254j403742
34198A060029j496899o78907n8148K91783Q62138J387057J172658K89194n15626
34189B313279p93026n97686j14466K89676J10655n43787p53414k9077P82543O45177
34179A309874j28434m28394l9931K61353Q5617j64072k19689k74759k92981P9287
34169A87871P22428R93591O83468K62382k5824n04595j207499j504888j048433
$$ plain form
34160 -1441499 -1824035 -1908670 -1829538 -1292598 -299536 543495 712526 354414 -9222 12257
34150 12257 606918 1692192 2618645 2416867 829150 -1165034 -2309920 -2387026 -2149028
34141 -2149028 -2132776 -2105119 -1698127 -1024407 -419546 42857 486483 914035 1213271 1346242
34131 1346242 1343235 1215750 1004468 787436 547175 204973 -122063 -145251 170041 498740
34121 498740 699517 1119830 1980038 2757524 2732433 2015023 1451539 1508010 1812501 1884668
34111 1884668 1724045 1457685 980008 327600 -28562 274228 926117 1329007 1339453 1254810
34101 1254810 1223729 1040216 461997 -501170 -1515924 -2015286 -1626169 -696087 -43934
34092 -43934 74105 299988 1066249 1681684 1244836 124972 -366794 285087 1281017 1828290
$$ packed form
34160a441499l82536q4635P9132N36940R93062Q43031J69031l58112l63636K1479
34150A2257N94661J085274R26453k01778j587717j994184j144886p7106K37998
34141b149028J6252K7657M06992O73720O04861M62403M43626M27552K99236J32971
34131A346242l007j27485k11282k17032k40261l42202l27036k3188L15292L28699
34121D98740K00777M20313Q60208P77486k5091p17410n63484N6471L04491P2167
34111A884668j60623k66360m77677o52408l56162L02790O51889M02890J0446q4643
34101A254810l1081j83513n78219r63167j014754m99362L89117R30082O52153
34092d3934J18039K25883P66261O15435m36848j119864m91766O51881R95930N47273
$$ plain form
34082 1828290 2082265 2423386 2604948 2222230 1526593 1173251 1424139 2027210 2624914
34073 2624914 2916667 2711382 2206612 1935338 2057098 2034861 1477165 937526 1218482 2096839
34063 2096839 2513097 2034883 1367803 1219589 1387473 1378718 1318108 1612080 2063625 2021664
34053 2021664 1368268 780482 874396 1480662 1927168 1751521 998331 95245 -374611 -25174
34043 -25174 936814 1795861 2039399 1888773 1913364 2260794 2593074 2717840 2862572 3207671
34033 3207671 3524699 3526930 3303572 3097784 2850764 2343634 1721480 1472644 1778671 2175006
34023 2175006 2042506 1289732 410193 -28292 169646 786914 1431499 1816847 1932096
34014 1932096 2001595 2252533 2696867 3149455 3447098 3575152 3528441 3175311 2503854 2000655
$$ packed form
34082A828290K53975L41121J81562l82718o95637l53342K50888O03071N97704
34073B624914K91753k05285n04770k71274J21760k2237n57696n39639K80956Q78357
34063B096839M16258m78214o67080j48214J67884q755o0610K93972M51545m1961
34053B021664o53396n87786R3914O06266M46506j75647p53190r03086m69856L49437
34043b5174R61988Q59047K43538j50626K4591L47430L32280J24766J44732L45099
34033C207671L17028K231k23358k05788k47020n07130o22154k48836L06027L96335
34023B175006j32500p52774q79539m38485J97938O17268O44585L85348J15249
34014A932096O9499K50938M44334M52588K97643J28054m6711l53130o71457n03199
$$ plain form
34004 2000655 2380401 3630487 4648441 4379968 3196915 2482415 2793756 3236795 3004299
33995 3004299 2663974 3128083 3985098 3985997 2999540 2317139 2813482 3833720 4349203 4334363
33985 4334363 4372563 4637948 5074963 6025554 7668352 9074546 8916455 7298207 5961833
33976 5961833 6240475 7534104 8416165 8654984 9242450 10654246 12140851 13022223 13743360
33967 13743360 14930264 16064335 16164220 15584052 15953430 18065833 20915662 23413378 26021602
33958 26021602 29703400 34074088 37996144 41675635 46675165 53734156 61969978 70642393
33950 70642393 80441549 92438212 106952083 124263324 145434543 171640147 203692299
33943 203692299 242658224 288437255 334967409 368193536 373309214 346600365 299159475
$$ packed form
34004B000655L79746J250086J017954k68473j183053p14500L11341M43039k32496
33995C004299l40325M64109Q57015Q99r86457o82401M96343J020238N15483j4840
33985D334363L8200K65385M37015R50591J642798J406194j58091j618248j336374
33976E961833K78642J293629Q82061K38819N87466J411796J486605Q81372P21137
33967A3743360J186904J134071R9885n80168L69378K112403K849829K497716K608224
33958B6021602L681798M370688L922056L679491M999530P058991Q235822Q672415
33950G0642393R799156J1996663J4513871J7311241K1171219K6205604L2052152
33943B03692299L8965925M5779031M6530154L3226127N115678k6708849m7440890
$$ plain form
33936 299159475 247877218 203646069 168304457 139809730 116876053 98916498 84685803
33929 84685803 72801039 62764137 54567432 47858154 42135712 37317421 33518462 30532356
33921 30532356 27950491 25561512 23284799 20954998 18542163 16390515 14854949 13806950
33913 13806950 12828714 11788179 10861970 10053282 9111833 8024298 7213877 7024004 7213843
33904 7213843 7196060 6676462 5879779 5203129 4810631 4569882 4277599 3911171 3658491 3642023
33894 3642023 3617988 3132021 2131396 1288527 1425471 2561111 3764763 4106971 3594741
33885 3594741 2969677 2722144 2661108 2521067 2575702 3228111 4132532 4280887 3210433 1757474
33875 1757474 1205276 1843005 2776213 3086219 2698926 2045590 1398387 849553 556365
$$ packed form
33936B99159475n1282257m4231149l5341612k8494727k2933677j7959555j4230695
33929H4685803j1884764j0036902q196705o709278n722442m818291l798959k986106
33921C0532356k581865k388979k276713k329801k412835k151648j535566j047999
33913A3806950r78236j040535r26209q08688r41449j087535q10421j89873J89839
33904G213843j7783n19598p96683o76650l92498k40749k92283l66428k52680j6468
33894C642023k4035m85967j000625q42869J36944J135640J203652L42208n12230
33885C594741o25064k47533o1036j40041N4635O52409R04421J48355j070454j452959
33875A757474n52198O37729R33208L10006l87293o53336o47203n48834k93188
$$ plain form
33866 556365 583033 703234 734362 909702 1535382 2388326 2865239 2714391 2268872 1967488
33856 1967488 1983735 2287257 2651084 2575442 1694010 433115 -162697 460785 1732566
33847 1732566 2658844 2851622 2605364 2303510 2164101 2346082 2805127 3069729 2609681
33838 2609681 1548049 675994 579449 990940 1232722 1125175 1114808 1490381 1856420 1684918
33828 1684918 1175474 1090256 1684956 2301692 2318035 2091451 2476442 3625275 4810649
33819 4810649 5402545 5548543 5846503 6736015 8251200 10031205 11570947 12742518 13895392
33810 13895392 15043964 15306737 13925741 11649851 10087955 9610129 9004207 7535141
33802 7535141 6116673 5706439 5647720 4722367 3109200 2062580 2037384 2296296 2196022
$$ packed form
33866E56365K6668J20201L1128J75340O25680Q52944M76913j50848m45519l01384
33856A967488J6247L03522L63827p5642q81432j260895n95812O23482J271781
33847A732566R26278J92778k46258l01854j39409J81981M59045K64602m60048
33838B609681j061632q72055r6545M11491K41782j07547j0367L75573L66039j71502
33828A684918n09444q5218N94700O16736J6343k26584L84991J148833J185374
33819D810649N91896J45998K97960Q89512J515185J780005J539742J171571J152874
33810A3895392J148572K62773j380996k275890j561896m77826o05922j469066
33802G535141j418468m10234n8719r25353j613167j046620k5196K58912j00274
$$ plain form
33793 2196022 1797157 1255053 588283 92887 122982 421349 469865 470232 1072389 2105696
33783 2105696 2588153 2190123 1683451 1591135 1379192 543410 -355069 -459676 164934 760563
33773 760563 875157 533598 -176306 -1035922 -1487249 -1128690 -324112 159297 53044 -236412
33763 -236412 -243858 125023 718947 1359684 1882403 2129869 1974917 1396392 636102 166546
33753 166546 226513 461668 383592 105466 130302 449387 517276 248188 275969 864031
33743 864031 1288018 881199 103699 -138674 181434 351151 142421 89808 538667 1108115
33733 1108115 1272511 982907 531872 194667 200297 729460 1647843 2372004 2281814 1369118
33723 1369118 379242 132546 651275 1146271 1002389 501271 258791 267093 76354 -261665
$$ packed form
33793B196022l98865n42104o66770m95396L0095K98367M8516L67O02157J033307
33783B105696M82457l98030n06672r2316k11943q35782q98479j04607O24610N95629
33773G60563J14594l41559p09904q59616m51327L58559Q04578M83409j06253k89456
33763b36412p446L68881N93924O40737N22719K47466j54952n78525p60290m69556
33753A66546N9967K35155p8076k78126K4836L19085O7889k69088K7781N88062
33743H64031M23987m06819p77500k42373L20108J69717k08730n2613M48859N69448
33733A108115J64396k89604m51035l37205N630N29163R18383P24161r0190r12696
33723A369118r89876k46696N18729M94996j43882n01118k42480Q302j90739l38019
$$ plain form
33713 -261665 -203224 314718 751865 1012361 1713210 2972191 3797044 3361549 2204234
33704 2204234 1405150 1145613 901820 581442 545608 791293 987306 1137079 1399674 1435464
33694 1435464 780415 -215005 -651069 -286267 255759 458705 349538 -1187 -600456
33685 -600456 -1092785 -990861 -467832 -182035 -215667 24652 713743 1261514 1304651 1212617
33675 1212617 1280763 1237833 956977 835289 949753 637628 -400382 -1265643 -945569 248596
33665 248596 1145772 1275995 1150722 1193491 1223506 1016942 695584 438246 307483 429157
33655 429157 877138 1309568 1179392 441817 -340232 -748153 -994498 -1437163 -1926725 -1985921
33645 -1985921 -1518629 -1004494 -924405 -1214971 -1447785 -1421620 -1324792 -1281579 -1032856 -327183
$$ packed form
33713b61665N8441N17942M37147K60496P00849J258981Q24853m35495j157315
33704B204234p99084k59537k43793l20378l5834K45685J96013J49773K62595L5790
33694A435464o55049r95420m36064L64802N42026K02946j09167l50725n99269
33685f00456m92329J01924N23029K85797l3632K40319O89091N47771M3137r2034
33675A212617O8146m2930k80856j21688J14464l12125j038010q65261L20074J194165
33665B48596Q97176J30223j25273M2769L0015k06564l21358k57338j30763J21674
33655D29157M47981M32430j30176p37575p82049m07921k46345m42665m89562n9196
33645a985921M67292N14135Q0089k90566k32814K6165R6828M3213K48723P05673
$$ plain form
33635 -327183 522648 842436 424954 -120918 -20551 791788 1581714 1563576 697860 -242125
33625 -242125 -430859 166727 822568 931042 611864 294780 60024 -245297 -514567 -515660
33615 -515660 -387304 -468211 -661766 -511998 23617 395765 211151 -268660 -535520 -389918
33605 -389918 11345 319704 167119 -451177 -970733 -853430 -313187 90930 450362 1286727
33595 1286727 2305660 2379590 1163587 -187433 -510471 -69110 186874 76847 32280
33586 32280 13238 -420811 -1170310 -1611735 -1518779 -1257272 -1077403 -849398 -524914 -294188
33576 -294188 -228734 -233082 -360944 -731367 -1132203 -1163291 -826875 -578562 -712361 -1010320
33566 -1010320 -1078423 -816422 -532513 -695751 -1435999 -2183551 -2114125 -1192832 -420435 -674143
$$ packed form
33635c27183Q49831L19788m17482n45872J00367Q12339P89926j8138q65716r39985
33625b42125j88734N97586O55841J08474l19178l17084k34756l05321k69270j093
33615e15660J28356q0907j93555J49768N35615L72148j84614m79811k66860J45602
33605c89918M01263L08359j52585o18296n19556J17303N40243M04117L59432Q36365
33595A286727J018933P3930j216003j351020l23038M41361K55984j10027m4567
33586C2280j9042m34049p49499m41425R2956K61507J79869K28005L24484K30726
33576b94188O5454m348j27862l70423m00836l1088L36416K48313j33799k97959
33566a010320o8103K62001K83909j63238p40248p47552O9426R21293P72397k53708
$$ plain form
33556 -674143 -1630626 -2275454 -2164384 -1648042 -1100432 -546964 26783 540168 978186 1284872
33546 1284872 1204284 641679 40946 -43247 372108 845501 1143810 1276434 1120377 540661
33536 540661 -267706 -1021118 -1698608 -2177083 -1895561 -583151 963978 1619190 1256674
33527 1256674 597015 -4614 -668997 -1083002 -646484 336957 713583 63920 -701250
33518 -701250 -720549 -303516 -203590 -499210 -716014 -534588 20203 659047 886390 471041
33508 471041 -59328 -2149 450861 526533 224412 293642 742728 680740 76490 277110
33498 277110 1941498 3706975 4014413 3229368 2695123 2535973 1875587 738237 200987
33489 200987 697478 1415517 1519702 1041303 464073 202709 513142 1226623 1618658 1180131
$$ packed form
33556f74143r56483o44828J11070N16342N47610N53468N73747N13385M38018L06686
33546A284872q0588n62605o00733q4193M15355M73393K98309J32624j56057n79716
33536E40661q08367p53412o77490m78475K81522J312410J547129O55212l62516
33527A256674o59659o01629o64383m14005M36518R83441L76626o49663p65170
33518g01250j9299M17033R9926k95620k16804J81426N54791O38844K27343m15349
33508D71041n30369N7179M53010P5672l02121O9230M49086o1988o04250K00620
33498B77110J664388J765477L07438p85045n34245j59150o60386j137350n37250
33489B00987M96491P18039J04185m78399n77230k61364L10433P13481L92035m38527
$$ plain form
33479 1180131 367929 -71291 -264338 -883017 -1857367 -2337159 -1897097 -941625 49511
33470 49511 833560 1014504 294432 -768756 -1133418 -586308 86123 331115 376747 417763
33460 417763 235234 -33615 313950 1446702 2438563 2394535 1564136 798828 419313 184722
33450 184722 -24750 -82424 34304 189389 249700 87074 -337210 -727199 -630919 -69850
33440 -69850 353555 205469 -232949 -379834 -33657 524863 844870 618057 -37597 -562214
33430 -562214 -515284 -88398 313996 805304 1709050 2668215 2894442 2355739 1845998 1713211
33420 1713211 1448357 827023 465233 729129 996209 641411 -12173 -366977 -439080 -427107
33410 -427107 -155610 335312 423976 -50074 -157738 752696 1814488 1884182 1343692 1359024
$$ packed form
33479A180131q12202m39220j93047o18679r74350m79792M40062R55472R91136
33470D9511P84049J80944p20072j063188l64662N47110O72431K44992M5632M1016
33460D17763j82529k68849L47565J132752R91861m4028q30399p65308l79515k34591
33450A84722k09472n7674J16728J55085O0311j62626m24284l89989R6280N61069
33440f9850M23405j48086m38418j46885L46177N58520L20007k26813o55654n24617
33430e62214M6930M26886M02394M91308R03746R59165K26227n38703n09741j32787
33420A713211k64854o21334l61790K63896K67080l54798o53584l54804p2103J1973
33410d27107K71497M90922Q8664m74050j07664R10434J061792O9694n40490J5332
$$ plain form
33400 1359024 1870329 1811491 1078788 721295 1111130 1400756 1082039 718326 670510 353325
33390 353325 -579939 -1340242 -1048881 42833 1013252 1359008 1139072 636577 329791
33381 329791 617891 1184068 1242036 738856 540054 985874 1152237 252458 -1000716 -1325197
33371 -1325197 -625375 81710 137189 -219074 -554814 -698152 -568700 -190355 178554 367706
33361 367706 540648 706139 376468 -685546 -1740195 -1821065 -982157 -95949 360964
33352 360964 557119 548833 170518 -331996 -415891 -98238 56059 -99416 -115932 107129
33342 107129 15668 -658698 -1368805 -1529467 -1221789 -797811 -392169 -169109 -414246 -940181
33332 -940181 -998826 -297401 439447 484456 177476 314431 871262 1103172 707417 123919
$$ packed form
33400A359024N11305n8838p32703l57493L89835K89626l18717l63713m7816l17185
33390C53325r33264p60303K91361J091714R70419L45756k19936n02495l06786
33381C29791K88100N66177N7968n03180j98802M45820J66363q99779j253174l24481
33371a325197O99822P07085N5479l56263l35740j43338J29452L78345L68909J89152
33361C67706J72942J65491l29671j062014j054649q0870Q38908Q86208M56913
33352C60964J96155q286l78315n02514q3895L17653J54297j55475j6516K23061
33342A07129r1461o74366p10107j60662L07678M23978M05642K23060k45137n25935
33332i40181n8645P01425P36848M5009l06980J36955N56831K31910l95755n83498
$$ plain form
33322 123919 -311175 -833582 -1698303 -2613818 -2944814 -2290993 -849745 614691 1256148
33313 1256148 859667 32700 -482680 -557953 -571720 -785628 -1103423 -1279303 -1108643 -577727
33303 -577727 -17424 148260 -8603 37073 403998 542659 235818 185023 895980 1609435
33293 1609435 1327845 444113 163959 573544 644435 156057 99964 783826 1025480 29320
33283 29320 -1202646 -1376911 -816920 -677234 -1005619 -890589 -114737 586451 745716 587415
33273 587415 366730 263254 767802 2111725 3368606 3239686 1852676 721741 707077
33264 707077 1058586 812972 93719 -501287 -868479 -1076253 -829207 -10172 769063 839075
33254 839075 286460 -447935 -1285624 -2192436 -2631855 -2143232 -1207948 -761286 -931851 -950793
$$ packed form
33322A23919m35094n22407q64721r15515l30996O53821J441248J464436O41457
33313A256148l96481q26967n15380p5273j3767k13908l17795j75880J70660N30916
33303e77727N60303J65684j56863M5676L66925J38661l06841n0795P10957P13455
33293A609435k81590q83732k80154M09585P0891m88378n6093O83862K41654r96160
33283B9320j231966j74265N59991J39686l28385J15030P75852P01188J59265j58301
33273E87415k20685j03476N04548J343923J256881j28920j387010j130935j4664
33264G07077L51509k45614p19253n95006l67192k07774K47046Q19035P79235P0012
33254H39075n52615p34395q37689r06812m39419M88623R35284M46662j70565j8942
$$ plain form
33244 -950793 -321382 519495 820153 378112 -310694 -518331 55123 872904 985913 135074
33234 135074 -807480 -834100 36184 1003031 1585405 1916505 2155986 2258252 2273262 2287151
33224 2287151 2069168 1337862 392523 -81715 109268 524725 862527 1282389 1843797
33215 1843797 2234239 2281292 2196944 2072051 1649679 881337 206969 -51396 -125178 -289940
33205 -289940 -371660 -168028 42741 -106721 -465436 -614512 -503230 -391000 -333248 -173912
33195 -173912 48844 102072 -60598 -237536 -285657 -244196 -183656 -114155 15306 324501
33185 324501 829457 1161788 785389 -257418 -1134493 -1109843 -396476 216661 307029 -28191
33175 -28191 -651655 -1414894 -1850010 -1501632 -658835 -220750 -657088 -1489051 -1935667 -1728800
$$ packed form
33244i50793O29411Q40877L00658m42041o88806k07637N73454Q17781J13009q50839
33234A35074r42554k6620Q70284R66847N82374L31100K39481J02266J5010J3889
33224B287151k17983p31306r45339m74238J90983M15457L37802M19862N61408
33215A843797L90442M7053q4348j24893m22372p68342o74368k58365p3782j64762
33205b89940q1720K03632K10769j49462l58715j49076J11282J12230N7752J59336
33195a73912K22756N3228j62670j76938m8121M1461O0540O9501J29461L09195
33185C24501N04956L32331l76399j042807q77075K4650P13367O13137R0368l35220
33175b8191o23464p63239m35116L48378Q42797M38085m36338q31963m46616K06867
$$ plain form
33165 -1728800 -1173704 -742233 -754360 -1189156 -1665352 -1775047 -1465822 -955737 -424634 -64584
33155 -64584 -189166 -797406 -1218187 -846338 -140486 -79000 -580264 -473074 598267 1308141
33145 1308141 470396 -1133539 -1798084 -1183406 -362492 86011 642559 1415457 1539716
33136 1539716 581430 -551875 -895586 -786653 -1028831 -1360565 -882704 287544 970959
33127 970959 617644 7117 -60650 129888 -50552 -449307 -463022 -67821 204028 95148
33117 95148 -228088 -711612 -1400070 -1899391 -1598075 -644531 -47132 -410661 -1100540 -1173790
33107 -1173790 -740525 -737953 -1492247 -2190703 -1948387 -896776 100995 512385 528136 487537
33097 487537 322256 -202709 -879131 -1070141 -493691 270316 385385 -239013 -938009 -1251163
$$ packed form
33165a728800N55096M31471j2127m34796m76196j09695L09225N10085N31103L60050
33155f4584j24582o08240m20781L71849P05852O1486n01264J07190J071341P09874
33145A308141q37745j603935o64545O14678Q20914M48503N56548P72898J24259
33136A539716r58286j133305l43711J08933k42178l31734M77861J170248O83415
33127I70959l53315o10527o7767J90538j80440l98755j3715L95201K71849j08880
33117I5148l23236m83524o88458m99321L01316R53544N97399l63529o89879p3250
33107a173790M33265K572p54294o98456K42316J051611R97771M11390J5751m0599
33097D87537j65281n24965o76422j91010N76450P64007J15069o24398o98996l13154
$$ plain form
33087 -1251163 -1375906 -1507422 -1302620 -443165 679092 1391118 1596754 1648796 1584104 1161819
33077 1161819 580352 389241 544093 282083 -715862 -1651878 -1590104 -684454 96320 200678
33067 200678 -72457 -253043 -324146 -590489 -1193132 -1836434 -1939383 -1177932 23380 742995
33057 742995 490009 -294181 -833796 -886458 -768420 -749903 -783299 -722627 -486636 -63599
33047 -63599 367327 401147 -187925 -1024593 -1413231 -1081402 -426798 -10433 -5565 -167151
33037 -167151 -178886 -5458 24194 -429133 -1198418 -1655560 -1454394 -974072 -723793 -575328
33027 -575328 -55361 764911 1256889 1129896 773502 564543 375241 46661 -126186 190949
33017 190949 755700 982631 687128 263202 148201 342938 469454 187659 -427131 -920132
$$ packed form
33087a251163j24743j31516K04802Q59455J122257P12026K05636N2042o4692m22285
33077A161819n81467j91111J54852k62010r97945r36016O1774R05650P80774J04358
33067B00678k73135j80586p1103k66343o02643o43302j02949P61451J201312P19615
33057G42995k52986p84190n39615n2662J18038J8517l3396O0672K35991M23037
33047f3599M30926L3820n89072q36668l88638L31829O54604M16365M868j61586
33037a67151j1735J73428K9652m53327p69285m57142K01166M80322K50279J48465
33027e75328N19967Q20272M91978j26993l56394k08959j89302l28580j72847L17135
33017A90949N64751K26931k95503m23926j15001J94737J26516k81795o14790m93001
$$ plain form
33007 -920132 -994769 -941213 -1200640 -1518128 -1095553 144363 1071002 749132 -118408 -42255
32997 -42255 1107684 1856863 1285866 402740 645926 1787872 2359192 1784054 936800
32988 936800 559653 312303 -160078 -271454 527069 1510385 1487318 548881 -55326 232753
32978 232753 612128 370758 1774 275268 952204 1221446 975810 818323 964212 915384
32968 915384 308975 -511732 -974631 -927111 -614628 -292122 -50990 106388 158960 38203
32958 38203 -260254 -552539 -636703 -636369 -904329 -1459520 -1848773 -1765813 -1426048 -1054638 -474081
32947 -474081 352040 843718 536343 -44702 2102 648259 1008674 631613 -50887 -528185
32937 -528185 -675322 -390685 387839 1173526 1265946 783703 537660 690371 515936 -154287
$$ packed form
33007i20132p4637N3556k59427l17488M22575J239916R26639l21870q67540P6153
32997d2255J149939P49179n70997q83126K43186J141946N71320n75138q47254
32988I36800l77147k47350m72381j11376P98523R83316k3067r38437o04207K88079
32978B32753L79375k41370l68984K73494O76936K69242k45636j57487J45889m8828
32968I15384o06409q20707m62899M7520L12483L22506K41132J57378N2572j20757
32958C8203k98457k92285q4164L34k67960n55191l89253Q2960L39765L71410N80557
32947d74081Q26121M91678l07375n81045M6804O46157L60415l77061o82500m77298
32937e28185j47137K84637P78524P85687R2420m82243k46043J52711j74435o70223
$$ plain form
32927 -154287 -328445 624159 1783195 1905914 1160653 686531 911278 1252911 1183027 704313
32917 704313 -37211 -834773 -1278331 -1238018 -1302331 -2024081 -2934710 -3083913 -2398733 -1670246
32907 -1670246 -1283261 -887544 -397771 -341844 -882611 -1343713 -1238934 -1135291 -1835611 -3051751
32897 -3051751 -3556374 -2641227 -963984 212136 377115 132680 245619 685316 875722
32888 875722 639378 335909 119421 -228769 -572653 -355862 323009 433410 -489134 -1354508
32878 -1354508 -968476 165561 611109 106967 -327405 -143958 173370 272325 407013
32869 407013 631897 686768 831186 1605477 2555773 2459625 1181921 55013 -63613 142340
32859 142340 -91622 -385064 -264032 -219229 -688903 -1023624 -587879 -7784 -137179 -540599
$$ packed form
32927a54287j74158R52604J159036J22719p45261m74122K24747L41633o9884m78714
32917G04313p41524p97562m43558M0313o4313p21750r10629j49203O85180P28487
32907a670246L86985L95717M89773N5927n40767m61102J04779J03643p00320j216140
32897c051751n04623R15147J677243J176120J64979k44435J12939M39697J90406
32888H75722k36344l03469k16488l48190l43884K16791O78871J10401r22544q65374
32878a354508L86032J134037M45548n04142m34372J83447L17328R8955J34688
32869D07013K24884N4871J44418P74291R50296r6148j277704j126908j18626K05953
32859A42340k33962k93442J21032M4803m69674l34721M35745N80095j29395m03420
$$ plain form
32849 -540599 -255644 550815 973271 929655 1030549 1250150 1059256 665941 779146 1191798
32839 1191798 925490 -97793 -787868 -551104 -67046 -40034 -258921 -395766 -752565
32830 -752565 -1530435 -2104127 -1790565 -907483 -412784 -718843 -1347158 -1615216 -1303247 -707056
32820 -707056 -274864 -226516 -492376 -957027 -1511839 -1785058 -1284324 -185113 482498 29170
32810 29170 -886254 -1156836 -785152 -627432 -801803 -485532 568338 1400923 1158530 192220
32800 192220 -622230 -964244 -979428 -702937 -119437 550333 1010478 1107552 777275 145233
32790 145233 -319665 -297198 -248818 -846213 -1731245 -1753216 -676334 325256 324877 -146523
32780 -146523 -162260 215564 419632 508720 864954 1244008 1057711 320913 -490252 -1295734
$$ packed form
32849e40599K84955Q06459M22456m3616J00894K19601j90894l93315J13205M12652
32839A191798k66308j023283o90075K36764M84058K7012k18887j36845l56799
32830g52565p77870n73692L13562Q83082M94699l06059o28315k68058L11969N96191
32820g07056M32192M8348k65860m64651n54812k73219N00734J099211O67611m53328
32810B9170r15424k70582L71684J57720j74371L16271J053870Q32585k42393r66310
32800A92220q14450l42014j5184K76491N83500O69770M60145R7074l30277o32042
32790A45233m64898K2467M8380n97395q85032k1971J076882J001590l79m71400
32780a46523j5737L77824K04068Q9088L56234L79054j86297p36798q11165q05482
$$ plain form
32770 -1295734 -2360656 -3520235 -4137840 -3811510 -2673149 -1155193 128429 572584 164571
32761 164571 -380388 -514396 -523222 -811873 -1032236 -656158 -21185 56987 -490229 -961598
32751 -961598 -958790 -713900 -462551 -271889 -412430 -1085850 -1776427 -1668627 -787633 9230
32741 9230 245433 276234 420752 429406 61849 -471355 -902021 -1179137 -1190635 -805929 -332652
32730 -332652 -276748 -479428 -196653 724349 1471606 1391639 781091 177435 -416363 -1080137
32720 -1080137 -1408818 -1063075 -435017 -126742 -98186 86357 453837 645433 539832 315436
32710 315436 29450 -371601 -700754 -635459 -182225 271083 366844 52803 -468330 -885120
32700 -885120 -958383 -681635 -210465 288656 504177 -74939 -1496690 -2703711 -2377768
$$ packed form
32770a295734j064922j159579o17605L26330J138361J517956J283622M44155m08013
32761A64571n44959j34008q826k88651k20363L76078O34973P8172n47216m71369
32751i61598K808K44890K51349J90662j40541o73420o90577J07800Q80994P96863
32741I230K36203L0801J44518Q654l67557n33204m30666k77116j1498L84706M73277
32730c32652N5904k02680K82775R21002P47257p9967o10548o03656n93798o63774
32720a080137l28681L45743O28058L08275K8556J84543L67480J91596j05601k24396
32710C15436k85986m01051l29153O5295M53234M53308R5761l14041n21133m16790
32700h85120p3263K76748M71170M99121K15521n79116j421751j207021L25943
$$ plain form
32691 -2377768 -658499 804033 915255 398477 399792 754191 627357 175599 280265
32682 280265 910769 1041933 274279 -588880 -842262 -791752 -979150 -1285198 -1284578 -941510
32672 -941510 -530487 -244155 -140316 -132301 76504 625505 1040432 697919 -229201 -970088
32662 -970088 -1351148 -1924970 -2685206 -2675791 -1455788 -51428 343701 -89882 -402365 -382124
32652 -382124 -463060 -612149 -437500 -164543 -378413 -859033 -781870 -151463 86896 -396720
32642 -396720 -782140 -576735 -526193 -1289786 -2111635 -1826289 -645106 113391 -137027 -626370
32632 -626370 -458859 318322 1043581 1257152 980772 572458 451360 696101 879846 557376
32622 557376 -134654 -649285 -699646 -428330 -60276 178411 -61181 -887491 -1710669 -1746522
$$ packed form
32691b377768J719269J462532J11222n16778J315L54399j26834m51758J04666
32682B80265O30504J31164p67654q63159k53382N0510j87398l06048O20L43068
32672i41510M11023K86332J03839Q015K08805N49001M14927l42513r27120p40887
32662i70088l81060n73822p60236R415J220003J404360L95129m33583l12483K0241
32652c82124q0936j49089J74649K72957k13870m80620P7163O30407K38359m83616
32642c96720l85420K05405N0542p63593q21849K85346J181183P58497k50418m89343
32632f26370J67511P77181P25259K13571k76380m08314j21098K44741J83745l22470
32622E57376o92030n14631n0361K71316L68054K38687k39592q26310q23178l5853
$$ plain form
32612 -1746522 -1047738 -449356 -408267 -580890 -728423 -1198904 -2004690 -2179020 -887485
32603 -887485 1202626 2494518 2290534 1373387 818506 890753 1204079 1375845 1266587
32594 1266587 946346 669619 692849 995304 1301409 1364550 1097156 560786 60671 67818
32584 67818 700969 1430328 1686409 1616814 1770886 2181251 2386935 2349680 2604996 3287470
32574 3287470 3710067 3321327 2501308 1898159 1469144 831183 223133 316408 1083342 1597960
32564 1597960 1232288 504984 307185 622546 600913 -104743 -672119 -159494 1144213
32555 1144213 2037282 2007828 1781432 2005020 2168072 1532020 545651 295671 760649 779171
32545 779171 -76351 -749088 -347346 453365 475967 -201665 -494594 104044 1086099 1825446
$$ packed form
32612a746522O98784N98382M1089j72623j47533m70481q05786j74330J291535
32603h87485K090111J291892k03984r17147n54881P2247L13326J71766j09258
32594A266587l20241k76727K3230L02455L06105O3141k67394n36370n00115P147
32584F7818O33151P29359K56081o9595J54072M10365K05684l7255K55316O82474
32574C287470M22597l88740q20019o03149m29015o37961o08050R3275P66934N14618
32564A597960l65672p27304j97799L15361k1633p05656n67376N12625J303707
32555A144213Q93069k9454k26396K23588J63052o36052r86369k49980M64978J8522
32545G79171q55522o72737M01742Q00711K2602o77632k92929N98638R82055P39347
$$ plain form
32535 1825446 2054740 1593884 480425 -589316 -735987 21229 784741 995052 979200
32526 979200 1121390 1191414 869722 376066 104459 15513 -151216 -330992 -247079 79673
32516 79673 324554 303283 122547 -74793 -258015 -413094 -515707 -608564 -718559 -672742
32506 -672742 -193844 704451 1540705 1756140 1266960 472808 -287147 -1020762 -1657689 -1664038
32496 -1664038 -598007 982236 1758386 1079808 -257045 -979071 -727608 -97833 360246
32487 360246 608992 705875 478682 -224069 -1201757 -1918798 -1864564 -1102760 -475024 -801455
32477 -801455 -1714245 -1921026 -1008921 -200367 -576055 -1331162 -967316 324470 959340
32468 959340 475113 111144 593994 989501 500458 -56295 305408 934342 524156 -768953
$$ packed form
32535A825446K29294m60856j113459j069741j46671P57216P63512K10311j5852
32526I79200J42190P0024l21692m93656k71607q8946j66729j79776Q3913L26752
32516G9673K44881k1271j80736j97340j83222j55079j02613r2857j09995M5817
32506f72742M78898Q98295Q36254K15435m89180p94152p59955p33615o36927o349
32496a664038J066031J580243P76150o78578j336853p22026K51463O29775M58079
32487C60246K48746R6883k27193p02751r77688p17041N4234P61804O27736l26431
32477h01455r12790k06781R12105Q08554l75688p55107L63846J291786O34870
32468I59340m84227l63969M82850L95507m89043n56753L61703O28934m10186j293109
$$ plain form
32458 -768953 -1500653 -902549 432368 1596211 2092692 1695570 573751 -462096 -659317
32449 -659317 -236718 90812 274251 752144 1318604 1251919 632608 473809 1267506 2316991
32439 2316991 2846059 2925229 2897998 2671679 2073079 1280057 446973 -533624 -1512022 -1943022
32429 -1943022 -1689718 -1332066 -1210907 -860757 4958 665217 392726 -274832 -259703 393734
32419 393734 623057 -14530 -850381 -1300137 -1502237 -1500646 -844447 390779 1033815 163736
32409 163736 -1421243 -1993567 -1034638 234343 545876 44873 -291434 -61137 356673
32400 356673 664437 922983 908050 -12959 -1831940 -3217953 -2679955 -393614 1807544
32391 1807544 2439471 1775629 997801 645180 532080 664769 1263051 1953328 1921152 1160481
$$ packed form
32458g68953p31700N98104J334917J163843M96481l97122j121819j035847j97221
32449f59317M22599L27530J83439M77893N66460o6685o19311j58799P93697J049485
32439B316991N29068P9170k7231k26319n98600p93022q33084r80597r78398m31000
32429a943022K53304L57652J21159L50150Q65715O60259k72491o67558J5129O53437
32419C93734K29323o37587q35851m49756k02100J591O56199J235226O43036q70079
32409A63736j584979n72324R58929J268981L11533n01003l36307K30297M17810
32400C56673L07764K58546j4933r21009j818981j386013N37998K286341K201158
32391A807544O31927o63842p77828l52621j13100J32689N98282O90277l2176p60671
$$ plain form
32381 1160481 755055 1396117 2269801 2140652 1122512 504046 920218 1575320 1483852
32372 1483852 723574 33885 -229812 -157666 266882 1042373 1630025 1331550 321464
32363 321464 -345730 -61429 518255 380043 -521174 -1337731 -1470703 -1085140 -567942 -9364
32353 -9364 657479 1353305 1817688 1699576 762231 -708060 -1834205 -1960882 -1499942 -1415787
32343 -1415787 -1828453 -1810991 -812080 458269 1063399 1115726 1313442 1690950 1706755 1336078
32333 1336078 1153153 1320141 1343738 991815 684106 721220 820793 735425 692424 849383
32323 849383 896690 599439 186887 -183580 -736176 -1385238 -1424433 -573195 304645 359297
32313 359297 73172 422492 1167415 1189245 354874 -242604 -7843 425936 474840 423081
$$ packed form
32381A160481m05426O41062Q73684j29149j018140o18466M16172O55102r1468
32372A483852p60278o89689k63697P2146M24548P75491N87652k98475j010086
32363C21464o67194K84301N79684j38212r01217q16557j32972L85563N17198N58578
32353i364O66843O95826M64383j18112r37345j470291j126145j26677M60940Q4155
32343a415787m12666J7462R98911J270349O05130N2327J97716L77508J5805l70677
32333A336078j82925J66988K3597l51923l07709L7114R9573q5368m3001J56959
32323H49383M7307k97251m12552l70467n52596o49062l9195Q51238Q77840N4652
32313C59297k86125L49320P44923K1830q34371n97478K34761M33779M8904n1759
$$ plain form
32303 423081 511908 355982 -92672 -44329 884940 1848609 2025647 1824759 1908646 1909263 1267486
32292 1267486 559610 599218 796450 -42450 -1607687 -2404284 -2085859 -1789108 -1996287
32283 -1996287 -1831767 -979507 -557924 -1198299 -1776475 -1197800 -164793 132269 14204
32274 14204 535379 1498446 1792154 1221417 503341 -229887 -1379589 -2446040 -2229549
32265 -2229549 -698082 732444 1149587 1111877 1231512 1095664 351779 -238432 177944
32256 177944 1207009 1854589 1975026 2129882 2380343 2214905 1584716 1133176 1278360
32247 1278360 1726627 2045812 2167318 2143366 1923573 1656810 1783171 2410723 2865809 2366139
32237 2366139 1103311 165419 230639 794049 1024947 943810 1102234 1349182 857199 -437047
$$ packed form
32303D23081Q8827j55926m48654M8343R29269R63669J77038k00888Q3887O17o41777
32292A267486p07876L9608J97232q38900j565237p96597L18425K96751k07179
32283a996287J64520Q52260M21583o40375n78176N78675J033007K97062j18065
32274A4204N21175R63067K93708n70737p18076p33228j149702j066451K16491
32265b229549J531467J430526M17143l7710J19635j35848p43885n90211M16376
32256A77944J029065O47580J20437J54856K50461j65438o30189m51540J45184
32247A278360M48267L19185J21506k3952k19793k66763J26361O27552M55086m99670
32237B366139j262828r37892O5220N63410K30898q1137J58424K46948m91983j294246
$$ plain form
32227 -437047 -1353441 -994691 -29621 269693 -301899 -998118 -1422494 -1740564 -1901579 -1690451
32217 -1690451 -1420586 -1562281 -1771174 -1345718 -582344 -464861 -959334 -988188 -343709 -112450
32207 -112450 -650603 -710863 484517 1751432 1755372 1063417 936205 1134413 637206 -199527
32197 -199527 -79422 961219 1515358 1007885 277576 -143131 -687813 -1383670 -1394806 -489553
32187 -489553 407886 749247 1157405 1978088 2294269 1349860 -43506 -567281 -140330
32178 -140330 334179 331397 -71946 -723919 -1226832 -820692 533780 1418067 449597 -1697895
32168 -1697895 -2876508 -2054232 -319687 780891 904639 614097 330286 163610 236116
32159 236116 572302 891162 906625 701015 529012 385805 44437 -518458 -978158 -1034870
$$ packed form
32227d37047r16394L58750R65070K99314n71592o96219m24376l18070j61015K11128
32217a690451K69865j41695k08893M25456P63374J17483m94473k8854O44479K31259
32207a12450n38153o0260J195380J266915L940o91955j27212J98208m97207q36733
32197a99527J20105J040641N54139n07473p30309m20707n44682o95857j1136R05253
32187d89553Q97439L41361M08158Q20683L16181r44409j393366n23775M26951
32178a40330M74509k782m03343o51973n02913M06140J354472Q84287r68470k147492
32168a697895j178613Q22276J734545J100578J23748k90542k83811j66676P2506
32159B36116L36186L18860J5463k05610j72003j43207l41368n62895m59700n6712
$$ plain form
32149 -1034870 -805619 -680111 -796631 -893666 -819821 -893778 -1368326 -1760116 -1350216 -364354
32139 -364354 81142 -521521 -1333084 -1385717 -896428 -731914 -1088853 -1464958 -1567877 -1440641
32129 -1440641 -946403 -4842 779657 629215 -237827 -814690 -789995 -916726 -1644849 -2332732
32119 -2332732 -2352293 -2172371 -2590422 -3432430 -3850518 -3631315 -3377280 -3403631 -3199264 -2247634
32109 -2247634 -907008 -90965 -215214 -732253 -751003 6097 985180 1529268 1609809 1626526
32099 1626526 1651955 1302757 438667 -421813 -663019 -333975 -84261 -422841 -1190372 -1696447
32089 -1696447 -1341952 -269618 584836 357615 -745588 -1626143 -1598519 -1144530 -1103999
32080 -1103999 -1498014 -1621638 -1106805 -372106 6604 -37141 -153596 -72981 142367 221367
$$ packed form
32149a034870K29251J25508j16520r7035P3845p3957m74548l91790M09900R85862
32139c64354M45496o02663q11563n2633M89289J64514l56939l76105j02919J27236
32129a440641M94238R41561P84499j50442q67042n76863K4695j26731p28123o87883
32119b332732j9561J79922m18051q42008m18088K19203K54035k6351K04367R51630
32109b247634J340626Q16043j24249n17039j8750P57100R79083N44088Q0541J6717
32099A626526K5429l49198q64090q60480k41206L29044K49714l38580p67531n06075
32089a696447L54495J072334Q54454k27221j103203q80555K7624M53989M0531
32080a103999l94015j23624N14833P34699L78710m3745j16455Q0615K15348P9000
$$ plain form
32070 221367 -24475 -487864 -847735 -896096 -721857 -554290 -562681 -836996 -1334145 -1745781
32060 -1745781 -1706095 -1318963 -1173216 -1552163 -1928034 -1626046 -735245 101479 584968 885183
32050 885183 1019533 802940 459328 555153 1078139 1247857 645205 -42272 62675 797777
32040 797777 1261509 1060658 610136 323526 169598 70586 119482 199460 -106150 -907605
32030 -907605 -1644259 -1647649 -888026 69119 686856 830747 673636 463333 334142 212694
32020 212694 -24296 -242947 -94732 482103 1002021 926310 308103 -316085 -615606 -763512
32010 -763512 -1029298 -1343707 -1394504 -1019670 -413335 5562 -52311 -423927 -585972 -237194
32000 -237194 270278 323083 -145046 -547183 -435744 -85564 -75342 -523725 -1001388 -1048586
$$ packed form
32070B21367k45842m63389l59871m8361J74239J67567q391k74315m97149m11636
32060a745781L9686L87132J45747l78947l75871L01988Q90801Q36724M83489L00215
32050H85183J34350k16593l43612R5825N22986J69718o02652o87477J04947P35102
32040G97777M63732k00851m50522k86610j53928r9012M8896P9978l05610q01455
32030i07605p36654l390P59623R57145O17737J43891j57111k10303j29191j21448
32020B12694k36990k18651J48215N76835N19918p5711o18207o24188k99521j47906
32010g63512k65786l14409n0797L74834O06335M18897n7873l71616j62045L48778
32000b37194N07472N2805m68129m02137J11439L50180J0222m48383m77663m7198
$$ plain form
31990 -1048586 -530417 376361 1232874 1441572 679086 -641835 -1581822 -1543166 -864940
31981 -864940 -438348 -740149 -1318137 -1300948 -445303 448339 390761 -547658 -1215382 -797298
31971 -797298 135419 412186 -187422 -784500 -735649 -422760 -491252 -897611 -1139877 -1044205
31961 -1044205 -843145 -671529 -404615 75786 717486 1273189 1269528 340747 -1044078 -1562430
31951 -1562430 -385947 1591855 2552655 1811010 426886 -337291 -411534 -413850 -483115 -310282
31941 -310282 70469 270526 201104 114512 40941 -225313 -562112 -543119 -140089 192535
31931 192535 340272 800482 1729899 2318671 1794167 707449 421543 1343126 2386871
31922 2386871 2379497 1390012 358624 -88819 -32079 155386 93760 -519417 -1580087 -2378599
$$ packed form
31990a048586N18169R06778Q56513K08698p62486j320921r39987L8656O78226
31981h64940M26592l01801n77988J7189Q55645Q93642n7578r38419o67724M18084
31971g97298R32717K76767n99608n97078M8851L12889o8492m06359k42266R5672
31961a044205K01060J71616K66914M80401O41700N55703l661r28781j384825n18352
31951a562430J176483J977802R60800p41645j384124p64177p4243k316o9265J72833
31941c10282L80751K00057o9422q6592p3571k66254l36799J8993M03030L32624
31931A92535J47737M60210R29417N88772n24504j086718k85906R21583J043745
31922B386871p374r89485j031388m47443N6740J87465o1626o13177j060670p98512
$$ plain form
31912 -2378599 -2217032 -1291356 -539229 -502186 -762127 -698205 -344429 -91601 115227 665849
31902 665849 1428018 1654195 1022316 279795 343415 985363 1021847 -111419 -1518714 -1903791
31892 -1903791 -1093559 -53823 387784 276210 35074 -121095 -58956 423790 1187080
31883 1187080 1574382 1150771 362336 -37728 12674 42122 -6618 227785 570640 238178
31873 238178 -949060 -2044602 -2176137 -1641976 -1228223 -1026259 -695149 -427991 -686142
31864 -686142 -1158906 -988482 -105323 569506 471072 98814 52991 169177 87369 -49610
31854 -49610 -86911 -425192 -1344017 -2206846 -2159353 -1356258 -704633 -576177 -607589 -679950
31844 -679950 -1136677 -1859978 -2049151 -1347913 -480283 -251912 -480384 -469339 -89292 219942
$$ packed form
31912b378599J61567R25676P52127L7043k59941O3922L53776K52828K06828N50622
31902F65849P62169K26177o31879p42521O3620O41948L6484j133266j407295l85077
31892a903791Q10232J039736M41607j11574k41136j56169O2139M82746P63290
31883A187080L87302m23611p88435m00064N0402K9448m8740K34403L42855l32462
31873B38178j187238j095542j31535N34161M13753K01964L31110K67158k58151
31864f86142m72764J70424Q83159O74829r8434l72258m5823J16186q1808j36979
31854d9610l7301l38281r18825q62829M7493Q03095O51625J28456l1412p2361
31844f79950m56727p23301j89173P01238Q67630K28371k28472J1045L80047L09234
$$ plain form
31834 219942 205475 -39249 -449110 -934017 -1096124 -586175 310535 977683 1305644 1647892
31824 1647892 1943379 1570565 305323 -1168868 -2066969 -2367935 -2503126 -2595030 -2483082
31815 -2483082 -2219835 -2005558 -1736413 -1099073 -135898 647227 793634 284974 -528476
31806 -528476 -1113294 -966690 -48644 973590 1316950 1028639 943346 1503878 2050535 1691272
31796 1691272 605011 -79141 279402 1014812 1027520 148242 -752381 -900069 -432689
31787 -432689 40601 326209 735255 1422520 2045352 2176924 1768479 1047851 195311 -674012
31777 -674012 -1377167 -1744534 -1752935 -1437756 -825285 -120515 254763 102061 -233244 -313881
31767 -313881 -251463 -487127 -991683 -1166945 -645730 230035 902346 1207248 1284392 1204794
$$ packed form
31834B19942j4467k44724m09861m84907j62107N09949Q96710O67148L27961L42248
31824A647892K95487l72814j265242j474191q98101l00966j35191r1904J11948
31815b483082K63247K14277K69145O37340R63175P83125J46407n08660q13450
31806e28476n84818J46604R18046J022234L43360k88311q5293N60532N46657l59263
31796A691272j086261o84152L58543P35410J2708q79278r00623j47688M67380
31787d32689M73290K85608M09046O87265O22832J31572m08445p20628q52540q69323
31777f74012p03155l67367q401L15179O12471P04770L75278j52702l35305q0637
31767c13881O2418k35664n04556j75262N21215Q75765O72311L04902P7144p9598
$$ plain form
31757 1204794 974072 704621 530084 456617 440826 476524 508343 440917 319163 292335
31747 292335 337705 280364 142445 139041 249746 211805 74549 252070 770810 1031502
31737 1031502 740831 515971 945061 1523436 1337772 541023 238080 900378 1739781
31728 1739781 1865654 1359723 881627 757237 839045 915090 929475 988593 1281865 1779639
31718 1779639 2016625 1539418 586836 -111305 -265616 -262181 -373726 -332675 41620 349653
31708 349653 167412 -301295 -551827 -472545 -333323 -300289 -282599 -97153 410010 1176319
31698 1176319 1736711 1601363 992607 732797 1125190 1478501 1158225 569606 494831 877599
31688 877599 985419 541121 -16591 -291012 -292581 -90134 290386 606558 608654 562520
$$ packed form
31757A204794k30722k69451j74537p3467j5791L5698L1819o7426j21754k6828
31747B92335M5370n7341j37919l404J10705l7941j37256J77521N18740K60692
31737A031502k90671k24860M29090N78375j85664p96749l02943O62298Q39403
31728A739781J25873n05931m78096j24390Q1808P6045J4385N9118K93272M97774
31718A779639K36986m77207r52582o98141j54311L435j11545M1051L74295L08033
31708C49653j82241m68707k50532P9282J39222L3034J7690J85446N07163P66309
31698A176319N60392j35348o08756k59810L92393L53311l20276n88619p4775L82768
31688H77599J07820m44298n57712k74421j569K02447L80520L16172K096m6134
$$ plain form
31678 562520 1032216 2032549 2847751 2811656 1933893 764122 18132 251076 1362377
31669 1362377 2387527 2310374 1196064 73988 -337682 -257360 -136320 3808 255756
31660 255756 428279 373939 329126 561358 965417 1285302 1442097 1404367 1073758 581458
31650 581458 378909 721225 1319002 1771342 2060996 2324632 2414551 2062361 1329865 601048
31640 601048 212627 243968 500169 591334 286984 -94908 2947 525869 700167 55466
31630 55466 -873659 -1248103 -964780 -585416 -542364 -837307 -1236543 -1337185 -742457 360740
31620 360740 1101561 916523 333496 173370 285097 -144559 -1169886 -1848525 -1534121
31611 -1534121 -639336 132957 656436 1128130 1462468 1364257 756462 -122962 -882455 -1169525
$$ packed form
31678E62520M69696J000333Q15202l6095q77763j169771p45990K32944J111301
31669A362377J025150p7153j114310j122076m11670Q0322J21040J40128K51948
31660B55756J72523n4340m4813K32232M04059L19885J56795l7730l30609m92300
31650E81458k02549L42316N97777M52340K89654K63636Q9919l52190p32496p28817
31640F01048l88421L1341K56201R1165l04350l81892R7855N22922J74298o44701
31630E5466r29125l74444K83323L79364M3052k94943l99236j00642N94728J103197
31620C60740P40821j85038n83027j60126J11727m29656j025327o78639L14404
31611a534121Q94785P72293N23479M71694L34338r8211o07795q79424p59493k87070
$$ plain form
31601 -1169525 -953901 -622628 -500442 -376179 56247 425091 27855 -1003421 -1639443
31592 -1639443 -1308255 -626717 -452132 -874596 -1546692 -2291045 -2801527 -2433266 -1110768
31583 -1110768 30143 -184309 -1394156 -2161696 -1851062 -1180149 -927902 -1012846 -1047246
31574 -1047246 -962718 -726194 -150089 558279 665948 -113053 -979113 -991619 -331536 15871
31564 15871 -357782 -902906 -1084515 -1034383 -1029070 -941493 -648450 -558190 -1147431 -2121976 -2612847
31553 -2612847 -2271289 -1663750 -1378093 -1217738 -696206 10087 197139 -347235 -1034255
31544 -1034255 -1301610 -1237180 -1140732 -950505 -525452 -148193 -201461 -475885 -331631 411718
31534 411718 1190347 1420958 1132065 686114 219280 -298649 -618201 -266220 789516
$$ packed form
31601a169525K15624L31273J22186J24263M32426L68844l97236j031276o36022
31592a639443L31188O81538J74585m22464o72096p44353n10482L68261J322498
31583a110768J140911k14452j209847p67540L10634O70913K52247q4944l4400
31574a047246Q4528K36524N76105P08368J07669p79001q66060j2506O60083L47407
31564A5871l73653n45124j81609N0132N313Q7577K93043R0260n89241r74545m90871
31553b612847L41558O07539K85657J60355N21532P06293J87052n44374o87020
31544a034255k67355O4430R6448J90227M25053L77259n3268k74424J44254P43349
31534D11718P78629K30611k88893m45951m66834n17929l19552L51981J055736
$$ plain form
31525 789516 1785691 1821805 919929 101518 136765 477754 -43389 -1511154 -2623474 -2373561
31515 -2373561 -1340273 -689646 -453621 257293 1546647 2327992 1874712 879351 481472
31506 481472 890749 1519786 1966605 2232554 2288554 2049547 1636303 1183373 560112 -242563
31496 -242563 -670816 -194019 720743 909109 -31200 -1140614 -1253598 -329637 714325
31487 714325 1172267 1128960 1028076 1075728 1118685 872827 214444 -614712 -1093558 -884304
31477 -884304 -260004 75421 -305139 -1096273 -1583785 -1350754 -589846 165045 446842 96481
31467 96481 -600106 -983856 -581658 232461 476160 -260160 -1219882 -1484653 -1209170 -1195021
31457 -1195021 -1478023 -1253115 -274310 646484 911513 1001073 1472871 1924689 1774378 1401075
$$ packed form
31525G89516R96175L6114r01876q18411L5247L40989n21143j467765j112320K49913
31515b373561J033288O50627K36025P10914J289354P81345m53280r95361l97879
31506D81472M09277O29037M46819K65949N6000k39007m13244m52930o23261q02675
31496b42563m28253M76797R14762J88366r40309j109414j12984R23961J043962
31487G14325M57942m3307j00884M7652M2957k45858o58383q29156m78846K09254
31477h84304O24300L35425l80560p91134m87512K33031P60908P54891K81797l50361
31467I6481o96587l83750M02198Q14119K43699p36320r59722k64771K75483J4149
31457a195021k83002K24908R78805R20794K65029Q9560M71798M51818j50311l73303
$$ plain form
31447 1401075 1518031 1892221 1786117 1360431 1423988 1878254 1701661 681904 -78555
31438 -78555 171130 776607 885286 679058 635606 462294 -283752 -1182068 -1548460 -1555666
31428 -1555666 -1764635 -1939496 -1422121 -481354 -137794 -574712 -798741 -186260 564117
31419 564117 521396 -147216 -557913 -401749 -240264 -639908 -1456674 -2017970 -1796881 -871669
31409 -871669 183835 819653 908815 700105 566597 824158 1486302 2036316 1803025 857306
31399 857306 166352 437882 1159417 1326161 827963 457110 725727 1384520 2025947 2430073
31389 2430073 2319827 1533134 530451 3948 -128659 -570707 -1336045 -1486574 -567372
31380 -567372 528965 726085 163269 -204812 57249 569871 895638 1042502 1314853
$$ packed form
31447A401075J16956L74190j06104m25686O3557M54266j76593j019757p60459
31438g8555K49685O05477J08679k06228m3452j73312p46046q98316l66392p206
31428a555666k08969j74861N17375R40767L43560m36918k24029O12481P50377
31419E64117m2721o68612m10697J56164J61485l99644q16766n61296K21089R25212
31409h71669J055504O35818Q9162k08710j33508K57561O62144N50014k33291r45719
31399H57306o90954K71530P21535J66744m98198l70853K68617O58793O41427M04126
31389B430073j10246p86693j002683n26503j32607m42048p65338j50529R19202
31380e67372J096337J97120n62816l68081K62061N12622L25767J46864K72351
$$ plain form
31371 1314853 1942763 2705884 2880052 1959523 466281 -547075 -861136 -1162236 -1598065
31362 -1598065 -1334095 -78592 1029038 928225 165500 -84914 208627 250305 -103176
31353 -103176 -373239 -515615 -724590 -556891 437526 1458464 1232829 -6384 -727844
31344 -727844 -376119 3890 -325665 -757753 -749034 -836590 -1389448 -1532163 -400034 1322346
31334 1322346 2170201 1731326 855469 395393 464516 684093 598794 49703 -537453 -567439
31324 -567439 -159393 -40356 -336000 -257084 595085 1467880 1612019 1368292 1333453 1220130
31314 1220130 507099 -377102 -568273 -88884 297551 252845 2653 -378434 -913639 -1225176
31304 -1225176 -989713 -638985 -709086 -799627 -204036 699430 872043 300637 -24893 123091
$$ packed form
31371A314853O27910P63121J74168r20529j493242j013356l14061l01100m35829
31362a598065K63970J255503J107630j00813p62725k50414K93541M1678l53481
31353a03176k70063j42376k08975J67699R94417J020938k25635j239213p21460
31344g27844L51725L80009l29555m32088Q719q7556n52858j42715J132129J722380
31334A322346Q47855m38875q75857m60076O9123K19577q5299n49091n87156k9986
31324e67439M08046J19037k95644P8916Q52169Q72795J44139k43727l4839j13323
31314A220130p13031q84201j91171M79389L86435m4706k50192l81087n35205l11537
31304a225176K35463L50728p0101r0541N95591R03466J72613n71406l25530J47984
$$ plain form
31294 123091 -171056 -1237064 -2001676 -1534803 -387134 314601 285445 -64062 -433072
31285 -433072 -583305 -145426 770165 1269518 699612 -413354 -1072128 -1039993 -712751 -183156
31275 -183156 739765 1750329 2079975 1406776 233444 -687261 -952660 -622251 -120661
31266 -120661 37446 -229663 -414204 -75971 565900 1092319 1638272 2539828 3358587 3087844
31256 3087844 1582212 92896 -106971 815363 1694948 1940240 1965568 2109979 1901489
31247 1901489 795316 -832606 -1983164 -2155926 -1699525 -1131892 -621825 -179606 160959
31238 160959 520449 1077230 1604958 1587582 1031813 625681 757884 976264 883441 906288
31228 906288 1470182 2008173 1724058 927500 577982 750186 633311 -52067 -728532 -1037701
$$ packed form
31294A23091k94147j066008p64612M66873J147669P01735k9156l49507l69010
31285d33072j50233M37879R15591M99353n69906j112966o58774L2135L27242N29595
31275a83156R22921J010564L29646o73199j173332r20705k65399L30409N01590
31266a20661J58107k67109j84541L38233O41871N26419N45953R01556Q18759k70743
31256C087844j505632j489316j99867R22334Q79585K45292K5328J44411k08490
31247A901489j106173j627922j150558j72762M56401N67633N10067M42219L40565
31238A60959L59490N56781N27728j7376n55769m06132J32203K18380r2823K2847
31228I06288N63894N37991k84115p96558l49518J72204j16875o85378o76465l09169
$$ plain form
31218 -1037701 -1155773 -1031521 -481258 -84723 -645553 -1584789 -1393363 -90881 443694
31209 443694 -656045 -1773334 -1362119 -306657 -141886 -383121 324099 1430413 1213363
31200 1213363 -177243 -789502 -37112 488994 -130532 -613462 237483 1474147 1512834
31191 1512834 455722 -415138 -601805 -584794 -613197 -483687 -275503 -331632 -574154 -556532
31181 -556532 -153661 349475 777977 1187543 1517503 1547329 1222312 753425 383941 189816
31171 189816 54019 -207869 -579356 -752073 -531198 -218995 -224572 -416717 -393444 -310827
31161 -310827 -728400 -1544048 -1890061 -1402136 -832813 -926695 -1350098 -1335976 -864899 -543662
31151 -543662 -668015 -1027466 -1395759 -1678724 -1790114 -1858820 -2329764 -3368976 -4357280 -4452509
$$ packed form
31218a037701j18072J24252N50263L96535n60830r39236J91426J302482N34575
31209D43694j099739j117289M11215J055462J64771k41235P07220J106314k17050
31200A213363j390606o12259P52390N26106o19526m82930Q50945J236664L8687
31191A512834j057112q70860j86667J7011k8403J29510K08184n6129k42522J7622
31181e56532M02871N03136M28502M09566L29960K9826l25017m68887l69484j94125
31171A89816j35797k61888l71487j72717K20875L12203n577j92145K3273Q2617
31161c10827m17573q15648l46013M87925N69323r3882m23403J4122M71077L21237
31151e43662j24353l59451l68293k82965j11390o8706m70944j039212r88304r5229
$$ plain form
31141 -4452509 -3531057 -2195814 -1046121 -338498 -142581 -334142 -530029 -461551 -363316
31132 -363316 -655209 -1329069 -1963165 -2228890 -2078268 -1569837 -854483 -264507 -119201 -430217
31122 -430217 -894407 -1064703 -557042 542321 1414329 1176814 32880 -815685 -707321
31113 -707321 -325750 -524633 -1082378 -1333313 -1365880 -1628760 -1803594 -1172489 61135 857188
31103 857188 741857 221519 -189514 -421657 -304834 407190 1266548 1369411 684325 213939
31093 213939 448158 618365 51277 -663814 -647653 -114803 147284 136972 447821 1020823
31083 1020823 1160246 791226 694419 1208230 1542936 914581 -205718 -630211 -6721
31074 -6721 782541 797776 113783 -489667 -536236 -199008 169640 433190 584046 615048
$$ packed form
31141d452509R21452J335243J149693P07623J95917j91561j95887O8478R8235
31132c63316k91893o73860o34096k65725J50622N08431P15354N89976J45306l11016
31122d30217m64190j70296N07661J099363Q72008k37515j143934q48565J08364
31113g07321L81571j98883n57745k50935l2567k62880j74834O31105J233624P96053
31103H57188j15331n20338m11033k32143J16823P12024Q59358J02863o85086m70386
31093B13939K34219J70207n67088p15091J6161N32850K62087j0312L10849N73002
31083A020823J39423l69020r6807N13811L34706o28355j120299m24493O23490
31074f721P89262J5235o83993o03450m6569L37228L68648K63550J50856L1002
$$ plain form
31064 615048 580634 527294 316624 -172493 -641466 -614926 -190361 1313 -205631 -221445
31054 -221445 197398 333672 -293552 -848682 -339960 655089 707542 -216508 -614175 289037
$$ packed form
31064F15048l4414n3340k10670m89117m68973K6540M24565J91674k06944j5814
31054b21445M18843J36274o27224n55130N08722R95049N2453r24050l97667R03212
$$ [...]
##END NTUPLES=NMR SPECTRUM
##END=
